##TITLE=1H_DE-80H_X3
 200.13MHz, d2o
 8 sc
 
 19ns.26.2.2025
##JCAMPDX= 6.0         $$ Bruker NMR JCAMP-DX V2.0
##DATA TYPE= NMR SPECTRUM
##DATA CLASS= NTUPLES
##ORIGIN= UXNMR, Bruker Analytische Messtechnik GmbH
##OWNER= pz
$$ XWIN-NMR		Version 3.5
$$ Thu Apr 16 13:23:07 2026 Russian Standard Time (UT+4h)  Yarkov@DPX200
##.OBSERVE FREQUENCY= 200.1313
##.OBSERVE NUCLEUS= ^1H
##.ACQUISITION MODE= SIMULTANEOUS
##.ACQUISITION SCHEME= undefined
##.AVERAGES= 8
##.DIGITISER RES= 18
##SPECTROMETER/DATA SYSTEM= spect
##.PULSE SEQUENCE= zg30
##.SOLVENT NAME= DMSO
##.SHIFT REFERENCE= (INTERNAL, DMSO, 0, 15.51)
##AUDIT TRAIL= $$ (NUMBER, WHEN, WHO, WHERE, WHAT)
$$ ##TITLE= Audit trail, XWIN-NMR		Version 3.5
$$ ##JCAMPDX= 5.01
$$ ##ORIGIN= Bruker BioSpin GmbH
$$ ##OWNER= Yarkov
$$ C:/Bruker/XWIN-NMR/data/yarkov2/nmr/H-C/1/pdata/1/auditp.txt
$$ ##AUDIT TRAIL=  $$ (NUMBER, WHEN, WHO, WHERE, WHAT)
(   1,<2026-04-16 13:22:11.51 +0400>,<Yarkov>,<DPX200>,
      <created by zg, POWCHK disabled, PULCHK disabled
       configuration hash MD5:
       00 E9 B6 7A A2 85 ED C7 34 08 36 98 17 FE 4E 26
       data hash MD5: 16K
       6A 0D 46 B1 19 33 D1 EE 0A 7A 0C F3 0F 14 59 49>)
(   2,<2026-04-16 13:22:21.75 +0400>,<Yarkov>,<DPX200>,
      <Start of raw data processing
       efp BC_mod = 2 LB = 0.25 FT_mod = 6 PKNL = 1 PHC0 = -5301.948 PHC1 = 6.821927 SI = 16K 
       data hash MD5: 16K
       31 D7 5C 22 1A E8 2B 12 72 65 CA 2F 18 5E 23 CB>)
$$ ##END=
$$ 
$$ hash MD5
$$ 0C 98 11 10 41 46 F2 E6 EB C8 BA 90 5E A0 5F 4B
##$RELAX= 
##$RELAX= 
##$RELAX= 
##$RELAX= 
##$RELAX= 
##$RELAX= 
$$ Bruker specific parameters
$$ --------------------------
##$DU= <C:/Bruker/XWIN-NMR>
##$EXPNO= 1
##$NAME= <H-C>
##$PROCNO= 1
##$TYPE= <nmr>
##$USER= <yarkov2>
##$AMP= (0..31)
100 100 100 100 100 100 100 100 100 100 100 100 100 100 100 100 100 100 
100 100 100 100 100 100 100 100 100 100 100 100 100 100 
##$AQSEQ= 0
##$AQ_mod= 1
##$AUNM= <au_zg>
##$AUTOPOS= <>
##$BF1= 200.13
##$BF2= 200.13
##$BF3= 200.13
##$BF4= 200.13
##$BF5= 200.13
##$BF6= 200.13
##$BF7= 200.13
##$BF8= 200.13
##$BYTORDA= 1
##$CFDGTYP= 0
##$CFRGTYP= 5
##$CHEMSTR= <none>
##$CNST= (0..31)
1 1 145 1 1 1 1 1 1 1 1 1 1 1 1 1 1 1 1 1 1 1 1 1 1 1 1 1 1 1 1 1 
##$CPDPRG= <>
##$CPDPRG1= <>
##$CPDPRG2= <>
##$CPDPRG3= <>
##$CPDPRG4= <mlev>
##$CPDPRG5= <mlev>
##$CPDPRG6= <mlev>
##$CPDPRG7= <mlev>
##$CPDPRG8= <mlev>
##$CPDPRGB= <>
##$CPDPRGT= <>
##$D= (0..31)
0 0.7 0 0 0 0 0 0 0 0 0 0.03 0 0 0 0 0 0 0 0 0 0 0 0 0 0 0 0 0 0 0 0 
##$DATE= 1776331331
##$DBL= (0..7)
120 120 120 120 120 120 120 120 
##$DBP= (0..7)
150 150 150 150 150 150 150 150 
##$DBP07= 0
##$DBPNAM0= <>
##$DBPNAM1= <>
##$DBPNAM2= <>
##$DBPNAM3= <>
##$DBPNAM4= <>
##$DBPNAM5= <>
##$DBPNAM6= <>
##$DBPNAM7= <>
##$DBPOAL= (0..7)
0.5 0.5 0.5 0.5 0.5 0.5 0.5 0.5 
##$DBPOFFS= (0..7)
0 0 0 0 0 0 0 0 
##$DE= 6
##$DECBNUC= <off>
##$DECIM= 32
##$DECNUC= <off>
##$DECSTAT= 4
##$DIGMOD= 1
##$DIGTYP= 9
##$DL= (0..7)
0 120 120 120 120 120 120 120 
##$DP= (0..7)
$$ [...]
##$SUBNAM2= <"">
##$SUBNAM3= <"">
##$SUBNAM4= <"">
##$SUBNAM5= <"">
##$SUBNAM6= <"">
##$SUBNAM7= <"">
##$SUBNAM8= <"">
##$SUBNAM9= <"">
##$SW= 18.0517328524113
##$SWIBOX= (0..15)
0 0 2 0 0 0 0 0 0 0 0 0 0 0 0 0 
##$SW_h= 3612.71676300578
##$TD= 16384
##$TD0= 1
##$TE= 0
##$TE2= 300
##$TE3= 300
##$TEG= 300
##$TL= (0..7)
0 120 120 120 120 120 120 120 
##$TP= (0..7)
150 150 150 150 150 150 150 150 
##$TP07= 0
##$TPNAME0= <>
##$TPNAME1= <>
##$TPNAME2= <>
##$TPNAME3= <>
##$TPNAME4= <>
##$TPNAME5= <>
##$TPNAME6= <>
##$TPNAME7= <>
##$TPOAL= (0..7)
0.5 0.5 0.5 0.5 0.5 0.5 0.5 0.5 
##$TPOFFS= (0..7)
0 0 0 0 0 0 0 0 
##$TUNHIN= 0
##$TUNHOUT= 0
##$TUNXOUT= 0
##$USERA1= <user>
##$USERA2= <user>
##$USERA3= <user>
##$USERA4= <user>
##$USERA5= <user>
##$V9= 5
##$VALIST= <valist>
##$VCLIST= <CCCCCCCCCCCCCCC>
##$VD= 0
##$VDLIST= <DDDDDDDDDDDDDDD>
##$VPLIST= <PPPPPPPPPPPPPPP>
##$VTLIST= <TTTTTTTTTTTTTTT>
##$WBST= 1024
##$WBSW= 4
##$XGAIN= (0..3)
0 0 0 0 
##$XL= 0
##$YL= 0
##$YMAX_a= 124245
##$YMIN_a= -129578
##$ZGOPTNS= <>
##$ZL1= 120
##$ZL2= 120
##$ZL3= 120
##$ZL4= 120
##$ABSF1= 0
##$ABSF2= 0
##$ABSG= 0
##$ABSL= 0
##$ALPHA= 0
##$AQORDER= 0
##$ASSFAC= 0
##$ASSFACI= 0
##$ASSFACX= 0
##$ASSWID= 0
##$AUNMP= <proc_1d>
##$AZFE= 0.1
##$AZFW= 0.1
##$BCFW= 0
##$BC_mod= 2
##$BYTORDP= 0
##$COROFFS= 0
##$CY= -3
##$DATMOD= 1
##$DC= 0
##$DFILT= <>
##$DTYPP= 0
##$F1P= 0
##$F2P= 0
##$FCOR= 1
##$FTSIZE= 16384
##$FT_mod= 6
##$GAMMA= 0
##$GB= 0
##$INTBC= 1
##$INTSCL= 3.241238e-09
##$ISEN= 128
##$LB= 0.25
##$LEV0= 0
##$LPBIN= 0
##$MAXI= 10000
##$MC2= 0
##$MEAN= 0
##$ME_mod= 0
##$MI= 1.114404
##$NCOEF= 0
##$NC_proc= -7
##$NLEV= 6
##$NOISF1= 3.799351
##$NOISF2= 2.8
##$NSP= 0
##$NTH_PI= 0
##$NZP= 0
##$OFFSET= 15.51
##$PC= 1
##$PHC0= -5301.948
##$PHC1= 6.821927
##$PH_mod= 1
##$PKNL= yes
##$PPARMOD= 0
##$PSCAL= 0
##$PSIGN= 0
##$REVERSE= no
##$SF= 200.130002341965
##$SI= 16384
##$SIGF1= 3
##$SIGF2= 2
##$SINO= 0.751879
##$SIOLD= 32768
##$SREGLST= <19F.Aceton>
##$SSB= 0
##$STSI= 16384
##$STSR= 0
##$SW_p= 3612.71676300578
##$SYMM= 0
##$S_DEV= 0
##$TDeff= 16384
##$TDoff= 0
##$TI= <>
##$TILT= no
##$TM1= 0
##$TM2= 0
##$TOPLEV= 0
##$USERP1= <user>
##$USERP2= <user>
##$USERP3= <user>
##$USERP4= <user>
##$USERP5= <user>
##$WDW= 1
##$XDIM= 16384
##$YMAX_p= 339018934
##$YMIN_p= -869396
$$ End of Bruker specific parameters
$$ ---------------------------------
##NTUPLES= NMR SPECTRUM
##VAR_NAME=  FREQUENCY,     SPECTRUM/REAL,   SPECTRUM/IMAG
##SYMBOL=    X,             R,               I
##VAR_TYPE=  INDEPENDENT,   DEPENDENT,       DEPENDENT
##VAR_FORM=  AFFN,          ASDF,            ASDF
##VAR_DIM=   16384,         16384,           16384
##UNITS=     HZ,            ARBITRARY UNITS, ARBITRARY UNITS
##FACTOR=    0.220516191357247, 1,           1
##FIRST=     3104.01638213, 0,               0
##LAST=      -508.700380875781, 0,           0
##MIN=       -508.700380875781, -869396,     0
##MAX=       3104.01638213, 339018934,       0
$$ Real data points
##PAGE= N=1
##DATA TABLE= (X++(R..R)), XYDATA
$$ [...]
12154B4908j75675m4326j57206L241O2531J60640l9070l02628J1825l1003K17233
12143b69530j3234L271j84259L0975M5401q6456K61531j18260L549J2798J25127
12132a89087J34044j48796P7241j69174J81765j64616K61506k89800J05268k18743
12122d20392R0645Q9922k8134J59580j37617J31961k49086L78850l60389J59093
12112a85567l55451N07429p7565K18443l81026r2768M5235J87919J8222j06818
12102b21947k98998J87491l0652j8739O1778J3289J48901j59659L19328k04872
12092b04080O0135k62212L30292j78323O8235k49453Q3704J30894K89034j11942
12082d3716l79285k6504J92928J02409r1415N848r096O8144P1284m0676n792p6779
$$ y = [24908, -150767, -195093, -352299, -349058, -286527, -125887, -164957, -467585, -455760, -486763, -269530, -282764, -279493, -463752, -432777, -387376, -473832, -212301, -330561, -327012, -314214, -189087, -55043, -203839, -126598, -295772, -114007, -278623, -17117, -306917, -201649, -420392, -329747, -239825, -267959, -108379, -245996, -114035, -363121, 15729, -344660, -185567, -541018, -33589, -111154, 107289, -273737, -366505, -321270, -133351, -115129, -221947, -520945, -333454, -364106, -382845, -321067, -307778, -158877, -318536, 792, -204080, -143945, -406157, -75865, -254188, -185953, -435406, -351702, -220808, 68226, -43716, -423001, -449505, -256577, -154168, -245583, -239735, -248831, -180687, -109403, -150079, -155871, -232650]
12070b32650J25725N8894j29875N9770J12610j0654l5918k19110K60179m9239
12060f0268j57079j27647P5208N0079L65889j9677j77873j90409n943K73442p307
12049A8415j44610j77113J46254J9121K39971k72490o6658J41877J76338K7884
12039A08989q5056p7289O5979J48941R6029k08909r2920k08786L06996J1072J36754
12028B01800l01103K12259j23916J63546m0733j67474N8555q1287K81844l39742
12018a36251K14300l12129K26331j52290K35574j65498J22406n9114O4024K2699
12008F0052k95903K4630J07977L18501k92577K27871k14636Q8770r0561J01207
11998C5331j46385k0197O3542l5681J0494k5765J55934p9165L2332R629k05776
$$ y = [-232650, -106925, -48031, -177906, -118136, -5526, -16180, -52098, -271208, -11029, -60268, -217347, -344994, -269786, -219707, 146182, 126505, -51368, -241777, -247720, 25722, 18415, -126195, -303308, -157054, -137933, 102038, -170452, -237110, -95233, 81105, 108989, 23933, -53356, 12623, 161564, 257593, 48684, -44236, -253022, 53974, 65046, 201800, -99303, 112956, -10960, 152586, 111853, -55621, 2934, -78353, 203491, -136251, 78049, -234080, -7749, -160039, 75535, -89963, 32443, -26671, 37353, 60052, -235851, -211221, -103244, 215257, -77320, 150551, -64085, 24685, -65876, 35331, -111054, -131251, -67709, -103390, -92896, -118661, 37273, -41892, -9560, 69, -205707]
11987b05707p284J22309n1944k19829J10516R1747J52877q1156k49920N1384R7811
11976a89196K58533l3541N3478l53148L70598r3837K76750l24651o1619k39110
11966c35743J81738P1214P3509o6652k7938K46368j54129J45194k63450J32341
11956B452j00123J98354k68131M5573m2195K39769j92107J39124j20077K0027
11946g7334j01771O443J34481N9962l3734j64473L8372k5949q9548O0987k4878
11935b17442L6544K7565J57047J4667j7161j37716j79277J55893P0844K1675l11827
11924c79188L78440j60546M45764m03930K12230m30711K30799M619J5932k16168
11914c02759j32248K13938j01224K55823q7926q964l17384J92668J04090L0904
$$ y = [-205707, -212991, -90682, -142626, -362455, -251939, -160192, -7315, -88471, -338391, -287007, -189196, 69337, 35796, 89274, -263874, 106724, 12887, 289637, -35014, -96633, -335743, -154005, -82791, -9282, -75934, -103872, 142496, -11633, 133561, -129889, 2452, -97671, 100683, -167448, -121875, -164070, 75699, -116408, 22716, -97361, -77334, -179105, -172662, -38181, 21781, -11953, -176426, -138054, -164003, -253551, -192564, -217442, -180898, -153333, 3714, 18381, 1220, -136496, -315773, -159880, -89036, -67361, -379188, -748, -161294, 284470, -119460, 92770, -337941, -107142, -102523, -86591, -302759, -435007, -221069, -322293, -66470, -154396, -163360, -480744, -288076, -183986, -153082]
11904a53082j13543n0032N3283K9147L8253p7649R8722L423k23981J24488j00955
11893c71926R2531k8233K96796l15009J68189m18113K15450R8558K00895n2012
11883a12874j32420j5380J02416Q336J142O7963l94624L9067n4869m3805J55382
11872c79666K9593J06093j13319R8042j22915J05828p5095O1976R2480J04499
11862i2484n5608j94137r3182k7421K27930j98582L65878l13316J01283j28577
11852d08216L42419r2316j30372q4451q6000J80308j8668o8255n2043q5614K91585
11841b11623L595j57439j94007J83899j676J45680k57687J93463j42549J85723
11831b52621K55254j75862L4924k16151J91083j5099J74591m62574K29469j75343
$$ y = [-153082, -266625, -316657, -263374, -234227, -195974, -273623, -174901, -171478, -395459, -270971, -371926, -279395, -307628, -10832, -325841, -157652, -575765, -360315, -261757, -60862, -112874, -245294, -260674, -158258, -149922, -148780, -80817, -475441, -436374, -491243, -535048, -379666, -350073, -243980, -357299, -259257, -382172, -276344, -351439, -289463, -196983, -92484, -148092, -342229, -435411, -462832, -234902, -433484, -67606, -380922, -279639, -408216, -65797, -158113, -288485, -372936, -458936, -278628, -297296, -365551, -417594, -503208, -211623, -208028, -365467, -559474, -375575, -377251, -231571, -489258, -295795, -438344, -252621, 2633, -173229, -138305, -354456, -163373, -178472, -3881, -466455, -236986, -412329]
11821d12329L63122j56354K7280k0317K1738j13651k5836k5505N7388O1874q7839
11810c10429J30700j17393L9389m1784M202k12351J6013J96049J60278j08281
11800b43607Q886j79156J50354n2890J50798j13235j12751k5350R4913j9868o6741
11789d08647r6345J77788K13792j36941R06p4446J5701L1256R6026k75310J9030
11778d37190Q9664K24203M4618K9k26767O7338M416O9425Q1775k68101L27964
11767b2626k57526J30378j02822j7117L0567N6941L5408L12431j25173j36435
11757i5974l7516j9471K8608k17712K95119k10797J50941j05809K05403M6258
11747C9050j7187k2044M6077r5614J75356N7318j96290N5063J4300J33849k29664
$$ y = [-412329, -49207, -205561, -178281, -198598, -176860, -290511, -316347, -341852, -284464, -222590, -310429, -179729, -297122, -257733, -299517, -295315, -507666, -491653, -295604, -135326, -243607, -234721, -413877, -263523, -316413, -165615, -278850, -391601, -416951, -322038, -341906, -408647, -504992, -327204, -113412, -250353, -249447, -323893, -308192, -276936, -180910, -456220, -437190, -347526, -123323, -78705, -78676, -305443, -238105, -233689, -164264, -82489, -350590, -22626, -280152, -149774, -252596, -269713, -239146, -182205, -146797, 165634, 40461, -95974, -133490, -152961, -124353, -342065, -46946, -257743, -106802, -212611, -7208, 39050, 21863, -181, 45896, -49718, 125638, 182956, -13334, 41729, 56029, 189878, -39786]
11736c9786P6371p6946M1654Q9483J22179j16295j16711o1120K91915n0636r8441
11725F1667p7955K97416J35347J87306l95465m6176j2790J58921K29400k92492
11715B45179k4439k97705L49929k8170L19416m70164Q6790j60022K88695j96095
11705A13414o986j23699J09556J12125P2957O5796n3823n0140o1404o158J840
11694A73478n0072n4909J42458j00887P2062k13731K04112k16897K52614j11540
11684I6688K32218l59094J87913k62198L99652O654j56756n2343j80488L29178
11674B41424j58205J90941l37463J3308r3676K50600j70844n8624N0731J33859
11664F2051K30311j62838L4569l87275J26484k9815L32725j52307p2998q1784
$$ y = [-39786, 36585, -40361, 1293, 90776, 212955, 96660, -20051, -81171, 210744, 160108, 61667, -16288, 281128, 416475, 603781, 208316, 162140, 149350, 308271, 537671, 245179, 220740, -76965, 272964, 244794, 564210, 94046, 180836, 20814, 309509, 113414, 106428, -17271, 92285, 204410, 277367, 343163, 289340, 239200, 177796, 171638, 173478, 123406, 68497, 210955, 110068, 182130, -31601, 172511, -44386, 208228, 96688, 328906, -30188, 157725, -104473, 295179, 301833, 145077, 92734, -87754, 241424, 83219, 274160, -63303, -49995, -143671, 106929, -63915, -122539, -71808, 62051, 292362, 129524, 164093, -223182, -96698, -126513, 206212, 53905, -19093, -100877]
11654a00877L32162l7267Q0704j78856m7165O5439O9140M6081k03486Q2243k83554
11643a75436K10127j7570Q7824k85507L07699j54444L26784l95638K79468k41904
11633e8597J71660j00367J73507l84177J22204P7230K06750J07647j02525J4585
11623B27917j31991Q0355n3169M3448k9549O3263j42595L9374j62189L81948j97794
11612A19018J90300k32325J46957k58493J01588j56006J89574j798R8332o1563
11602A35584j89339O1241k8356L57539j94887M3457j75277J7155K62124q2230
11592B07011P05k05051J84253r2640J65132j68876J76426m0640J43952q7137P2241
11581C55376j11584n9999M2419N7261j56991n0993n1967R7654J32185j2183M4268
$$ y = [-100877, 231285, 194018, 274722, 95866, 48701, 114140, 183280, 229361, 25875, 108118, -175436, 34691, 17121, 104945, -180562, 127137, -27307, 299477, -96161, 183307, -58597, 113063, 12696, 186203, -197974, -75770, 1460, 208210, 315857, 213332, 227917, 95926, 176281, 123112, 166560, 137011, 200274, 57679, 97053, -65136, 316812, 119018, 309318, 76993, 223950, -34543, 67045, -88961, 100613, 98815, 197147, 135584, -53755, 7486, -20870, 336669, 141782, 185239, 9962, 27117, 289241, 207011, 207716, 2665, 186918, 94278, 259410, 90534, 266960, 226320, 370272, 283135, 355376, 243792, 183793, 226212, 283473, 126482, 75489, 23522, 121176, 253361, 241178, 285446]
11570B85446j87858J76610k24148K20108k08620K79332l01711L27126j87302J26250
11560C05233k49496J72141N8518p1286j41780N3484P4417R6575j96058K60933
11550C62681j76313K40019k55645q7077r828k4166J35640j96466L45785k51111
11540H3519J18982j98828L36432l13645L54896m88831M82159k04637L9528j33886
11530G5689J04108k7123L1368j08831o4260m9888J93254k3987L7111q5183p114
11519G5144J1997R1545L4503k15897K10326j28200J87142k50990K32238j98310
11509D9498K1845Q5614K504M475j13672Q9161r3485j70605J052J73259O2694j88078
11497g5738J22181j78443K10329k59194K40967j46387J57413n7671O6347j00385
$$ y = [285446, 97588, 274198, 50050, 270158, 61538, 340870, 39159, 366285, 178983, 305233, 55737, 227878, 286396, 215110, 73330, 126814, 201231, 297806, 101748, 362681, 186368, 426387, 170742, 83665, 73837, 49671, 185311, -11155, 334630, 83519, 202501, 3673, 340105, 26460, 381356, -107475, 374684, 170047, 209575, 75689, 179797, 152674, 184042, 75211, 10951, -38937, 154317, 130330, 167441, 82258, 75144, 87141, 178686, 213189, -2708, 207618, 79418, 266560, 15570, 247808, 49498, 71343, 156957, 159461, 163936, 50264, 139425, 45940, -124665, -123613, 49646, 112340, -75738, 46443, -132000, 78329, -180865, 60102, -86285, 71128, 13457, 79804, -20581]
11487b0581j07698J43567m5501R2931j63622o0215j5398Q0360J69156k55416m4612
11476b27029k43000L74566r3576L40180j40850k5529O9029j38240J71554l37308
11466b50203J44018l87499M53833j79805J92652n28393L58897k01035L06710j41844
11456b32669J3839l504J19420O6600r2941k30596m8828J15459L7050L05707j64213
11445a14676n4681k16438M3108j16773J92113q7364J03214o4601K33770m7505
11435a29833J09978k21134L0737l1317P2930j54623J00110k16056L23334o6657
11425a82531K02200l79943J00560l0051Q3967J41528o9820j66578k5095J89638
11415a36125P311L3084k39238P3266k0841J82659j62724o5765k46555K30454K05169
$$ y = [-20581, -128279, 15288, -30213, 62718, -100904, -161119, -176517, -96157, 72999, -182417, -227029, -470029, -95463, -189039, 151141, 10291, -15238, 53791, -84449, 87105, -250203, -106185, -493684, -39851, -219656, -27004, -555397, -196500, -397535, -90825, -232669, -218830, -222334, -102914, -36314, -129255, -359851, -408679, -293220, -256170, 49537, -114676, -169357, -385795, -342687, -459460, -267347, -354711, -251497, -316098, -82328, -129833, -19855, -240989, -210252, -241569, -168639, -323262, -223152, -439208, -115874, -182531, 19669, -360274, -259714, -289765, -205798, -64270, -134090, -300668, -325763, -136125, -128814, -95730, -334968, -261702, -282543, -99884, -262608, -328373, -574928, -344474, -139305]
11404a39305Q7443l72071O1902N5036L13203j78037K9538q9853j41273J44646
11394b28771J57269o46j70785K0091L678L8277m8486k8054N7907q3022K36643
11383d5899r2815m4696k31564J67929P9282J04045M8985l6165k5090L9619R4951
11372E8582k1590j982j70503j33689N7701J51179r3252j37694Q1338P1842Q0855
11361e7213R8351l30820M9009k9028L03438P5251K6920k92388O0962K12711J52632
11350B69825k92911p4556j03540J35463J87215q0515j14418j69849l5075K65448
11340a2913J22465p3128j05700j15488Q7243k747K83427l57046j4217p2603K76044
11329A5337o1269k7813j01290J06210J06121J169j2597j84606K34716J01533J21534
$$ y = [-139305, -51862, -423933, -362031, -306995, 6208, -171829, -142291, -232144, -373417, -228771, -71502, -72148, -242933, -222842, -219164, -180887, -229373, -257427, -199520, -282542, -45899, -138714, -183410, -414974, -247045, -167763, -63718, -14733, -50898, -75988, -36369, 58582, 36992, 35010, -135493, -269182, -211481, -60302, -153554, -291248, -209910, -138068, -57213, 41138, -289682, -240673, -269701, 33737, 108988, 135908, -156480, -95518, 117193, 269825, -23086, -97642, -201182, -65719, 121496, 40981, -73437, -243286, -278361, -12913, 109552, 36424, -69276, -184764, -97521, -100268, 183159, -173887, -188104, -260707, 15337, -45932, -73745, -175035, -68825, 37296, 38465, 25868, -158738, 75978, 177511, 299045]
11318B99045k64525j62629O2208R1474J22826m164k91516L2837j5171M0497M9665
11307c9453j01890o4484j89561K22973J16330J13404k68179K81269j55610J16593
11297C1392r5575o2843j44715L7807K37573j18888R0343k91842J31599K7295K78419
11286A20565j89075k4748k15241J56386J76040O4604l27695k28682J92632K44613
11276c0601Q2548j07358j48222P1747K0252K60336k16349m7969k10515K44597
11266h1534K71264K7120j94966k00712M0014L08442M6426k92978J46165k55504
11256a86263K07902j74994J82437k51547j05154M3052J27446M6025O0043o6333
11246a17386p1404J26165j37729R8109r8541J48669j621O1371J05479k00848k1771
$$ y = [299045, 34520, -128109, -65901, 25573, 148399, 144235, -147281, -114444, -129615, -89118, -39453, -141343, -205827, -395388, -172415, -56085, 57319, -210860, 70409, -85201, 31392, -64183, -127026, -271741, -233934, 3639, -115249, -24906, -316748, -185149, -157854, 120565, -68510, -93258, -308499, -152113, 23927, 88531, -239164, -467846, -275214, -30601, 51947, -55411, -203633, -131886, -111634, 148702, -67647, -115616, -326131, -81534, 189730, 216850, 21884, -178828, -138814, 169628, 216054, -76924, 69241, -186263, 21639, -153355, 29082, -222465, -327619, -284567, -157121, -111096, -51053, -117386, -188790, -62625, -200354, -102245, -200786, -52117, -53738, 7633, 113112, -87736, -109507]
11235a09507L7400K59784j54316o4041k12637Q9271K16427N0317k00014r9971
11225a87287P2326K6111R4919r8677k2323j23568P8373O4209R1307j78415m9483
11214b32508P2990K50062r7892n3789j40284p0105M28182n3497J3302m20830o0558
11203c64927j15651J81504J64671O8445k13180L8694P853l7308J2421j93008K57741
11192a92745r3793J39312k29429R284N8504M0520K3427j045j31377k05188K69164
11181c13366J43061J4799l31165k17765Q3327K8592K17512j02499J1114o8741
11171e35131J72047p4381l3258M8169q8759j70282P2828N1566K07259j69688l8350
11160e57980O2641J17553O036k04906j13915J1227J55390J51078o4444m32076
$$ y = [-109507, -72107, 187677, 33361, -30680, -243317, -154046, 62381, 112698, -87316, -187287, -114961, -88850, 6069, -92608, -114931, -238499, -160126, -95917, -4610, -183025, -232508, -159518, 90544, -7348, -61137, -201421, -271526, 156656, 103159, 116461, -304369, -364927, -480578, -299074, -134403, -65958, -279138, -240444, -232591, -269899, -257478, -450486, -192745, -286538, -147226, -376655, -367371, -308867, -268347, -244920, -245965, -377342, -582530, -313366, -170305, -155506, -486671, -704436, -621109, -592517, -375005, -477504, -466390, -535131, -363084, -437465, -470723, -422554, -511313, -681595, -608767, -557201, -349942, -519630, -557980, -495339, -377786, -371750, -576656, -690571, -679344, -523954, -372876, -437320, -869396]
11150h69396K04501N7L91261k42792Q0550j78071P625J91619J31020R0897j26561
11139c19290j6771j69821J08795k14411K4241j20537J80616Q0762j64419K0659
11129e90176j36232K11928k0117J9155j64374j80972J02559K50101L8610p6176
11119e45694r1092J9041J65120j49876J28456j35944L0554M567L6515n1979P4011
11108e16321k8896J69962j75363J45040j66224q4454k7128K78517M9878j59306
11098e14295j72972o3337K61940q3145K32952l13803m4453l2785K58910O3569
11088d07419N79l670j09860O1184n2903k6583P505J9030Q7054K83R0769q7097
11076d21128J23039j3864O9016m7355l3146k57823l2287J43387K11937J81684
$$ y = [-869396, -664895, -664838, -273577, -516369, -435819, -613890, -606265, -414646, -283626, -192729, -319290, -336061, -505882, -397087, -611498, -587257, -707794, -527178, -446416, -610835, -590176, -726408, -514480, -534597, -515442, -679816, -860788, -758229, -508128, -469518, -545694, -636786, -617745, -452625, -602501, -474045, -609989, -579435, -574868, -538353, -590332, -516321, -545217, -375255, -550618, -405578, -571802, -656256, -683384, -404867, -354989, -514295, -687267, -750604, -488664, -571809, -338857, -652660, -697113, -729898, -470988, -407419, -406840, -410510, -520370, -459186, -512089, -538672, -531167, -512137, -425083, -424800, -334031, -421128, -298089, -311953, -242937, -290292, -323438, -581261, -613548, -470161, -258224, -76540]
11066g6540k17018k22580K09389J0374J34824j39212K9146j31189J01868M4372
11056b56566L6502l7993J66390j66282J55875j62689k139j9222K3474J12480k5718
11045a75888r6566j09318K13121m5003J52453q0884j4132l52135L30762j07983
11035b85573J93823j35835J16386k42857K42413j09785K42957k85276J20522l1933
11025a75158k7428J85705n9310K05111j25791k9094j42160R4147o1003J38605
11015C624L007J16607j19110k0053N7894k57530L2630J36401J0639n1462m5029
11004a32382Q2851l8839K18727N8597l04929n5266j41979J64064J507R3536M6682
10993g431r6805N2089m3213J68404j7537R4624j74836m5475j59091J93916L1664
$$ y = [-76540, -293558, -516138, -306749, -296375, -161551, -300763, -271617, -402806, -300938, -256566, -220064, -258057, -91667, -257949, -102074, -264763, -266902, -286124, -262650, -150170, -175888, -272454, -381772, -168651, -213654, -61201, -142085, -156217, -508352, -177590, -285573, -91750, -227585, -111199, -354056, -111643, -221428, 21529, -263747, -143225, -175158, -202586, -16881, -76191, 128920, 3129, -25965, -168125, -73978, -134981, 3624, 6631, 123238, 4128, -15925, 41969, -215561, -182931, -46530, -35891, -87353, -132382, -49531, -88370, 130357, 188954, -115975, -171241, -313220, -149156, -147649, -54113, -7431, -104236, -52147, -95360, 73044, 55507, 150131, -24705, -70180, -229271, -35355, -3691]
10982c691O9155Q0336j62145Q0664k21645J45544J35422J24363j87092j20553
10972e9642j23704J83109J07392j64762R1298j75517K30269j14150K61162j52728
10962H2727L0588j30680J30640j37736O3263n9921K3489M405O4087J29217k66413
10951f6334O2397j45681K54054K8080J6782k17237K2547n3040J56704j30454K01306
10940A29124j52474M9025P1078p0287J3816j47429J34352J29217j6534j4471J6979
10929A42396j7684L5090N5325j63455j4471j15516J41297n550K7732j84519j6401
10918a15756Q4580J77310J91316k08786m7458j55907J22864m660J85610j38055
10908I1058L6288j45441K9106J74319q4134Q9787r2194R8518r8871J24719m5307
$$ y = [-3691, 65464, 145800, -16345, 64319, -157326, -11782, 123640, 248003, 60911, -59642, -183346, -237, 107155, -57607, 33691, -141826, 88443, -25707, 235455, 82727, 113315, -17365, 113275, -24461, 38802, -21119, 2370, 6775, 70862, 200079, -66334, -3937, -149618, 104436, 132516, 149298, -67939, -45392, -98432, 58272, -72182, 129124, -23350, 25675, 96753, 26466, 40282, -107147, 27205, 156422, 139888, 125417, 142396, 124712, 159802, 215127, 51672, 37201, -78315, 62982, 57432, 85164, -99355, -115756, -31176, 146134, 337450, 128664, 81206, -74701, 48163, 43503, 229113, 91058, 127346, -18095, 11011, 185330, 101196, 190983, 98789, 197307, 98436, 223155, 177848]
10897A77848o9097J8089P6825J05400j32610J23380j34223L19719j75093M9314
10887C59552j83554K6208J24203J06588p6808l9454L4030K010p4376O0465r9552
10876B39312Q9952Q6491J83261k04148j50503q7989N675J39140J69603r4773p0957
10865C05064m6395J15784J11051j22191o5752j27293N4324O6465O5912k59059
10855I7910J36358k58226K45917K4155J51682j18058q8792j69635J03417j92106
10845f7378J45348O2456P2743j44021k397J6415n0885N5563m1752N6354n4027
10834D8419r8010q6378J70359M937O6772j43058j01781j7992o6596K27867j15638
10823a11099R8924l24360K68858j06615J5695j63189J83925O8453o5408K02419
$$ y = [177848, 108751, 126840, 203665, 309065, 176455, 299835, 165612, 485331, 310238, 359552, 175998, 202206, 326409, 432997, 356189, 316735, 350765, 352775, 278399, 338864, 239312, 329264, 415755, 599016, 394868, 244365, 156376, 162051, 301191, 470794, 376021, 305064, 258669, 374453, 485504, 363313, 297561, 170268, 224592, 291057, 356969, 97910, 234268, -23958, 221959, 246114, 397796, 279738, 190946, 21311, 124728, -67378, 77970, 140426, 213169, 69148, 66751, 83166, 32281, 87844, 46092, 102446, 48419, -49591, -135969, 34390, 39327, 106099, -36959, -138740, -156732, -223328, 4539, -111099, -12175, -336535, -67677, -174292, -158597, -321786, -137861, -69408, -134816, 67603]
10813F7603m31037J37136j02046L91611m67531K81848l02577K63269l6156J30175
10803f7705k32713r8182j04772N448J03816m8365N2635J44544J42530m0377j54385
10792b97526M3576R9908j9130M7901j33241j9086k87382M10516j91849K08687
10782a37626q6954M6729n5272M1670J20015l1194J3638j74936M1375j76341K02532
10771a96364l6348J26075K2766q8040Q0898j4861K05026k99999J90192J8720k2898
10760a4833K3222p0395J09974l7757M3510j24709M6921m511J07743M1880j72436
10749e1391K51632k01115J98172k54605K92115k88217J69363j14181R0581j11144
10739a8790O7222J9023k569J63111j93060R8335k1550J67955l31838J44348k17350
$$ y = [67603, -363434, -226298, -328344, 63267, -404264, -122416, -424993, -161724, -197880, -67705, -300418, -398600, -503372, -497924, -394108, -442473, -389838, -245294, -102764, -143141, -297526, -253950, -154042, -173172, -125271, -258512, -277598, -564980, -154464, -346313, -137626, -224580, -177851, -233123, -191453, -71438, -102632, -88994, -263930, -222555, -398896, -196364, -232712, -106637, -83871, -171911, -91013, -105874, 99152, -200847, -10655, 8065, -14833, 8389, -62006, 47968, 10211, 53721, -70988, -24067, -28578, 79165, 121045, -51391, 200241, -874, 197298, -57307, 234808, -53409, 115954, 1773, 92354, -18790, 48432, 67455, 64886, 227997, 34937, 133272, 111722, 279677, -52161, 92187, -125163]
10728a25163l4038R3330Q9480j54463J38708j32006J65787k24250J24735n3411
10718a11291J58658o8311r8k09462O8368n7109K06498K7980n7957k43793M2535
10707b43982J27072J21973j22767O4446k3796q2187j30316N4767r2443P1626K12357
10696d3250j56356R5666l34899K97618j98676L10440m50224L79853k20070K63842
10686e6056j46746P0125N265k84397Q7810q9662K9003n2510K53024M84K1639J23290
10674c8731k72915K03133k8504J7097j72550R7880P1300j18207J71441j49917
10664b19973K90760j29516L02767m15947L6013k60565K29876L5293m6685J418
10654a76559j42930J70200Q2623k9339K3517j75573R4656N5237R3981j57856J56300
$$ y = [-125163, -159201, -65871, 23609, -130854, 7854, -124152, 41635, -182615, -57880, -111291, 47367, -20944, -21042, -230504, -162136, -219245, -12747, 15233, -42724, -286517, -243982, -116910, 5063, -117704, -53258, -77054, -159241, -289557, -234790, -327233, -255607, -43250, -199606, -103940, -438839, -141221, -339897, -29457, -479681, -99828, -319898, -56056, -202802, -132677, -127412, -411809, -323999, -413661, -384658, -437168, -184144, -183660, -162021, -38731, -311646, -108513, -137017, -119920, -292470, -194590, -123290, -241497, -70056, -219973, 70787, -58729, 244038, -171909, -135896, -396461, -166585, -131292, -177977, -176559, -319489, -149289, -66666, -96005, -72488, -248061, -153405, -98168, -4187, -162043, -5743]
10643e743l3502q9121O7240k02398J62995j78576K74180k16668L4658m6855L14925
10632H1135J28847j65531N216k98224J69098k49097J69262L7357R2471p1185j40294
10621b40945O6978j23375K39509k02195L06888j61059J73623p0335J80091N2024
10611B21204j70259j80564j94786J74469q2175K03729k52032Q1136Q1246j21680
10601b39712m1363r3750L00995j07443L5103n6858j04731J69849J7078J25694
10591D862k36408P9419j08540K13515j55155l4705j22133n2728J95646R1475j5345
10580a40097j28820J78016M4167j51002p3392j26890J85779j14455K39395J11822
10570B4523j88561r0411j17297L17252j99019K13228n45370K64481k16737K94951
$$ y = [-5743, -39245, -128366, -61126, -263524, -100529, -279105, -4925, -221593, -186935, -233790, 81135, 209982, 44451, 49667, -248557, -79459, -328556, -159294, -121937, -29466, -100651, -240945, -173967, -297342, -57833, -260028, 46860, -114199, 59424, -10911, 169180, 221204, 50945, -129619, -324405, -149936, -232111, -28382, -280414, -199278, -118032, -239712, -281075, -374825, -73830, -181273, -146170, -203028, -307759, -137910, -120832, 4862, -231546, -152127, -260667, -47152, -202307, -237012, -359145, -411873, -216227, -124752, -140097, -268917, -90901, -46734, -197736, -271128, -398018, -212239, -326694, -87299, 24523, -164038, -254449, -371746, -54494, -253513, -40285, -585655, -321174, -537911, -242960]
10560b42960j98914J43889q1700p0302K43746k29188K76163k72595J93310j11066
10550c49617M4005p7300K16316q5404k4756J02670o6979j1168o9283k17568K98695
10539b40389q1117L32348m02973J35216j48567K32250M0326j42228k2444l90509
10529f88087L13173j73942K97509l41424L60231o4768K67363k17093p5501j54031
10519d76570J22998J80983J8200j56066n4892O893L24782k09566m8456m8390J63850
10508a76234n6413r4264Q1138k30479K62202k43593L60080j12664L23943m72664
10498c58948J67963m4484J8216N841r2381J99585m7573J18997k33684J11810K5856
10487a28802p9315N6630l2574m2861J1860J33236J6881J35707p5562j76040o8458
$$ y = [-242960, -441874, -297985, -379685, -449987, -206241, -435429, -159266, -431861, -238551, -349617, -305612, -382912, -166596, -252000, -276756, -174086, -241065, -252233, -321516, -539084, -240389, -321506, 10842, -392131, -256915, -405482, -173232, -132906, -275134, -297578, -688087, -374914, -548856, -251347, -592771, -232540, -297308, -29945, -247038, -322539, -476570, -353572, -172589, -154389, -310455, -365347, -358454, -33672, -243238, -291694, -340084, -176234, -232647, -326911, -245773, -476252, -214050, -457643, -97563, -210227, 113716, -358948, -190985, -235469, -217253, -211412, -303793, -104208, -151781, -32784, -266468, -154658, -128802, -208117, -151487, -184061, -226922, -215062, -81826, -64945, 70762, -4800, -180840, -249298]
10476b49298N6591J22756J72459j4580q5772r3993J33092o4140L7334k26099J38513
10465g3137o799J36438l9851k36840M4777J10315J96100q0698k06846q2623l2803
10454b71967Q4114J36526n1228k01700L8537J01559J98110j06975j57406J26485
10444a03945j44885K94059j45316R8513j31947K33211J00830j08255l21914j9677
10434b49326K89290J90291J6392k53374k74205J56039J33883J25363j94820J10506
10424E0039k01418R1812J5177P785k54623M6533J13034L1770L9544q3439J01751
10413d2035j10440J00320M0938q1710r980j28912J93254J5507j3414Q5478j77724
10402a28718M3631q2923K91968k00365L2347l61047L00841m7840J10959k79396
$$ y = [-249298, -192707, -69951, 102508, 87928, 2156, -91837, 41255, -22885, 14449, -211650, -73137, -79936, 56502, 16651, -220189, -175412, -65097, 131003, 50305, -156541, -239164, -271967, -187853, -51327, -102555, -304255, -265718, -164159, 33951, -73024, -230430, -103945, -248830, 45229, -100087, -1574, -133521, 99690, 200520, 92265, -229649, -249326, 39964, 230255, 246647, -6727, -280932, -124893, 8990, 134353, -60467, 50039, -151379, -59567, -44390, -36605, -291228, -244695, -131661, -99891, -60347, -143786, -42035, -152475, -52155, -11217, -92927, -102907, -231819, -38565, -23058, -36472, 49006, -128718, -85087, -168010, 123958, -76407, -44060, -405107, -104266, -152106, -41147, -320543]
10392c20543M7870j4280K29118k5407p6605m9759j0635L2638J16640K275j89638
10381b58326k6530J5703K73103k31642p991k32607K80615k6685L6414k49530P5061
10370c52415p8696K89196J97155l07173j0061k49325K30402p3565Q8355m992K8641
10359b42478J4576k9468J0429k09937J56099J52740J40745j85788r3731n2485
10349c39298k4765J88450p9715P6507q3390M1933N5005J43989r1851k52587R313
10338c56409j36042m4070j4083K58799O59j9731O0917O1811R6251J10r1595P1166
10326a12217q0142J17211n6551L189k07951J65946m7505K63964k07716J0571m0000
10315a91201M7647L4866p8574q5510J4279J46186R7854q3807p1462L9593J5930
$$ y = [-320543, -272673, -286953, -57835, -83242, -159847, -209606, -220241, -187603, -70963, -68688, -258326, -284856, -269153, 3950, -227692, -235683, -468290, -187675, -214360, -177946, -427476, -352415, -431111, -141915, 55240, -251933, -261994, -511319, -280917, -354482, -266127, -271119, -242478, -227902, -257370, -246941, -456878, -300779, -148039, -7294, -193082, -286813, -339298, -364063, -175613, -255328, -178821, -262211, -220278, -165273, -21284, -113135, -365722, -356409, -492451, -536521, -550604, -291805, -291146, -310877, -249960, -188149, -91898, -91788, -183383, -112217, -192359, -75148, -131699, -128510, -336461, -170515, -218020, 45944, -161772, -151201, -191201, -143554, -108688, -187262, -272772, -258493, -112307, -14453, -98260, -169722, -130129, -114199]
10304a14199L3895j65145j1851j46068M67266m4494K4302m18100J99920Q236L74482
10293B08244k89366o5057k07800L9511K98273P881k32766o4611J13934j23504
10283c15261J81614j39461J29890j42228K09259l3527n7573P6140m2867J3475
10273a20539L7335M7412j29577J49563m2979K0070j31320J01584J26657j92347
10263a34141M0865q1067J77117o4044P8624q9409j00555J34365P6114j2837j05050
10252h0018p0645k0088J41509L4858M0102M0978o8618J46791j99757K763j82642
10241b14767K16951N136J54739m4366l69803K39993Q2198K87690k43622j39677
10231b5528L409J99676Q6206j91429j28205o0914K62256j40502J20530k21837
$$ y = [-114199, -80304, -245449, -257300, -403368, 63898, 19404, 43706, -374394, -174474, -166238, 208244, -81122, -146179, -353979, -314468, -16195, -8314, -241080, -305691, -191757, -315261, -133647, -273108, -143218, -285446, -76187, -109714, -167287, -91147, -134014, -120539, -83204, -35792, -165369, -15806, -58785, -38715, -170035, -68451, 58206, -134141, -93276, -174343, 2774, -61270, 17354, -72055, -172610, -38245, 37869, 25032, -80018, -150663, -170751, -29242, 5616, 45718, 86696, 18078, 164869, -34888, -32125, -214767, 2184, 7320, 162059, 117693, -252110, -12117, 70081, 357771, 114149, -25528, -22119, 177557, 263763, 72334, -55871, -116785, 145471, 4969, 125499, -96338]
10221i6338J55694J01432k24142L4737n3718L31164j71922K09384k25163m1825
10211A9303j26025K96574j5501j73891N584k20355P0874M160J34276R1912J9203
10200A06114o7388n736j17972n7731J93871P6628j20186l7412l8731J42381M5723
10189A19561R5599j98538j4017n4636l6542J32527k77265P0549r0171J41407j79761
10178b91287K9144l4980L7249L20918m5285j6654k24693K3728R1099o0957j31997
10167c03715J64825j3549M5231J29492j83490k5654o3491O7298o0124j49266J92701
10156a99742k06203L42868j68190k3412j57822R7256j42942M12595k10593J445
10146b54740r7196j2878J23376p4325J67252l63653K82598k05816J40277j55514
$$ y = [-96338, 59356, 160788, -63354, -28617, -82335, 248829, 76907, 286291, 61128, 19303, -106722, 189852, 174351, 460, 6044, -214311, -143437, -139277, -5001, 86911, 106114, 38726, 32990, -84982, -142713, 51158, 127786, 7600, -29812, -68543, 73838, 119561, 215160, 16622, 2605, -52031, -88573, 43954, -233311, -162762, -252933, -111526, -291287, -262143, -297123, -259874, 61044, 15759, -895, -225588, -201860, -110761, -171718, -303715, -138890, -152439, -107208, 22284, -161206, -186860, -250351, -183053, -243177, -392443, -199742, -405945, -63077, -231267, -254679, -412501, -315245, -458187, -45592, -256185, -254740, -351936, -364814, -241438, -315763, -148511, -512164, -229566, -435382, -295105, -450619]
10136d50619L31997j96069o4157l66858K52626K9985K46891o1360n9134N9403
10126b77295k8887l1157K1724p2795m9706R8425j18010R8406j00726K56428l0812
10115b34405L39686m45992P5776j57498K97956j72353J40254l26354K01984P4101
10105b06845R9001M4846k25874R0221P378J56359k47494K125l2972K18290O884
10094h8081J63680m03930P5768Q6714J49244j9421n0061j38398N9955p8968K77260
10083C3762o8938n170j00403j2337Q0894o0819J17515L8338R0400r8284j90490
10072a75532J3204R5733K47355L7191j74140j50447J37292o2750J84184j93316
10062d1226k17289P3861K1135Q1954L2237Q9891L7132j84797n1645k7338J65829
$$ y = [-450619, -118622, -314691, -378848, -745706, -493080, -463095, -216204, -277564, -336698, -277295, -306182, -337339, -315615, -388410, -438116, -339691, -457701, -359295, -460021, -203593, -234405, 105281, -340711, -264935, -422433, -124477, -296830, -156576, -482930, -280946, -206845, -107844, -62998, -288872, -198651, -191273, -34914, -282408, -280283, -313255, -94965, -88081, 75599, -328331, -252563, -165849, -16605, -36026, -86087, -224485, -164530, -243498, 33762, -35176, -40346, -140749, -153086, -72192, -133011, -15496, 22842, 113242, 14958, -175532, -162328, -66595, 180760, 217951, 43811, -106636, 30656, -32094, 152090, -41226, -258515, -184654, -163519, -81565, -49328, 40563, 77695, -107102, -158747, -186085, -20256]
10051b0256J15014n6541R4321k74970J54796p4520J78576l04870L50964k76680
10041a14166L31764m51866L46980j96718J94387J60938n6646j48272k15263J85531
10031C6669j31001N3685j35614J17168j36955J76855j11016J42599k50821K61526
10021B3095Q136l3187j79645J50531r481K48619k18223Q2965k01060n7101J80259
10010e092J24101k77401K1143k01734J87488N1248J55209k40990j0841m8998O4137
9999a81730j03816N1290J19611M5999N9751l89171L13915j85421K88261k45751
9989b27062J20403k67462J01198K9017K9241N9756p4173K0338j42036K68326j97453
9978b79907P56q432k398M0025j61868J80759j02754L51258k31189P9546q6144
$$ y = [-20256, 94758, 38217, 132538, -142432, 12364, -62156, 116420, -188450, 162514, -114166, 217598, -234268, 112712, -84006, 110381, 271319, 214673, 66401, -148862, 36669, -94332, -40647, -176261, -59093, -196048, -19193, -130209, 12390, -238431, 23095, 31231, -1956, -181601, -31070, -40551, 208068, -10155, 72810, -128250, -185351, -5092, 119009, -158392, -137249, -338983, -151495, -100247, 54962, -186028, -196869, -245867, -181730, -285546, -234256, -114645, -68646, -8895, -398066, -84151, -269572, 18689, -227062, -106659, -374121, -272923, -243906, -214665, -154909, -229082, -208744, -350780, -82454, -279907, -279151, -287583, -289981, -249956, -411824, -231065, -333819, 17439, -213750, -134204, -220348]
9967b20348L1646j72558n7413J34922P8327j9920r1045K49567j35884J14035j33153
9956b21824p920j1910j20384j360p8747K81079J00808m5848j36726p9827r9749
9945d22408K41605j9042K06181l5147l8701k23920p0952N8892J49417O9218k02130
9934b86987p345j23759L64059J059K19539m58708J1075J30868J06973j30965n2037
9923b26228p7352o3460J3959J72926r6451o3607K15885p1462j8080j44964O2995
9912b95839K52207M9816J08608j47288k59876J33314J19627Q748p3110j01573
9902b05366J47256j56090O6207j97750R2364J98566J60169p2072n7399j11107
9892a35222r027K61663L2508J3184k44550Q5886j29432J77566N1505M5043j43493
$$ y = [-220348, -188702, -361260, -418673, -283751, -205424, -225344, -316389, -66822, -202706, -88671, -221824, -229744, -241654, -362038, -363398, -442145, -161066, -60258, -106106, -242832, -322659, -422408, -180803, -199845, 6336, -28811, -67512, -291432, -362384, -303492, -154075, -84857, -286987, -294332, -418091, -54032, -52973, 166566, -292142, -281067, -150199, -43226, -174191, -226228, -303580, -367040, -353081, -180155, -276606, -340213, -124328, -195790, -213870, -358834, -295839, -43632, 6184, 114792, -32496, -292372, -159058, -39431, -30683, -103793, -205366, -58110, -214200, -147993, -345743, -253379, -54813, 105356, 33284, -24115, -135222, -144249, 117414, 149922, 163106, -81444, 4442, -124990, 52576, 104081, 149124, 5631]
9881E631M6877q8071K32723j54111P4481k77285J65386o4657j5465o8909K26370
9870H2970K6179j3138m8959o8568J18893m4862J75838k51349K8199j83385R8801
9859g9381N6190K28166j34523j4211k94034J75460j0046J88858k7016k26713m8288
9848a85538R256J14373J0621q6710j52459Q1323J91472j46506J2662j15888N2234
9837b15160J5809K57926k45217K16880l3500l3818q26J11819j10383k35637J96225
9826g5882j12533K8755p3829J56713Q9567J29234j17329m3759n8215J50784J18190
9815A91696n6196l57073J34105r320L20015k90483J44995l79267J99367R1131
9805a1030J55423j25829k96130j52336K20682L8351j04921L46892j61001L2585
$$ y = [5631, 52508, -35563, 197160, 43049, 117530, -159755, 5631, -59026, -74491, -143400, 82970, 109149, 96011, 47052, -21516, 97377, 52515, 228353, -22996, 5203, -178182, -79381, -23191, 204975, 70452, 56241, -237793, -62333, -72379, 116479, 89463, -137250, -185538, -176282, -61909, -51288, -137998, -290457, -209134, -17662, -164168, -151506, -267394, -215160, -199351, 58575, -186642, 30238, -3262, -37080, -37906, 73913, -36470, -272107, -75882, -188415, -159660, -233489, -76776, 12791, 142025, 24696, -19063, -77278, 73506, 191696, 135500, -221573, -87468, -96788, 223227, -67256, 77739, -301528, -102161, -11030, 144393, 18564, -277566, -429902, -209220, -170869, -275790, 71102, -89899, -57314]
9795e7314n1839R7785j61484j37090J79110j35196j30935K27598j30288R8529
9785b01124j04333J16498j28832K10945j69966J19238j28934O8239j89207N8240
9775c49236J07134J2787O4310k00021L19693j39823o359k04826R3883j659j10084
9764d14201J30700L9565Q4452k10963J68483j46902J62657O206J25488q5686j69548
9753c09749K84302k07052R7324k38048R9151k88074K27590J92884J5409j90788
9743c17051N1673J92619j01408K0486l17509L91412q5315j0413j81464q5097J81478
9732b60589K34517P1996k65181r1128n3457J92234J22162j5910j64994O496m7469
9721b71323J79894q573o6228k33442L60306r8434K23123k81476J26651j43387
$$ y = [-57314, -109153, -11368, -172852, -309942, -130832, -266028, -396963, -169365, -299653, -201124, -305457, -188959, -317791, -106846, -276812, -157574, -286508, -218269, -407476, -349236, -242102, -229315, -165005, -365026, -45333, -185156, -191515, -396341, -302458, -304117, -414201, -283501, -243936, -159484, -370447, -201964, -348866, -186209, -180003, -54515, -140201, -309749, -25447, -232499, -135175, -373223, -274072, -562146, -334556, -141672, -126263, -317051, -265378, -72759, -174167, -153681, -471190, -79778, -165093, -175506, -356970, -442067, -260589, -26072, 45924, -219257, -310385, -363842, -171608, -49446, -65356, -230350, -223854, -271323, -91429, -100002, -166230, -399672, -39366, -137800, 85323, -196153, -69502, -212889]
9711b12889N2397J26435l19656J95597j33425K38035k47877L36270k33345J72690
9701b5768k63987L43590j06130J19727j0204j53642m4242L8341Q2107r5832J11195
9690d845q5746L2543m4449J84552k23941R5478m941J46767K1757j50987O9015
9679C5203k5104J44004j07997J02383q8551J13608J2985J3081k9618q0901j34589
9668d5496k36414M68001p9783K56568l68082J30801j00644R9635M6889j054l8253
9657A32168m107K0575M973J759j48198O4789k1429j24207P4833N6940l2323j82049
9645a56276K65047L6362q7521Q8503q4863j1468j1606l989r2930O8040j18329
9634a09030K31715k77810J74432k04788J58712j67753K62460p60r2743j66473
$$ y = [-212889, -160492, -34057, -353713, -158116, -291541, -53506, -301383, 34887, -198458, -25768, -289755, 53835, -52295, 67432, 57228, -96414, -140656, -102315, -20208, -116040, -4845, -90591, -58048, -102497, 82055, -141886, -46408, -51349, 95418, 117175, -33812, 35203, 10099, 154103, 46106, 148489, 59938, 173546, 186531, 199612, 169994, 89093, -45496, -281910, 186091, 106308, 362876, -5206, 125595, 24951, 124586, 171475, 170421, 132168, 128061, 148636, 153609, 155368, 7170, 71959, 50530, -73677, 1156, 58096, 25773, -156276, 108771, 145133, 57612, 146115, 61252, 49784, 38178, 34189, -58741, 9299, -109030, 122685, -155125, 19307, -185481, -26769, -194522, 67938, 67178, -25565, -192038]
9624a92038J5716K8237J12132p2644k34540K19888J68005J03746k82847j9348
9614a53693k09879J79334O2682Q8951j90460M3859K3537J76418L0312p8042k93936
9603c20917l3772R3640J06208K2112J6258j16634J62239j88936J42246j45696
9593b63252m7343K37927j69771N6278j56415J55855l02728L76396l6611o6950
9583b16614j92102K40842N5665R6325n0037n5048l4812k0929L67407l18412L0288
9572i7427M25o4555j7498K32410r063l34501P2612K33143K16004q0574o1645j02843
9560a3512J13672J52953J00810k4607k28933M8559L0681J44622j85486Q1562j28987
9549I1334j2340J04066R6517p9673l4624k0428K4433J46757k3510L5500j82697
$$ y = [-192038, -176322, -148085, -35953, -108597, -343137, -123249, 44756, 148502, -134345, -153693, -363572, -184238, -121556, -32605, -223065, -179206, -155669, 20749, 51061, -26981, -320917, -354689, -261049, -154841, -132729, -116471, -233105, -70866, -259802, -117556, -263252, -310595, -72668, -242439, -186161, -342576, -186721, -489449, -113053, -149664, -216614, -408716, -167874, -112209, -15884, -65921, -120969, -155781, -176710, 190697, -127715, -97427, -97002, -161557, -179055, 53355, 44292, -290209, -217597, 15546, 231550, 150976, 89331, -13512, 100160, 253113, 353923, 329316, 100383, 148942, 179623, 324245, 138759, 220321, 91334, 78994, 183060, 279577, 199904, 165280, 144852, 169285, 316042, 292532, 328032, 145335]
9538A45335K95437o0139J22727m01805J16575J39485K61118j84236l3633k03014
9528A97850J65981M38294k32615j7084k94846J94274O0613K71649k26140l4271
9518E23705j10568J02925K01408O9080k25749j24181r5494K06597R2924K74993
9508I15640k72758l0255J17190K55098o299O2491Q6878r8785J08568q8509j955
9497A047304j98407K8163j12357M94p7698j7215K7302j34209K83867Q5412q7092
9486H45564k11100N1543J21234O0565j44079j38174R8707J62239K73735k52899
9476H67335o4863k68692M27917J78219J6561k44902q7692l3955K79484P8178j39987
9465A007603k44859Q0275K97956P5482j43006q1575P9135l2162L56242R7239L1868
$$ y = [145335, 440772, 380633, 503360, 101555, 218130, 357615, 618733, 434497, 400864, 197850, 363831, 802125, 569510, 552426, 257580, 451854, 512467, 784116, 557976, 523705, 413137, 516062, 717470, 786550, 560801, 436620, 341126, 547723, 640647, 915640, 642882, 612627, 729817, 984915, 978616, 1041107, 1127985, 1029200, 1137768, 1049259, 1047304, 848897, 877060, 764703, 765197, 687499, 670284, 697586, 563377, 847244, 932656, 845564, 634464, 686007, 807241, 867806, 723727, 585553, 684260, 846499, 1120234, 867335, 802472, 533780, 961697, 1139916, 1156477, 911575, 823883, 789928, 1069412, 1147590, 1007603, 762744, 843019, 1140975, 1216457, 1073451, 991876, 1071011, 1038849, 1395091, 1492330, 1524198]
9454A524198r3736K09155K19772J79534L09280L75634O93471P26006L65905k18508
9444D290711o10513m14075m10372m45032l97278k15248l15193l8502r7423J7908
9434A364983k34826k08304L8165j66694m5222l9628p9272j9214P9194J8183O6890
9423G74255j90497j2471k09210O8221L1651j01034r2935r3732m1120J54252M7512
9412C34892J7838j3105j35800Q8749r2484O4239j96067N7188p2223Q2715j30173
9401E769J90673j19090J52168O1280p3484j29174L0262J09349J05312L8625j09188
9390B62502O825J6466K46171j56584j26956j57348J49824r1324K91817o9767J3566
9379C85192k86547L57600j38510J81608j80899L9162q4855J19501R836J7604q930
$$ y = [1524198, 1430462, 1639617, 1859389, 2038923, 2348203, 2723837, 3417308, 4143314, 4509219, 4290711, 3680198, 3266123, 2855751, 2410719, 2013441, 1798193, 1483000, 1444498, 1347075, 1364983, 1130157, 921853, 960018, 793324, 748102, 708474, 629202, 609988, 689182, 707365, 774255, 583758, 571287, 362077, 430298, 461949, 360915, 267980, 174248, 133128, 287380, 334892, 352730, 339625, 203825, 292574, 200090, 264329, 68262, 125450, 53227, 135942, 5769, 196442, 77352, 229520, 290800, 217316, 88142, 118404, 227753, 333065, 371690, 262502, 269327, 285793, 531964, 375380, 248424, 91076, 240900, 149576, 441393, 371626, 385192, 98645, 456245, 317735, 499343, 318444, 357606, 272751, 392252, 402088, 419692, 410762]
9368D10762j41357O9753q383N8835m1841Q7055k63428Q4676M1861J94816j59180
9357C33569O4928l0207J94661l3119K48521j36948M2389j01571K09168J32342
9347I23733O8623J26505K11464l9726j47454J5369j15587j37858J90791n9876
9337A035984j51309k72731J93044J54193K09968j24651j47096k02260K12456J24007
9327A031605p408m6083j77761K04548m8360K44643j29331J29066j10789K99724
9317A389854j83805N9795j55350J43873J4960J18987K2583k5375p9406J59405
9307A465521P9844J20461m9761O2759K255J38661n8453j08308l7828J20061J22960
9296A858172j81610j00990j94670J8067j04773K43940k7058N6276j35597J38916
$$ y = [410762, 269405, 339158, 330775, 389610, 347769, 434824, 171396, 256072, 297933, 492749, 333569, 398497, 368290, 562951, 529832, 778353, 641405, 683794, 582223, 791391, 923733, 992356, 1118861, 1330325, 1290599, 1143145, 1158514, 1042927, 905069, 1095860, 1035984, 884675, 611944, 804988, 959181, 1169149, 1044498, 897402, 695142, 907598, 1031605, 1024197, 978114, 800353, 1004901, 956541, 1201184, 1071853, 1200919, 1090130, 1389854, 1206049, 1265844, 1110494, 1254367, 1269327, 1388314, 1410897, 1385522, 1306116, 1465521, 1545365, 1665826, 1616065, 1678824, 1681079, 1819740, 1761287, 1652979, 1615151, 1735212, 1858172, 1676562, 1575572, 1380902, 1398969, 1294196, 1538136, 1511078, 1567354, 1431757, 1570673]
9286A570673N1032K49400j07863R8792k58537q788K1322J95694j22905n8134M1321
9275A672007O6308Q73j1267J51527r1422J09165K76209J78931j82845l8547Q1601
9264B212540L9212J73754P2518q6125j66277J55703p2436o5438q7177J8566O0746
9253B255586j62759J63739k56435J98398k01648K45883k5638J7709r5786J85932
9243B324981J19014j47012J13538l37682K50337j933K38738l15094k5801o8202
9233B150884O1390Q0164M8445R6754j89316J20144k02291K04180j26850Q2924
9223B326428j33130J094r3267Q7495J1917P6222O1122r5052o2192M2365M2253
9212B265255O0888j21553n7476K52033n1723L000Q9242L2240j29669K39086L5372
$$ y = [1570673, 1621705, 1871105, 1763242, 1862034, 1603497, 1594709, 1616031, 1811725, 1688820, 1630686, 1672007, 1738315, 1739188, 1727921, 1879448, 1788026, 1897191, 2173400, 2352331, 2169486, 2130939, 2212540, 2251752, 2425506, 2498024, 2411899, 2245622, 2401325, 2328889, 2263451, 2176274, 2194840, 2255586, 2092827, 2256566, 2000131, 2198529, 1996881, 2242764, 2217126, 2234835, 2139049, 2324981, 2443995, 2296983, 2410521, 2072839, 2323176, 2321243, 2559981, 2244887, 2219086, 2150884, 2212274, 2292438, 2340883, 2437637, 2248321, 2368465, 2166174, 2370354, 2243504, 2326428, 2193298, 2194392, 2101125, 2188620, 2200537, 2276759, 2337881, 2242829, 2180637, 2223002, 2265255, 2326143, 2204590, 2147114, 2399147, 2347424, 2350424, 2439666, 2471906, 2342237, 2581323, 2616695]
9201B616695J94292o6630O5515k0910j6687P2640J76788k0028j0782J49046j21128
9190C018811J67985P5632Q1406j25239K90830O9436L16074p6420J61453j34160
9180C845808N0493L4095M40363n1793M5120J32507R8353J85554o1056L87723K3489
9169E130656J74587j00679K36258l5560K43897J84690M6759o7183Q7707K55949
9159F157081P1115L45750R8489k4032R5243O1436K19049o3996K49848p7574J62987
9148G295396J93112L63040K1626J00939J23641L02528K59712K01482K04887K77638
9138I344001J42788J56393L66532K46847K54528K88631K70233K73906L72980K78047
9128A1994886L81985K93110M36232K24714N25796N86895N82824L57376N91884
$$ y = [2616695, 2810987, 2744357, 2809872, 2788962, 2772275, 2844915, 3021703, 3001675, 2990893, 3139939, 3018811, 3186796, 3262428, 3343834, 3218595, 3509425, 3578861, 3894935, 3818515, 3979968, 3845808, 3896301, 3930396, 4370759, 4318966, 4364086, 4496593, 4594946, 4780500, 4719444, 5107167, 5130656, 5305243, 5204564, 5440822, 5405262, 5649159, 5833849, 5880608, 5813425, 5901132, 6157081, 6228196, 6573946, 6672435, 6648403, 6743646, 6805082, 7024131, 6960135, 7209983, 7132409, 7295396, 7488508, 7851548, 7873174, 7974113, 8097754, 8400282, 8659994, 8861476, 9066363, 9344001, 9486789, 9643182, 10009714, 10256561, 10511089, 10799720, 11069953, 11343859, 11716839, 11994886, 12376871, 12669981, 13106213, 13330927, 13856723, 14443618, 15026442, 15383818, 15975702]
9119A5975702Q19285N30209Q43795O09860P26950M14636Q99284Q01890R12352
9110B2533963J088123Q75036R45665Q61868J333607J217134J517605J178014J216545
9101C2767560J629174J873632J796874K194887K186852K280476K793400K856712
9093E0379567L121820L342253L543262L878597M565163N200004N743020O483566
9085H6257252P470402Q706633J0358568J1721503J2914814J4042950J4997546
9078A66469668J5997788J5545158J4230939J2973207J2997786J2747150J2277198
9071B63238894J0812449J0954204J1357056J2220643J1821721R899567O620288
9064C36924822K094112j403037o115727j0835211j6116435j9453360k1154240
$$ y = [15975702, 16794987, 17325196, 18168991, 18778851, 19505801, 19920437, 20819721, 21621611, 22533963, 23622086, 24497122, 25442787, 26304655, 27638262, 28855396, 30373001, 31551015, 32767560, 34396734, 36270366, 38067240, 40262127, 42448979, 44729455, 47522855, 50379567, 53501387, 56843640, 60386902, 64265499, 68830662, 74030666, 79773686, 86257252, 93727654, 102434287, 112792855, 124514358, 137429172, 151472122, 166469668, 182467456, 198012614, 212243553, 225216760, 238214546, 250961696, 263238894, 274051343, 285005547, 296362603, 308583246, 320404967, 330304534, 336924822, 339018934, 337615897, 331500170, 320664959, 304548524, 285095164, 263940924]
9057B63940924k1336752k1282727k0307492j8906093j6771251j4830447j3118363
9050A37387799j1297883j0147780q872173p746473o961625o237259n623790m814875
9042G5685941m547433l989952l536662l357489k942257k449630k486633k306710
9034E0069175k136142j788286j477792j657186j395419j517375j232263j261626
9026C7603086j172814r38380j086123j156949j065539p82105n61536o78141p83189
9017B9378310p77957o63484m23686n09985l48424m14733m22582k59250l57476
9008B5200733o2415m79368k03338k09277N6056l69518J81317j5773K01058r7272
8998B4202203K76825K13124K12772P11987M32720M12790N42246P91448J130932
$$ y = [263940924, 242604172, 221321445, 201013953, 182107860, 165336609, 150506162, 137387799, 126089916, 115942136, 107069963, 99323490, 92361865, 86124606, 80500816, 75685941, 71138508, 67148556, 63611894, 60254405, 57312148, 54862518, 52375885, 50069175, 47933033, 46144747, 44666955, 43009769, 41614350, 40096975, 38864712, 37603086, 36430272, 35491892, 34405769, 33248820, 32183281, 31401176, 30839640, 30161499, 29378310, 28600353, 27936869, 27513183, 27003198, 26654774, 26240041, 25817459, 25558209, 25200733, 25138318, 24658950, 24455612, 24246335, 24302391, 23932873, 24114190, 24098417, 24299475, 24202203, 24479028, 24692152, 24904924, 25616911, 26049631, 26462421, 27004667, 27796115, 28927047]
8989B8927047J247133J453439J704477J982812K738568L523783M498946N819154
8981E1895359P929516J0767805J4441191J6710616J5821096Q100032k335631j1863053
8973A11466931j5639219j5341310j2671942j0271837q261263o073895m661838
8966C8545627l350999k951239j870227j480349p71391p16151m06003O146j13289
8957B6892125K32695J65381P39971M08168R37287Q03983Q97378J150719J593157
8948C3820864K034218K653524L259796L909771N183184O680618R323546J2536164
8940G9401685J6988639K1521937K2863411J6735575L892675j0176033j9546196
8933A31681693k1834918j9240567j6047790j2701650j0028219p669475o276509
$$ y = [28927047, 30174180, 31627619, 33332096, 35314908, 38053476, 41577259, 46076205, 51895359, 59824875, 70592680, 85033871, 101744487, 117565583, 125665615, 123329984, 111466931, 95827712, 80486402, 67814460, 57542623, 49281360, 43207465, 38545627, 35194628, 32243389, 30373162, 28892813, 28121422, 27405271, 26999268, 27005414, 26892125, 27124820, 27290201, 28030172, 28438340, 29375627, 30179610, 31076988, 32227707, 33820864, 35855082, 38508606, 41768402, 45678173, 50861357, 57541975, 66865521, 79401685, 96390324, 117912261, 140775672, 157511247, 161403922, 151227889, 131681693, 109846775, 90606208, 74558418, 61856768, 51828549, 44159074, 37882565]
8926C7882565m528826l612756k778617k324223j510212j527260j264640j084185
8918A9251846r74217o91880p04721m33078n47806m67616l39921l87327q08082
8909A3897198m02657p24793k53915o54343j79078m30770l84596l48440O3736j14445
8899A0467897N7125k34541l07378p4387k23759q3178k28519l50217k28388j65096
8889H629559k39505k12940j55106p4653j28969j46392l02191r1611k06988K72921
8879G344125j19783R0746k45026r621j31921k8469j25655j26539j62096k44815
8869F240946K31934k37713k01072j52038J46900j9110J90080j02408J8567r4178
8859F021908K4944Q4528p3026k08131k16712Q8976j96874l7290j00259j39212
$$ y = [37882565, 33353739, 29740983, 26962366, 24638143, 23127931, 21600671, 20336031, 19251846, 18277629, 17585749, 16881028, 16447950, 15900144, 15432528, 15092607, 14705280, 13897198, 13494541, 12769748, 12515833, 11861490, 11682412, 11251642, 10867046, 10518606, 10582342, 10467897, 10525022, 10290481, 9983103, 9908716, 9684957, 9601779, 9373260, 9023043, 8794655, 8629559, 8390054, 8177114, 8022008, 7947355, 7818386, 7671994, 7369803, 7278192, 7071204, 7344125, 7224342, 7315088, 7070062, 7060441, 6928520, 6900051, 6774396, 6647857, 6485761, 6240946, 6472880, 6235167, 6034095, 5882057, 6028957, 6009847, 6199927, 6097519, 6116086, 6021908, 6046852, 6131380, 6058354, 5850223, 5633511, 5722487, 5525613, 5488323, 5388064, 5248852]
8849E248852k31043J14633k98934J74352m03864m9139k23100J08935k2571j59922
8839D258199O279j14972J81880n1417L0160j62672j86366p6686Q6113K556r1287
8828C881787l2118J59726K4833P8079j20828J46170l51019M19322j74919J19224
8818D150257m11421p5875p1814K82167J39025j94679j06533j56575K55605j36282
8808C673875O3084l14999J00046j47941J73214J6685p9359j9825J90459J9565
8798C674804K28606l47331o7824R8747L77405O2021l7738j40866J24891P6860
8788D049575M3158k574j854R7563M7595J70275Q6117L1157L1502m1396L07049
8777D818167J35927p6512K9086R9173J96328l2208J13729q8177L17715K01087
$$ y = [5248852, 5017809, 5132442, 4833508, 5007860, 4603996, 4554857, 4331757, 4440692, 4418121, 4258199, 4264478, 4149506, 4331386, 4279969, 4310129, 4147457, 3961091, 3884405, 3970518, 3973074, 3881787, 3849669, 4009395, 4034228, 4112307, 3991479, 4137649, 3786630, 4205952, 4031033, 4150257, 3738836, 3662961, 3591147, 3873314, 4012339, 3817660, 3711127, 3554552, 3810157, 3673875, 3736959, 3421960, 3522006, 3374065, 3547279, 3563964, 3484605, 3464780, 3655239, 3674804, 3903410, 3556079, 3488255, 3587002, 3964407, 4026428, 3988690, 3847824, 3972715, 4049575, 4092733, 4090159, 4088305, 4185868, 4233463, 4403738, 4489855, 4521012, 4552514, 4511118, 4818167, 4954094, 4877582, 4906668, 5005841, 5202169, 5169961, 5283690, 5195513, 5513228, 5714315]
8767E714315J89541J51384J30522l7966K01281M25558m823J56244J54636J05626
8757G186318M68997J63061M80813J53548O62494J81327R37971L80467N46066O02947
8747A1764009Q68172P85127Q48132J079117P90212J654229J425998K050280J826178
8738B3091454K750204L054859M251818M900285N216500N199803N548212O334522
8730F0347657N938717L998029K615549K437684K250478J258391o94711r62206
8722G7189588p29036j29121J82545L13904p90516j665606k138278j769785k602961
8713F7860734m366526n554331n380996m597019m551681m250836l840646l082126
8705C2236573k364284j465866r73428n59053j03464L42326Q08463J473170J984305
$$ y = [5714315, 5903856, 6055240, 6185762, 6147796, 6349077, 6774635, 6769812, 6926056, 7080692, 7186318, 7655315, 7818376, 8299189, 8452737, 9115231, 9296558, 10234529, 10614996, 11161062, 11764009, 12632181, 13417308, 14265440, 15344557, 16134769, 17788998, 19214996, 21265276, 23091454, 25841658, 28896517, 33148335, 38048620, 43265120, 48464923, 54013135, 60347657, 66286374, 70284403, 72899952, 75337636, 77588114, 78846505, 78151794, 77189588, 76460552, 76331431, 76513976, 76827880, 76037364, 74371758, 72233480, 70463695, 67860734, 63494208, 57939877, 52558881, 47961862, 43410181, 39159345, 35318699, 32236573, 29872289, 28406423, 27432995, 26873942, 26770478, 27112804, 27921267, 29394437, 31378742]
8696C1378742K681449L026892L427546L456684M109308M034119L421160K052388
8688E7588288J316603J244154J038675j65480r22265q88484l16545j07717L002
8679E8790231m19637j316077j833638j904504j666199l018443m109097m454015
8671D0068621m052067m059740l808821l649775l000930k686418j802945j499915
8663A5508010j376434j286441o95662r02754m42367p86567l39283o91114k78556
8654H708832l42360k82326k19425l62071J2057l60725j72258k44778p3298l26753
8644F336895R6835k85387q1533l35263R2358k29442k9970o8920n3121j52970n4785
8633E234697j95105l02776j78439P3148j67666j03321m0411q8724l09118j39735
$$ y = [31378742, 34060191, 37087083, 40514629, 43971313, 48080621, 52114740, 55535900, 57588288, 58904891, 60149045, 61187720, 61022240, 60099975, 59211491, 58894946, 58787229, 58790231, 58370594, 57054517, 55220879, 53316375, 51650176, 48631733, 44522636, 40068621, 36016554, 31956814, 28147993, 24498218, 21497288, 18810870, 17007925, 15508010, 14131576, 12845135, 12149473, 11246719, 10804352, 10017785, 9678502, 8987388, 8708832, 8366472, 8084146, 7864721, 7502650, 7514707, 7153982, 6981724, 6736946, 6663648, 6336895, 6433730, 6148343, 6066810, 5731547, 5823905, 5594463, 5564493, 5495573, 5442452, 5289482, 5234697, 5039592, 4736816, 4558377, 4631525, 4463859, 4360538, 4320127, 4231403, 3922285, 3782550]
8623C782550q7977O6274j0604n1937m7162n0844j12937P1438L8252q2421j27976
8612C386656J43996K862k1062N263j24597r5952M0421J8064J14353J64300K5012
8601C659316j15969n6785O6635o9826j19499m9947J3395k04939j0244k15127k6159
8590B870851k38546L6326o4663j17274j03014L9392l3807q7264k37437L10149
8580B374713N566j69561l25223P4705j74195J67809m3862J2476j61244J32786
8570A893970p8870o6856K11894r8117N0176l03916K99131K63274M292L0117j23853
8559B081242k3242J519J22671p2397k71366M1490r8019Q2032l53763J19060r3249
8548A535978J90430j49871K7500m08282Q2334J29799K8678J76166j68306k48130
$$ y = [3782550, 3694573, 3760847, 3750243, 3698306, 3651144, 3600300, 3487363, 3558801, 3597053, 3514632, 3386656, 3530652, 3533514, 3512452, 3517715, 3393118, 3297166, 3337587, 3355651, 3470004, 3634304, 3659316, 3543347, 3486562, 3553197, 3483371, 3363872, 3313925, 3327320, 3122381, 3112137, 2897010, 2870851, 2632305, 2668631, 2603968, 2486694, 2383680, 2423072, 2389265, 2302001, 2064564, 2374713, 2380279, 2210718, 1885495, 1960200, 1786005, 1953814, 1909952, 1922428, 1761184, 1893970, 1815100, 1748244, 1960138, 1862021, 1912197, 1608281, 1907412, 2170686, 2174978, 2205095, 2081242, 2058000, 2059519, 2182190, 2109793, 1838427, 1879917, 1781898, 1863930, 1510167, 1629227, 1535978, 1726408, 1576537, 1604037, 1195755, 1278089, 1407888, 1436566, 1612732, 1444426, 1196296]
8538A196296R789J79808J33615j86282j51780r3820l1295J74349q4775M2374n0591
8527A137688R5398n3442J67780l01734k9356J0461J0722P5520k3856p0864j5254
8516A003063k8354J92656j17677M0422k68075J99631q4954K38128k18491R8895
8506A055244j18403K66677L137k1058k01211J39704M0669j84066J93588k3657
8496A150624K1974J74907J92405r8130n4813j50201M21925k72436L60859j53295
8486A593819K19353l25692N36527j33911K38716k82077J72671K6641M22908K49216
8476B718171L79290J33778K34978O90844P57166R84160J664461J904938J319497
8467A0787283K31081j332384j913665j819538r15722j083554m83080o70607k42881
$$ y = [1196296, 1206085, 1385893, 1519508, 1333226, 1181446, 1087626, 1056331, 1230680, 1145905, 1188279, 1137688, 1233086, 1179644, 1347424, 1045690, 1016334, 1026795, 1037517, 1113037, 1089181, 1018317, 1003063, 974709, 1167365, 1049688, 1090110, 822035, 1021666, 936712, 1174840, 956349, 1055244, 936841, 1203518, 1206655, 1185597, 984386, 1124090, 1164759, 980693, 1174281, 1150624, 1172598, 1347505, 1539910, 1441780, 1386967, 1236766, 1658691, 1386255, 1747114, 1593819, 1813172, 1487480, 2024007, 1890096, 2128812, 1846735, 2019406, 2046047, 2468955, 2718171, 3097461, 3231239, 3466217, 4157061, 4914227, 5898387, 7562848, 9467786, 10787283, 11018364, 9685980, 7772315, 5952777, 5037055, 3953501, 3470421, 2799814, 2556933]
8458B556933l55285p4570j93660o3522j30408j89578K99369j77131j73447k54504
8448A244197o732J04239j97494K60016k78460J84152k42315K00643j56348J75418
8438A287316k45682J44579n0033J35761r5586j89227j87384J24403J42923l0592
8428A036478o8917k07953J6720K01034O7094p7770p8379l7496K5668q6716m2526
8417G47237j05434J3576j60840L31193j94149P2328k61731L07083j09141M8320
8407F88442j18822j45283j1203L08559J5262O2119k41019K9169j6179l7854K20819
8396G54010k07078l6423l5589j1952N3265l340J14470j54984j13139K301K17531
8385E79072r1164J66754j55017J24448k3691q9937J1645k21404J65569l8205J74482
$$ y = [2556933, 2201648, 2127078, 1933418, 1869896, 1739488, 1549910, 1849279, 1672148, 1498701, 1244197, 1237465, 1341704, 1144210, 1404226, 1125766, 1309918, 1067603, 1268246, 1111898, 1287316, 1041634, 1186213, 1136180, 1271941, 1176355, 987128, 799744, 924147, 1067070, 1036478, 967561, 759608, 776328, 977362, 1044456, 966686, 888307, 850811, 876479, 789763, 747237, 641803, 655379, 494539, 825732, 631583, 703911, 442180, 749263, 640122, 688442, 569620, 424337, 413134, 721693, 736955, 799074, 558055, 587224, 571045, 533191, 754010, 546932, 510509, 474920, 462968, 516233, 512893, 627363, 472379, 359240, 361541, 579072, 487908, 654662, 499645, 624093, 600402, 510465, 522110, 300706, 466275, 428070, 602552]
8374F02552k75232J55957k08806L21276k47582K69361p7561K29498k34665K14421
8364G49219N4960k6797P45R9369j2135M075J11940j79493P6985m2030j9622j29660
8352F87556J96951J64468q7650m0157N9942J1631M4226j24222J12954l10949j3864
8341G00886j47673J92809k40347K66510j26172O6318j49939k1009R8941J79781
8331H20105k2698j25156L4153q448M2635k6868j26418K39966j09172q7472P3560
8320G04187j9219J53142o9635k5590J14363j1628n0593J95780l33179J29463j68777
8309F18314Q7588P617M1220J88321r4196n3871j25504J99379n2582j33526p4030
8298F08730m2490J8349R8021M7771k18489J09362j07468J57289j51441N7032J68120
$$ y = [602552, 327320, 483277, 274471, 595747, 348165, 617526, 539965, 769463, 534798, 749219, 804179, 777382, 778127, 877496, 865361, 869436, 981376, 801883, 878868, 836838, 817216, 687556, 884507, 1048975, 961325, 921168, 981110, 992741, 1036967, 912745, 1025699, 714750, 700886, 553213, 746022, 505675, 772185, 646013, 712331, 562392, 541383, 640324, 820105, 797407, 672251, 706404, 697956, 740591, 713723, 587305, 827271, 718099, 630627, 704187, 684968, 838110, 768475, 742885, 857248, 845620, 795027, 990807, 657628, 787091, 618314, 705902, 713519, 754739, 943060, 848864, 794993, 669489, 868868, 816286, 682760, 608730, 566240, 584589, 682610, 730381, 511892, 621254, 513786, 671075, 519634, 576666, 744786]
8287G44786l88113r0976L7188J50587K41862p491m8658j11263M2398J42509M6160
8276G58989k05089J27046j27572L9423k5406J33660q442j59725J6853j17201N8479
8265D91015J50707k6248J64183k50989J66980j6757J0995O6548J01237j45115
8255G12556K9110P4454m2890Q4991j35553K36938m29414J82598q2310J55432J1232
8244G97144L2650l6276p9303O9066l801j3947O9633j49765J42118j78464J09469
8233G58524j46088J31990j29944K78524n687J017j38358j61274L13107k95494
8223F06317N14399l64090J41310l37720J99256l5615N5066j97688n2022J03917
8213F33130K2039O9447j80476J81275k43842J37368r7064k6335L5188m0769j93638
$$ y = [744786, 356673, 265697, 302885, 453472, 695334, 687843, 639185, 527922, 570320, 712829, 758989, 553900, 680946, 553374, 592797, 567391, 701051, 692609, 532884, 549737, 432536, 491015, 641722, 615474, 779657, 528668, 695648, 678891, 689886, 756434, 857671, 712556, 741666, 816120, 773230, 858221, 722668, 959606, 530192, 712790, 630480, 785912, 797144, 829794, 793518, 714215, 783281, 779480, 765533, 835166, 685401, 827519, 649055, 758524, 612436, 744426, 614482, 893006, 887319, 888336, 749978, 588704, 901811, 606317, 1120716, 756626, 897936, 560216, 759472, 723857, 778923, 581235, 529213, 633130, 655169, 724616, 544140, 725415, 481573, 618941, 521877, 495542, 530730, 489961, 296323]
8202B96323O9859K2578K31270m31046M42769o26705L89863l82756K81499p89920
8192d96266O38293P59542k44654r6825l40115M17276m99205K84097n19214N35817
8182D38746l14821L47550l08250J79519n14992L77470k71519L49705l19516K60392
8172B24284l27911J65515k44739K17869k87866K9045J83749r8297J50278m70400
8162d58473L82088l71727N44363l52281J97362k91686J74098M4681Q9897j01205
8152a42883J33583j89428M05m5208N4591r1283J61494k12011J85913k58879K35945
8141a67761l90172K92515J22163J53881j77809j71874J36767J3138P3323L2604
8131h3225J1049k70235J95449M4723J98449j98961l7672N403L6763J36134j6049
$$ y = [296323, 366182, 388760, 620030, 188984, 631753, 5048, 394911, 12155, 293654, -496266, 142027, 901569, 656915, 560090, 219975, 637251, 138046, 422143, -97071, 438746, 123925, 471475, 163225, 342744, -172248, 205222, -66297, 283408, -36108, 224284, -103627, 61888, -182851, 35018, -252848, -223803, -40054, -138351, 11927, -458473, -76385, -448112, 96251, -256030, -58668, -350354, -176256, -131575, -41678, -142883, -9300, -198728, -198323, -243531, -188940, -280223, -118729, -330740, -144827, -403706, -167761, -557933, -265418, -143255, 10626, -167183, -339057, -202290, -189152, -115829, -83225, -72176, -342411, -146962, -102239, 96210, -102751, -140423, -135020, -98257, 37877, 21828]
8120B1828q7484m8926L2223J57628J6950L0185o5892q3390J01517P8333q8556
8109F4416O2019j80562J46651n1865K03254j69956l7817j53820L18089q8714J20738
8098B32433j88614P9694Q3049N5530p8919j4081j7180J43735l8041J01755k56991
8087A02370m8573N6210N9037k638r5448j18520Q3358K30866P8316J8307l08155
8076E5130M7065m3206J97004k01800J09975j35688m2569Q0826M257m7718K15185
8065B38461p4671j3315J9046J946N9566k00250K12167J01040N5161j80406j59113
8054E9632J85821l8795J85892o5620j3741l50240M99968k05967K37149m62923
8044C1176K59773p9472J29043o4277m6873k8988J26780J8992K3586r9752j40101
$$ y = [21828, -65656, -114582, -82359, 75269, 92219, 122404, 56512, -26878, 74639, 152972, 64416, 126435, -54127, 92524, 40659, 243913, 73957, 36140, -117680, 200409, 111695, 232433, 43819, 123513, 206562, 262092, 183173, 169092, 151912, 295647, 257606, 359361, 102370, 53797, 110007, 169044, 166406, 70958, -47562, 35796, 266662, 344978, 363285, 55130, 102195, 58989, 255993, 54193, 164168, 28480, -14089, 66737, 70994, 23276, 238461, 163790, 150475, 169521, 171467, 231033, 30783, 242950, 343990, 399151, 218745, 59632, 245453, 206658, 392550, 326930, 313189, -37051, 462917, 256950, 494099, 31176, 290949, 211477, 340520, 276243, 229370, 200382, 327162, 346154, 369740, 269988, 129887]
8033A29887J83348o1920K64696l46939M2711k42097M53134o3840K94716l36656
8023C17040K03268l59826K09027j10738K63573j75323R7179l6200k516m6696K49934
8012F08722j07507k1082j63252K37852j07432R5791j03849R0336r2631j01295
8002C35653K4420k13892M26144k84854L82076m99908K46758k30417M86880m28223
7992B44637J48468k13295P5326l3752J65472q6319L325M7319k1837j30594j19110
7981G9640o4192J7112J8163M37526j22092k31127n832J86304p1853o8858K8186
7970B02977M1829J4650J9482O6109j32870l435p1669N4880l8581J24582j62557
7959A15397n0659q5473J94091j40328P5027m2970J39100j19294J68347j61189
$$ y = [129887, 313235, 251315, 516011, 169072, 211783, -30314, 422820, 358980, 653696, 317040, 520308, 160482, 369509, 258771, 522344, 347021, 444200, 408000, 405484, 358788, 608722, 501215, 480133, 316881, 554733, 447301, 543092, 439243, 529579, 436948, 335653, 360073, 146181, 572325, 287471, 669547, 169639, 416397, 185980, 672860, 244637, 393105, 179810, 255136, 221384, 386856, 300537, 303862, 351181, 329344, 198750, 79640, 15448, 32560, 50723, 488249, 366157, 135030, 129198, 315502, 243649, 174791, 202977, 244806, 259456, 278938, 345047, 212177, 208742, 137073, 191953, 153372, 277954, 115397, 64738, -20735, 173356, 33028, 108055, 65085, 204185, 84891, 253238, 92049]
7949I2049J2136k20350K20678q7489J23749k59617P4729j97913J88390K2947J50590
7938A19899r4011R7046j1074p2337p2919J32184R8735j27540Q9583q6694R0910
7927A63782o9138j80626P4997j10328q4196J53245m0198O4675M9811J30462l30606
7916a78120K11996r3665K84067j87522J64919k89776J36113k53113L61870o0175
7906I6594m9069L1196k03268K3703N3460P3476p3272j58653J07488q244J16490
7895I901j41312O205J22272j3544J10884n6617m0811k03987L68926k65596L00116
7884A96437j39493k9142j91939L06687o3145l9106r5975P1166j6093l581P9663
7873G5479J50861p6020n47n9693P9603l8278J35594k2081r2221r3904j81986J74216
$$ y = [92049, 104185, -116165, 104513, 17024, 140773, -118844, -44115, -242028, -53638, -30691, 119899, 25888, 122934, 111860, 39523, -33396, 98788, 197523, 69983, 159566, 72872, 163782, 94644, -85982, -10985, -121313, -205509, -52264, -92462, -27787, 22024, 152486, -178120, 33876, -59789, 224278, 36756, 201675, -88101, 48012, -205101, 156769, 96594, 47525, 78721, -124547, -100844, -47384, 26092, -47180, -205833, -98345, -106589, 9901, -131411, -125206, -2934, -16478, 94406, 37789, -3022, -207009, 161917, -103679, 196437, 56944, 27802, -164137, 142550, 79405, 40299, -55676, 15490, -603, -4184, 75479, 226340, 150320, 149773, 90080, 169683, 131405, 266999, 244918, 152697, 58793, -123193, 51023]
7861E1023k44834M60884k20501J39350k63876K18716m393o6873j03080L4894O9953
7850G1263n9886J74244j27515K05161j73723P9840j59427R5783P7770j84877J21411
7839A20044Q0227J91068j06680k3066j54450J21077j01366J68948j61994n0047
7829H3761q7257J89410j45165Q0948Q7031Q2121j06781q9810O2865p8435K65867
7818C44555k74500L28858k31428J13094j34442J14404j45933O4350k58048J66638
7808H7548J07133K84607k19735j22001l88187P54049L54556l54996l2784m28414
7798D1776K54036q5617K32159l14910L42053l56256K73285k97549K94803k06323
7788A77457N4761r596P2298o1376k03609J70798M0053r6068m3971Q2064j34902
$$ y = [51023, -193811, 267073, 46572, 185922, -77954, 140762, 136369, 69496, -33584, 1310, 71263, 11377, 185621, 58106, 263267, 89544, 169384, 9957, 105740, 183510, -1367, 120044, 200271, 391339, 284659, 261593, 107143, 228220, 126854, 295802, 133808, 83761, -3496, 185914, 40749, 121697, 208728, 290849, 184068, 94258, 157123, 78688, 344555, 70055, 398913, 167485, 280579, 146137, 260541, 114608, 178958, -79090, 87548, 194681, 479288, 259553, 137552, -250635, 503414, 857970, 502974, 470190, 41776, 295812, 210195, 442354, 127444, 469497, 113241, 386526, 88977, 383780, 177457, 232218, 222622, 294920, 233544, 29935, 200733, 240786, 144718, 100747, 182811, 47909]
7777D7909J15834N5622P1092j16041P4484j95116O5323l5959K02599j52651J38102
7766B71198o6664J21894j95757j5308r2480J05759J57017M1604L9919j99804j12030
7755E5348M8777J60214J04645r3816k4638l8060r686K39077p1532k2078j64913
7744A83338J02941p1933L62781j51554R2670q0429q620J7039k41780K54380j57123
7733C01710K36417l14675J53037k27458J89198J69197J96965k42066k09043M7165
7723C00447P1075J83545o4170P3915j15730P1832k4028J51006o3734J19484r2722
7712F10920L10044j178M09642r2127L27470j20130o7634k81169j63304p1424j74581
7701F86529k2588p3507J62479l11070Q1958p5007J81822k11938J75365J4842l0244
$$ y = [47909, 163743, 219365, 290457, 174416, 248900, 53784, 119107, 83148, 285747, 133096, 271198, 204534, 326428, 130671, 115363, 22883, 128642, 285659, 327263, 367182, 167378, 55348, 104125, 264339, 368984, 275168, 250530, 212470, 202784, 441861, 370329, 348251, 183338, 286279, 214346, 577127, 425573, 518243, 437814, 429194, 446233, 204453, 458833, 301710, 538127, 223452, 376489, 149031, 338229, 507426, 704391, 462325, 253282, 300447, 371522, 555067, 490897, 564812, 449082, 520914, 496886, 647892, 584158, 703642, 610920, 920964, 919786, 1329428, 1237301, 1564771, 1444641, 1377007, 1095838, 932534, 861110, 686529, 663941, 590434, 752913, 441843, 523801, 448794, 630616, 418678, 594043, 608885, 578641]
7690E78641K5665J29694J14388j38386j21214K21074j60480J50465K7858M17138
7680A244843q6430J97310J80128J27389j94304j42711n4948j67796j82213j21252
7670H00016o6083p1344K75564o5660q6851o5095K22352k1784k22591j20561K4583
7659F02546K857J01057j65664l8105j07755J73289l02557J07140j2721Q7324j41832
7648C05579K05925K8791K21323J1970N6684n5545k03984p9806K4370p6099o9040
7637C70168R8190K2121k94286J4735P9163R0918j50682l2490R9497p6163j0328
7626B10843p015m8363n6647K02227k21111P5502p8448J76628j16997r1111o5440
7615a9932K47619j94504L2192j21587O8263j48951K91061k65605q1432r6017L54572
$$ y = [578641, 604306, 734000, 848388, 710002, 588788, 809862, 649382, 799847, 827705, 1244843, 1158413, 1355723, 1535851, 1663240, 1468936, 1326225, 1271277, 1103481, 921268, 800016, 733933, 662589, 938153, 872493, 785642, 720547, 942899, 921115, 698524, 577963, 602546, 605403, 706460, 540796, 502691, 394936, 568225, 265668, 372808, 360087, 447411, 305579, 511504, 540295, 761618, 773588, 830272, 774727, 570743, 490937, 515307, 439208, 370168, 468358, 490479, 196193, 210928, 290091, 381009, 230327, 197837, 297334, 221171, 210843, 203828, 155465, 98818, 301045, 79934, 155436, 76988, 253616, 136619, 45508, -19932, 227687, 33183, 65375, -56212, 12051, -136900, 154161, -111444, -192876, -288893, 65679]
7604F5679J04015l26130J93333j27752k5324j08252K64861k34538R6730q859R0572
7593a5665o0988J11592j33758p6668N7125J42982j67988j88368n5685M19688j36135
7582a03868J7970q7459L9152j11414K72954J4945l99210J70058q2267J06766k53892
7571d16265L16252r8515J35547q6512J56413L6017j99710p2553M2861J4047M6571
7560a25847J34571J32972k14267N5743k8178J15999q3107R5470k5140k50635K15896
7549B3477J42819L9682j00765M2656q340r4714L3577J08223j04876n4814J12145
7538A39070n3848m0146K65939L5889N4556k88722K01713r9495J45546o9071l0944
7527B60487j82857O1485R1625k0727M5271r2455Q878k32690K10823K0157R4762
$$ y = [65679, 169694, -156436, 36897, -90855, -116179, -224431, 40430, -194108, -97378, -106237, -15665, -76653, 34939, -98819, -175487, -118362, 24620, -143368, -331736, -387421, 32267, -103868, -85898, -173357, -134205, -245619, 27335, 42280, -356930, -186872, -269139, -162373, -416265, -100013, -198528, -62981, -149493, 6920, 42937, -156773, -229326, -186465, -172418, -125847, 8724, 141696, -72571, -16828, -45006, 70993, -12114, 83356, 58216, -192419, 23477, 166296, 205978, 105213, 147869, 139529, 44815, 78392, 186615, 81739, 26925, 139070, 85222, 45076, 311015, 346904, 401460, 112738, 314451, 214956, 360502, 291431, 260487, 77630, 139115, 230740, 210013, 255284, 162829, 171707, -60983, 149840, 169997, 264759]
7516B64759j16553J35264o7377j5682j77696K11638N7052L1484j696m2106j5338
7505B63749j74125J56096j74702J75912j48066K66258k26932J13649j83105J94960
7495B63694j01098J77542j0873l83398J62547m5023K66077k48664J06777m9454
7485A38127k5004J9492J2538p8728o0544K37941o3152q2059Q2933J18163q8788
7474B10919j26424K15200j63770K18276j04071J92791j60583j64207m1238J54221
7464B31114l5240l127L1754k12226j82108L46817q4823l2450O1129N7848p946
7453A70742j88412K41026j29878J79892j45880N3430q5471N6326M8330L9358j67823
7442G1640j27296L70575j12620J98340j50653J67573j31013J53607l7223j4090
$$ y = [264759, 148206, 283470, 216093, 200411, 22715, 234353, 291405, 322889, 321193, 279087, 263749, 89624, 245720, 71018, 246930, 98864, 365122, 138190, 251839, 68734, 263694, 162596, 340138, 329265, -54133, 108414, 63391, 329468, 80804, 187581, 138127, 113123, 132615, 145153, 66425, 5881, 243822, 180670, 98611, 181544, 299707, 210919, 84495, 299695, 135925, 354201, 250130, 442921, 282338, 118131, 76893, 231114, 195874, 192747, 224501, 12275, -169833, 176984, 92161, 59711, 120840, 178688, 170742, -17670, 223356, 93478, 273370, 127490, 180920, 95449, 151775, 200105, 239463, 71640, -55656, 314919, 202299, 400639, 249986, 417559, 286546, 440153, 402930, 388840]
7432C88840n4311o96J56022k57062J15749j61243L08764k24743J46724k00072
7422B17972J76144l4554J66474l8069N9494j51088k1061j04304R2843m520l6486
7411C22845J64121R6739P1185k62597J73007j42950J27616k4689J79700l88327
7401C16650j84120k057K57787J03520j46642N1155l3193J53246K8417J491O3168
7390F09422k20516J8225j60893J55547J17764o6452j72244O1241P3414J1332j02865
7379C23975R730K15518k85099J86472j79386R0545q8740J84706j27591J44412
7369D74542k13763J24643l24324J10556J61403j87767Q9156q4284K89341k43739
7359A95764J04781k51326J56687n1343J7952n7592j09900n4144O3641L22885k37407
$$ y = [388840, 334529, 333833, 489855, 232793, 348542, 187299, 496063, 271320, 418044, 217972, 394116, 359562, 526036, 487967, 547461, 396373, 375312, 271008, 363851, 359331, 322845, 486966, 583705, 654890, 392293, 565300, 422350, 549966, 525277, 704977, 316650, 132530, 130473, 388260, 491780, 345138, 396293, 363100, 516346, 544763, 546254, 609422, 388906, 407131, 246238, 401785, 519549, 453097, 280853, 342094, 415508, 426840, 323975, 333705, 549223, 264124, 450596, 271210, 361755, 273015, 457721, 330130, 474542, 260779, 385422, 61098, 171654, 333057, 145290, 234446, 150162, 439503, 195764, 300545, 49219, 205906, 154563, 172515, 114923, 5023, -49121, 14520, 337405, 99998]
7348I9998Q6310l74536L44489m6100O5282o543k81205P4201J62672J4664l50538
7337b11306J82348j91580L44353k18548K33438m20399K12067J62108M3512j82298
7327d6305k9846L0131M6004N8038O0722j67286j75782K21410m5948J37745O8197
7316A57080j79866K4880n6393K30402J42192k14742p3637j3581K90744j24987
7306A82092Q4745j60663j0500p0848L39879j27671r031l55463J00489P5340R2840
7295A41209J48318q9471j50961J47614N7754r1510l0708N0440M1414J24588J56300
7284E04987j28309k63480M1832K87166o7055j865k75779L48897j47717K38482
7274E37159j01234o907k55710L89399K54470k6981k44966j4219J07273J10180
$$ y = [99998, 186308, -188228, 156261, 110161, 175443, 168900, -112305, -38104, 124568, 139232, -211306, -28958, -220538, 123815, -94733, 138705, -281694, -69627, 92481, 135993, -46305, -76151, -46020, -16, 58022, 118744, -48542, -224324, -2914, -48862, 88883, 157080, -22786, 2094, -54299, 176103, 318295, 103553, 29916, 16335, 307079, 182092, 266837, 106174, 95674, 24826, 364705, 237034, 228003, -127460, -26971, 48369, 141209, 289527, 200056, 49095, 196709, 254463, 162953, 132245, 182685, 224099, 348687, 504987, 376678, 113198, 155030, 442196, 375141, 373276, 97497, 446394, 298677, 537159, 435925, 429018, 173308, 562707, 817177, 790196, 545230, 531011, 638284, 748464]
7264G48464j5853l29767o6786j53639M07517l01816J35651k04649J00800j34800
7254A85122J97147k12231R5168j59291K30534J30757k13470J33655j34858K5816
7244B78349k23835L23790j86383P3161q0142J64859k33165N0380j05910J4691
7234G5795L739N5076K19975l09881m511L6326P8273R7182j55812q6139k0514O8373
7222E7882k3777N3909k02740R04P4258J25933R3991l0426j45968q2473J20029
7211D1522l9827J56880k06491J39065j22030N7444j14316K10180l05559L88784
7201B05652o4101j02250j85084o7164N8618J6052J50520j82355Q3481j11152K11330
7190A3547k46077J30216k90386J79531M6197N1669P6664j19241M128q5380K03793
$$ y = [748464, 732611, 402844, 336058, 182419, 589936, 288120, 423771, 219122, 319922, 185122, 382269, 170038, 265206, 105915, 336449, 467206, 253736, 387391, 252533, 278349, 54514, 378304, 191921, 265082, 184940, 349799, 116634, 167014, 61104, 75795, 79534, 134610, 354585, 44704, 40193, 76519, 154792, 251974, 96162, 10023, -10491, 57882, 34105, 88014, -114726, -113822, -39564, 86369, 180360, 149934, 3966, -78507, 41522, 1695, 158575, -47916, 91149, -30881, 26563, -87753, 122427, -183132, 205652, 141551, 39301, -145783, -212947, -154329, -138277, 12243, -170112, -86631, -197783, 13547, -232530, -102314, -392700, -213169, -166972, -115303, -38639, -157880, -153752, -239132, -35339]
7179c5339j56018J08301j29425J90581Q5498L5695o9459j03236N5791j08054J77661
7168E1996k30198O9547n8479R2517K6330p8822J53546K7866M1080m4703j46823
7157i6143N3423J23978J00632k00621q9534J77077J43036j3036l7850J8009j73895
7146E076l3301J30220J54149k05885L2048o0706o2036K81505o1364J82021j34039
7135B27688P924j3241N1083j14905J48254R4239p6737J2668o5991J67952j71624
7124B67310M6598o3088n3986J9139N5597J52613r9466M2545J8521j44360J17110
7113C58533k0847P9949k88735K45804j90582P6363J2010J70093k51420J20877
7103C12045r6252J79911K38261j85572j8414j1391J80414o175j25054j50809J3452
$$ y = [-35339, -191357, -83056, -212481, -21900, 63598, 99293, 29834, -73402, -17611, -125665, 51996, -178202, -108655, -167134, -74617, -48287, -127109, 26437, 54303, 95383, 50680, -96143, -42720, 81258, 181890, -18731, -108265, 68812, 211848, 198812, 160962, 178971, 5076, -28225, 101995, 256144, 50259, 82307, 21601, -40435, 241070, 179706, 361727, 227688, 235612, 222371, 273454, 158549, 306803, 401042, 324305, 336973, 270982, 438934, 267310, 313908, 250820, 196834, 215973, 271570, 424183, 324717, 367262, 385783, 241423, 358533, 337686, 417635, 128900, 374704, 184122, 260485, 272495, 442588, 191168, 312045, 215793, 395704, 633965, 448393, 429979, 418588, 599002, 592827, 467773, 316964, 330416]
7092C30416j58150K71327j10609J77763l77145K18612j39330K60837j37626Q1987
7082D18082J2844O5166m6144k7227J24760p3472o6593j22644N6891p7936J3243
7071B76970J85581k20019j444j84553J31022R302R7175Q3426k65047O5950m2219
7060A36144K93217j63850J75138r6766O6898k23374J67702Q51n0287j06292J9850
7049B19231R1685K00950j84868j8532j99036K09202J326n1710R0548j33924K30624
7038D55496n0867K48589k45463K6923k70377J82666l825J32063j44228l328Q5451
7027D13100m209P6848k42427J344O7508J69363j18079j23922m1467n3214J76628
7016C21473k90j35908l3084j60167P3662K11493R1392p0279k7691j14682K07354
$$ y = [330416, 172266, 443593, 332984, 510747, 133602, 352214, 212884, 473721, 336095, 418082, 430926, 496092, 449948, 422721, 547481, 474009, 407416, 284772, 341663, 263727, 276970, 462551, 242532, 241088, 56535, 187557, 196859, 294034, 377460, 112413, 178363, 136144, 429361, 265511, 440649, 343883, 410781, 187407, 355109, 355960, 305673, 199381, 219231, 310916, 511866, 326998, 308466, 109430, 318632, 319958, 268248, 358796, 224872, 455496, 404629, 653218, 407755, 434678, 164301, 346967, 343142, 475205, 330977, 327649, 413100, 408891, 485739, 243312, 244656, 312164, 481527, 363448, 239526, 198059, 144845, 321473, 321183, 185275, 152191, -7976, 65686, 277179, 368571, 298292, 270601, 155919, 363273]
7005C63273P1907j55517k07819M7142K3837L0205O8723J0187j73297J58756k5262
6994B12135Q2576k47281J64842P6505m3469n872r9801J80586j26229J81882j13999
6983B61875p1972k98146J46506J53822P8687L0887j28327o6987m43K88285k09078
6972A85109j63314r7027K68094P0487J30622j80264j37857j38777K23316J27985
6962B88374j17756n7999o2339K50892K3011J52944j42363N502k45209K55517m5622
6951C04952K050j26580M5501m0892M01752L8594l42719r3723J78732J65772Q0941
6940F14380n0276n2568M3718m4652O9354K3403k44516q1891K05883L8034P3812
6929E94681k52539M4607q1141K09639j38365P101o9380R4989J45817J19054j77446
$$ y = [363273, 435180, 279663, 71844, 118986, 142823, 173028, 241751, 251938, 78641, 237397, 212135, 294711, 47430, 212272, 288777, 245308, 239436, 139635, 320221, 193992, 375874, 261875, 189903, -108243, 38263, 192085, 270772, 301659, 173332, 106345, 105902, 394187, 185109, 21795, -75232, 192862, 263349, 393971, 213707, 75850, -62927, 160389, 288374, 170618, 112619, 50280, 301172, 324183, 477127, 334764, 340266, 95057, 350574, 304952, 307002, 180422, 225923, 185031, 586783, 625377, 282658, 188935, 367667, 533439, 614380, 564104, 511536, 555254, 510602, 579956, 603359, 358843, 276952, 482835, 520869, 594681, 342142, 386749, 305608, 515247, 376882, 383983, 314603, 409592, 555409, 674463, 497017]
6918D97017j19313M2294J07134K01069j43276j84031J18597R5042L3645k5628
6908F22550J7960j65162K7464K28804j69202Q4999l65222L9864N0770J87852M6846
6897F07523j57427j7666o7528K82270p4844j54958k10088J87733L1117O648K0938
6886D53718j72860j1749Q514K60539j85757k28684M0032P4247K71831o3051k24702
6875B22078j88470K39718K50175O3752j35297j73738J11407k27399L42907l73112
6865A32021R7171l75364N32462j3397j00816r8238o6034k1160o856J69161k10694
6854C8256K70116k26644J60295r5582J49812l05619J42370j7919K76102k75864
6844A15323j05499l28819M63089N5895K9180l57974l1007O1541J02769K73419
$$ y = [497017, 377704, 419998, 527132, 728201, 584925, 400894, 519491, 614533, 648178, 622550, 640510, 475348, 502812, 731616, 562414, 647413, 282191, 322055, 372825, 560677, 607523, 450096, 432430, 364902, 647172, 572328, 417370, 207282, 395015, 426132, 432780, 453718, 280858, 269109, 277623, 538162, 352405, 123721, 163753, 238000, 509831, 446780, 222078, 33608, 273326, 523501, 587253, 451956, 278218, 389625, 162226, 505133, 132021, 229192, -146172, 386290, 372893, 272077, 173839, 107805, 86645, 79789, 248950, 38256, 308372, 81728, 242023, 146441, 296253, -9366, 133004, 115085, 391187, 115323, 9824, -318995, 144094, 199989, 229169, -128805, -159812, -98271, 4498, 277917]
6834B77917l71670n502l16054M81435j0589R6243m02519J72829K7765Q0093R0885
6823A20833k57952J2455J32202K01434M5866l12998q4245j70172L68994o3337
6813f920K74322k72542n0401K84340n5931N7384l73491J57386j52071N99283n8350
6802D03009l9145j85486j2722R872m5391K44729l35891L5843k85556M61448L8010
6791B88720r0806o4852m3498J99125k0671J39431m30355L9171Q9769K53582j59530
6780B00086j0103n7521J84868J16456L9074j30225r5234q3337L08192j15105N8363
6769D15514k97128O6584Q9273K3469J58629k65483R3707n9716L77901k61025q036
6758C33689j08713J27478k6201q1242O594k04519K57178P9675M9764k37518l4680
$$ y = [277917, -93753, -99255, -415309, 66126, 55537, 151780, -250739, -77910, -50145, 29948, 120833, -137119, -124664, 7538, 208972, 254838, -58160, -142405, -312577, 56417, -6920, 267402, -5140, -55541, 228799, 172868, 230252, -143239, 14147, -137924, 461359, 403009, 363864, 178378, 165656, 175528, 130137, 374866, 38975, 74818, -210738, 250710, 288720, 197914, 133062, 89564, 288689, 268018, 407449, -22906, 16265, 106034, 359616, 200086, 189983, 132462, 317330, 433786, 472860, 342635, 247401, 164064, 472256, 357151, 415514, 118386, 184970, 274243, 297712, 456341, 190858, 284565, 224849, 602750, 341725, 333689, 224976, 352454, 326253, 245011, 251605, 47086, 304264, 383939, 433703, 196185, 161505]
6747A61505J69528N1214J47383j13777K2219k10008K38217n1877j07220k06460
6737A00724J41667J12800J36929m8890N0422k19302m3445l7601j10281P6450q9708
6726F9765K85607k97036J70429k07421P2506j57276J30781k6257J02781m8066
6716I5813j07856K20477p9989J69482p8488J1505k06729K6890P9228p0788L2476
6705I2021j59895J80298j07079R9009k55434O8622m1647J47295j21348m7221L0647
6694a14732j18117J26602l429Q7548j99675K08981p9844J58917l16980k6123o2983
6683c39835J81689q8105J59488j60522M5890m9952J34319j38346n1693j3927J82371
6672a38623r5077K6529q7062m4662J35772J77508r6154k94431J01307J33301J96531
$$ y = [161505, 331033, 382247, 529630, 415853, 438072, 228064, 466281, 414404, 307184, 100724, 242391, 355191, 492120, 443230, 493652, 274350, 230905, 193304, 83023, 159473, 69765, 355372, 58336, 228765, 21344, 93850, -63426, 67355, 41098, 143879, 95813, -12043, 208434, 128445, 297927, 219439, 230944, 24215, 51105, 130333, 59545, 92021, -67874, 112424, 5345, 104354, -151080, -82458, -124105, 23190, -98158, -145379, -114732, -232849, -106247, -109676, -22128, -221803, -12822, -92666, 66251, -250729, -276852, -339835, -158146, -246251, -86763, -247285, -201395, -251347, -117028, -255374, -307067, -320994, -138623, -233700, -207171, -294233, -338895, -203123, -25615, -121769, -416200, -314893, -181592, 14939]
6661A4939N2471p0131o08289K19705L42751K14892l04961M166r6209J74755J64149
6650A08238j45906q6095j26382J67725P1948N5089k98027j1644J37075Q6752K31324
6639A90097k98258m9313k40310M38900p0217J16531l9551M1445j19593j9880K98055
6628B47906k22837J02246r7362K51048k71060L6945j86456N0383J64585K38832
6618C14230j6800k86104m8576l5946L79907m0888o5461j94593n3121J29106K27771
6607C09525k06396L2214L9711O1693j3334M4335j03822k48775J3130K29224J07035
6596B64540j45366j19429K03808J38906j2752k62180J508j02998M4617L65062
6586C75716k16929l76245j34276K62379J57195J32347j73701k76308p0267M84643
$$ y = [14939, 67410, -2721, -611010, -391305, -48554, 166338, -138623, -134457, -230666, -55911, 108238, -37668, -123763, -250145, -82420, -10472, 44617, -253410, -265054, -127979, -41227, 190097, -108161, -157474, -397784, 41116, -29101, 87430, 47879, 89324, -30269, -50149, 247906, 25069, 127315, 29953, 281001, 9941, 46886, -139570, -89187, 75398, 314230, 297430, 11326, -37250, -73196, 306711, 265823, 200362, 5769, -47352, 81754, 309525, 103129, 135343, 175054, 236747, 223413, 267748, 163926, -84849, -71719, 157505, 264540, 119174, -255, 203553, 342459, 329707, 67527, 69035, -33963, 10654, 375716, 158787, -217458, -351734, -89355, 67840, 200187, 26486, -249822, -320089, 164554]
6576A64554J6645r9848k52586J5953k0125L12549j24722k11914m0287J13059K10004
6565H3282l25162L1949k41264L60277k743J01137k54137J09773p8218J30502J84460
6554I9856j03669k9947l04067K46893j8582K30664l53865l2273N1592J58120J24822
6543F9544n5045N7076m4028K8840N954K6650k72047q1431J75919j5937J54325
6532D9820j96775M7327k06984Q9060K76873n2751j19091k36183K80393J26258
6522E7947Q6339k57888R9201j02353K80748k6324l0583k7795L5550O3145k1725
6511A56262N0659k32110R3474J11323J20440j72702r8283j45539M66282q7887
6501B61919J22945k17780M4273j35563K61551n4422R0307k25705J03641L2986
$$ y = [164554, 181199, 81351, -171235, -155282, -175407, 137142, 12420, -199494, -239781, -126722, 83282, -241880, -209931, -451195, -90918, -93661, 7476, -246661, -136888, -215106, -84604, 99856, -3813, -33760, -337827, -90934, -109516, 121148, -232717, -264990, -213398, -55278, 69544, 14499, 71575, 27547, 56387, 62341, 88991, -183056, -264487, -88568, -104505, 49820, -146955, -99628, -306612, -217552, 59321, 6570, -112521, -348704, -68311, 57947, 144286, -113602, -14401, -116754, 163994, 137670, 107087, 79292, 114842, 177987, 156262, 206921, -25189, 68285, 179608, 300048, 127346, 29063, -116476, 349806, 261919, 384864, 167084, 211357, 75794, 337345, 282923, 373230, 147525, 251166, 284152]
6491B84152m4349Q6317p6482K03958j36831K55148k62942J25952j78909J27997
6481C84011j54548J62337k10422K8433j15043K29054J93264M5838j35257p2705
6471C54962k04929j44427K11285N6181p1544j10377J67927J01575m5040m5491
6461B70122j133j03460K22089k7640J3926j44964M2923P2955L8347j38289L1513
6450B76389j23429L4424J77994J41554k09093j48276Q4221Q3137j8977M6008j35809
6439B08143j90354Q1266M8731J68010k80117J10258k9819R7228r7260J63331j79346
6428A00071p4745J61692j10309R0602k60608J88932q7188K61824j29337K1602
6418A62536P7765j28603M1671n7538J50645j80125L9846j16390k2587l8321j48213
$$ y = [284152, 239803, 326120, 249638, 453596, 316765, 571913, 308971, 434923, 256014, 384011, 229463, 391800, 181378, 209811, 94768, 323822, 517086, 562924, 427667, 354962, 150033, 5606, 216891, 273072, 201528, 91151, 259078, 360653, 315613, 270122, 268989, 165529, 387618, 359978, 373904, 228940, 271863, 344818, 383165, 244876, 276389, 152960, 187384, 365378, 506932, 297839, 149563, 233784, 316921, 297944, 343952, 208143, 17789, 99055, 147786, 315796, 35679, 145937, 116118, 213346, 116086, 279417, 100071, 25326, 187018, 76709, 167311, -93297, 95635, 8447, 270271, 140934, 162536, 240301, 111698, 153369, 95831, 246476, 66351, 106197, -10193, -32780, -71101, -219314]
6407b19314J23552P178R7478j37244K59399j59704n2022n4846k6997J01161j75995
6396b37354K23021j99309J70666r2665J83388k84278m8257Q8880K38903k3781
6386A9214j21474j96333O3775l4682K48341k39305Q742j71388L77814j53526m5444
6375b44266J1185J7763P5976j26892K42257l12029K91046j92030L38200m92049
6365c90839Q6271j41139L05017j14314L21509j68770j07555j29409J03253j12032
6355c48008J70784j29908P3974j99840R1760K46503o9601J24687j98890R0485
6345a48054k58627J46956k05965J78284l8768K25118o6986k2791j1925O8610J19783
6334a4365p6497j38584j00475j24761M93780j27265O2779l77876L04419j40695
$$ y = [-219314, -95762, -88584, 8894, -128350, 131049, -28655, -80677, -135523, -162520, -61359, -237354, -14333, -213642, -42976, -135641, 47747, -236531, -284788, -195908, 42995, 19214, -102260, -298593, -234818, -269500, -21159, -260464, -251722, -423110, -45296, -198822, -244266, -233081, -215318, -139342, -266234, -23977, -336006, -44960, -236990, 101210, -390839, -304568, -445707, -140690, -255004, 66505, -102265, -209820, -339229, -235976, -348008, -177224, -307132, -233158, -432998, -341238, -94735, -164336, -39649, -238539, -148054, -406681, -259725, -465690, -287406, -326174, -101056, -168042, -190833, -202758, -134148, -14365, -90862, -229446, -329921, -454682, 39098, -88167, -25388, -403264, -98845, -239540]
6324b39540J57829l4966K60634r8973r5345r838k7989J56261j72736K20871j46814
6313c0606K27630l02101p6247k12052L81824l0410K3209j92386K03845j38298
6303a45592L67597m5337k9932j99231J43134m2850J20371k7135n0447J65N1272
6292A42015O9006n1634J21942o2262L8O4190j88513j6006j9813R2022M4140q2367
6280A12758N9633j11267K63143k90427K46993k01865N8539j83828K44106o405
6270A91380K4077o8009j6508J21643k9428L64Q945M1761O5813k86294K43003k65130
6258C1617K12970j22177J96326j14349o6792J3363l4668l9958o4694L19765j73600
6247A57803J45964l85742L56462j87400K30814j68773Q3157j25517J39574n2649
$$ y = [-239540, -81711, -116677, 143957, 44984, -50361, -60199, -88188, 68073, -104663, 116208, -30606, 197024, -105077, -181324, -393376, -11552, -41962, -18753, -211139, -7294, -145592, 222005, 176668, 146736, -52495, 90639, 47789, 168160, 141025, 90578, 90743, 142015, 211021, 159387, 281329, 219067, 219105, 283295, 94782, 78776, 58963, 150985, 195125, 112758, 172391, 61124, 324267, 33840, 280833, 78968, 137507, -46321, 197785, 191380, 215457, 147448, 130940, 252583, 223155, 223519, 232464, 274225, 340038, 53744, 296747, 31617, 244587, 122410, 318736, 204387, 137595, 150958, 116290, 76332, 11638, 331403, 157803, 303767, -81975, 274487, 87087, 317901, 149128, 232285, 106768, 246342, 193693]
6237A93693O1887j45367J50011j49917Q946J0487N3725J02119Q5441r0281j36797
6226A43947n3503j7944M80262m05749L19140n08725M14404k16101K96179j20703
6216C31207l4612L8385n7619P8579l37810K35558j29743L45172j30249J38123
6206D76991j85221m2465K6993K02137j06116k15658Q9909J15122n7120J73990
6196D78562q4213O9386o1118K01002k17447k7818O5235p715J72233j08735K29248
6185G08620k10754K43915k36353L81436j80107P1911p6040K5255J25232P9760
6175I32875J37929q9830R8009p9718l6498K25608k698n5765j05498J37540M8994
6164A210948Q5093K70J73170K89792k40296M88067m4893L07929R3844N46695L24087
$$ y = [193693, 255580, 110213, 260224, 110307, 119253, 129740, 183465, 285584, 371025, 280744, 143947, 90444, 72500, 552762, 147013, 466153, -42572, 371832, 155731, 451910, 331207, 296595, 334980, 277361, 355940, 18130, 253688, 123945, 469117, 338868, 476991, 291770, 249305, 276298, 478435, 372319, 156661, 246570, 361692, 304572, 478562, 394349, 463735, 402617, 603619, 386172, 358354, 423589, 415874, 588107, 479372, 708620, 497866, 741781, 505428, 886864, 706757, 778668, 702628, 727883, 853115, 932875, 1070804, 980974, 1078983, 999265, 962767, 1188375, 1185677, 1129912, 1024414, 1161954, 1210948, 1296041, 1296311, 1469481, 1759273, 1518977, 2007044, 1962151, 2270080, 2363924, 2910619, 3234706]
6153C234706L66168P73616Q46839Q72850l3263k27944j235170n24762o16423j55473
6143C301144m19339k82921l10945j52794Q7223N4458J36775j26308K25824P4575
6133B587692r4585J10859J57747K7841L93210K30643M89755K32360P23037M48124
6123E306683J155558Q97352J598545J965288K836266K365740R04240q93133k404707
6114A3731832k268676k181479j552717j306130q78649p27079n19403n81608m37336
6105C278755L1461j15873J02016q8729N1370j58063J45222Q9780J85684L43565
6095C865188M02876J23853M55103O49616R52715J078425J421349J950281K277004
6086A3176410K581530J525085p6780k165487k446119k510772j647022j474182
$$ y = [3234706, 3600874, 4374490, 5221329, 6094179, 6060916, 5832972, 4597802, 4073040, 3456617, 3301144, 2881805, 2598884, 2287939, 2135145, 2222368, 2276826, 2413601, 2287293, 2513117, 2587692, 2493107, 2603966, 2761713, 2789554, 3182764, 3413407, 3903162, 4135522, 4858559, 5306683, 6462241, 7359593, 8958138, 10923426, 13759692, 16125432, 17029672, 16136539, 13731832, 11463156, 9281677, 7728960, 6422830, 5544181, 4817102, 4297699, 3716091, 3278755, 3310216, 3194343, 3296359, 3207630, 3259000, 3100937, 3246159, 3335939, 3521623, 3865188, 4268064, 4391917, 4847020, 5496636, 6449351, 7527776, 8949125, 10899406, 13176410, 15757940, 17283025, 17206245, 15040758, 12594639, 10083867, 8436845, 6962663]
6078F962663p31422j158614n03755m66374m80385k86745l06145q4280j02255j06849
6068B735839j25232j73324O1550j4074J17592j04025K07609K2266L27931K38510
6058C294642J92990N01076K79958R69837N58175R44423j78051l09188j044127
6049E209735o07536q25671l08509m30884l91825J4112l90593j66056k24148q8719
6039A789906j49646j9056M3103j10538p9674j25071j45760r885P6761K19923k68181
6028A221882K0199m32560M04861J30317o5311k64504K9414j27437J3785J33503
6018A064149p5844K6814k3986J74035k0242j28675n8431j7705J40709l7640n2896
6007I90288k67141o6871P2330J86395r7315j03577j61822j40374M50325j53336
$$ y = [6962663, 6231241, 5072627, 4568872, 4102498, 3622113, 3335368, 3029223, 2944943, 2842688, 2735839, 2610607, 2437283, 2498833, 2484759, 2602351, 2498326, 2705935, 2728201, 3056132, 3294642, 3487632, 3988708, 4268666, 5238503, 5796678, 6741101, 6563050, 6253862, 5209735, 4602199, 3776528, 3468019, 3037135, 2645310, 2659422, 2268829, 2102773, 1878625, 1789906, 1640260, 1621204, 1664307, 1553769, 1474095, 1349024, 1203264, 1193379, 1270140, 1490063, 1221882, 1242081, 809521, 1214382, 1344699, 1279388, 1014884, 1044298, 916861, 930646, 1064149, 988305, 1015119, 991133, 1165168, 1144926, 1016251, 957820, 940115, 1080824, 1043184, 990288, 723147, 656276, 728606, 915001, 817686, 714109, 552287, 411913, 862238, 708902]
$$ [...]
##END NTUPLES=NMR SPECTRUM
##END=
