##TITLE=1H_DE-80H_X3
 200.13MHz, d2o
 8 sc
 
 19ns.26.2.2025
##JCAMPDX= 6.0         $$ Bruker NMR JCAMP-DX V2.0
##DATA TYPE= NMR SPECTRUM
##DATA CLASS= NTUPLES
##ORIGIN= UXNMR, Bruker Analytische Messtechnik GmbH
##OWNER= pz
$$ XWIN-NMR		Version 3.5
$$ Fri Mar 13 10:34:01 2026 Russian Standard Time (UT+4h)  Yarkov@DPX200
##.OBSERVE FREQUENCY= 200.1313
##.OBSERVE NUCLEUS= ^1H
##.ACQUISITION MODE= SIMULTANEOUS
##.ACQUISITION SCHEME= undefined
##.AVERAGES= 8
##.DIGITISER RES= 18
##SPECTROMETER/DATA SYSTEM= spect
##.PULSE SEQUENCE= zg30
##.SOLVENT NAME= CDCl3
##.SHIFT REFERENCE= (INTERNAL, CDCl3, 0, 15.4351)
##AUDIT TRAIL= $$ (NUMBER, WHEN, WHO, WHERE, WHAT)
$$ ##TITLE= Audit trail, XWIN-NMR		Version 3.5
$$ ##JCAMPDX= 5.01
$$ ##ORIGIN= Bruker BioSpin GmbH
$$ ##OWNER= Yarkov
$$ C:/Bruker/XWIN-NMR/data/yarkov2/nmr/H-C/1/pdata/1/auditp.txt
$$ ##AUDIT TRAIL=  $$ (NUMBER, WHEN, WHO, WHERE, WHAT)
(   1,<2026-03-13 10:33:17.42 +0400>,<Yarkov>,<DPX200>,
      <created by zg, POWCHK disabled, PULCHK disabled
       configuration hash MD5:
       00 E9 B6 7A A2 85 ED C7 34 08 36 98 17 FE 4E 26
       data hash MD5: 16K
       D3 0E A9 75 5B 70 A0 EE D6 CA B9 02 50 D6 C0 52>)
(   2,<2026-03-13 10:33:28.96 +0400>,<Yarkov>,<DPX200>,
      <Start of raw data processing
       efp BC_mod = 2 LB = 0.25 FT_mod = 6 PKNL = 1 PHC0 = -5299.148 PHC1 = 6.821927 SI = 16K 
       data hash MD5: 16K
       56 29 8D 08 E8 2D 62 0C F0 AB C1 16 E0 D9 D4 73>)
$$ ##END=
$$ 
$$ hash MD5
$$ 1F 14 D8 BB DD 8E 34 1F 18 87 F9 17 25 B1 FD 19
##$RELAX= 
##$RELAX= 
##$RELAX= 
##$RELAX= 
##$RELAX= 
##$RELAX= 
$$ Bruker specific parameters
$$ --------------------------
##$DU= <C:/Bruker/XWIN-NMR>
##$EXPNO= 1
##$NAME= <H-C>
##$PROCNO= 1
##$TYPE= <nmr>
##$USER= <yarkov2>
##$AMP= (0..31)
100 100 100 100 100 100 100 100 100 100 100 100 100 100 100 100 100 100 
100 100 100 100 100 100 100 100 100 100 100 100 100 100 
##$AQSEQ= 0
##$AQ_mod= 1
##$AUNM= <au_zg>
##$AUTOPOS= <>
##$BF1= 200.13
##$BF2= 200.13
##$BF3= 200.13
##$BF4= 200.13
##$BF5= 200.13
##$BF6= 200.13
##$BF7= 200.13
##$BF8= 200.13
##$BYTORDA= 1
##$CFDGTYP= 0
##$CFRGTYP= 5
##$CHEMSTR= <none>
##$CNST= (0..31)
1 1 145 1 1 1 1 1 1 1 1 1 1 1 1 1 1 1 1 1 1 1 1 1 1 1 1 1 1 1 1 1 
##$CPDPRG= <>
##$CPDPRG1= <>
##$CPDPRG2= <>
##$CPDPRG3= <>
##$CPDPRG4= <mlev>
##$CPDPRG5= <mlev>
##$CPDPRG6= <mlev>
##$CPDPRG7= <mlev>
##$CPDPRG8= <mlev>
##$CPDPRGB= <>
##$CPDPRGT= <>
##$D= (0..31)
0 0.7 0 0 0 0 0 0 0 0 0 0.03 0 0 0 0 0 0 0 0 0 0 0 0 0 0 0 0 0 0 0 0 
##$DATE= 1773383596
##$DBL= (0..7)
120 120 120 120 120 120 120 120 
##$DBP= (0..7)
150 150 150 150 150 150 150 150 
##$DBP07= 0
##$DBPNAM0= <>
##$DBPNAM1= <>
##$DBPNAM2= <>
##$DBPNAM3= <>
##$DBPNAM4= <>
##$DBPNAM5= <>
##$DBPNAM6= <>
##$DBPNAM7= <>
##$DBPOAL= (0..7)
0.5 0.5 0.5 0.5 0.5 0.5 0.5 0.5 
##$DBPOFFS= (0..7)
0 0 0 0 0 0 0 0 
##$DE= 6
##$DECBNUC= <off>
##$DECIM= 32
##$DECNUC= <off>
##$DECSTAT= 4
##$DIGMOD= 1
##$DIGTYP= 9
##$DL= (0..7)
0 120 120 120 120 120 120 120 
##$DP= (0..7)
$$ [...]
##$SUBNAM2= <"">
##$SUBNAM3= <"">
##$SUBNAM4= <"">
##$SUBNAM5= <"">
##$SUBNAM6= <"">
##$SUBNAM7= <"">
##$SUBNAM8= <"">
##$SUBNAM9= <"">
##$SW= 18.0517328524113
##$SWIBOX= (0..15)
0 0 2 0 0 0 0 0 0 0 0 0 0 0 0 0 
##$SW_h= 3612.71676300578
##$TD= 16384
##$TD0= 1
##$TE= 0
##$TE2= 300
##$TE3= 300
##$TEG= 300
##$TL= (0..7)
0 120 120 120 120 120 120 120 
##$TP= (0..7)
150 150 150 150 150 150 150 150 
##$TP07= 0
##$TPNAME0= <>
##$TPNAME1= <>
##$TPNAME2= <>
##$TPNAME3= <>
##$TPNAME4= <>
##$TPNAME5= <>
##$TPNAME6= <>
##$TPNAME7= <>
##$TPOAL= (0..7)
0.5 0.5 0.5 0.5 0.5 0.5 0.5 0.5 
##$TPOFFS= (0..7)
0 0 0 0 0 0 0 0 
##$TUNHIN= 0
##$TUNHOUT= 0
##$TUNXOUT= 0
##$USERA1= <user>
##$USERA2= <user>
##$USERA3= <user>
##$USERA4= <user>
##$USERA5= <user>
##$V9= 5
##$VALIST= <valist>
##$VCLIST= <CCCCCCCCCCCCCCC>
##$VD= 0
##$VDLIST= <DDDDDDDDDDDDDDD>
##$VPLIST= <PPPPPPPPPPPPPPP>
##$VTLIST= <TTTTTTTTTTTTTTT>
##$WBST= 1024
##$WBSW= 4
##$XGAIN= (0..3)
0 0 0 0 
##$XL= 0
##$YL= 0
##$YMAX_a= 182251
##$YMIN_a= -109214
##$ZGOPTNS= <>
##$ZL1= 120
##$ZL2= 120
##$ZL3= 120
##$ZL4= 120
##$ABSF1= 0
##$ABSF2= 0
##$ABSG= 0
##$ABSL= 0
##$ALPHA= 0
##$AQORDER= 0
##$ASSFAC= 0
##$ASSFACI= 0
##$ASSFACX= 0
##$ASSWID= 0
##$AUNMP= <proc_1d>
##$AZFE= 0.1
##$AZFW= 0.1
##$BCFW= 0
##$BC_mod= 2
##$BYTORDP= 0
##$COROFFS= 0
##$CY= -3
##$DATMOD= 1
##$DC= 0
##$DFILT= <>
##$DTYPP= 0
##$F1P= 0
##$F2P= 0
##$FCOR= 1
##$FTSIZE= 16384
##$FT_mod= 6
##$GAMMA= 0
##$GB= 0
##$INTBC= 1
##$INTSCL= 3.241238e-09
##$ISEN= 128
##$LB= 0.25
##$LEV0= 0
##$LPBIN= 0
##$MAXI= 10000
##$MC2= 0
##$MEAN= 0
##$ME_mod= 0
##$MI= 1.114404
##$NCOEF= 0
##$NC_proc= -8
##$NLEV= 6
##$NOISF1= 3.799351
##$NOISF2= 2.8
##$NSP= 0
##$NTH_PI= 0
##$NZP= 0
##$OFFSET= 15.43508
##$PC= 1
##$PHC0= -5299.148
##$PHC1= 6.821927
##$PH_mod= 1
##$PKNL= yes
##$PPARMOD= 0
##$PSCAL= 0
##$PSIGN= 0
##$REVERSE= no
##$SF= 200.130017335385
##$SI= 16384
##$SIGF1= 3
##$SIGF2= 2
##$SINO= 0.751879
##$SIOLD= 32768
##$SREGLST= <19F.Aceton>
##$SSB= 0
##$STSI= 16384
##$STSR= 0
##$SW_p= 3612.71676300578
##$SYMM= 0
##$S_DEV= 0
##$TDeff= 16384
##$TDoff= 0
##$TI= <>
##$TILT= no
##$TM1= 0
##$TM2= 0
##$TOPLEV= 0
##$USERP1= <user>
##$USERP2= <user>
##$USERP3= <user>
##$USERP4= <user>
##$USERP5= <user>
##$WDW= 1
##$XDIM= 16384
##$YMAX_p= 462353842
##$YMIN_p= -896409
$$ End of Bruker specific parameters
$$ ---------------------------------
##NTUPLES= NMR SPECTRUM
##VAR_NAME=  FREQUENCY,     SPECTRUM/REAL,   SPECTRUM/IMAG
##SYMBOL=    X,             R,               I
##VAR_TYPE=  INDEPENDENT,   DEPENDENT,       DEPENDENT
##VAR_FORM=  AFFN,          ASDF,            ASDF
##VAR_DIM=   16384,         16384,           16384
##UNITS=     HZ,            ARBITRARY UNITS, ARBITRARY UNITS
##FACTOR=    0.220516191357247, 1,           1
##FIRST=     3089.02274283474, 0,            0
##LAST=      -523.694020171045, 0,           0
##MIN=       -523.694020171045, -896409,     0
##MAX=       3089.02274283474, 462353842,    0
$$ Real data points
##PAGE= N=1
##DATA TABLE= (X++(R..R)), XYDATA
$$ [...]
11852c26984L5415j15245j20723l8403K61940J81954k09341Q9531R8146j44371
11842b88081j06767K54083N7680j8980p0722p4156j09475M60584k41704l01304
11832d38842N8316L36082l3968j77616K54679j50132j4770K86759j97286j65594
11822b42372K86342K0890j69517J72019j35049n3036j15450j98453J89099r4657
11812c40184Q0237L7410J37474K27310j26968l18335j09334K51702n2370M389
11802b08669l23807n4107M82899J2661o8362J78592j97140j37680p0722j47282
11792e33617K26084K74976j53007n0205j5897j0233J52265m8853k83068n38l5246
11781d77339J57555K72449j21679p250j60917L5737M6849j49450K7893J75522
$$ plain form
11852 -326984 -291569 -406814 -527537 -565940 -304000 -122046 -331387 -241856 -143710 -288081
11842 -288081 -394848 -140765 -83085 -102065 -172787 -246943 -356418 104166 -137538 -438842
11832 -438842 -380526 -44444 -78412 -256028 -1349 -151481 -166251 120508 -76778 -242372
11822 -242372 43970 64860 -104657 67362 -67687 -120723 -236173 -434626 -245527 -340184
11812 -340184 -259947 -222537 -85063 142247 15279 -303056 -412390 -160688 -213058 -208669
11802 -208669 -532476 -586583 -103684 -91023 -159385 19207 -177933 -315613 -386335 -533617
11792 -533617 -307533 -32557 -185564 -235769 -251666 -261899 -109634 -158487 -441555 -442093 -477339
11781 -477339 -319784 -47335 -169014 -176264 -337181 -301444 -254595 -404045 -376152 -200630
11771b00630O1952R8749J63353j03766j06669j18805l0048K59680k8547j77869
11761a82600j83670j42880M50L81121j07916j36629M7011J9986k70832Q1855L62461
11750a31643K26818q5166j85425q9608n6242K2349R5494J14729J52875l2838l05302
11739b73959j52647O9647K43781j41151j20819j07275O3984K6336J32102m4488
11729c04489P1146j70779r5091J24794J06174k05046J04401L20570k46453j14828
11719d09601J05097K22773M8196k5021l9570j79748K3961q7199m8474N3327j41095
11708d77354J03132L11862K64676j37511k88427J75904R5724l30608K60731J021
11698b0850n0216j1833j47765L6540j83264j43712L1436J30630J99547Q0252Q8079
$$ plain form
11771 -200630 -138678 -39929 123424 19658 -87011 -205816 -235864 23816 -4731 -182600
11761 -182600 -366270 -509150 -508700 -127579 -235495 -372124 -325113 -305127 -575959 -494104 -131643
11750 -131643 95175 10009 -175416 -265024 -321266 -298917 -203423 -88694 64181 31343 -273959
11739 -273959 -426606 -356959 -113178 -254329 -375148 -482423 -418439 -392103 -260001 -304489
11729 -304489 -233343 -404122 -499213 -374419 -268245 -473291 -368890 -48320 -294773 -409601
11719 -409601 -304504 -81731 -33535 -58556 -98126 -277874 -253913 -341112 -389586 -336259 -477354
11708 -477354 -374222 -62360 202316 64805 -223622 -47718 48006 -282602 -21871 -20850
11698 -20850 -71066 -82899 -230664 -194124 -377388 -521100 -489664 -359034 -159487 -79235 8844
11687H844k89889l65499P1442K17458K44217Q9351k39623J08648l4311k46022
11677d35384J70204k68367J52480O7236j86265m381L6284Q2721j79591M9292J138
11666e14633k4849q562J73041R7504K70954j4925l04905l31647j06050J62399
11656f01673M06083L0498k78176K30364k3900J18271J95695j44921N1427j07362
11646a23694j34941L27060J06324k65035R1313o9344l78007K6577L61100J85892
11636A27245k47051J02897L2893k73437n5914L6934N8078q032j3425j62338J23643
11625b78507K7470J40761K9189q8053k695j65606n2136j74123J18938M03421j83022
11614b24363M5974j0788K96955R119r8182m8605q5402K72554l66782K12053j17341
$$ plain form
11687 8844 -281045 -646544 -575102 -357644 -113427 -24076 -263699 -155051 -189362 -435384
11677 -435384 -265180 -533547 -381067 -313831 -500096 -504477 -468193 -385472 -565063 -515771 -514633
11666 -514633 -539482 -548044 -375003 -277499 -6545 -21470 -326375 -658022 -764072 -601673
11656 -601673 -195590 -165092 -443268 -212904 -236804 -118533 77162 -67759 -16332 -123694
11646 -123694 -258635 68425 174749 -90286 1027 -68317 -446324 -419747 -58647 127245
11636 127245 -119806 -16909 15984 -257453 -313367 -276433 -218355 -226387 -239812 -402150 -278507
11625 -278507 -251037 -110276 -81087 -169140 -171835 -337441 -389577 -563700 -444762 -41341 -224363
11614 -224363 -178389 -189177 107778 116897 18715 -29890 -115292 157262 -209520 2533 -114808
11603a14808j56244R700L5716k01433J90082M3225l00479J17103K07521j45899
11593c15516n1836j39013j68350M71753m7215J63324N6245j51376J1740J8686
11583a51558k8908P5856q6659k7931J0494p6562n3317m7563r4128J35977K9285
11572c15014j39545K43953Q2561k62168j32353L23509J69215j31727j16520m9679
11562c27768K3547m6726J21714K1216k98733J23971J8962J06858L6541J08739
11552a11679k67143k9920J50395P4013j38977Q0566M1031J4630k16259k62509
11542f65852J38985J90404J32359j85917r5936M43440m9698j74065n9556r4684
11532d20520J92560J72202J26926k5014j55393k74064K7507K9233K7268j8682
$$ plain form
11603 -114808 -271052 -261352 -225636 -427069 -236987 -193762 -494241 -377138 -169617 -315516
11593 -315516 -367352 -506365 -674715 -202962 -250177 -86853 -30608 -181984 -170244 -151558
11583 -151558 -180466 -104610 -191269 -219200 -208706 -285268 -338585 -386148 -480276 -344299 -315014
11572 -315014 -454559 -210606 -128045 -390213 -522566 -199057 -29842 -161569 -278089 -327768
11562 -327768 -304221 -350947 -229233 -208017 -506750 -382779 -363817 -256959 -220418 -111679
11552 -111679 -378822 -408742 -258347 -184334 -323311 -242745 -201714 -187084 -403343 -665852
11542 -665852 -526867 -336463 -204104 -390021 -485957 -42517 -92215 -266280 -325836 -420520
11532 -420520 -227960 -55758 71168 46154 -109239 -383303 -355796 -326563 -299295 -317977
11522c17977j24416J24301j70451J54981N388l04649J81763P8534n7336q6288
11512e16150J5460J7679J36218K83807j46209k8331j5880J92130j07254R3240
11502g5290j89852j15630K51076j42219j39261m7225R3664J58464N6279j84472
11492c34466j1311r7259Q7580J93569J86735K1794O6991j87345J21436k4610J57396
11481A80510q6769j68190k60853N197J35014K70059r4371L2175k09785j15639
11471c12652O5771J81897q5293p3474l13738j77989J88015J39716m7235j08360
11461e43342j965J09666k1141k9689Q2363J15691P4876M0857K8792r208K49654
11450I6554j36707j48520q3040r5688j06044l6603K53533J51953J45744J0860
$$ plain form
11522 -317977 -442393 -318092 -488543 -333562 -328174 -632823 -451060 -372526 -429862 -516150
11512 -516150 -500690 -483011 -346793 -62986 -209195 -237526 -253406 -61276 -168530 -75290
11502 -75290 -265142 -380772 -129696 -271915 -411176 -458401 -364737 -206273 -149994 -334466
11492 -334466 -345777 -443036 -355456 -161887 24848 46642 113633 -73712 47724 23114 180510
11481 180510 93741 -74449 -335302 -330105 -195091 74968 -19403 12772 -197013 -312652
11471 -312652 -246881 -64984 -150277 -223751 -537489 -715478 -527463 -387747 -434982 -543342
11461 -543342 -545307 -435641 -456782 -486471 -404108 -288417 -213541 -172684 -143892 -153100 96554
11450 96554 -40153 -188673 -271713 -367401 -473445 -510048 -256515 -104562 41182 52042
11440E2042j74053k88137K17663K17003m06871R1890J63174l91504K65232K34266
11430a9295p9187P5741p7478J69148l1399n7232l27483J64507Q8870K30431j89076
11419e2453k01493O1426P9264p4120J01058n7837n1227J0531j79025m5153M01585
11408g444r7488Q3332L5645k9829n6282p7647J41982j05969J3593j98664k15571
11397e14342J25373O6727J32117n3091K28014P0109j1010j11245l62223K7027
11387d02544j28329j9779K6379J21212j431J94743J75789n0623j52818k42813
11377d80214n6644J75562K47685q499q3059j62728p0289K60745K1466J77168O0314
11366H1507j99365m9039J84j78048J18985J13503K3570l260q4215k64467l57678
$$ plain form
11440 52042 -122011 -410148 -192485 24518 -382353 -290463 -127289 -518793 -253561 -19295
11430 -19295 -98482 -22741 -100219 68929 37530 -19702 -347185 -182678 -93808 136623 -52453
11419 -52453 -253946 -192520 -113256 -187376 -86318 -144155 -195382 -184851 -363876 -409029 -7444
11408 -7444 -104932 -21600 14045 -15784 -72066 -149713 -7731 -113700 -100107 -298771 -514342
11397 -514342 -388969 -322242 -190125 -243216 -15202 54907 43897 -67348 -429571 -402544
11387 -402544 -530873 -550652 -524273 -403061 -404492 -209749 -33960 -84583 -237401 -480214
11377 -480214 -536858 -361296 -113611 -122110 -205169 -367897 -438186 -177441 -155975 21193 81507
11366 81507 -117858 -166897 -166713 -344761 -225776 -112273 -88703 -91963 -176178 -440645 -798323
11355g98323L15604K52986q4108K584K62015P8555q284J97035j33193l13131k25546
11344d53806J16428k8960J78761R3526M2285k17332o9789R4302j80945j68729
11334e94259L29263K13222Q0077q7020P7374R6307n7386m6032P1087J07159k35751
11323d5959p5149J13425M8749j17511Q651k22872l4510J69478k19334L2834J98798
11312a43400k4629j12843k91953N0813L6902K79799K59712K2037p4524k00389
11302a98475K18268j75451l1395P5920j90942O7083L42014j30348n9757j38792
11292b21875n0206K67386J00984j13820k43207k7534J73639K14245k43166R4040
11282d9514L37177j49077l19079j62958K39520J25638j61827k8165k82044J04936
$$ plain form
11355 -798323 -482719 -229733 -313841 -311257 -49242 29313 21029 218064 84871 -228260 -453806
11344 -453806 -337378 -366338 -187577 -94051 -51766 -269098 -338887 -244585 -425530 -594259
11334 -594259 -264996 -51774 28303 -58717 18657 114964 57578 11546 82633 189792 -45959
11323 -45959 -121108 -7683 41066 -76445 -67794 -290666 -325176 -155698 -375032 -342198 -143400
11312 -143400 -168029 -280872 -572825 -522012 -485110 -205311 54401 76438 1914 -198475
11302 -198475 19793 -155658 -187053 -111133 -302075 -234992 107022 -23326 -83083 -221875
11292 -221875 -272081 -4695 96289 -17531 -260738 -288272 -114633 99612 -143554 -49514
11282 -49514 287663 138586 -180493 -343451 -103931 21707 -140120 -168285 -450329 -345393
11272c45393n2679R4314J07945L07217l00971j99111R6665J40091l0385L3353
11262a48954o6333m0872J16653j00553l283P3111K9279L2677m9240K82843o1441
11251F3887m87854q6156L00327K8934L34092j95332m26973K062P1090o8965J41957
11240c22931J12674k9458J79215k18488J31326J4376M6109j77451J930j64909
11230d27607J57477J20032L32373l3556m60819L47025J6710k75574j69069Q8051
11220c04957l86741m045K67790j1530j21862r2036K54091J66136j42997j5829
11210c91980M46668o6100m0445m2370Q1496Q9473j96436k72142k1916J1209K1809
11199c80734K9883K50766n9369L1429J41818k14559p6186R8300j34557J06618
$$ plain form
11272 -345393 -398072 -303758 -195813 111404 -189567 -388678 -292013 -151922 -182307 -148954
11262 -148954 -215287 -256159 -139506 -240059 -243342 -170231 -140952 -108275 -157515 125328 63887
11251 63887 -423967 -510123 -209796 -180862 153230 -42102 -469075 -467013 -395923 -464888 -322931
11240 -322931 -210257 -239715 -60500 -278988 -147662 -133286 -87177 -264628 -262698 -427607
11230 -427607 -270130 -150098 182275 148719 -312100 34925 51635 -223939 -393008 -304957
11220 -304957 -691698 -695743 -427953 -439483 -561345 -653381 -399290 -233154 -376151 -391980
11210 -391980 54688 -11412 -51857 -94227 -12731 76742 -119694 -391836 -413752 -402543 -380734
11199 -380734 -350851 -100085 -159454 -128025 13793 -200766 -276952 -178652 -313209 -206591
11189b06591M3604K65863j64245J38504k45025l86501l8532K67466K05674j04172
11179b23955J87666r1267l78663o6876L98366j04474l05484J64019j64741O1536
11169e23873j32294L33334L9979J92283J43336j22828j60888j39763P3402j27455
11159d24767m0793l76P8454n6680K8224J85927K2630k66402n3884r3405K1004
11148f00068J27132K50637m4466k5021k884K88232m7465l9171l66311M6612K03963
11137b08810K52165j39202j45140r9327P3229j61019r6417L51514J64851o2653
11127g0809l03152k11131L11384o6281l2846L83733j27866j98991k8582M7311
11117b97230P0318l0477j11225j89150K42392K57869J39143K9102k86165j29221
$$ plain form
11189 -206591 -162987 102876 -61369 77135 -167890 -554391 -592923 -325457 -119783 -223955
11179 -223955 -36289 -127556 -506219 -573095 -174729 -279203 -584687 -420668 -585409 -523873
11169 -523873 -656167 -322833 -282854 -90571 52765 -70063 -230951 -370714 -297312 -424767
11159 -424767 -465560 -465936 -387482 -444162 -415938 -230011 -207381 -473783 -527667 -621072 -600068
11148 -600068 -472936 -222299 -266765 -291786 -294670 -6438 -53903 -93074 -459385 -412773 -208810
11137 -208810 43355 -95847 -240987 -340314 -267085 -428104 -524521 -173007 -8156 -70809
11127 -70809 -373961 -585092 -273708 -339989 -372835 10898 -116968 -315959 -344541 -297230
11117 -297230 -226912 -257389 -368614 -557764 -315372 -57503 81640 110742 -175423 -304644
11107c04644J45305k28672j19479k045P2660J45357j85500K44712P8778j64275
11097c17803N6016M1744Q6215J02246k0881l2686j330r8653K0817N9255j51707
11086b56767K6906P7045k57560J50898K11707m2405j24527K67939J20918k48569
11076g4415l28736K71427J23777J06242k51061k54764J14721K60093j1625k09615
11066b53956n3526J13647K5414j78040O1427r2713j12989K34072j09750r3644
11056d60058J87113l8652K19378M2355j28043j34131J64675k77373K47728j15758
11046b92766n3337k8493J52011K17507N7751l58592J53245j6887j27492l968j54388
11035d55409l548K85198j41014J66501J12898m1225k21049P4828R6003k14817
$$ plain form
11107 -304644 -159339 -388011 -507490 -509535 -436875 -291518 -477018 -232306 -153528 -317803
11097 -317803 -261787 -220043 -133828 -31582 -52463 -85149 -86479 -185132 -164315 -105060 -256767
11086 -256767 -229861 -152816 -410376 -259478 -47771 -90176 -214703 53236 174154 -74415
11076 -74415 -403151 -131724 -7947 98295 -152766 -407530 -292809 -32716 -44341 -253956
11066 -253956 -307482 -193835 -168421 -346461 -285034 -377747 -490736 -256664 -366414 -460058
11056 -460058 -272945 -311597 -92219 -49864 -177907 -312038 -147363 -424736 -177008 -292766
11046 -292766 -346103 -374596 -222585 -5078 52673 -305919 -152674 -169561 -297053 -301021 -455409
11035 -455409 -458957 -173759 -314773 -148272 -35374 -76599 -297648 -222820 -126817 -341634
11025c41634K20255j50938Q4732M7521n2720J0994N7237m79864L45354K7293j24111
11014c55881j6898O0411J18351j70669j40474k63725K89444K44977o8922j27968
11004d31354J6679L33621O3099p0655l3333M9686o7624j70712j31416K90289J2888
10993a38832j53821q7619P011m0260J33375j4096k47797Q1789P7557m548k07798
10982e95039j8656K62811m227k38424K46836K85108j5478k28688J30186q0398
10972b55969P3286l4063j5899Q6752Q9064k93649M2N444N1169n0889j81004l1976
10960e57692r7457J23481N77814o48j46744k04856j33075j08795J27904L15706
10950a04362r8702j70499j5304J56005P1950J10722K11609J31874l41672j64241
$$ plain form
11025 -341634 -121379 -272317 -187585 -140064 -192784 -181790 -124553 -604417 -259063 -231770 -355881
11014 -355881 -372779 -312368 -194017 -364686 -505160 -768885 -479441 -234464 -303386 -431354
11004 -431354 -414675 -81054 -17955 -88610 -121943 -72257 -139881 -310593 -442009 -151720 -138832
10993 -138832 -292653 -380272 -373261 -413521 -280146 -294242 -542039 -460250 -382693 -387241 -595039
10982 -595039 -613695 -350884 -355111 -593535 -346699 -61591 -77069 -305757 -175571 -255969
10972 -255969 -182683 -216746 -232645 -145893 -56829 -350478 -350436 -344992 -293823 -344712 -525716 -557692
10960 -557692 -655149 -531668 46146 45498 -101246 -306102 -439177 -547972 -420068 -104362
10950 -104362 -203064 -373563 -388867 -232862 -160912 -50190 161419 293293 -48379 -212620
10940b12620j18911R5566q2280j0095Q2660J54039k09797j637K3511P0370J5512
10929a93682p2080m5904j53976p9948q7878K39786L21690J32471M5153k16401
10919a10769j7349j73323K32167J28068O5295n0421j68479l9172j89700K4368
10909b99315J22979J09152M10m5385o7307J13454n4748j26660K67940L4120k09827
10898a55187k63376N2255m4863Q4538j70039j48964L63263M14655k03669j40471
10888b11858R7839Q9887j38974K47831N4425l99705K04500L664j05989j38438
10878b96818m2796M919J22484J51670j65574J6487J85056k58020J48871l8025
10868a71746k3700J64243j95632j04117J2063q6131L2108j4021J58138R9066r2061
$$ plain form
10940 -212620 -331531 -235965 -318245 -328340 -245680 -91641 -301438 -303075 -279564 -209194 -193682
10929 -193682 -265762 -311666 -465642 -545590 -633468 -393682 -71992 60479 105632 -110769
10919 -110769 -128118 -301441 -69274 58794 124089 73668 -94811 -133983 -323683 -299315
10909 -299315 -176336 -67184 -66774 -112159 -179466 -66012 -120760 -247420 20520 54640 -155187
10898 -155187 -418563 -366308 -411171 -326633 -496672 -645636 -282373 132282 -71387 -211858
10888 -211858 -114019 -24132 -163106 84725 139150 -260555 -56055 -52391 -158380 -296818
10878 -296818 -339614 -334695 -212211 -60541 -226115 -209628 -24572 -282592 -133721 -171746
10868 -171746 -195446 -31203 -226835 -330952 -318889 -405020 -372912 -386933 -228795 -129729 -221790
10857b21790K20472m9632j75946M3526q5570K15974j02440p6669J36214j82598
10847b78459k31036J88364Q5708l55131O1726O8261J65903l5583j25846P0633
10837c85460k3782K26242J80338j99593j59728J34800K63886j05072l838P0005
10827b202j9697j46208P7398J4844j97280J95016j35398j6278j39549J31879J715
10816b35760l7902k15281K10878K86785k72788k09898Q3913M12269K6001l00319
10806b52102j01908J1593m6415J83636p7776j9483L9378k7447K32486j35041n2527
10795b45606J4982m6604O9977R8617O8147k166j44492k9420J43007J21189j1090
10784C6541L4750J49364l34169n3952n3501J34454J1004k36138p5509P397L88750
$$ plain form
10857 -221790 -1318 -50950 -226896 -183370 -268940 -52966 -155406 -232075 -95861 -278459
10847 -278459 -509495 -321131 -235423 -590554 -528828 -460567 -294664 -330247 -456093 -385460
10837 -385460 -409242 -183000 -2662 -202255 -361983 -227183 36703 -68369 -72207 -2202
10827 -2202 -21899 -168107 -90709 -75865 -273145 -78129 -213527 -229805 -369354 -237475 -235760
10816 -235760 -273662 -488943 -278065 8720 -264068 -473966 -390053 22216 48217 -252102
10806 -252102 -354010 -342417 -388832 -205196 -282972 -302455 -263077 -290524 -58038 -193079 -245606
10795 -245606 -230624 -277228 -207251 -108634 -40487 -42653 -187145 -216565 -73558 47631 36541
10784 36541 71291 220655 -113514 -167466 -220967 -86513 -75509 -311647 -387156 -379759 8991
10773H991l5280j02427n2507k97453k1544J20666j9747Q7336m4531L16152l19512
10762c59856j67303L66086r1109q4769L2676j43176n1086j4970k1855r6897j40430
10751g72689K47320p446K71749k66991K2188L40316k14280J2052J76702L3992
10741a57087Q4510o7832k91967R6393p9055J32912O114J18173l4535m8072l9908
10730b80354O6129K7836M8802J82161m65932M5002N8196R4772k08901N3171j10874
10719d89992O937P0123M57274N5622k11127j14942Q4795j62513J30438k11160
10709c84545j41885L54827q7638J5399k56177K00544L11633j10794j23642J66830
10699e5448j14347m0602Q7690j53022n22744J30256K93129j88964J20527K96831
$$ plain form
10773 8991 -26289 -128716 -181223 -478676 -500220 -379554 -399301 -311965 -356496 -40344 -359856
10762 -359856 -527159 -161073 -252182 -336951 -304275 -447451 -498537 -513507 -535362 -632259 -772689
10751 -772689 -525369 -532815 -261066 -528057 -505869 -165553 -379833 -367781 -191079 -157087
10741 -157087 -72577 -140409 -432376 -335983 -415038 -282126 -276012 -157839 -192374 -240446 -280354
10730 -280354 -214225 -186389 -137587 44574 -421358 -376356 -318160 -223388 -432289 -379118 -489992
10719 -489992 -483055 -412932 44342 99964 -111163 -226105 -141310 -303823 -173385 -384545
10709 -384545 -526430 -171603 -259241 -243842 -500019 -299475 12158 -98636 -222278 -55448
10699 -55448 -169795 -210397 -122707 -275729 -798473 -668217 -375088 -564052 -443525 -146694
10689a46694j64919j52791L706K61181l5109M0915j94563K79037k1088k13530
10679c43855j01156j51051M54405M7548M1833r1461n77233K15840J8353q9420
10669e76197J87899L7557j11769K71717O3417R4617k2506m27044j48705P8266
10659e52748N5200J41452L19852k15724p2050M7191J56750M8326J2331l34817
10649c94237r6515K83708O9130m27127M9600K35863K13059k33963n9696J62803
10639a97375J00735k0464k95754L12236K50557j93972q5181M9909j33924j0051
10629b23284J79151k46169L1007j57636m5997L00960Q7434j95868j67361O121
10619d31642K79526Q5861o5499p8231L3370J56052K14071p7124J68648j24603
$$ plain form
10689 -146694 -311613 -464404 -460698 -199517 -234626 -193711 -388274 -109237 -130325 -343855
10679 -343855 -445011 -596062 -141657 -94109 -52276 -143737 -720970 -505130 -486777 -576197
10669 -576197 -388298 -350741 -462510 -190793 -127376 -32759 -55265 -482309 -631014 -552748
10659 -552748 -497548 -356096 -36244 -251968 -324018 -276827 -120077 -71751 -59420 -394237
10649 -394237 -490752 -207044 -137914 -565041 -515441 -279578 -66519 -300482 -360178 -197375
10639 -197375 -96640 -117104 -412858 -100622 149935 -44037 -129218 -79309 -213233 -223284
10629 -223284 -44133 -290302 -259295 -416931 -462928 -161968 -74534 -270402 -437763 -431642
10619 -431642 -152116 -66255 -131754 -209985 -176615 -20563 193508 116384 285032 160429
10609A60429k42126j78936k24017j47549J65915K22890J53576n4730k06460o6548
10599d17556j48431J80070M0682Q6898k4718N6382j4120O8848q8680K46281j25855
10588a40199L934j8276K48379N5218j73793k05463k03374j81831M10649L50491
10578A45735K003m17839o0488O7810k38969O7365J22928J2449j4699k59213K68617
10567c04301N334j57791K49486k3419j90810k4171K54398j25451q7414L6772k8754
10556c96121K61299L8611j77989K77712j60854j8361j05650J786o6595j00690
10546d46852R5592J76637j82165J44950N8750K2319j08705k9436l9058j28486
10536d36454K7786J53569K32674k98110J85555o1113m3983K3557j24564o7542
$$ plain form
10609 160429 -81697 -260633 -484650 -632199 -466284 -243394 -89818 -144548 -351008 -417556
10599 -417556 -565987 -385917 -345235 -258337 -283055 -226673 -240793 -171945 -260625 -14344 -140199
10588 -140199 -136265 -154541 93838 149056 -24737 -230200 -433574 -615405 -204756 145735
10578 145735 147738 -270101 -330589 -262779 -501748 -434383 -311455 -299006 -313705 -572918 -304301
10567 -304301 -298967 -456758 -207272 -230691 -421501 -445672 -191274 -316725 -404139 -367367 -396121
10556 -396121 -134822 -96211 -274200 3512 -157342 -175703 -281353 -279567 -346162 -446852
10546 -446852 -351260 -174623 -356788 -211838 -153088 -130769 -239474 -268910 -307968 -436454
10536 -436454 -408668 -255099 -22425 -320535 -134980 -196093 -240076 -216519 -341083 -408625
10526d08625p1103K15896J37397j7117J36575k60017j0561J16199K5240M9376
10516h6740j13240j04421j26468k0659J83449J12669l58985J29640N3051J03365
10506b28339j9522J73224q9487J9405k356j78148O5010k31786R4781J46571K7203
10495b23444p1018m1350J92581K615K40254l4305l9792R5569l94368l5684l28874
10484f37816K1847L62885N5561k22483k4294j7158O1166O3103J9600n1596j55562
10473e24747J18862K74671L5402l07318J89189o6132J50966k03682k69397J47530
10463d54656L69034M6603J28927J82837k78041m1595J73368J95499k19193j79530
10453g6747M4207Q5971k34160J28263n9406r4194J98472j51468j86920M09317
$$ plain form
10526 -408625 -479728 -263832 -126435 -143552 -6977 -266994 -277555 -161356 -136116 -86740
10516 -86740 -199980 -304401 -430869 -451528 -268079 -155410 -514395 -384755 -331704 -228339
10506 -228339 -247861 -74637 -164124 -144719 -147075 -325223 -260213 -491999 -397218 -250647 -223444
10495 -223444 -294462 -335812 -143231 -140616 99638 65333 25541 121110 -273258 -308942 -637816
10484 -637816 -615969 -253084 -197523 -420006 -444300 -461458 -400292 -337189 -317589 -369185 -524747
10473 -524747 -405885 -131214 -95812 -403130 -213941 -280073 -129107 -332789 -602186 -454656
10463 -454656 -85622 -39019 89908 272745 -5296 -46891 126477 321976 102783 -76747
10453 -76747 -32540 53431 -180729 -52466 -111872 -206066 -7594 -159062 -345982 63335
10443F3335K83364j91341j02482J3674j73875j21371O4555j37995j70715q3834
10433e56685N7517M96427Q5780K52468k61438n94592P6245p6597L10782Q4644
10423a25449j24083L97573k83553j47228J46883j24386N8942j06131P1025j22903
10413c59310K6806j55262J65871k6498j57066J8395R3562M3936m9397K33791P6386
10402h8786p8485J0354j12069L28321n5750j34873J73622l682n3932k49371K053
10391b62598J25538q2100j23650J44448K7834K70869k91495o4774n1057j25709
10381d32694j58339L60461J96134J0157P0709k06807k4344J005O0134M0173K79963
10370A96552l14762l25046Q8253n2433K50661j5012l5126J91865N1742N996N7524
$$ plain form
10443 63335 346699 155358 52876 66550 -107325 -228696 -164141 -302136 -472851 -556685
10433 -556685 -499168 -2741 83039 335507 74069 -520523 -444278 -520875 -210093 -125449
10423 -125449 -249532 148041 -135512 -282740 -135857 -260243 -201301 -307432 -236407 -359310
10413 -359310 -332504 -487766 -321895 -348393 -505459 -487064 -393502 -349566 -398963 -165172 -88786
10402 -88786 -167271 -156917 -268986 59335 3585 -131288 42334 38652 -15280 -264651 -262598
10391 -262598 -137060 -219160 -342810 -198362 -170528 100341 -191154 -255928 -306985 -432694
10381 -432694 -591033 -230572 -34438 -24281 46428 -160379 -184723 -183718 -123584 -83411 196552
10370 196552 -118210 -443256 -355003 -407436 -156775 -171787 -206913 -15048 36694 42690 100214
10359A00214j26999j02083J12236r2521k99089p5710J99486k5873R297J36754
10349a64288L14073o5377j99559j65896L5664L27848J12331j96024K6535J19219
10339A44526J24209p2904j36818j34411K8257k0308J15789L4304l8781N0358k95013
10328b00792J2914M4097Q9029n072p0935J13211j76645j76030q0554O9800K62960
10317a18017J7169j69153J05974L2277O030O526n5443j15708Q2951j99917r4289
10306e01600L70777j8788l8143L8601O8152j04970Q9060k793j33635Q2712K11831
10295F1204J281j61061O566k30853Q5634L7356l0137J98897R4904k31751r2424
10284b60384K17680j29135m9654o6477J96364J82364r9645N5078j25471n3668
$$ plain form
10359 100214 -26785 -128868 -16632 -109153 -408242 -483952 -284466 -310339 -301042 -164288
10349 -164288 149785 84408 -115151 -281047 -245383 82465 194796 -1228 25307 144526
10339 144526 268735 195831 59013 -75398 -47141 -67449 48340 82644 43863 94221 -200792
10328 -200792 -187878 -143781 -54752 -59824 -130759 -17548 -194193 -370223 -450777 -380977 -118017
10317 -118017 -100848 -270001 -164027 -131750 -125720 -119194 -174637 -290345 -207394 -407311 -501600
10306 -501600 -130823 -149611 -187754 -149153 -81001 -185971 -96911 -99704 -233339 -150627 61204
10295 61204 62485 -98576 -92010 -322863 -237229 -199873 -230010 -31113 63791 -167960 -260384
10284 -260384 -42704 -171839 -221493 -287970 -91606 90758 -8887 46191 -79280 -132948
10274a32948J52248K31405k42138O5418q3763k92373j40077L25170Q7716m31377
10264d60719r4420J1894J98655K74331j38127l60792J19750j12412L03309J63937
10254i4594M9507l70765l5665J78638P6132J39433q9694k12340o8648K40750k4497
10243b11743k9563J8430j55612K98507K4386J7788j13112K12078J147k27389L09804
10232A44721l9324j61138k06757k25746O4826J54688n7279l0676r1881J50641
10222b97925M7289l9755J93678J45489j34118k9647J34671j26719J15385k12665
10212b04317m90060K94530K19493J16480N0969q666P2851j41365N9832j94397
10202b24650l47059K4645M8807J46068J58974j34103K84297K13755n037k01094
$$ plain form
10274 -132948 19300 250705 8567 73985 -9778 -302151 -442228 -117058 -29342 -460719
10264 -460719 -555139 -543245 -344590 -70259 -208386 -569178 -449428 -561840 -258531 -94594
10254 -94594 -45087 -415852 -451517 -272879 -196747 -57314 -147008 -359348 -427996 -187246 -211743
10243 -211743 -241306 -222876 -378488 -79981 -55595 -37807 -150919 61159 62306 -165083 144721
10232 144721 105397 -55741 -262498 -488244 -423418 -268730 -326009 -356685 -448566 -297925
10222 -297925 -250636 -290391 -96713 48776 -85342 -114989 19682 -107037 8348 -204317
10212 -204317 -694377 -399847 -180354 -63874 -12905 -21571 51280 -90085 -30253 -224650
10202 -224650 -571709 -547064 -498257 -352189 -193215 -327318 -43021 170734 165697 -35397
10192c5397q7123L71306L8022k15402k22210L4153K06790K52917k80654l04188
10182b41786M2241j47580R2289L60185J6835j29110o4597K64164j52721q9970
10172e0050j99492K08997O3796k26755j2535o362J57527J55424q7586J60198j52802
10161A0360j04787m0935r7252J34768L4951n7130n407r6497j22248J50541J32468
10150f1168L6646j50061Q4438O2224r2509M6920n5849J55228K8081m32563J66895
10139b11718Q2254k62099j90577K42429J09073O1470K14544J2237j66404k09762
10129c18553J15178J48466j25837n7538l7499j06762J02660J20716J3255Q4568
10119f1346K4494K3227N9786k65642n102O6260K03414J67533j25091j17529l11746
$$ plain form
10192 -35397 -122520 248786 286808 71406 -150804 -116651 90139 343056 62402 -241786
10182 -241786 -199545 -347125 -254836 105349 122184 -6926 -71523 192641 39920 -50050
10172 -50050 -249542 -40545 23251 -203504 -216039 -222401 -64874 90550 2964 163162 10360
10161 10360 -94427 -135362 -232614 -97846 -62895 -120025 -125432 -221929 -344177 -193636 -61168
10150 -61168 -24522 -174583 -90145 -27921 -120430 -73510 -129359 25869 53950 -378613 -211718
10139 -211718 -129464 -391563 -582140 -339711 -230638 -169168 45376 57613 -108791 -318553
10129 -318553 -203375 -54909 -180746 -238284 -275783 -382545 -279885 -159169 -145914 -61346
10119 -61346 -36852 -13625 46161 -219481 -224583 -158323 45091 212624 87533 -29996 -341742
10108c41742q5543K85835R9486P6308k17773j44318K33561O1053n2681R1488P7595
10097H3269L0648L41700r2042L2320K99528k7998o9532n0391O0914m0977l4709
10086E32730o1571n0360l9067j42987P8566O3669j60251j02016M62837n4859k8844
10075D97847J45597l75407q5036M1726j84462J70922O1309j24927k14979K46144
10065A78734M1583j45673j658j00868M3012j9526K23854j8796j83954O9746k41433
10054a54979J36833J74905o1643O4356J69245k570k86861P8085J47965K1080p7914
10043B08502j79897K69949O4422m5742K41332k21671p5141K04360j8678m12989
10033C4447J22690M88669J19359J1242l9015N0573q9386J06196J46581L05212
$$ plain form
10108 -341742 -427285 -141450 -41964 34344 -183429 -327747 -94186 -33133 -85814 5674 83269
10097 83269 113917 455617 363575 395895 695423 667425 597893 547502 608416 567439 532730
10086 532730 471159 420799 381732 238745 317311 380980 220729 118713 581550 526691 497847
10075 497847 643444 268037 183001 224727 40265 211187 272496 147569 -67410 178734
10065 178734 220317 74644 72986 -27882 15130 -4396 219458 200662 16708 86454 -154979
10054 -154979 -18146 156759 95116 159472 328717 326147 39286 117371 265336 286416 208502
10043 208502 28605 298554 362976 317234 558566 336895 261754 466114 447436 34447
10033 34447 157137 645806 765165 776407 737392 787965 698579 804775 951356 1256568
10023A256568M3987j37188J25421k51404l21764L00393n26k00928r3104j75911
10013E45544J16638Q3990K98589j08271j79721J04545j43789j69334o412M8226
10003E90005J53250Q3963J00224L10089J8672k28209J88799Q127j10863N4369
9993A168426j65053j03846J23804J80131K67148n2726K9642J02057k31237j58072
9983A160274J55976n0353L7777m29248p6139K18268l25757j56895r5197J47469
9973E86175K78014l97501k57999o4700J0724J16170K64247k08013j74514J04256
9963B56859k1482j14643J09123J94027q7552K31598j54255j20086o3191p5275
9953A55123l1845K44732k04014m4116K02439J88330K60640p6018l34526J24637
$$ plain form
10023 1256568 1300555 1163367 1288788 1037384 715620 1016013 1015487 814559 721455 545544
10013 545544 662182 746172 1044761 936490 756769 861314 717525 548191 541779 590005
10003 590005 743255 827218 927442 1237531 1256203 1027994 1216793 1224920 1114057 1168426
9993 1168426 1003373 899527 1023331 1203462 1470610 1417884 1447526 1549583 1318346 1160274
9983 1160274 1316250 1265897 1303674 874426 798287 1016555 690798 533903 438706 586175
9973 586175 864189 466688 208689 143989 154713 270883 535130 327117 152603 256859
9963 256859 235377 120734 229857 423884 336332 567930 413675 293589 230398 155123
9953 155123 123278 368010 163996 119880 322319 510649 771289 695271 360745 485382
9943D85382J80728j43179j18889J06277Q3725J88044j45500j0366n2127j34255
9933D39840J85937M3427K30840j59732k71338j11952M1053K40881j4859k21438
9923D02659J21633K32357O2204j60605Q3383P4240K64434j40245J5402q1022O5683
9912I40123M3759k72908p3333o7612O6530K19653R3859O8453J7997j9417R1170
9901A108274j41519O7653J02807J13930O272m3348M0907l45565k58010J9298j29901
9890E40798M96411K68274l70468j49797p2038o5419p3253K40473J00864r0325
9880H25520l20850J23891j9704j18164N0497q298J27674Q325L1271P4332J03881
9869H78375K1600J56586J61913O7821J6929j43108m7698K0062n2173J16984N2938
$$ plain form
9943 485382 666110 522931 404042 510319 594044 782088 636588 626222 574095 439840
9933 439840 625777 669204 900044 740312 468974 357022 398075 638956 624097 402659
9923 402659 524292 756649 818853 658248 741631 815871 1080305 940060 955462 874440 940123
9912 940123 983882 710974 637641 570029 636559 856212 950071 1018524 1036521 1017104 1108274
9901 1108274 966755 1034408 1137215 1251145 1257417 1214069 1254976 909411 651401 670699 540798
9890 540798 1037209 1305483 935015 785218 713180 647761 574508 814981 915845 825520
9880 825520 504670 628561 608857 490693 541190 532892 660566 668891 700162 774494 878375
9869 878375 899975 1056561 1218474 1286295 1303224 1160116 1112418 1132480 1080307 1197291 1250229
9858A250229m0383m28331J61337K74307Q9826P4834L3162p251j93475n8478M1991
9847A197768m9578Q6523n3736J72875j51393j57147J24802J67716K56936M1081
9837A635847o2015L1444K3865J39175J4942J4455L356J22726J24537n7022j29877
9826A861433J45120m5280k4394L66618j32116N2268j45715n9939J07293P1566
9816B196854r2811j62526L20919J16040k24506l45792j3577M17904P4182n5002
9806B231685k6137j08437J68293K22315L80547K35619J11647j85083k13090j35091
9796B682268r2479k7238J67118K14871J75678J0519K42920J84689j64430Q9779
9786C483695p5023J25036q1176j31378M42291q793Q3938p3124J45768M26993j16046
$$ plain form
9858 1250229 1209846 781515 942852 1217159 1306985 1381819 1414981 1407730 1214255 1155777 1197768
9847 1197768 1148190 1234713 1180977 1353852 1202459 1045312 1170114 1337830 1594766 1635847
9837 1635847 1573832 1605276 1629141 1768316 1783258 1797713 1801069 1923795 2048332 1991310 1861433
9826 1861433 2006553 1961273 1936879 2303497 2171381 2223649 2077934 2017995 2125288 2196854
9816 2196854 2104043 1941517 2262436 2378476 2153970 1808178 1794601 2212505 2286687 2231685
9806 2231685 2205548 2097111 2265404 2487719 2868266 3103885 3215532 3030449 2817359 2682268
9796 2682268 2589789 2562551 2729669 2944540 3120218 3130737 3373657 3558346 3393916 3483695
9786 3483695 3408672 3533708 3452532 3321154 3763445 3754652 3838590 3765466 3911234 4338227 4222181
9775D222181J00884L47321M4832j63336R3684K77588M10615j7321j70352K76261
9765E422357O6059O5662N08800M11884o3148m6107N04819M28816L68678L9822
9755G707642L92775K63881K41028J71005j23461K57651P10512O26605N28543O05206
9745A1381387N76841P69075M67438R47199J607393J215074K296951K007884J725644
9736B2994886J488116P60871O36993R01402J184634K013668K839065L360070M349563
9727D0529268N797796P314746P753066O753304N143715J408334j894073k872887
9719F9933269k199304Q54236N445692P920914R074332R160581N931644J763762
9711A07885126j632288o271486q639197q858701p109287l238505Q92005L288511
$$ plain form
9775 4222181 4323065 4670386 4715218 4551882 4645566 4923154 5333769 5316448 5146096 5422357
9765 5422357 5488416 5554078 6062878 6474762 6411614 6365507 6870326 7299142 7667820 7707642
9755 7707642 8100417 8364298 8605326 8776331 8652870 8910521 9621033 10247638 10776181 11381387
9745 11381387 11958228 12727303 13194741 14141940 15749333 16964407 19261358 21269242 22994886
9736 22994886 24483002 25243873 25880866 26782268 27966902 29980570 32819635 36179705 40529268
9727 40529268 46327064 53641810 61394876 68148180 73291895 74700229 72806156 69933269
9719 69933269 67733965 68588201 74033893 81954807 91029139 100189720 106121364 107885126
9711 107885126 106252838 99981352 91342155 82483454 75374167 72135662 73027667 76316178
9703G6316178L058378J466696k796517o443862p625561p541887o615619m597843
9695D5219963l320296j925181j347136p35037j96002J43739M86150N89965R09848
9686C9826013J361267J845594K616559L670917M801058O460991R080435R919069
9678G9581903Q384682O053649M920912M160933N483625P568195R833460J3141158
9670A39128517J4365232J0398006O336529N836690O150050Q368130Q579918M068413
9662B03231485J32261m538146j1888956j7580707j7675041j7262780j7115612
9655A17302504j4210724j0097820o134482m264185k800179j498062n59098Q51927
9647G8589881J377921K382472L822921O346824R642428J3600184J6080989J6125111
$$ plain form
9703 76316178 79374556 80841252 78044735 71600873 63975312 56433425 49817806 45219963
9695 45219963 41899667 39974486 38627350 37892313 37696311 37840050 38326200 38916165 39826013
9686 39826013 41187280 43032874 45649433 49320350 54121408 60582399 69662834 79581903
9678 79581903 87966585 94020234 98941146 103102079 108585704 116153899 125987359 139128517
9670 139128517 153493749 163891755 170228284 176064974 182215024 190583154 199163072 203231485
9662 203231485 203363746 198825600 186936644 169355937 151680896 134418116 117302504
9655 117302504 103091780 92993960 86859478 82595293 79795114 78297052 77737954 78589881
9647 78589881 79967802 82350274 86173195 92520019 102162447 115762631 131843620 147968731
9639A47968731J8037660J9504052J8528577J7342640J1492014M089842Q58882
9632B37822398R34888K292664M922576Q376210M765611j348799o200550j4372092
9624B37192906k2325561k4622372k4464307k3071589j9312116j4511411j1658695
9617I7226855j0212011q581800o815210n056694k852040j156727q19270j195442
9609F0537661k173663l120147l160494l179908k958666k169092j624191j227326
9601D0924174j453467p40415o96705q69278O5703L08847J56941K9874N4969j14020
9591C7666623k26786j15462n5394N32293J753140K179332K394204K326614K743766
9582D9198330K831122K316343K078913J312228O70019Q69340N51146l31988j108842
$$ plain form
9639 147968731 166006391 185510443 204039020 221381660 232873674 236963516 237822398
9632 237822398 238757286 241049950 245972526 254348736 259114347 257765548 251564998 237192906
9624 237192906 214867345 190244973 165780666 142709077 123396961 108885550 97226855
9617 97226855 87014844 78433044 71617834 66561140 63709100 62552373 61733103 60537661
9609 60537661 58363998 55243851 52083357 48903449 45944783 43775691 42151500 40924174
9601 40924174 39470707 38730292 38033587 37164309 37230012 37538859 37695800 37725674 37780643 37666623
9591 37666623 37439837 37324375 37268981 37801274 39554414 41733746 44127950 46454564 49198330
9582 49198330 52029452 54345795 56424708 57736936 58406955 59276295 59827441 59495453 58386611
9573E8386611j725358k016235j524783l05732J055482J156659L71311k1762j395742
9564E3980451k902360l036330l333587l121601k479610j883366j111631j203207
9556C4908759o98431k17486N57268R83922K142101K852456K627453K955331K942218
9547D9053591K504358K043590J895236J668141J456110R54361n58226k083663
9539E6933498k062991j952872j319707J61788J450695J195756K87446r64106k302910
9530E1426597l228662m039613m364712m489313m174677l983326l114676k339323
9522B1692295j761769j305331j160011j212287o74640n84444q98253n42606m97538
9513A3055416j28586m13328l44428j76843j05912l33875n72179l79669m30309
$$ plain form
9573 58386611 56661253 54645018 53120235 52814503 53869985 55026644 55397955 55376193 53980451
9564 53980451 51078091 48041761 44708174 41586573 39106963 37223597 36111966 34908759
9556 34908759 34210328 33992842 34550110 35534032 37676133 40528589 43156042 46111373 49053591
9547 49053591 51557949 53601539 55496775 57164916 58621026 59575387 59017161 56933498
9539 56933498 54870507 52917635 51597928 51759716 53210411 54406167 54693613 53729507 51426597
9530 51426597 48197935 44158322 39793610 35304297 31129620 27146294 24031618 21692295
9522 21692295 19930526 18625195 17465184 16252897 15578257 14993813 14095560 13552954 13055416
9513 13055416 12926830 12513502 12169074 11992231 11886319 11552444 10980265 10600596 10170287
9504A0170287k31909j69330q9307J77849j08000k96782k37975k8832k07236k55410
9494H723355j66752p2053j95690j5586J08879p3400K3776k74113j07671n10275
9484G440470j28482k05967k01172K81287l23420j28225p2082j31295q6262J1268
9474F456120K02814O7580M9253j58086K0212j60535m0312J67411p3463K2963j46811
9463F407146p6217j21591K17633J61872j14309N1241K99452j87851j43339o3722
9453F430315j27281K02754K79536j85407k96313L26290k2157q1943k3745p2784
9443F429265j45386q4165J86322j2466J53135m4085P554q6962J11598P5532l20642
9432F269700K66637J73764k16823J75690R8683J35193K84365l16548J28024K36936
$$ plain form
9504 10170287 9938378 9769048 9679741 9857590 9749590 9452808 9214833 9186001 8978765 8723355
9494 8723355 8556603 8484550 8288860 8273274 8382153 8308753 8332529 8058416 7950745 7440470
9484 7440470 7311988 7106021 6904849 7186136 6862716 6734491 6662409 6531114 6444852 6456120
9474 6456120 6658934 6726514 6775767 6617681 6637893 6477358 6437046 6604457 6530994 6553957 6407146
9463 6407146 6330929 6209338 6426971 6588843 6474534 6525775 6825227 6637376 6494037 6430315
9453 6430315 6303034 6505788 6785324 6599917 6303604 6629894 6607737 6525794 6502049 6429265
9443 6429265 6283879 6199714 6386036 6373570 6526705 6482620 6490174 6403212 6514810 6590342 6269700
9432 6269700 6536337 6710101 6493278 6668968 6767651 6902844 7187209 6870661 6998685 7235621
9422G235621R6971L346K00335j83019q0450q8889J64540J92194k5762P9893k686
9411G592094J56736j64711K33991J74928l50805J6136K01747j70923R9914Q3342
9401G872449L4709q1604j04433k37870l03009M5774J09245L1162k35623q5093
9391G045707J34524k346j76175K38192j25001k61831J44562p3578q3493j89220
9381F651341j47168m6552K7280j87o6256J5821J39785J5058k73449J46361j43307
9370F318727n97655q5949N7128m11022Q2311O2668J7952k62274L3011j32377j29494
9359D953026j08534n4011N8694q404j6419l03169j2408J54295K75774m5175l57778
9348D535891k82628R4728j21172k05918K46509M1229o7690P9418k2656M0970O7048
$$ plain form
9422 7235621 7332592 7335938 7536273 7353254 7272804 7183915 7348455 7540649 7514887 7594780 7592094
9411 7592094 7748830 7584119 7818110 7993038 7642233 7658369 7860116 7689193 7789107 7872449
9401 7872449 7907158 7825554 7721121 7483251 7180242 7226016 7335261 7366423 7130800 7045707
9391 7045707 7180231 7177885 7001710 7239902 7114901 6853070 6997632 6924054 6840561 6651341
9381 6651341 6504173 6457621 6484901 6484714 6418458 6434279 6574064 6589122 6315673 6462034 6318727
9370 6318727 5721072 5635123 5692251 5281229 5363540 5426208 5444160 5181886 5214897 5082520 4953026
9359 4953026 4844492 4790481 4849175 4840771 4824352 4521183 4508775 4663070 4938844 4893669 4535891
9348 4535891 4253263 4347991 4226819 4020901 4267410 4308639 4240949 4320367 4297711 4338681 4405729
9337D405729o0285j57456J13764j679n6237P5221K13853m91136j10164j32878
9327C798732M9838J69780l79739j61247n1182J13180r1901K5630J20761K14483
9317C808335m2501K76196j26852j66440p224L0854L55513Q943n346L6451L04761
9306D472690J26422j6698L3625J15640j8198K03841j29260J10865R1930j01667
9296D889190J60704J80348k14287k08058l45596k67641L7091N07165l63562k19803
9286D155551q6602p2487Q5872q8715n7215K7118K06494J2589q703P6132K67472
9275D517506J63186J25232J45917N7421J4423K59302P3228r1800R8974K35927
9265E599316O030L51378O3742K2073R5982K402j0995L0270j87206n27811K8961
$$ plain form
9337 4405729 4345444 4187988 4301752 4300073 4243836 4319057 4532910 4041774 3931610 3798732
9327 3798732 3848570 4018350 3638611 3477364 3426182 3539362 3447461 3473091 3593852 3808335
9317 3808335 3765834 4042030 3915178 3748738 3741514 3772368 4127881 4136824 4131478 4167929 4472690
9306 4472690 4599112 4582414 4616039 4731679 4713481 4917322 4788062 4898927 4990857 4889190
9296 4889190 5049894 5230242 5015955 4807897 4462301 4194660 4231751 4738916 4375354 4155551
9286 4155551 4068949 3996462 4082334 3993619 3936404 3963522 4170016 4182605 4173902 4250034 4517506
9275 4517506 4680692 4805924 4951841 5009262 5023685 5282987 5356215 5264415 5363389 5599316
9265 5599316 5605346 5956724 6020466 6042539 6138521 6140923 6129928 6160198 5972992 5445181 5474142
9254E474142k78411k81341k54093l77681P6138j45828J40773j11914O0072K18222
9244D520079p5491p7j190J517q5862r6863R7932j150j47352J20855j36686J57753
9232D353465R9215j90552r033J26400n6447k0320O2769L4893L78591P1639J05353
9221D955973j26216j44534K28789K15637k56847m5832j03505K0380K49742J68480
9211E162067K43273j31653l46770j98645P6116K47026n7395J08475K07356P3298
9201E383148J0214J63250J23636j25691k80853J47018M85609K401k3778j25657
9191E759297K97780L55015j61136n6055l7738K13275L55354J66016K42641M9872
9181G184321J8478m2603K12707K01242r0924L26528J70816J31393J9281j37052
$$ plain form
9254 5474142 5195731 4914390 4660297 4282616 4358754 4212926 4353699 4241785 4301857 4520079
9244 4520079 4444588 4444511 4443321 4444838 4358976 4262113 4360045 4358895 4211543 4332398 4195712 4353465
9232 4353465 4452680 4262128 4253095 4379495 4323048 4302728 4365497 4400390 4778981 4850620 4955973
9221 4955973 4829757 4685223 4914012 5129649 4872802 4826970 4723465 4743845 4993587 5162067
9211 5162067 5405340 5273687 4926917 4728272 4804388 5051414 4994019 5102494 5309850 5383148
9201 5383148 5393362 5556612 5680248 5554557 5273704 5420722 5906331 5908732 5884954 5759297
9191 5759297 6057077 6412092 6250956 6194901 6157163 6370438 6725792 6891808 7134449 7184321
9181 7184321 7202799 7160196 7372903 7574145 7483221 7809749 7980565 8111958 8131239 7994187
9171G994187L41931p1017K07359K34740m1430L41627K51785K36012K51117M0561
9161I786872j02362J81395N58844N48714M498L83561K17894L13671K99263K27011
9151A2419361L19333L08130K89147L53547M42975O45045L20359P22785P11888
9142A6532570J103281J682145J138785J033855O50877L58607M75702O93643P38574
9133B4408039J144315J706388J500575J815636J673459J759008K289547L239386
9125C9536353M322542N420392N638655N050957M969925M324387J633642L04247
9117G1201100N80859N71568J066690J512174K043590K420950K537458J172289
9109H3106678N50960J85066r70954j707151p98324Q40331L557052N503886O786482
$$ plain form
9171 7994187 8336118 8265101 8472460 8707200 8665770 9007397 9259182 9495194 9746311 9786872
9161 9786872 9684510 9865905 10424749 10973463 10977961 11361522 11579416 11893087 12192350 12419361
9151 12419361 12738694 13046824 13335971 13689518 14132493 14777538 15097897 15820682 16532570
9142 16532570 17635851 19317996 20456781 21490636 22141513 22500120 22975822 23669465 24408039
9133 24408039 25552354 27258742 28759317 30574953 32248412 34007420 36296967 39536353
9125 39536353 43858895 49279287 54917942 59968899 64938824 69263211 70896853 71201100
9117 71201100 71781959 72353527 73420217 74932391 76975981 79396931 81934389 83106678
9109 83106678 83657638 83842704 82871750 81164599 80366275 81206606 84763658 90267544 97054026
9100I7054026P001199O122532L167229J698318K533288M513265N934874O423449
9092A34448180N752876N118602M305837L634869K162405o62489k131995k097662
9084A50530623k218315j730123K50143J559183O59533o60075k37946R11252K919305
9075A51983580N855696Q083724Q839974P638486M059408p58524l167659l210277
9067A79324408r91110L075949P125745R565194P591431M309349K703320J032572
9059B13736858J367638L722445P391392Q311022O029634M181093L784030L232098
9051B51756210J483584m433427j1858721j6807540k1023207k1274069j7397477
9044A60445353j3036406r585225o714910l482301L87462L251197K487867N84539
$$ plain form
9100 97054026 104055225 110177757 113344986 115043304 117576592 122089857 128024731 134448180
9092 134448180 140201056 145319658 149625495 153260364 155422769 154760280 152628285 150530623
9084 150530623 148312308 146582185 146832328 148391511 149051044 148390969 148153023 149064275 151983580
9075 151983580 157839276 165923000 174762974 182401460 186460868 185702344 182534685 179324408
9067 179324408 178333298 181409247 188534992 198100186 205691617 210000966 212704286 213736858
9059 213736858 215104496 218826941 226218333 234529355 240558989 244740082 248524112 251756210
9051 251756210 253239794 248806367 236947646 220140106 199116899 177842830 160445353
9044 160445353 147408947 137823722 131108812 127626511 128013973 131265170 133753037 134337576
9036A34337576p08883j534464l65916J380873K362503K195998J981379J338620
9028A40987686K594639P206269J3328785J5202790J0858840M083227m46572l411139
9020A90404525k668229l34069k935470p197651j0754890j5908898j7457611j4947137
9012A18200570j1398030r094192p025988o162037n545355n429649n284466n561792
9004F2699061m948317l983192l207265k817111j976484j590887j718777j343581
8996D1113447j235496p60375q46784o09021p14632m82655k16837k98663p1182
8987C5877802k22687j35924R9113q2950q6375K00193J65670M24249K59561k8768
8977C6469884J10669j03049m464J79900M99401N82360M31623M34265P48894L27927
$$ plain form
9036 134337576 133628693 132094229 131728313 133109186 135471689 137667687 139649066 140987686
9028 140987686 143582325 150788594 164117379 179320169 190179009 194262236 193815664 190404525
9020 190404525 187736296 187402227 184466757 177269106 166514216 150605318 133147707 118200570
9012 118200570 106802540 97708348 90682360 84520323 78974968 73545319 68260853 62699061
9004 62699061 57750744 53767552 50560287 47743176 45766692 44175805 42457028 41113447
8996 41113447 39877951 39117576 38270792 37661771 36947139 36464484 36247647 35948984 35877802
8987 35877802 35655115 35519191 35618304 35535354 35448979 35649172 35814842 36239091 36498652 36469884
8977 36469884 36580553 36477504 36473040 36652940 37152341 37734701 38166324 38600589 39349483 39677410
8967C9677410K97300P44242J189896J093626J023052J489126J570719J853416
8959D8938787J559570K010752K259535K127951K748329K780084L323781L739619
8951F9488408M318304N135728O142693P516468Q789931R997983J1740006J5057555
8943A38187076J9848776K4604839K5614236K4793634K8147504L4461949M2018013
8936C37676027M3485289L3857284K0956031J2497599P743024N890627K47961j1273012
8928D51080830j9804138k3471116k9135519l6094547l2829401l0851162l3376236
8921B45518711k7886326k0988619j5871003j2216491r261482n830371j537711
8914A51926708K875601P108754R265476J0268655J1666398J2284190J0897502
$$ plain form
8967 39677410 39974710 40718952 41908848 43002474 44025526 45514652 47085371 48938787
8959 48938787 50498357 52509109 54768644 56896595 59644924 62425008 65748789 69488408
8951 69488408 73806712 78942440 85085133 92601601 101391532 111389515 123129521 138187076
8943 138187076 158035852 182640691 208254927 233048561 261196065 295658014 337676027
8936 337676027 381161316 415018600 435974631 448472230 456215254 462105881 462353842 451080830
8928 451080830 431276692 407805576 378670057 342575510 309746109 278894947 245518711
8921 245518711 217632385 196643766 180772763 168556272 159294790 153464419 151926708
8914 151926708 154802309 161911063 171176539 181445194 193111592 205395782 216293284
8907B16293284Q715754P376571P762554J0111439J3659897J8639013K1812357
8900C04370869K3751914K3751400K2638475K1277820J5504929O950560j735967
8893D16510000j1394757j9677090k6362819l2245053l3201784l1835092k8373490
8886B33419915k2789516j7963852j4078622j0506051p168441k865203K368249
8879A60416479P179214J0527421J2349490J2493360J2218570J0228541N514854
8872B30927929p62029q223951j3453502j6282564j5696804j1824362o267998j447392
8864A56969327j829336l764240l386086l435960l235082l217746m952960o687112
8856A26460805r252409j0032519q815572o969853n722428n236176m641238l731119
$$ plain form
8907 216293284 225009038 232385609 240148163 250259602 263919499 282558512 304370869
8900 304370869 328122783 351874183 374512658 395790478 411295407 418245967 416510000
8893 416510000 405115243 385438153 359075334 326830281 293628497 261793405 233419915
8886 233419915 210630399 192666547 178587925 168081874 160913433 158048230 160416479
8879 160416479 167595693 178123114 190472604 202965964 215184534 225413075 230927929
8872 230927929 230165900 221941949 208488447 192205883 176509079 164684717 158416719 156969327
8864 156969327 155139991 151375751 147989665 144553705 141318623 138100877 133147917 126460805
8856 126460805 117208396 107175877 98360305 91390452 85668024 80431848 75790610 72059491
8848G2059491k746320j587828j38220J433639K746250L889871M970721N239789
8840H5867393N534069N161572L506711J990459j7974k472305m125649n179366
8832I0264910n916050o596224p342867p051890o515360n952484m804050m187125
8824D1898860l192629k635725k245306k159117j589847j391744j056919r55972
8816B6671601q13707q85757q01156n78306n11499n04785n80424n01530n14062
8807B0980375m79248k04312l23202M2152q08441r12954m11823J18688j34423k25156
8797A7641656k10841l32050k2677K10275J54022J2911j50563R3539k92291l48817
8787A6755164K22229l3556l1746l41803R5401K38001J91761M27469L46764Q04267
$$ plain form
8848 72059491 69313171 67725343 67587123 69020762 71767012 75656883 80627604 85867393
8840 85867393 91401462 96563034 100069745 102060204 102042230 99569925 95444276 90264910
8832 90264910 84348860 77752636 70409769 63357879 56842519 50890035 46085985 41898860
8824 41898860 38706231 36070506 33825200 31666083 30076236 28684492 27627573 26671601
8816 26671601 25857894 24972137 24170981 23592675 23081176 22576391 21995967 21494437 20980375
8807 20980375 20501127 20296815 19973613 20015765 19207324 18294370 17882547 18001235 17866812 17641656
8797 17641656 17430815 17098765 17076088 17286363 17440385 17453296 17302733 17396272 17103981 16755164
8787 16755164 16977393 16943837 16912091 16570288 16665689 16903690 17095451 17522920 17869684 18673951
8777A8673951R29897J226996J388842Q14732Q83550O29594m42423q32504o04277
8768B2668358m14463J13789p257J64500N53114Q84394J588168K480699L495058
8759C1526360M981657P198213P363906O056872M362816N95316l022116n162065
8751E3900959o005201n474529m799609l609381k451672j129128k86615K20913
8743C0365737J770454L226785N697743O871294P823187O992719M920017J639251
8735F9307187j964458m412738o410584o439728n974966m811288m048965l261582
8727C1982878k019038j163842o91668j94835O70299J215789K179469L348061M866290
8718D0193403N885178N374248L751387J663623j424623l567913m434946m700319
$$ plain form
8777 18673951 19603848 20830844 22219686 23034418 23917968 24547562 24105139 23272635 22668358
8768 22668358 22253895 22367684 22360427 22524927 23078041 23962435 25550603 28031302 31526360
8759 31526360 36508017 43706230 51070136 57127008 61489824 62085140 59063024 53900959
8751 53900959 47895758 42421229 37621620 34012239 31560567 30431439 30144824 30365737
8743 30365737 32136191 35362976 41060719 47932013 55755200 62747919 67667936 69307187
8735 69307187 67342729 62929991 56519407 50079679 44104713 39293425 35244460 31982878
8727 31982878 29963840 28799998 28108330 27913495 28583794 29799583 31979052 35327113 40193403
8718 40193403 46078581 51452829 55204216 56867839 55443216 51875303 47440357 42740038
8710D2740038m140108l018333j893817j061260m6603R82925K597033L958844O253475
8701D6372194R348665J1790480J2004510R389487N199041j197982o856731j0010181
8693G6039483j0797649j0440251q609529o844043m944683l968682l178391k058207
8685B5198048j316936p63489j023872l30677K56659J52574J064205J935966J975465
8676B7147943J826665J226277j74817j485398j832799j836731j714678j596380
8668B1560082j315148n18167p5056J19713J109967J771332K968130M502272N036321
8659C5159446M864636M055108J975413q18485l140470m178735m552578m212040
8651B9152295m207525l279993k745909k091389j409478j347561o31890k04783
$$ plain form
8710 42740038 38599930 35581597 33687780 32626520 32579917 33562842 36159875 40118719 46372194
8701 46372194 55720859 67511339 79515849 88905336 94104377 92906395 86049664 76039483
8693 76039483 65241834 54801583 46192054 39348011 34403328 30434646 27256255 25198048
8685 25198048 23881112 23117623 22093751 21763074 22019733 22172307 23236512 25172478 27147943
8676 27147943 28974608 30200885 30026068 28540670 26707871 24871140 23156462 21560082
8668 21560082 20244934 19726767 19651711 19771424 20881391 22652723 25620853 30123125 35159446
8659 35159446 40024082 44079190 46054603 45236118 42095648 37916913 33364335 29152295
8651 29152295 24944770 21664777 18918868 16827479 15418001 14070440 13438550 13233767
8643A3233767j59409j0390R8039N99512J293387K156355J822719J139922K22959
8634B0396861q53493j185017j730720j853062j955184j525667j328515o86340
8626I278863n06737p92757p04519k39099j92235p1181j46711j88758J45869K34576
8616F817311M40675K14870p573q8883j40453l05881m19059n82397l42750k35114
8606E350746o71689k70005j08914j47848j18501j33301k25790J65031l6219j35993
8596C667517J38708o6205K56467j27386j43165k27056J04727j2524j3961J45778
8586C722900N8341k59412J51933j9043J466k2448O0932L96956M03484j16915L32224
8575D710418n89181n75251O77133K96920K23304L2674l09210l64602K61934j25840
$$ plain form
8643 13233767 13074358 13063968 13162007 13761519 15054906 17211261 19033980 20173902 20396861
8634 20396861 19543368 18358351 16627631 14774569 12819385 11293718 9965203 9278863
8626 9278863 8772126 7979369 7274850 7035751 6843516 6772335 6625624 6436866 6582735 6817311
8616 6817311 7257986 7472856 7465283 7376400 7235947 6930066 6511007 5928610 5585860 5350746
8606 5350746 4679057 4409052 4300138 4152290 4033789 3900488 3674698 3839729 3803510 3667517
8596 3667517 3806225 3740020 3996487 3869101 3725936 3498880 3603607 3591083 3577122 3722900
8586 3722900 3781241 3521829 3673762 3654719 3656185 3633737 3694669 4091625 4495109 4378194 4710418
8575 4710418 4121237 3545986 4223119 4520039 4743343 4776017 4466807 4102205 4364139 4238299
8565D238299N7532k99247p3831n70791l15342j29440J7305j40808j39024L15708
8555B960361j83706k2228j2851q1252Q4329K76676Q6823k46286J119K88971l5653
8544C116303l12J34714J37377P4194m6004J24328K59162J43002J72607J81645
8534D297016L23301k37975p8376j20411n09418n5896R144q9516k32137l26996
8524B978736k63674j51502j57358j63900J62661n9341j35834j53731k8729l0136
8514A997192J97697K97223q588n06387k07647N59611J84302k21423j94287n9352
8504B038341K17955J57189J22661J32447l65923q8856o1592r6456j87737L8126
8494A906155j48006R255j1363j62449K9526j99507l3060J9645n8420P9508j00338
$$ plain form
8565 4238299 4295831 3996584 3922753 3351962 3036620 2907180 2924485 2783677 2644653 2960361
8555 2960361 2776655 2754427 2741576 2660324 2744653 3021329 3108152 2861866 2862985 3151956 3116303
8544 3116303 3115991 3250705 3388082 3462276 3416272 3540600 3799762 3942764 4115371 4297016
8534 4297016 4620317 4382342 4303966 4183555 3674137 3618241 3627385 3537869 3305732 2978736
8524 2978736 2715062 2563560 2406202 2242302 2404963 2345622 2209788 2056057 2027328 1997192
8514 1997192 2194889 2492112 2483524 1977137 1769490 2329101 2513403 2291980 2097693 2038341
8504 2038341 2256296 2413485 2536146 2668593 2302670 2213814 2152222 2055766 1868029 1906155
8494 1906155 1758149 1767404 1756041 1593592 1623118 1423611 1390551 1410196 1351776 1431284 1330946
8483A330946N6970J34919j30932o8426q721K9685J13941j13662R4050k30576K7752
8472A235946q5147J87043J5214m41248j14759J43158J93275k02139l3276m2274
8462H55793J45840J39641j65185j65317J46112J05677j45860n8868J31218M4478
8452A033529l15342k762K85675M07280r7300j9889l04397k31573J53447k35537
8442F73131J93858n5521J26683k24167j3965k02421M3464L36546J8801K83221
8432A179630k37976k01437n59L0604O3231P5835M1010l5701k56746R2697R9079
8421H49667K1933J1180q8044P1761J959j45682n5791O9971j55041J2853J85661
8410G80427J36929j57420o9895l33857K71018L64704m878j54414r9256O9587N8507
$$ plain form
8483 1330946 1387916 1522835 1391903 1323477 1314756 1344441 1458382 1344720 1438770 1208194 1235946
8472 1235946 1150799 1337842 1353056 911808 797049 940207 1133482 931343 898067 855793
8462 855793 1001633 1141274 976089 810772 956884 1062561 916701 857833 989051 1033529
8452 1033529 718187 715425 1001100 1408380 1311080 1291191 986794 755221 908668 673131
8442 673131 866989 811468 938151 713984 700019 497598 541062 877608 896409 1179630
8432 1179630 941654 740217 739658 770262 833493 909328 950338 914637 657891 750588 849667
8421 849667 871600 882780 794736 866497 868456 722774 666983 736954 581913 594766 780427
8410 780427 917356 759936 690041 356184 627202 991906 987028 832614 733358 802945 861452
8399H61452p6254o6447P43J28561q9317K53331L37870k49392k39228m2684K59987
8388A078622m9092o7247K52604l26414j10751k14606p2407N2763m5205J06209
8378F04476j5630J59560O562r9093m1328J6448m4329J38310J71938o9264j11114
8367G16536J45814m0129J10759J46407N6930j01772o2176k1930k43787J54004
8357H60656P2937k03668n4951K0976M1405l15375J4286J70163l6306K50390L4035
8346H54548N1392p6423j64230J34088j62658l7452J60484k71403o5202N17990
8336I41134q6149J8325r2161k7642P8164M0147p987O078K9668n471R836J04151
8324A008093J28080m69654o9179j19043k1028j08154J05068J31149j46956O0132
$$ plain form
8399 861452 785198 718751 719494 848055 758738 1012069 1349939 1100547 861319 818635 1078622
8388 1078622 1029530 962283 1214887 888473 777722 563116 490709 543472 498267 604476
8378 604476 588846 748406 754968 655875 614547 630995 586666 724976 896914 827650 716536
8367 716536 862350 822221 932980 1079387 1136317 1034545 972369 950439 706652 860656
8357 860656 933593 729925 674974 695950 737355 421980 436266 606429 570123 820513 854548
8346 854548 905940 829517 665287 799375 636717 599265 759749 488346 423144 941134
8336 941134 854985 873310 781149 753507 831671 871818 863831 869909 899577 894106 903942 1008093
8324 1008093 1136173 666519 597340 478297 457269 349115 454183 585332 438376 498508
8314D98508J28152J44114k54730j76947K53195P6447j77990J55274k37910k36451
8304A71662K00876L59963K01953m54261k24768J63057R3859J60724l7258p699
8294F28108r988K05698j7587n8296j14828k20100l7989j00259K49311J04870p2917
8283E56023Q1618J47727j72026j25766K902j49165J35037n4288k9902J2446M1863
8272D46469q8893N5695J04388O8208Q2843n3108R7437K3995j23810j06356p2466
8261D34402j06275O6900p254j98115j26981R3384J39828J98281k00012o454K63640
8250E51344j005j29753j62051r0260j8252K66056j57666l23386L01257p1717l8764
8239A25803J6953J30564K41712k49277j00899N1954k72407K66907J44813j45393
$$ plain form
8314 498508 626660 770774 516044 339097 592292 668739 490749 646023 408113 171662
8304 171662 372538 732501 934454 480193 255425 418482 512341 673065 635807 628108
8294 628108 618120 823818 806231 747935 633107 413007 375018 274759 524070 628940 556023
8283 556023 637641 785368 613342 487576 490478 341313 476350 422062 392160 404606 446469
8272 446469 357576 413271 517659 585867 668710 615602 713039 737034 613224 506868 434402
8261 434402 328127 395027 387773 189658 62677 156061 295889 494170 294158 287704 551344
8250 551344 550339 420586 258535 168275 150023 416079 258413 -64973 236284 164567 125803
8239 125803 142756 273320 515032 265755 164856 216810 -55597 211310 356123 210730
8229B10730K69287L9364N0105q7311O8904j59781j31693K41835k436O7669l01894
8218B64779j22171o8525J70342J98392J08714o045J22107o850J60565J57001n3002
8207I25307k79988j51776J86272K5039p0071p2181J99086m56588J84439o9309
8197D20230J17747M3031J75117r9519J48242q2881n12567K7641k47596J98703
8187A88148k99290K5109Q2180R5074l0578O8803R7789j87757p3380K58202k6969
8176A97331j03153Q020K02737N1084L1235M03592K678l43790k28254K05953J71262
8165E98695j72554k12312L9499L3429k1832p7388O0933P2747P7839k15694M7466
8154B30828j0277J97433l8425k49600N0209J04747Q5350N296J17428O4435j44741
$$ plain form
8229 210730 480017 519381 569486 482175 551079 391298 259605 501440 499004 566673 264779
8218 264779 142608 74083 244425 442817 551531 545486 667593 660743 821308 978309 925307
8207 925307 645319 493543 679815 704854 634783 562602 761688 305100 489539 420230
8197 420230 537977 581008 756125 656606 804848 721967 209400 237041 -10555 188148
8187 188148 -111142 -86033 -3853 91221 60643 129446 227235 39478 -33902 224300 197331
8176 197331 94178 102198 304935 356019 387254 790846 793524 449734 221480 427433 598695
8165 598695 426141 213829 253328 286757 264925 187537 248470 321217 399056 183362 230828
8154 230828 220551 417984 379559 129959 180168 284915 370265 375561 492989 557424 412683
8143D12683j66624k6315K55826r6998k08410L6237m94380J35985K66985R3668
8133B08657L1631R4360k20736Q7181P3915m76138K05895K54157O3669K8555j65978
8122A85168k1493l5673R2088O0785K5384k6023j91921j26684q8120j7426K6386
8111a17529J1655l8962L09799J80346l5684R3587j68968J1723j90887j61017K44566
8100A38629O5316K73774m384j8900j14234j53434j17644J33244K99761p6609k54782
8089A70737j21644n2294J21658r1308M577l9950J79693n4035J0252J20938k7774
8078B20850R4712R0029j43934j67143K00681m553L0331j38158k50943P13j2032
8067g9447J93249J24263L11481l63030k40990K95816O4709K1671l6608K3611J51457
$$ plain form
8143 412683 246059 219744 475570 378572 170162 206399 -287981 -151996 114989 208657
8133 208657 240288 334648 113912 201093 275008 -201130 4765 258922 322591 351146 185168
8122 185168 163675 128002 220090 280875 306259 280236 88315 -38369 -126489 -143915 -117529
8111 -117529 -105874 -144836 164963 345309 309625 403212 234244 245967 55080 -105937 138629
8100 138629 203945 477719 473335 454435 340201 186767 69123 202367 502128 425519 170737
8089 170737 49093 -3201 118457 27149 31726 -8224 171469 117434 127686 248624 220850
8078 220850 315562 405591 261657 94514 295195 290642 320973 182815 -68128 -67415 -79447
8067 -79447 113802 238065 549546 186516 -54474 241342 306051 327722 291114 314725 466182
8056D66182k2755p0551j7995O4060J09133k02625M3962p1184Q6108r7540j10756
8045A76039j62530J96210j4200k8431k82769N1954K72580J38787k10139K80627
8035D18128j60736j19535Q3618K17382k6913l06018J17256j63662l2790r0004
8025f3274J45008K45236J7251j13921o3485j31374k4414R024L3894K4304p830
8014G0419j29458J74640J12164o6398M2538k665k9014q7463K0827K51857l27915
8003B9532k17225M4913J42709L47855P4246k23452m72801L29948L80205q5525
7993C50405j22796l0439O1166R7510J93044j30624m25095L01000j38994J60912
7983C16089n8367j71447K3963j53402J39196l890O6385j70045r5574K60911J76035
$$ plain form
8056 466182 443427 372876 354881 418941 528074 325449 369411 298227 384335 286795 176039
8045 176039 13509 209719 195519 167088 -115681 -63727 208853 347640 137501 418128
8035 418128 257392 137857 221475 438857 411944 105926 223182 59520 26730 -63274
8025 -63274 81734 326970 344221 230300 166815 35441 11027 20051 53945 78249 70419
8014 70419 -59039 115601 227765 161367 203905 201240 172226 84763 105590 357447 29532
8003 29532 -187693 -142780 -71 347784 422030 198578 -274223 55725 435930 350405
7993 350405 227609 197170 258336 355846 548890 418266 -6829 294171 155177 316089
7983 316089 257722 86275 110238 -43164 96032 92142 158527 -11518 -107092 153819 329854
7972C29854O423k65053k2774K71103j15624j58151j32653M12191j50937j62911
7962A1468j16989J62565j29286J41664K6203O2964r4122l27264J54839K48955
7952A40997Q6814n961k32988K94922J45232j60184k26698J27118l7390J55101
7942B86963L4325L0484r4883j91679J34188l66338Q5815L17713N9316l4454Q8918
7931C50368n3855P0135l05377n9273K41427P8919k86050J16553Q8444m6276r8812
7920I6203L13344K258k54327J53405k47610K12486J33749j97914J84646p2128
7910C24112k08463o4274j18672K24082J11088p0506k70429n398L09274j35661
7900I5153J01439K16874j18362m9326j20616k00337k8861J43321n1152J76655
$$ plain form
7972 329854 336277 71224 48450 319553 203929 45778 -86875 325316 174379 11468
7962 11468 -105521 57044 -72242 69422 95625 158589 64467 -262797 -107958 140997
7952 140997 227811 221850 -11138 283784 429016 268832 42134 169252 131862 286963
7942 286963 321288 351772 256889 65210 199398 -166940 -81125 236588 295904 261450 350368
7931 350368 296513 366648 61271 1998 243425 322344 36294 152847 241291 195015 96203
7920 96203 409547 411805 157478 310883 63273 275759 409508 211594 396240 324112
7910 324112 115649 51375 -67297 156785 267873 197367 -73062 -78460 230814 95153
7900 95153 196592 413466 295104 245778 125162 -75175 -104036 39285 -11867 164788
7890A64788k2303j3637J358K6294L1658q1998N98J69824q8889J79151K96352k28594
7878D34602j15044j10o926l20823J03713k5243j08642R402L14338r7899k66806
7867g9438P9332J12763r3992j9882J17464L36166p1996r7907J23289m5054j9742
7856C41003Q1192j34338j17411K5803K80977l1067m3413j35379j18671j75292
7846b6596j39332K11239M5599M12178j55868r2132l6873k35626J0254P6646K22240
7835B91729Q4992j31064k016K16472j35076k35302o1690L5980L6521K39058j41030
7824A98574j49840J56879l3064k04172J23157J06180Q7867p8679J36586j28759
7814B14729Q4124N2833L40210P2647L68585k49435j267079K35641P8143K38513
$$ plain form
7890 164788 142485 128848 130206 156500 188158 106160 106758 276582 187693 366844 663196 434602
7878 434602 319558 319448 312522 -8301 95412 70169 -38473 -29071 285267 187368 -79438
7867 -79438 -106 112657 18665 -1217 116247 452413 380417 282510 405799 360745 341003
7856 341003 422195 287857 170446 196249 477226 446159 402746 267367 148696 -26596
7846 -26596 -165928 45311 90910 503088 347220 255088 218215 -17411 -7157 69489 291729
7835 291729 376721 245657 243641 460113 325037 89735 28045 64025 100546 339604 198574
7824 198574 48734 205613 172549 -31623 91534 197714 285581 206902 343488 214729
7814 214729 298853 351686 691896 764543 1133128 883693 -383386 -147745 -69602 168911
7804A68911r5330J3125m1994P2398P5249j07886N1356J7421j68344r3445L84346
7793B75807L7664j69448j50525J04354j40627J07244J78858m19072J4614J29207
7783c1924J64316k22655N3187m7506Q1981J12590O6903n9288j76964k6072J47135
7772F1703M21455j04632o9985J22381N996n4268L8036j19788k01622P7893N8323
7761B35492J5421n7759P4211J0308Q5241q5036q9348L1032J56780J55325k20755
7750C10912l62196L19129J44120j49582R6087O4011J76231o5033l21504N0306
7740B62481k399l9868j09948j83503K60542j6015l47387O0312L67775j0432k00082
7729D1476k21857m1672j26007k2395L93104K46591L10106j80273k29155n7495
$$ plain form
7804 168911 73581 86706 44712 117110 192359 84473 135829 153250 -15094 -108539 275807
7793 275807 313471 144023 -6502 97852 -42775 64469 243327 -175745 -161131 -31924
7783 -31924 132392 -90263 -37076 -84582 -2601 109989 176892 117604 -59360 -85432 61703
7772 61703 483158 378526 308541 430922 436918 382650 420686 300898 99276 177169 235492
7761 235492 250913 193154 267365 277673 362914 277878 188530 219562 376342 531667 310912
7750 310912 -51284 267845 411965 262383 358470 422481 598712 533679 212175 262481
7740 262481 260082 220214 110266 -73237 187305 171290 -176097 -115785 251990 241558 41476
7729 41476 -180381 -222053 -348060 -370455 22649 269240 579346 399073 169918 112423
7719A12423J71750l0589O6281k19497k54348Q6440k2726J67000Q280k45749L32484
7708A71749r038r4468l4334K18822k4675k24300p5296j97649K23101k78427M7598
7697b76917M09187J66626q8399K71839q5304k03708Q9842J13029J88804k42401
7687C42598k71043J02402n4884k31637L0849L52552j32948o038J55900J39343
7677D27094l69348J57879j20191k42429j7894J64594J34263N6277r8633L0122
7667A21734K32042J44821p0933q7340j04143m9160R0073k85512K52998K12725
7657D57305o0784J02756m84910j73654K67936l4496L4237k20042J52393L20327
7647C61068l15659j88358P6401J5921J71470P3048j67760l3176q7032j31116M6358
$$ plain form
7719 112423 284173 253584 319865 100368 -153980 -67540 -90266 76734 85014 -160735 171749
7708 171749 162711 68243 33909 252731 228056 3756 -71540 -269189 -46088 -324515 -276917
7697 -276917 132270 298896 210497 482336 397032 193324 283166 396195 584999 342598
7687 342598 71555 173957 119073 -112564 -81715 270837 137889 131851 287751 427094
7677 427094 57746 215625 95434 -146995 -164889 -295 133968 190245 91612 121734
7667 121734 353776 498597 427664 340324 236181 187021 277094 -8418 244580 457305
7657 457305 396521 499277 14367 -159287 108649 74153 108390 -111652 40741 361068
7647 361068 45409 -142949 -66548 -50627 120843 193891 26131 -7045 -94077 -225193 -178835
7636a78835J90108J77175P2410k89415O8258R6631J9916J7329j32071N6805M7833
7625A46144o731m23699o616K15187j00740J29498J01762K26327j6140k88473K00469
7614A76988K287k52843R0488J20625o9972K29192O7086j89783j12946K81031K43682
7603E85835n05170j38812M2109J8097m4620J01182P0941K1532J53245k66224m0431
7592b316K75734o2873j45564j56254J63928j7493q9197J83991J00097M8866j52648
7581A46271l4193J9610m5505j75260j05486J23041L92244l41796J35026K51771
7571C65723j53333j16198j93581k94689K89368K98130j07701j87910J18943o7298
7561d8546J15659J16852o7810P7717n9665m8911O5779l4700q0212J00494J09410
$$ plain form
7636 -178835 11273 188448 260858 -28557 39701 136332 156248 173577 41506 98311 146144
7625 146144 139413 -284286 -290902 -75715 -176455 -46957 54805 281132 264992 -23481 176988
7614 176988 179275 -73568 16920 137545 67573 296765 363851 174068 61122 342153 585835
7603 585835 80665 -58147 -16038 2059 -42561 58621 129562 151094 304339 38115 -2316
7592 -2316 273418 210545 64981 -91273 72655 55162 -34035 149956 250053 298919 146271
7581 146271 112078 131688 86183 -89077 -194563 -71522 320722 -21074 113952 365723
7571 365723 212390 96192 -97389 -392078 -102710 195420 87719 -100191 18752 -48546
7561 -48546 67113 183965 116155 193872 134207 85296 151075 116375 36163 136657 246067
7550B46067l5635J71782J54432K3111k31272J22405j66300k76045p6236P8025
7540A0334N0464q1647L3707n0755M12958l02215N7501k22732m4342J63580l001
7529B3852J78782L2035k38130o8721L6917j94598K2066M9144L12041J76337l20488
7518I237k30103K00754m0606k7423j90629N24432J8104j68483l41654j18026J57426
7507b06971J56504L5861J49055K40042l94645j41278j84839J19643J56551q0504
7497a50581m7687P2030r2647n0476N8256J52436m4963J05988J28887n2989M7922
7486A26176l642J21422r1071q0263j42035j0087K37640j28415J36850O6403j8469
7475B14509j8489r1611n4580j21557l0262L17389l66401R2557K73478p3965j55293
$$ plain form
7550 246067 210432 382214 536646 559757 328485 450890 284590 8545 -67691 10334
7540 10334 60798 -20849 12858 -37897 375061 72846 130347 -92385 -136727 26853 23852
7529 23852 202634 234669 -3461 -72182 -35265 -229863 -207797 -158653 153388 329725 9237
7518 9237 -220866 -20112 -60718 -88141 -278770 245662 263766 95283 -246371 -364397 -206971
7507 -206971 -50467 -14606 134449 374491 -20154 -161432 -346271 -226628 -70077 -150581
7497 -150581 -198268 -126238 -218885 -269361 -211105 -58669 -103632 2356 131243 78254 126176
7486 126176 122534 243956 152885 72622 -69413 -79500 158140 29725 166575 232978 214509
7475 214509 196020 104409 49829 -71728 -101990 215399 -151002 -58445 215033 141068 -14225
7464a4225r4366J2188K06325J89636k06864j45667L4076k79522J78945R2630k05692
7453b32536j2575J22028J58084J01367L2068N4026j20501k32849j26105L97136
7443A40143J03077N229o7971k1109L8594K3945J82051q2908l12714J55251p9744
7432H3844J7267K58102q9751o9570J27496M1345p0158K04836N3729q5047j73647
7421B98446Q9766n5318k00481k52425K27071j31931p6519P7051J98762L3090M2617
7410B50129k91519q8754R528J77229J42013k0317j79550j35161J09874J53039
7400A26511K09615p5021o1268p4430j329k26822j0202Q0477K22315L65740M0971
7389E96557k86574j81391J87175j69123K08147Q6976l53367R2259J52637l7693
$$ plain form
7464 -14225 -108591 -96403 109922 299558 92694 -52973 -18897 -298419 -119474 -26844 -232536
7453 -232536 -245111 -123083 35001 136368 168436 222462 101961 -130888 -256993 140143
7443 140143 243220 248449 180478 159369 197963 221908 403959 321051 8337 163588 83844
7432 83844 101111 359213 269462 199892 327388 368733 298575 503411 557140 472093 298446
7421 298446 388212 332894 132413 -120012 107059 -24872 -101391 -24340 174422 207512 250129
7410 250129 -41390 -130144 -120616 56613 198626 178309 -1241 -136402 -26528 126511
7400 126511 336126 261105 199837 125407 124078 -102744 -112946 -32469 189846 555586 596557
7389 596557 309983 128592 315767 146644 354791 441767 88400 180659 333296 295603
7379B95603m6647L27996p8022l02805k20899N2533J72487j19072J7870j72372
7369g3328J90753o6927K11361p0939r1462L8727J92768K68084k50421K2956j50741
7358B20831L2303j84149J40679K02952p0529j11022J09432J33826j38498j16296
7348B19529k187m5134p0771j67706q5650N4863R6882K85264J18120p6026l40687
7337a3503n6102n8934J49530K13935l09776P8727K00444k31448l39275J04714
7327b61688K51816J7857J45372P9090m44493j15686K09638J75832K85713k33045
7317A10406k715J46758l91479J87470J17349q3361j34713n4992J48240P1219J29749
7306B43931j11121j36913Q1570j3106j62016J16113L27122J27575n44368M6631
$$ plain form
7379 295603 248956 576952 498930 196125 -24774 27759 200246 81174 99044 -73328
7369 -73328 117425 50498 261859 190920 99458 138185 330953 599037 348616 371572 220831
7358 220831 253134 68985 209664 412616 342087 231065 340497 474323 335825 219529
7348 219529 217342 172208 101437 -66269 -151919 -97056 -174 285090 403210 327184 -13503
7337 -13503 -69605 -128539 20991 234926 -74850 3877 204321 -27127 -366402 -261688
7327 -261688 -9872 7985 153357 232447 -212046 -327732 -118094 57738 343451 110406
7317 110406 107691 254449 -137030 50440 167789 84428 -50285 -105277 42963 114182 243931
7306 243931 132810 -4103 77467 64361 -97655 18458 345580 473155 -71213 -24582
7296b4582J80129J9472k1681k72251J63548J21855j1029M5243j0069j26604J63076
7285B27107o3533l1203l0839l0598Q2373P1648J40509j01814k24596K1100M7691
7274A07845J15635j96762K0874N4116k70880O0473J90346J54596j76939Q4260
7264A43564J19630j26546r4697J29954k28404J41658k05539O1739K27730q3685
7254H5404J62789o5934j28588K9627K40104J05268j70512j71963j85573K40869
7244A41491J54612l34488J72984n1731k30990R7422L00940m8267r9303j34590
7234c1920P0049K03697l64680R4570M10742k8607k25831O7449M133k1858j62335
7223A5409J26561k38453M8740J9847N5064K78173j57022J95895K679j7004m8820
$$ plain form
7296 -24582 155547 175019 153338 -118913 44635 166490 155461 200704 190635 64031 227107
7285 227107 163574 132371 101532 70934 153307 224955 365464 263650 39054 60154 107845
7274 107845 223480 26718 47592 101708 -169172 -108699 81647 236243 59304 143564
7264 143564 263194 136648 41951 171905 -56499 85159 -120380 -58641 169089 85404
7254 85404 248193 182259 53671 83298 323402 428670 258158 86195 -99378 141491
7244 141491 296103 -38385 134599 82868 -148122 -50700 250240 201973 102670 -31920
7234 -31920 38129 241826 -122854 -28284 382458 353851 128020 195469 199602 177744 15409
7223 15409 141970 -96483 -47743 -27896 27168 305341 148319 344214 346893 329889 281069
7212B81069K6954j6918r0947j64529K11864P5596r8365j41560M9209J4879K3683
7201A70935J58685L8365L9551j01289k12061J35746k43354q6725j8158k9270J16453
7190c1122L95836k53883P111m0333j46432K64349O8074q8725O4227j84502j34797
7179h0197P2557N8722J01379l45442L55077k1925Q6480j17898r4554o1972k9044
7168g6817J02683o1291J87534j78151L5277K71738m5873R2381m6545j54448K73322
7157C99810l5422N9456j16718j53482J83564j24902k68296M0388k26381k8559
7147b70542L15112O8110q4596p8393j63123j26422K54829K11693k41732N8340
7137e6724m9742q1095M91877m48567m4138K75931J52433j27988J13164p5621k04387
$$ plain form
7212 281069 308023 291105 200158 35629 247493 323089 224724 83164 132373 147252 170935
7201 170935 329620 367985 407536 306247 94186 229932 -13422 -100147 -118305 -147575 -31122
7190 -31122 364714 110831 117942 77609 -68823 195526 263600 174875 239102 54600 -80197
7179 -80197 -7640 51082 152461 -192981 162096 140171 226651 108753 14199 -47773 -76817
7168 -76817 25866 -35425 152109 -26042 9235 280973 235100 327481 280936 126488 399810
7157 399810 364388 423844 307126 153644 337208 212306 -55990 -15602 -241983 -270542
7147 -270542 44570 112680 28084 -50309 -213432 -339854 -85025 126668 -115064 -56724
7137 -56724 -106466 -187561 304316 -144251 -188389 87542 239975 111987 225151 149530 -54857
7126e4857K5833j46047K45283J98227J50865l26561m3155j74408K54813J24958
7116B54951k35609K1411J44884J22508q5731k94958K0067m4903k0114Q6489j28543
7105a59548K11838j61338J1933j35104K04995j32036j28637L8064J16406J4638
7095a18789K49362J3699J22250l06171r3156K65482n2644j21229j45964J19661
7085f7499J14789K48048l0112q1590M073j78685o2433J63525j92730J27469J87623
7074B32478p4362k11397K23199M5481p1784K3047J65717J2172o8050J51038M7048
7063D74587k66587k33082L22J36366K06579k70394J06186p5073j63572J45459
7053F0791j5910j02204k055K70583J73704j85595k69832j52146N18040o0967j03600
$$ plain form
7126 -54857 -29024 -175071 70212 268439 419304 92743 49588 -124820 129993 254951
7116 254951 19342 40753 185637 308145 222414 -72544 -52477 -97380 -117494 -31005 -159548
7105 -159548 52290 -109048 -97115 -232219 -27224 -159260 -287897 -249833 -133427 -118789
7095 -118789 130573 144272 266522 -39649 -132805 132677 80033 -41196 -187160 -67499
7085 -67499 47290 295338 265226 183636 187709 9024 -53409 110116 -82614 44855 232478
7074 232478 158116 -53281 169918 215399 143615 166662 332379 344551 276501 427539 474587
7063 474587 208000 -25082 -24760 111606 318185 47791 153977 78904 -84668 60791
7053 60791 44881 -57323 -59378 211205 384909 199314 -70518 -222664 295376 234409 130809
7042A30809q0971M8892k68858K50392K46151n1313j32749j55566J73007m39q9788
7031F9567k11244L15291J61452m9785k08237O4908j86926P7249J23113j30439
7021B4949j6807J43957K3751n1296J65540j08144k29875k8709L29832J57363k48559
7010A62002Q9839R8960q8176m06419J72440K04398J46453J41355k16910m6804
7000B57138J97178J12024m0379l7178k50292j80303K19558P4032J11794k99080
6990A64492K26647j57615m1268K91068j87545j0482J16094j20037j96379Q38J65447
6979B51260P4757k08027j23994Q5416j37169L0842L86267O4158n8921j17586J05277
6968C52280R055J46466j11284l23070j3622k4425K08561L8557O6766J46582j92815
$$ plain form
7042 130809 49838 98730 -170128 80264 326415 275102 142353 -13213 159794 159355 69567
7031 69567 -141677 173614 335066 285281 77044 141952 -44974 32275 155388 24949
7021 24949 8142 152099 175850 124554 290094 181950 -47925 -76634 253198 410561 162002
7010 162002 251841 350801 262625 -143794 28646 233044 379497 520852 303942 257138
7000 257138 454316 566340 525961 488783 238491 58188 277746 351778 463572 164492
6990 164492 391139 233524 192256 483324 295779 285297 401391 281354 84975 85813 251260
6979 251260 326017 117990 -6004 79412 -57757 -26915 359352 423510 364589 247003 352280
6968 352280 361335 507801 396517 73447 59825 35400 243961 282518 349284 495866 303051
6957C03051o9483R3612O3091p9870L3197M42084j23818l07721K6029J30716p7134
6946D33754j15402k16400J51414J75336N1659K86352k26754P5234l6849l17471
6936B60873p6966R6125J24324k51347K03714j54382n3764M08384j01286j31862
6926C23813j13262J84828J72536k23406k8830m160o2492L3079j40405q748J21252
6915B54205L4590R529K4876J49042J47633j17988L893l5759j6793k45788L59074
6904E66514J83380j17026m4340J50110j74652j8489J58982j60042M1445k7628
6894E58254K2739L4256j01994r0548l8242K7325K04676j66445R2560M3723k13585
6883C72719L42983N8105o3512j15586o2091j4203R4990o0033R0855K591m4544
$$ plain form
6957 303051 233568 327180 390271 310401 343598 785682 661864 354143 380172 510888 433754
6946 433754 318352 101952 253366 428702 480361 766713 539959 615193 578344 260873
6936 260873 183907 280032 404356 153009 356723 202341 148577 556961 455675 323813
6926 323813 210551 395379 567915 344509 315679 311519 249027 282106 141701 132953 254205
6915 254205 288795 298324 323200 472242 619875 501887 505780 470021 453228 207440 566514
6904 566514 749894 632868 588528 738638 563986 545497 704479 544437 585882 558254
6894 558254 580993 615249 513255 422707 384465 411790 616466 450021 542581 586304 372719
6883 372719 715702 773807 710295 594709 532618 518415 613405 553372 644227 646818 602274
6872F02274L9354j71159K08346o1700j60575j36561J18894K96560j91667m6300
6862D97466l815J01412M1961k11203j63785J6527p190K88525o6179J22543j01207
6851E15055j60838M2900J78888p3716M0920K2691k58245M0162r5501J07899K7408
6840C87623J12194j5476M9574J47516k01688j07839K8848o4942J52275Q2011J791
6829E71887J6580L5128q161l40813L83818J12334j94806r3169J17255k03570j16964
6818B79519M4918R6010N9919O7325J50230p9533l13658k2348J01716P7421L84880
6807H46399j76880k28636j14262J36290k0620J38942k7490J64246J6984j39134
6797E95839o2527K32857j07248r0033j30043j92924l329J66716M6481k50910j65655
$$ plain form
6872 602274 641628 470469 678815 617115 456540 319979 438873 735433 543766 497466
6862 497466 493651 595063 637024 425821 262036 278563 271373 559898 493719 616262 515055
6851 515055 354217 397117 576005 502289 543209 565900 307655 347817 252316 360215 387623
6840 387623 499817 484341 533915 681431 479743 371904 400752 335810 488085 570096 571887
6829 571887 588467 623595 615434 274621 658439 770773 575967 482798 600053 396483 279519
6818 279519 324437 420447 480366 547691 697921 618388 304730 282382 384098 461519 846399
6807 846399 669519 440883 326621 462911 442291 581233 553743 717989 734973 595839
6797 595839 533312 766169 658921 568888 438845 245921 242592 409308 455789 204879 39224
6786C9224K62504J46400J4177J6023R153j93022R9805L5384k8902p9146J80894
6775E02494M2315j611r2919P6649n0599j33768j01223R2837o385q6592R1256J22702
6763D55156Q8483R1633M0448j36423N4941o9106J637J70921l72570J61019J17970
6752F04109q0120j80925O7707J90290R8759j13687J62910Q882r7600L0459j30444
6741E60340M3604k69894K10885j16670r250O2593p6178K37016Q0417k76384K39688
6730F86167J6056l62754j80822J71548J30732J375O3911j28961l2975K4338j24514
6719B64101L60813K49471j36717n0484Q5266K36896r1593J9354j18885J76683
6709I94905K32351n17986l3744J79856K77190l15582m5140P8807J75665j94061
$$ plain form
6786 39224 301728 448128 462305 478328 487481 294459 394264 429648 400746 321600 502494
6775 502494 544809 543198 450279 526928 476329 342561 241338 334175 327790 241198 332454 455156
6763 455156 543639 635272 675720 539297 594238 525132 526769 697690 325120 486139 604109
6752 604109 523989 343064 410771 601061 699820 586133 749043 757925 660325 690784 560340
6741 560340 603944 334050 544935 428265 419015 481608 405430 642446 722863 446479 686167
6730 686167 702223 339469 158647 330195 460927 462302 526213 397252 364277 388615 264101
6719 264101 624914 874385 737668 687184 772450 1009346 917753 937107 818222 994905
6709 994905 1227256 709270 675526 855382 1132572 816990 771850 850657 1026322 832261
6699H32261k43884L15290K72871j02600K16462l11317j27830o3274j58263L8429
6689F68145l31116n1937O8844J95905N9720J90334k31532l6879K50492R990n123
6678G86843j21653M00248p8678J72541m5472k7492j07615j51480J91727K34377
6668A253346R1664j53834P811J35113l1063R3129J27886l48876N2825N9346K48886
6657A536233j73631j46223K58898r3741L4060K178l742K2599k99791Q7781K89789
6646A514410n4521O8898l56561L9052M66737J36027o8308K42664j4261j62928
6636A811209j78750k8764K03950J35865J21268n5255j9705j33152J2682K50236
6626B119584K97092n6136p6676J49174M1953J05895K74001J03857L6070j13507
$$ plain form
6699 832261 588377 903667 1176538 1073938 1290400 979083 851253 787979 629716 668145
6689 668145 337029 285092 353936 549841 609561 799895 568363 531484 781976 791966 786843
6678 786843 665190 1065438 986760 1159301 1113829 1086337 978722 827242 1018969 1253346
6668 1253346 1345010 1191176 1198987 1334100 1303037 1396166 1524052 1175176 1228001 1287347 1536233
6657 1536233 1362602 1216379 1475277 1381536 1415596 1417774 1414032 1436631 1136840 1224621 1514410
6646 1514410 1459889 1528787 1172226 1211278 1678015 1814042 1745734 1988398 1974137 1811209
6636 1811209 1632459 1603695 1807645 1943510 2064778 2009523 1989818 1856666 1869348 2119584
6626 2119584 2416676 2360540 2283864 2433038 2474991 2580886 2854887 2958744 2994814 2881307
6616B881307o4049n7111n0615O35482K96239k4592L12895K42035K15427K71744
6606D658762L14224J07935K10097K86432J43976M11162J23453r4741j25805k19433
6596E816062M44594K79145L56866n0664J86655R0248J20659N67369K53358K14762
6586H279054M53036M02567N53949N33036P48270Q64491M36127M61199J76752J85243
6576A3093724K50251J25859P4902j42737J25871J14203N03800l7144L19947L35175
6566A4763851j01254K18907M33616k7398J37972M38264M89955K23355J80837J43769
6556A6901874P84615N23760M00918Q58892N74672N54600Q85047Q39682P99763
6547B3123823O45451N61783K0537j38472K40831o35486o23877l35285m30652l58181
$$ plain form
6616 2881307 2817258 2760147 2709532 3345014 3641253 3616661 3929556 4171591 4387018 4658762
6606 4658762 4972986 5080921 5291018 5577450 5721426 6132588 6256041 6161300 6035495 5816062
6596 5816062 6260656 6539801 6896667 6846003 7032658 7122906 7243565 7810934 8064292 8279054
6586 8279054 8732090 9134657 9688606 10221642 10969912 11834403 12270530 12731729 12908481 13093724
6576 13093724 13343975 13469834 13544736 13401999 13527870 13642073 14145873 14108729 14428676 14763851
6566 14763851 14662597 14881504 15315120 15287722 15425694 15863958 16353913 16577268 16758105 16901874
6556 16901874 17686489 18210249 18611167 19470059 20044731 20599331 21484378 22324060 23123823
6547 23123823 23769274 24331057 24351594 24213122 24453953 23818467 23194590 22859305 22428653 22070472
6537B2070472p1051j81919n6422l5731k38936L2578L75198J42589L91221L36519
6527B2764518L67297n2271J29393Q0073P4715O3091l65O4882M4163j57308N6613
6516B3434801K99394p9744J93629J87600r699J7602j45846l53437k55425r2546
6506B3196329l83698o46054l36592l53209j48336l29021P3867q1328q1455J06632
6496B1017135j38665K66129M86640N37590K51105K10228J6088J08813l81130o2349
6486B2311584j88236j50216l80655l04607l27066j72390j77931j92714k4934j56230
6476B0236605L42375P30103J47128M5042P6829j07761k15332K21240K91780k43150
6466B1524859m72535k53377l78786n7955p7217l33483k63015j34753m5922J66597
$$ plain form
6537 22070472 21999421 21817502 21761080 21725349 21486413 21518991 21894189 22036778 22427999 22764518
6527 22764518 23131815 23079544 23208937 23289010 23363725 23426816 23426451 23491333 23535496 23378188 23434801
6516 23434801 23734195 23654451 23848080 24035680 24025981 24043583 23897737 23544300 23288875 23196329
6506 23196329 22812631 22166577 21829985 21476776 21328440 20999419 21073286 20991958 20910503 21017135
6496 21017135 20878470 21144599 21631239 22168829 22419934 22630162 22646250 22755063 22373933 22311584
6486 22311584 22123348 21973132 21592477 21287870 20960804 20788414 20610483 20417769 20392835 20236605
6476 20236605 20578980 21309083 21456211 21501253 21578082 21470321 21254989 21476229 21768009 21524859
6466 21524859 21052324 20798947 20420161 20362206 20284989 19951506 19688491 19553738 19507816 19674413
6456A9674413K14218J87872J38520N8880M55208j8508K16797j18466K05794N6449
6446B1071177l96093j32913J62259j75516l76124L76827M7177N0795l5570j32655
6436B0459364j58651p4668l2585l28938l65838k43610m98686j76340k25127o05532
6426A7749389j34677K2820J03584l60801j44442L46000J54785K17697K34868L16923
6416A8506146j29191O8308K77158N3962q4177l85599l22990j48825j59494K28925
6406A7904223L28362j89158K29447K10046L24712M93412L99472M14804P46553
6397B0861873L30807L67726P79343P61993Q83812J800907K156160K390905L489565
6388C3823091M031994L747452K713928J125335q27955k220306l271088l700970
$$ plain form
6456 19674413 19888631 20076503 20215023 20273903 20729111 20710603 20927400 20808934 21014728 21071177
6446 21071177 20675084 20542171 20704430 20528914 20152790 20529617 20576794 20627589 20592019 20459364
6436 20459364 20300713 20226045 20193460 19864522 19498684 19255074 18756388 18580048 18354921 17749389
6426 17749389 17614712 17637532 17741116 17380315 17235873 17581873 17736658 17954355 18189223 18506146
6416 18506146 18376955 18445263 18722421 18776383 18692206 18306607 17983617 17834792 17675298 17904223
6406 17904223 18232585 18043427 18272874 18482920 18807632 19301044 19700516 20115320 20861873
6397 20861873 21192680 21560406 22339749 23101742 23985554 25786461 27942621 30333526 33823091
6388 33823091 37855085 41602537 44316465 45441800 44613845 42393539 39122451 35421481
6380C5421481k876709k520776k140253j847936j163879r24556p57164o19953k39242
6371B2331013j27804r2190N4901K01972L01296M16757M50720R36305Q06678R62556
6361B6242204J653944J856792J986250J726701J578094R41313Q04061Q07608J08172
6352C7705139p886k43800j140572j893112j783078j891111j793074j324307j345719
6343B6282480j005707n66280l14068j09597j15017j92061J66099M60512O37990
6334B5244351P14028R34697J330298J483581J545795J867759K156199K925679
6326C8202387L356796L942849M704229O068131P334961Q227259Q419879P377165
6318H7633656M556181K75586l253979o115027p529605p558902o653008n727195
$$ plain form
6380 35421481 32544772 30023996 27883743 26035807 24871928 23947372 23190208 22570255 22331013
6371 22331013 22203209 22111019 22165920 22367892 22669188 23085945 23536665 24472970 25279648 26242204
6361 26242204 27896148 29752940 31739190 33465891 35043985 35985298 36789359 37596967 37705139
6352 37705139 37697253 37453453 36312881 34419769 32636691 30745580 28952506 27628199 26282480
6343 26282480 25276773 24710493 24396425 24286828 24171811 23979750 24145849 24606361 25244351
6334 25244351 25958379 26893076 28223374 29706955 31252750 33120509 35276708 38202387
6326 38202387 41559183 45502032 50206261 56274392 63609353 71836612 80256491 87633656
6318 87633656 92189837 92465423 89211444 83096417 75566812 68007910 61354902 55627707
6310E5627707m735760l689733k709489j789081j094973m46467Q349O68168R93844
6301D2832565K121294K353760K655712K950993K616142K418228K555160L147544
6293F3651398M011977M551908M439699M347127M304269L386654L341911K850643
6285I4885586J726132L23159j492697l393620n106778n800218n581180m951987
6277G0608397l915531l127342k413281k016514k220659j859430j851664j393003
6269E1810973j182310m78763M62580R93302J068477J878601K361457K039846K140097
6260F1094260K846591L409002L428990L007912K982866K962698L473827M506745
6252H7712891N475964O651432O386062M720168J828853j575133m241252n756346
$$ plain form
6310 55627707 50891947 47202214 44492725 42703644 41608671 41162204 41170553 41838721 42832565
6301 42832565 44953859 47307619 49963331 52914324 55530466 57948694 60503854 63651398
6293 63651398 67663375 72215283 76654982 81002109 85306378 88693032 92034943 94885586
6285 94885586 96611718 96934877 95442180 92048560 86941782 81141564 75560384 70608397
6277 70608397 66692866 63565524 61152243 59135729 56915070 55055640 53203976 51810973
6269 51810973 50628663 50149900 50612480 51605782 52674259 54552860 56914317 58954163 61094260
6260 61094260 63940851 67349853 70778843 73786755 76769621 79732319 83206146 87712891
6252 87712891 93188855 99840287 106226349 110946517 112775370 111200237 106958985 101202639
6244A01202639o079988n270692m008222k609518j090218N37324K440179L246520
6236H8368024L556121M346655L669715L926829M495159M416613M014303L679173
6228A20472592K461745M2382j586310l889691n846885p780912q234874p661642
6220H7976405o829542n268652m255285l083846j482047p53J042292J709047K135537
6211G1943156K343984J758082J059352M26407p40116j943207k590687l313936
6203F8943035l397804l237713k452403j571711q62369l96134M99707M36596K66939
6194E8228143o63898j214013j898269j931312j822585j432671k99162L97802R90861
6185E0354896K387965K911696L551624L286415J705512O43494j040349j545393
$$ plain form
6244 101202639 95122651 89851959 85843737 83234219 82144001 82681325 85121504 88368024
6236 88368024 91924145 96270800 99940515 103867344 108362503 112779116 116793419 120472592
6228 120472592 122934337 122976719 121390409 117500718 111653833 103872921 95638047 87976405
6220 87976405 81146863 75878211 71622926 68539080 67057033 67056280 68098572 69807619 71943156
6211 71943156 74287140 76045222 77104574 77530981 76790865 74847658 72256971 68943035
6203 68943035 65545231 62307518 59855115 58283404 57421035 57024901 57524608 57961204 58228143
6194 58228143 57564245 56350232 54451963 52520651 50698066 49265395 48966233 49364035 50354896
6185 50354896 52742861 55654557 59206181 62492596 64198108 64841602 63801253 62255860
6177F2255860j948416j463504q62547m04677n28554J19738k76635j02903k34103
6168E6554259l7981m78253q30670q07209q17761n63466J62131P46796J015458
6159E4943304R97259Q55262l24566r16087m81129j48873J92716N84493J882853
6150E7585232K696545K999605K851557K878378K167354J029958Q63582j33644
6142G2938567r47824j591170k698310k816087k836044l246296k919273j868265
6134E4015298j838218r52778O9208M08942J304446J528824J234547O19189L32779
6125E6722237m17552q66963r95282r35511j184214r45379j203725j661707j648548
6116D6863356j915752k078905k564197k020189k368205k153823j841843k035084
$$ plain form
6177 62255860 60307444 58843940 57981393 57576716 57048162 57167900 56891265 56788362 56554259
6168 56554259 56516278 56038025 55207355 54400146 53582385 53018919 53181050 53927846 54943304
6159 54943304 55940563 56795825 56471259 55555172 55074043 54925170 55117886 55702379 57585232
6150 57585232 60281777 63281382 66132939 69011317 71178671 72208629 73072211 72938567
6142 72938567 71990743 70399573 67701263 64885176 62049132 58802836 55883563 54015298
6134 54015298 52177080 51224302 51293510 51702452 53006898 54535722 55770269 56389458 56722237
6125 56722237 56304685 55437722 54442440 53506929 52322715 51377336 50173611 48511904 46863356
6116 46863356 44947604 42868699 40304502 38284313 35916108 33762285 31920442 29885358
6108B9885358j696718p92694q88271o68253n38696k52732L61395N15348N46997
6099B6471734L35731L35405J98445k94805r02389p66074p04356j117335o15886
6090B2940470m49676n27311m06223o8823J89441Q27369R65965J342304J712204
6081B6525720J848136J731470J243799O42469L44528J08895j69581l74232p53630
6072C1147574o11129j156368q29007o71239o22179m26182k27393L13234J74955
6063B7092266K54478M36511J83813J50148Q1480k08642l40848p06655r21628n15095
6053B5505828n00230q59949o59407n31160n04324n39357l97765J44462m45440
6044B1212658N4563L56768L50784M67787M32337L3613k20843l86975r43775o03217
$$ plain form
6108 29885358 28188640 27395946 26507675 25839422 25300726 25047994 25409389 25924737 26471734
6099 26471734 26807465 27142870 27341315 27046510 26144121 25378047 24673691 23556356 22940470
6090 22940470 22490794 21963483 21557260 21488437 21677878 22505247 23471212 24813516 26525720
6081 26525720 28373856 30105326 31349125 31991594 32336122 32445017 32275436 31901204 31147574
6072 31147574 30536445 29380077 28551070 27879831 27257652 26831470 26604077 26917311 27092266
6063 27092266 27346744 27783255 27967068 28117216 28198696 27990054 27649206 26942551 26020923 25505828
6053 25505828 25005598 24145649 23486242 22955082 22450758 21911401 21513636 21658098 21212658
6044 21212658 21267221 21623989 21974773 22442560 22874897 22908510 22687667 22300692 21356917 20753700
6034B0753700o51045l99961n78869q88965l57011j55237o44957k39579j33710
6025A6704366K462L9361K34649K52304L15441J26988R4826l6650m65641P3187
6015A7341293k49694q15109n99808j014064j121264p14892r76536p09640q46871
$$ plain form
6034 20753700 20102655 19702694 19123825 18234860 17877849 17722612 17077655 16838076 16704366
6025 16704366 16706828 16746189 16980838 17233142 17548583 17675571 17770397 17733747 17268106 17341293
6015 17341293 17091599 16276490 15676682 14662618 13541354 12826462 11849926 11140286 10293415
$$ [...]
##END NTUPLES=NMR SPECTRUM
##END=
