##TITLE=1H_DE-80H_X3
 200.13MHz, d2o
 8 sc
 
 19ns.26.2.2025
##JCAMPDX= 6.0         $$ Bruker NMR JCAMP-DX V2.0
##DATA TYPE= NMR SPECTRUM
##DATA CLASS= NTUPLES
##ORIGIN= UXNMR, Bruker Analytische Messtechnik GmbH
##OWNER= pz
$$ XWIN-NMR		Version 3.5
$$ Tue Mar 24 13:56:53 2026 Russian Standard Time (UT+4h)  Yarkov@DPX200
##.OBSERVE FREQUENCY= 200.1313
##.OBSERVE NUCLEUS= ^1H
##.ACQUISITION MODE= SIMULTANEOUS
##.ACQUISITION SCHEME= undefined
##.AVERAGES= 8
##.DIGITISER RES= 18
##SPECTROMETER/DATA SYSTEM= spect
##.PULSE SEQUENCE= zg30
##.SOLVENT NAME= DMSO
##.SHIFT REFERENCE= (INTERNAL, DMSO, 0, 15.4913)
##AUDIT TRAIL= $$ (NUMBER, WHEN, WHO, WHERE, WHAT)
$$ ##TITLE= Audit trail, XWIN-NMR		Version 3.5
$$ ##JCAMPDX= 5.01
$$ ##ORIGIN= Bruker BioSpin GmbH
$$ ##OWNER= Yarkov
$$ C:/Bruker/XWIN-NMR/data/yarkov2/nmr/H-C/1/pdata/1/auditp.txt
$$ ##AUDIT TRAIL=  $$ (NUMBER, WHEN, WHO, WHERE, WHAT)
(   1,<2026-03-24 13:56:03.40 +0400>,<Yarkov>,<DPX200>,
      <created by zg, POWCHK disabled, PULCHK disabled
       configuration hash MD5:
       00 E9 B6 7A A2 85 ED C7 34 08 36 98 17 FE 4E 26
       data hash MD5: 16K
       2B B7 62 17 1B 20 08 8F F5 A9 A8 B4 11 30 0C 5A>)
(   2,<2026-03-24 13:56:09.92 +0400>,<Yarkov>,<DPX200>,
      <Start of raw data processing
       efp BC_mod = 2 LB = 0.25 FT_mod = 6 PKNL = 1 PHC0 = -5299.148 PHC1 = 6.821927 SI = 16K 
       data hash MD5: 16K
       DE 06 DA 63 62 CA FB 92 95 D5 0D 30 C1 82 C2 AE>)
$$ ##END=
$$ 
$$ hash MD5
$$ A6 FE D2 F4 02 C4 4D 79 34 14 57 0C 23 35 13 DA
##$RELAX= 
##$RELAX= 
##$RELAX= 
##$RELAX= 
##$RELAX= 
##$RELAX= 
$$ Bruker specific parameters
$$ --------------------------
##$DU= <C:/Bruker/XWIN-NMR>
##$EXPNO= 1
##$NAME= <H-C>
##$PROCNO= 1
##$TYPE= <nmr>
##$USER= <yarkov2>
##$AMP= (0..31)
100 100 100 100 100 100 100 100 100 100 100 100 100 100 100 100 100 100 
100 100 100 100 100 100 100 100 100 100 100 100 100 100 
##$AQSEQ= 0
##$AQ_mod= 1
##$AUNM= <au_zg>
##$AUTOPOS= <>
##$BF1= 200.13
##$BF2= 200.13
##$BF3= 200.13
##$BF4= 200.13
##$BF5= 200.13
##$BF6= 200.13
##$BF7= 200.13
##$BF8= 200.13
##$BYTORDA= 1
##$CFDGTYP= 0
##$CFRGTYP= 5
##$CHEMSTR= <none>
##$CNST= (0..31)
1 1 145 1 1 1 1 1 1 1 1 1 1 1 1 1 1 1 1 1 1 1 1 1 1 1 1 1 1 1 1 1 
##$CPDPRG= <>
##$CPDPRG1= <>
##$CPDPRG2= <>
##$CPDPRG3= <>
##$CPDPRG4= <mlev>
##$CPDPRG5= <mlev>
##$CPDPRG6= <mlev>
##$CPDPRG7= <mlev>
##$CPDPRG8= <mlev>
##$CPDPRGB= <>
##$CPDPRGT= <>
##$D= (0..31)
0 0.7 0 0 0 0 0 0 0 0 0 0.03 0 0 0 0 0 0 0 0 0 0 0 0 0 0 0 0 0 0 0 0 
##$DATE= 1774346162
##$DBL= (0..7)
120 120 120 120 120 120 120 120 
##$DBP= (0..7)
150 150 150 150 150 150 150 150 
##$DBP07= 0
##$DBPNAM0= <>
##$DBPNAM1= <>
##$DBPNAM2= <>
##$DBPNAM3= <>
##$DBPNAM4= <>
##$DBPNAM5= <>
##$DBPNAM6= <>
##$DBPNAM7= <>
##$DBPOAL= (0..7)
0.5 0.5 0.5 0.5 0.5 0.5 0.5 0.5 
##$DBPOFFS= (0..7)
0 0 0 0 0 0 0 0 
##$DE= 6
##$DECBNUC= <off>
##$DECIM= 32
##$DECNUC= <off>
##$DECSTAT= 4
##$DIGMOD= 1
##$DIGTYP= 9
##$DL= (0..7)
0 120 120 120 120 120 120 120 
##$DP= (0..7)
$$ [...]
##$SUBNAM2= <"">
##$SUBNAM3= <"">
##$SUBNAM4= <"">
##$SUBNAM5= <"">
##$SUBNAM6= <"">
##$SUBNAM7= <"">
##$SUBNAM8= <"">
##$SUBNAM9= <"">
##$SW= 18.0517328524113
##$SWIBOX= (0..15)
0 0 2 0 0 0 0 0 0 0 0 0 0 0 0 0 
##$SW_h= 3612.71676300578
##$TD= 16384
##$TD0= 1
##$TE= 0
##$TE2= 300
##$TE3= 300
##$TEG= 300
##$TL= (0..7)
0 120 120 120 120 120 120 120 
##$TP= (0..7)
150 150 150 150 150 150 150 150 
##$TP07= 0
##$TPNAME0= <>
##$TPNAME1= <>
##$TPNAME2= <>
##$TPNAME3= <>
##$TPNAME4= <>
##$TPNAME5= <>
##$TPNAME6= <>
##$TPNAME7= <>
##$TPOAL= (0..7)
0.5 0.5 0.5 0.5 0.5 0.5 0.5 0.5 
##$TPOFFS= (0..7)
0 0 0 0 0 0 0 0 
##$TUNHIN= 0
##$TUNHOUT= 0
##$TUNXOUT= 0
##$USERA1= <user>
##$USERA2= <user>
##$USERA3= <user>
##$USERA4= <user>
##$USERA5= <user>
##$V9= 5
##$VALIST= <valist>
##$VCLIST= <CCCCCCCCCCCCCCC>
##$VD= 0
##$VDLIST= <DDDDDDDDDDDDDDD>
##$VPLIST= <PPPPPPPPPPPPPPP>
##$VTLIST= <TTTTTTTTTTTTTTT>
##$WBST= 1024
##$WBSW= 4
##$XGAIN= (0..3)
0 0 0 0 
##$XL= 0
##$YL= 0
##$YMAX_a= 53976
##$YMIN_a= -47219
##$ZGOPTNS= <>
##$ZL1= 120
##$ZL2= 120
##$ZL3= 120
##$ZL4= 120
##$ABSF1= 0
##$ABSF2= 0
##$ABSG= 0
##$ABSL= 0
##$ALPHA= 0
##$AQORDER= 0
##$ASSFAC= 0
##$ASSFACI= 0
##$ASSFACX= 0
##$ASSWID= 0
##$AUNMP= <proc_1d>
##$AZFE= 0.1
##$AZFW= 0.1
##$BCFW= 0
##$BC_mod= 2
##$BYTORDP= 0
##$COROFFS= 0
##$CY= -3
##$DATMOD= 1
##$DC= 0
##$DFILT= <>
##$DTYPP= 0
##$F1P= 0
##$F2P= 0
##$FCOR= 1
##$FTSIZE= 16384
##$FT_mod= 6
##$GAMMA= 0
##$GB= 0
##$INTBC= 1
##$INTSCL= 3.241238e-09
##$ISEN= 128
##$LB= 0.25
##$LEV0= 0
##$LPBIN= 0
##$MAXI= 10000
##$MC2= 0
##$MEAN= 0
##$ME_mod= 0
##$MI= 1.114404
##$NCOEF= 0
##$NC_proc= -9
##$NLEV= 6
##$NOISF1= 3.799351
##$NOISF2= 2.8
##$NSP= 0
##$NTH_PI= 0
##$NZP= 0
##$OFFSET= 15.49127
##$PC= 1
##$PHC0= -5299.148
##$PHC1= 6.821927
##$PH_mod= 1
##$PKNL= yes
##$PPARMOD= 0
##$PSCAL= 0
##$PSIGN= 0
##$REVERSE= no
##$SF= 200.130006089336
##$SI= 16384
##$SIGF1= 3
##$SIGF2= 2
##$SINO= 0.751879
##$SIOLD= 32768
##$SREGLST= <19F.Aceton>
##$SSB= 0
##$STSI= 16384
##$STSR= 0
##$SW_p= 3612.71676300578
##$SYMM= 0
##$S_DEV= 0
##$TDeff= 16384
##$TDoff= 0
##$TI= <>
##$TILT= no
##$TM1= 0
##$TM2= 0
##$TOPLEV= 0
##$USERP1= <user>
##$USERP2= <user>
##$USERP3= <user>
##$USERP4= <user>
##$USERP5= <user>
##$WDW= 1
##$XDIM= 16384
##$YMAX_p= 480537689
##$YMIN_p= -1330015
$$ End of Bruker specific parameters
$$ ---------------------------------
##NTUPLES= NMR SPECTRUM
##VAR_NAME=  FREQUENCY,     SPECTRUM/REAL,   SPECTRUM/IMAG
##SYMBOL=    X,             R,               I
##VAR_TYPE=  INDEPENDENT,   DEPENDENT,       DEPENDENT
##VAR_FORM=  AFFN,          ASDF,            ASDF
##VAR_DIM=   16384,         16384,           16384
##UNITS=     HZ,            ARBITRARY UNITS, ARBITRARY UNITS
##FACTOR=    0.220516191357247, 1,           1
##FIRST=     3100.26797250156, 0,            0
##LAST=      -512.448790504218, 0,           0
##MIN=       -512.448790504218, -1330015,    0
##MAX=       3100.26797250156, 480537689,    0
$$ Real data points
##PAGE= N=1
##DATA TABLE= (X++(R..R)), XYDATA
$$ [...]
5135H423398k13825M92013j5813K40122o3142K52171M44366k48881L17603P2333
5125I700345L34233L229K5966J26074Q4437M53410J00839O6306k59687j14831
5115A0520321K24049l86049j1295J95068L59757o2612K87532P3579N60922M79385
5105A2240657l16206N09026L02711o0030k24360M56407j21852r2351Q80756P30792
5095A4305550l55570k95986P16655L7699K445J044664k18105L38055M38639n03666
5085A5510380L99553J393696j37781K12825M16282K65142M32189R00012J043692
5076B0435990O07665L19692L41594J23852l1784N86842R16267J266784M71685
5067B5038587Q47428J074312P34942P57137N40657N50783R63183Q30402R17691
$$ plain form
5135 8423398 8209573 8701586 8685773 8925895 8862753 9114924 9559290 9310409 9628012 9700345
5125 9700345 10034578 10037807 10063773 10189847 10274284 10727694 10828533 10894839 10635152 10520321
5115 10520321 10744370 10358321 10347026 10542094 10901851 10839239 11126771 11200350 11761272 12240657
5105 12240657 11924451 12433477 12736188 12676158 12451798 12908205 12786353 12694002 13574758 14305550
5095 14305550 13949980 13653994 14370649 14408348 14410793 15455457 15237352 15575407 16014046 15510380
5085 15510380 15909933 17303629 17165848 17378673 17794955 18060097 18492286 19392298 20435990
5076 20435990 21043655 21363347 21704941 21828793 21797009 22383851 23300118 24566902 25038587
5067 25038587 25886015 26960327 27695269 28452406 28993063 29543846 30507029 31337431 32255122
5058C2255122J529238P17572Q65218J184870Q05886J156037O48020N71901N67041
5049D0300905P47838J095878N31629O49466O12573K66041o1273j09351M19984
5040D4453690k1526k49349K67160M3325r59360r94663J9668l36705j167971l95017
5030D0659252q37128j000467n85153p65274r40841j121412p44146l01005o72728
5021C3691098p76194n32707o57650m28793p53760j024847m11988q90445k06180
5012B8008534K42952k99078q77013m2582l29098p12945m2191p2483l8898J32708
5002B5969906J27053o3859l00681j29766o72241q8395k96526o39003j81211k45373
4992B3479904L43226l87864n48566r49706l81337l04593O3485j51846j828k6650
$$ plain form
5058 32255122 33784360 34501932 35367150 36552020 37357906 38513943 39161963 39733864 40300905
5049 40300905 41048743 42144621 42676250 43325716 43938289 44204330 44143057 44033706 44453690
5040 44453690 44432164 44182815 44449975 44493300 43533940 42539277 42558945 42222240 41054269 40659252
5030 40659252 39822124 38821657 38236504 37471230 36530389 35408977 34664831 34363826 33691098
5021 33691098 32914904 32382197 31724547 31295754 30541994 29517147 29105159 28214714 28008534
5012 28008534 28251486 27952408 27075395 27032813 26703715 25990770 25948579 25876096 25837198 25969906
5002 25969906 26096959 26033100 25732419 25602653 24930412 24842017 24545491 23906488 23725277 23479904
4992 23479904 23823130 23435266 22886700 21936994 21555657 21251064 21314549 21162703 21160875 21134225
4982B1134225n11227n2242L79863J39628m85404J50977n85358J43694K35992m4432
4972B0505716K43286K91135J02062m18191l95663M7205K7882m13599J74563J65418
4962B0329814j1068N15662j81182k53199J6788k70141k26299o4612k0548L325
4952A9838540M37371k25005r1991l4908p0598j44801k38187N34867K75584l2075
4942B0248797k19047n51870J6001J88218K98202k18033r4229J50898j92077n14298
4932A9112562k33635L26822J9153j14734K16072N10275L21238k19330j69014J77403
4922A9946812K49422M97026Q9625L75341J95859M07107O9748j27197P01383P43035
4912B3148161Q38119N2316j68369n4386O49572L77029M58284J17032K90766K02991
$$ plain form
4982 21134225 20622998 20570756 20950619 21090247 20604843 20755820 20170462 20314156 20550148 20505716
4972 20505716 20749002 21040137 21142199 20724008 20328345 20375550 20403432 19989833 20164396 20329814
4962 20329814 20318746 20834408 20653226 20400027 20416815 20146674 19920375 19855763 19835215 19838540
4952 19838540 20275911 20050906 19958915 19924007 19853409 19708608 19470421 20005288 20280872 20248797
4942 20248797 20029750 19477880 19493881 19682099 19980301 19762268 19668039 19818937 19626860 19112562
4932 19112562 18878927 19205749 19224902 19110168 19326240 19836515 20157753 19938423 19769409 19946812
4922 19946812 20196234 20693260 20782885 21158226 21354085 21761192 21830940 21703743 22405126 23148161
4912 23148161 23986280 24038596 23870227 23815841 24465413 24842442 25300726 25417758 25708524 25911515
4902B5911515R27212O42932j99913L4848N11583M72759j2212L50204J68438Q69802
4892B9677168O60144j61942m3250j68980L47233L66342J00186L33804N57275k42757
4882C1425223n59027k34896p484L50352M36046N05905l93314J19883N50911P15672
4872C2909271P01896K72874n92183k12602P32525L44876L50177M04206L2626O20485
4862C5564151J67797L2281J39851M53975J22047J24906k17947k11095K58104J02728
4852C6536798J92367j03674L65020O14327J387336J053529J355660R74571J213725
4843D3589659J375561J940184K998753L624968L164140L520493M225279N204881
4835F9643918N750753N844671O251696N717530L709181J811035J537019Q3412
$$ plain form
4902 25911515 26838727 27481659 27281746 27316594 27828177 28300936 28288724 28638928 28807366 29677168
4892 29677168 30337312 30175370 30132120 29963140 30310373 30676715 30776901 31110705 31667980 31425223
4882 31425223 30866196 30631300 30623816 30974168 31410214 31916119 31522805 31642688 32193599 32909271
4872 32909271 33611167 33884041 33291858 33079256 33811781 34156657 34506834 34911040 34943666 35564151
4862 35564151 35731948 35764229 35904080 36358055 36480102 36605008 36387061 36175966 36434070 36536798
4852 36536798 36729165 36625491 36990511 37604838 38992174 40045703 41401363 42375934 43589659
4843 43589659 44965220 46905404 49904157 53529125 56693265 60213758 64439037 69643918
4835 69643918 75394671 81239342 87491038 93208568 96917749 98728784 100265803 100349215
4827A00349215j848605l030292l407940l619607m297354n360462n586126o101539
4819F7097290n430981m853189l966997m295905l710662l506825k757373j978469
4811C6596889k078206j463223j056670j400881j110982o79756q34016r47770p06223
4802B6319162j122224m13014p2914j77981j012620j133025l38780o7401k96173
4793B1685030k61647p45195n24796j40747k30175k14319q10829m03282P278O80108
4783A9041426n12835o3748j16235m4396O0205m93805l87765q24849M24145J78595
4773A7260738n90345O44103L33989N43529L44328n05552R2962M50030k36240m11935
4763A7925607j67289K97075J186460O56541N49718L72477K9682L29219M67778
$$ plain form
4827 100349215 98500610 95470318 92062378 88442771 84145417 78784955 73198829 67097290
4819 67097290 61666309 56813120 52846123 48550218 44839556 41332731 38575358 36596889
4811 36596889 34518683 33055460 31998790 30597909 29486927 28807171 27973155 27025385 26319162
4802 26319162 25196938 24783924 24711010 24533029 23520409 22387384 22048604 21981203 21685030
4793 21685030 21423383 20678188 20153392 20012645 19782470 19568151 18757322 18354040 18361318 19041426
4783 19041426 18528591 18464843 18348608 18304212 18364417 17870612 17482847 16657998 17082143 17260738
4773 17260738 16670393 17314496 17648485 18192014 18536342 18030790 18123752 18573782 18337542 17925607
4763 17925607 17758318 18055393 19241853 19898394 20448112 20820589 20850271 21179490 21647268
4754B1647268N83624J030884O96740P96242J143415K86944M02843P20145J735950
4745B9044055J882201R80082O10374O71801J148632J152816Q71758J174773P57420
4736C8293912J093081J132002P05137P95898J068157Q76074M94188P39572N73020
4727D5771041J65028P66470N70037J033052O91001Q81770N94197P81599J221437
4718E2475632R76202J411378J291301J047294P46864J406553J073906N10621R15080
4709F1854831J345184N50241q2919M90914M7780n8879j66461o72469r99562j838573
4699F0470087q95140n93562r71653j074014j547637j305086j252113j779216j379321
4690D9672345p23874o89823p98021j350840r97356r38991j227274o92947j873158
$$ plain form
4754 21647268 22230892 23261776 23958516 24754758 25898173 26185117 26587960 27308105 29044055
4745 29044055 30926256 31906338 32516712 33188513 34337145 35489961 36361719 37536492 38293912
4736 38293912 39386993 40518995 41224132 42020030 43088187 43964261 44458449 45198021 45771041
4727 45771041 45936069 46702539 47272576 48305628 48996629 49878399 50472596 51254195 52475632
4718 52475632 53451834 54863212 56154513 57201807 57948671 59355224 60429130 60939751 61854831
4709 61854831 63200015 63750256 63667337 64158251 64206031 64147152 63980691 63308222 62308660 60470087
4699 60470087 59574947 58981385 58009732 56935718 55388081 54082995 52830882 51051666 49672345
4690 49672345 48948471 48258648 47460627 46109787 45112431 44173440 42946166 42253219 40380061
4681D0380061n45765n25723j176325j112117j531271j299962j351396j488369
4673C1349133q22593j243248j419677j339880r13452p58213j656483j328463j054083
4664B0813041j055783o39424n75458j274705o65420m74357K29729o87144p60330
4655A4910149K58485o08256p95522m28511l17388K31343M60120l50312l70190
4646A2989918k72120l60963l79940L15296M55286k3740N24989J268764J171531
4637A5689021K01226N56867M72785J632568J478211J271882J460093J360950J366422
4628B5490025P09225N12695J090076P16049K25315m99932k77138M2415m03168
4619B7605562k55570j69978K44438M022M65754R49530J145309J235847J580352
$$ plain form
4681 40380061 39834296 39308573 38132248 37020131 35488860 34188898 32837502 31349133
4673 31349133 30526540 29283292 27863615 26523735 25610283 24852070 23195587 21867124 20813041
4664 20813041 19757258 19117834 18542376 17267671 16602251 16127894 16357623 15670479 14910149
4655 14910149 15168634 14560378 13764856 13336345 13018957 13250300 13710420 13360108 12989918
4646 12989918 12717798 12356835 11976895 12292191 12747477 12723737 13248726 14517490 15689021
4637 15689021 15890247 16447114 16919899 18552467 20030678 21302560 22762653 24123603 25490025
4628 25490025 26199250 26711945 27802021 28518070 28743385 28243453 27966315 28008730 27605562
4619 27605562 27349992 27180014 27424452 27428474 27894228 28843758 29989067 31224914 32805266
4610C2805266J741307J606517K195164K562047K101042K557024K080542K253125
4602D9902034K195008K007177J863765K246034J876740J845910J876239J139307
4594F4952214J601907O67347K10R2518j3358q94134j215269q30445j577551j354335
4584F1429104k101402l089554k470894k718896k156277k258628k813992k536066
4576D1283395l006061k163529k381868l102770k315584k280628j992425k552212
4568B1488318k022318j488566k163017j509389q41957r06412j490636q16745l3083
4559A0216195k90115q04800p52168m01334n18066q09882j71172m63162K24949
4550F230445o8563L5015o985n65442R4597j7503J1719j39814l73032J07030j30285
$$ plain form
4610 32805266 34546573 36153090 38348254 40910301 43011343 45568367 47648909 49902034
4602 49902034 52097042 54104219 55967984 58214018 60090758 61936668 63812907 64952214
4594 64952214 66554121 67221468 67221678 67314196 67300838 66406704 65191435 64360990 62783439 61429104
4584 61429104 59327702 56238148 53767254 51048358 48892081 46633453 43819461 41283395
4576 41283395 38277334 36113805 33731937 30629167 28313583 26032955 24040530 21488318
4568 21488318 19466000 17977434 15814417 14305028 13463071 12556659 11066023 10249278 10216195
4559 10216195 9926080 9121280 8369112 7967778 7449712 6639830 6468658 6005496 6230445
4550 6230445 6161882 6196897 6189912 5624470 5719067 5701564 5713283 5573469 5200437 5307467 5177182
4539E177182q9756m24374j8230L89455L30743j79598k83878L73843J93545n91721
4529D877211j67973L71550N01174k63089m19178j49478L8226K76199J56738k8206
4519E193174k96538K80960l89100k06706j69928K43628P0654L42156n97636j59403
4509D311261Q04485J3465k97768J46989k32011n10820j4613L13061m36170l22041
4499C775838j46436N85443l9811k35293L16172J1021K65173R0140m21695j86355
4489D014197L48849M13563J5786o62326k85338J05777r9029J92849J20700j65556
4479C999472l2074j01625m21787K9445k47949J20075O3486m8544K6745m56186
4469B931058J01396L15176n20636l8284J63082r0297k08668m87229O8077J83995
$$ plain form
4539 5177182 5087426 4663052 4644822 5034277 5365020 5185422 4901544 5275387 5468932 4877211
4529 4877211 4709238 5080788 5581962 5318873 4899695 4750217 4788443 5064642 5221380 5193174
4519 5193174 4896636 5177596 4788496 4581790 4411862 4655490 4726144 5068300 4470664 4311261
4509 4311261 5115746 5129211 4831443 4978432 4746421 4235601 4220988 4534049 4097879 3775838
4499 3775838 3629402 4214845 4175034 3939741 4255913 4266934 4532107 4622247 4200552 4014197
4489 4014197 4363046 4776609 4792395 4130069 3844731 3950508 3851479 4044328 4165028 3999472
4479 3999472 3967398 3865773 3443986 3473431 3225482 3345557 3409043 3360499 3387244 2931058
4469 2931058 3032454 3347630 2826994 2788710 2951792 2861495 2652827 2165598 2233675 2417670
4459B417670n0415K53852K40736k7888M3221k40316j73336j01960J11987j99841
4449B273710K48274k5712m47695K71292M42821j87182l68414l49864L11658M55387
4439B624275K40001q08906J62366Q5350j79676M14521m06563j59571l07042J04199
4429A768954N31792r7151K05208m1803J56607K81255r9928k84232j28588k33774
4419B058340K45042K81783n56105j59245q5463J21822L30206j99127o6914j01656
4409A868683J2617J88751J02007O5685L47248l62308m18984P53240k8211m31677
4399B097051K58110K57835n69358L9660N2029n40794J14783O18963M02041j00910
4389B629410n44362L53916k22147O3819P41128M36622k37741n50715k37191K49390
$$ plain form
4459 2417670 2367255 2621107 2861843 2833955 2877176 2636860 2463524 2361564 2473551 2273710
4449 2273710 2521984 2496272 2048577 2319869 2762690 2575508 2207094 1857230 2168888 2624275
4439 2624275 2864276 2055370 2217736 2303086 2123410 2537931 2131368 1971797 1664755 1768954
4429 1768954 2300746 2203595 2408803 2367000 2523607 2804862 2704934 2420702 2292114 2058340
4419 2058340 2303382 2585165 2029060 1869815 1784352 1906174 2236380 2037253 1970339 1868683
4409 1868683 1881300 2070051 2172058 2237743 2584991 2222683 1803699 2556939 2528728 2097051
4399 2097051 2355161 2612996 2043638 2083298 2135327 1594533 1709316 2328279 2730320 2629410
4389 2629410 2085048 2438964 2216817 2280636 3021764 3458386 3220645 2669930 2432739 2682129
4379B682129Q7266k53927J37811K58278L9439j05388k51241o41774O15155L21739
4369B889487k00180k19634J23055Q0517J08603M01210K01309j70313R743M0865
4359C264662r4835r3561k67484j43196P8810k18893M29556K97382K26704l5059
4349C444086n27219K47004l3639K5905j51228k32194O31830n20454m65411j91774
4339B226906M25469M6813L00892N55497k49462K37266l45453M4888O535J18932
4329C368283k9916Q7233n4808J84879J35446j49779L01693R402l26662m92070
4319C033701k74742O28513L23590P5099J58380n300n62783j23793J23824R78832
4309D355321l67295k56755J05060k55284K50457l20242M63069L27136m49544K79217
$$ plain form
4379 2682129 2769395 2515468 2653279 2911557 2950996 2845608 2594367 1952593 2567748 2889487
4369 2889487 2689307 2469673 2592728 2673245 2781848 3183058 3384367 3214054 3223797 3264662
4359 3264662 3169827 3076266 2808782 2665586 2744396 2525503 2955059 3252441 3479145 3444086
4349 3444086 2916867 3163871 3130232 3156137 3004909 2772715 3404545 2884091 2418680 2226906
4339 2226906 2652375 2699188 3000080 3555577 3306115 3543381 3197928 3242816 3249351 3368283
4329 3368283 3338367 3425600 3370792 3555671 3691117 3541338 3843031 3852433 3525771 3033701
4319 3033701 2758959 3387472 3711062 3786161 3944541 3939241 3376458 3252665 3376489 4355321
4309 4355321 3988026 3731271 3836331 3581047 3831504 3511262 3974331 4301467 3851923 4131140
4299D131140K23420K82079j04139m48681j01668o597J09095K69454L8749J39679
4289D532531L80274k69106K46943K84242l67672k61128r8307J20950o1702N82467
4279E089492L8026r1632J84266k24373K51040n53176m49300J17843P4484k07428
4269D229242k1615K14758j49182K64847r497j45504M62025p28769J98550M16659
4259D731514l6194j86838J38441k64374j75696N75292n9608m73816J46895P9553
4249D475169l37834m11094L91240J66319j7343n8959J4528k04100N07092j24578
4239D400440K06808j43384q866N2735j33628K92373L63277K8427m55866m0937
4229D561379k96254j31156k5520q1591l68038p84209M13790N46812l86995L80383
$$ plain form
4299 4131140 4354560 4636639 4532500 4083819 3982151 3975554 4084649 4354103 4392852 4532531
4289 4532531 4912805 4643699 4890642 5174884 4807212 4546084 4447777 4568727 4507025 5089492
4279 5089492 5127518 5035886 5220152 4995779 5246819 4693643 4244343 4362186 4436670 4229242
4269 4229242 4207627 4422385 4273203 4538050 4528553 4383049 4845074 4116305 4314855 4731514
4259 4731514 4695320 4508482 4646923 4382549 4206853 4782145 4722537 4248721 4395616 4475169
4249 4475169 4137335 3726241 4117481 4283800 4266457 4207498 4222026 4017926 4525018 4400440
4239 4400440 4607248 4463864 4454998 4507733 4374105 4666478 5029755 5058182 4602316 4561379
4229 4561379 4265125 4133969 4108449 4026858 3658820 2874611 3288401 3835213 3448218 3828601
4219C828601M43428K90564l09269q9989n30515J32925J78995J81553K06333p86428
4209C546198o40798O14140j15862O6298K19647q4608m8392J38824n31648R7584
4199C261383m7734j85110L41650M34563n20714j23151K46098l64736k00400K36913
4189C078762L75677K93920O810L20388j74068j3105J21548n52090j94439K69402
4179C532805N26855k09375J645m6606j67847K25541j87390j74864p6295M48022
4169C872491L44643j67154L07491N96260l79492k2134o1173l06869l98414N8448
4159C844097Q5008l2979M62172L96803k97470J72216O13536M48330k29036k24667
4149E238010J211560j15651l11058P4236L13226m37776R8910K06006k62383R54608
$$ plain form
4219 3828601 4272029 4562593 4253324 4163335 3632820 3765745 3944740 4126293 4332626 3546198
4209 3546198 2905400 3519540 3403678 3469976 3689623 3605015 3556623 3695447 3163799 3261383
4199 3261383 3213649 3028539 3370189 3804752 3284038 3160887 3406985 3042249 2841849 3078762
4189 3078762 3454439 3748359 3755169 4075557 3901489 3888384 4009932 3457842 3263403 3532805
4179 3532805 4059660 3850285 3851930 3805324 3637477 3863018 3675628 3500764 3424469 3872491
4169 3872491 4217134 4049980 4357471 4953731 4574239 4552105 4490932 4184063 3785649 3844097
4159 3844097 3929105 3896126 4358298 4755101 4457631 4629847 5243383 5691713 5462677 5238010
4149 5238010 6449570 6333919 6022861 6097097 6410323 5972547 6071457 6277463 6015080 6969688
4139F969688M80484m15771R95087M00885L30157N26248R1095J61985P31602M00246
4129A0671706M27677k95481L29600M61382P05382O17921N52264l53739O02792
4120A3719504J124210K4901M52228K54798K66632L33501O27597J008346N97784
4111A8409501N85869M73994J06365K53076Q90566N39713Q05052R22727O75792
4102B3662655k39868N61223Q42042J52602J128211J251521N24221K25803L93362
4093B8501772R36298J128605Q55681P84499P98520O53973J96246R03947J068669
4084C5828210M41003N48820M57301L38902R05239O36586Q20363L11521M17212
4075D0705157N37156P29908O71259P11817M90107L99963K53407Q99462Q18684
$$ plain form
4139 6969688 7450172 7034401 8029488 8430373 8760530 9286778 9377873 9539858 10271460 10671706
4129 10671706 11099383 10803902 11133502 11594884 12300266 12918187 13470451 13116712 13719504
4120 13719504 14843714 14868615 15320843 15575641 15842273 16175774 16803371 17811717 18409501
4111 18409501 18995370 19469364 19575729 19828805 20719371 21259084 22064136 22986863 23662655
4102 23662655 23422787 23984010 24826052 24978654 26106865 27358386 27882607 28108410 28501772
4093 28501772 29438070 30566675 31422356 32206855 33005375 33659348 33855594 34759541 35828210
4084 35828210 36269213 36818033 37275334 37614236 38519475 39156061 39976424 40287945 40705157
4075 40705157 41242313 41972221 42643480 43355297 43845404 44245367 44498774 45398236 46216920
4066D6216920P09792J168019J150315J544851K022853J084760J785565J963476
4058E7646551J453408P04504J141998Q01117M64596Q84927J0329J018137L97870
4049F4523437k46322J50757k48977J19131o57180j22461L67895M6965l42237k35483
4039F3355525q5824K9164L71944J55081q1824L56728K8374k07321J87718L81402
4029F4490967p19740L50998Q4898N39785m44668l79126L00805r73570p6527n4812
4019F3119010j42670l49697j32918K33753j04996k25578l14957m37054m4332n76897
4009F1023664l97256p80093Q2197m69807p17802Q5250r37784j067750r49652p97936
3999E5073031l1370q18871j115768p47889l24778q19250j013195n09072N7481
$$ plain form
4066 46216920 46926712 48094731 49245046 50789897 52812750 53897510 55683075 57646551
4058 57646551 59099959 59804463 60946461 61747578 62212174 63097101 63107430 64125567 64523437
4049 64523437 64277115 64427872 64178895 64298026 63640846 63518385 63886280 63933245 63591008 63355525
4039 63355525 63269701 63298865 63670809 63825890 63744066 64100794 64129168 63921847 64109565 64490967
4029 64490967 63771227 64122225 64207123 64746908 64302240 63923114 64223919 63250349 63173822 63119010
4019 63119010 62976340 62626643 62493725 62727478 62622482 62396904 62081947 61644893 61600561 61023664
4009 61023664 60626408 59846315 59928512 59458705 58740903 58826153 57888369 56820619 55870967 55073031
3999 55073031 55041661 54222790 53107022 52359133 52034355 51215105 50201910 49692838 49750319
3990D9750319o63294m21910m3155l45418n46943p8668l77588m23677r49719M290
3980D5904237L65297r50938o5556J65346o24148K2380k28552r02441o88210n74216
3970D2423199k82782r59675J17486k36059K30405P4469p7999P38728M18700N34471
3960D2980943k12950l06784J76785n38978l67795k32113r61723j030355j606887
3951C7900143r72333j070550q17205j130434j508213p44296n28509j020948l39455
3942B9768200j161969p61816j57259l01963K54290K55299N844J73866M77669O60355
3932B9212516J138581N76391M68930L33155M23977N77297M81534L44489J04691
3923C3661561q61357o97928J92276q38979q15169o21760j088233o30892q03218
$$ plain form
3990 49750319 49087025 48665115 48621960 48276542 47729599 47650931 47273343 46849666 45899947 45904237
3980 45904237 46269534 45318596 45253040 45418386 44794238 44816618 44588066 43685625 42997415 42423199
3970 42423199 42140417 41180742 41298228 41062169 41292574 41367043 41289044 42027772 42446472 42980943
3960 42980943 42767993 42461209 42637994 42099016 41731221 41499108 40537385 39507030 37900143
3951 37900143 36927810 35857260 35040055 33909621 32401408 31657112 31128603 30107655 29768200
3942 29768200 28606231 27844415 27687156 27385193 27639483 27894782 27900626 28074492 28552161 29212516
3932 29212516 30351097 30927488 31396418 31729573 32153550 32730847 33212381 33556870 33661561
3923 33661561 32800204 32102276 32294552 31455573 30640404 30018644 28930411 28299519 27496301
3914B7496301j269599n81866p96946p74680j33153n15006j236283q76501J13766
3905B1426033j36268q96929k50369K17739l52395m03620k62418L3507q5149m80744
3895A8809387k23673l57385j245367N42910J67769o24746l77114L06291k33491
3886A6764581L02573J98677k73290o1297K41632K29562K95655l5122J47756J25158
3876A7935885P5047r595O4283L3634l52196L07600N60389P57505J79144J01567
3866A9653263N3691N75232K38260J01848N14982L07265L13179L67327Q47281K56154
3856B3228482o9464O17799Q52339J311468N40692P8823K83681J178084j08295
3847B7913609R45051J006052K50305J91297j8346O11097M85633k3628K83050K38395
$$ plain form
3914 27496301 26226702 25644836 24847890 24073210 23940057 23425051 22188768 21312267 21426033
3905 21426033 21289765 20392836 20142467 20360206 20007811 19604191 19341773 19375280 19290131 18809387
3895 18809387 18585714 18228329 16982962 17525872 17693641 17068895 16691781 16998072 16764581
3886 16764581 17067154 17265831 16992541 16931244 17172876 17402438 17698093 17662971 17810727 17935885
3876 17935885 18010932 18001337 18065620 18099254 17747058 18054658 18615047 19372552 19551696 19653263
3866 19653263 19706954 20282186 20520446 20622294 21137276 21444541 21757720 22125047 22972328 23228482
3856 23228482 23159018 23776817 24629156 25940624 26481316 26560139 26843820 28021904 27913609
3847 27913609 28858660 29864712 30115017 30306314 30287968 30899065 31384698 31361070 31644120 31882515
3837C1882515M67525L07852L84902J35019Q6486Q30723k01498j22841k74914P3932
3827C3569701k18430K37706J75484r0551j65285m30956k3372l61962l99663J71384
3817C2464056K1165q7980k9395R0117k28627n62292r3917M13864K39993P6318
3807C2303302o96835Q3318l4475L80795J48592k28316l3872m50048q26800J64429
3797C0810090J7010Q499R4781m20392J69042m6363J13521m20563k63033J14253
3787C0176845j32074j53640j1493l7741l30881l84426J61793P8572m81444o05029
3777B8280482k24053m01029o05074m47027J27310p1139o10453n62607l56209q9114
3767B5041087j3595j05597K44260r03382n73935o33560l58486o47332j47866j37846
$$ plain form
3837 31882515 32350040 32657892 33042794 33177813 33264299 34095022 33893524 33770683 33495769 33569701
3827 33569701 33351271 33588977 33764461 33673910 33508625 33077669 33054297 32692335 32292672 32464056
3817 32464056 32485221 32397241 32367846 32457963 32229336 31667044 31573127 31986991 32226984 32303302
3807 32303302 31606467 31689785 31655310 32036105 32184697 31956381 31922509 31472461 30645661 30810090
3797 30810090 30827100 30835599 30930380 30509988 30679030 30632667 30746188 30325625 30062592 30176845
3787 30176845 30044771 29891131 29879638 29841897 29511016 29126590 29288383 29366955 28885511 28280482
3777 28280482 28056429 27655400 27050326 26603299 26730609 26659470 26049017 25486410 25130201 25041087
3767 25041087 25027492 24921895 25166155 24262773 23688838 23055278 22696792 22049460 21901594 21763748
3757B1763748n85234q17013j39676l55916m25842q09199J5667J34753r34138m38678
3747A7408472q45879o96626r48787j41461K56698l50892k89683r244l19245O9180
3737A4132533l32649o75590l3262J13914j84951R2457j82374n58621j02940n1193
3727A2217324n08159K63391J96264l95930l82737J46626L12412l55753j84298
3718A1309140N7169M41577J25825j85225k67046j59373j00754m71807L99608K51926
3708A1401040J09383j27303r6689J19531j4053O6882R4030k72876M86370K80744
3698A2047059l64075K10961J25825K44726O51069j4423l28172n9200l4623j16814
3688A2362333K40768J74966K81565k39908l83158J79599N24804J76078j96547
$$ plain form
3757 21763748 21178514 20361501 20221825 19865909 19440067 18630868 18646535 18781288 17847150 17408472
3747 17408472 16562593 15865967 14917180 14775719 15032417 14681525 14391842 14382598 14063353 14132533
3737 14132533 13799884 13124294 13091032 13204946 13019995 13112452 12930078 12371457 12268517 12217324
3727 12217324 11709165 11972556 12168820 11772890 11390153 11536779 11849191 11493438 11309140
3718 11309140 11366309 11807886 11933711 11748486 11481440 11322067 11221313 10749506 11149114 11401040
3708 11401040 11510423 11383120 11286431 11405962 11391909 11458791 11552821 11279945 11766315 12047059
3698 12047059 11682984 11893945 12019770 12264496 12915565 12901142 12572970 12513770 12479147 12362333
3688 12362333 12603101 12778067 13059632 12819724 12436566 12616165 13140969 13317047 13120500
3679A3120500k68766R8258N79009J59265j37900m35891J47057N91430k2424N78419
3669A4408957N5806k85913N89214j66606k40078L64395p0386q1329L57026k70688
3659A4660398l1456K01854j90117M97919J36214o30325N4546Q2479j30981l49716
3649A4300815o35869J81719l9210q8832O81517m6388j63305l49500K87618k20080
3639A3908485P6602k79922l09898M78824l01357K1022k65682J16374L87191Q9196
3629A3920835J5520n13019p30789J27598L95365L1712Q05418N85063o79224m44607
3619A3513872J21221K07569J05734n00605Q3772L20623k63301p8089L29715L34606
3609A4175117k53428R8883k37221q1921M40742m32730L74437Q1055o39308k99248
$$ plain form
3679 13120500 12851734 12949992 13529001 13688266 13550366 13114475 13261532 13852962 13830538 14408957
3669 14408957 14464763 14178850 14768064 14601458 14361380 14725775 14655389 14574060 14931086 14660398
3659 14660398 14628942 14830796 14640679 15138598 15274812 14644487 14699033 14781512 14650531 14300815
3649 14300815 13664946 13846665 13807455 13718623 14400140 14353752 14190447 13840947 14128565 13908485
3639 13908485 13985087 13705165 13395267 13874091 13572734 13593756 13328074 13444448 13831639 13920835
3629 13920835 13936355 13423336 12692547 12820145 13215510 13247222 14052640 14637703 13958479 13513872
3619 13513872 13635093 13842662 13948396 13447791 13531563 13852186 13588885 13510796 13840511 14175117
3609 14175117 13921689 14020572 13783351 13701430 14142172 13709442 14083879 14164934 13525626 13226378
3599A3226378N43097J07499k09298n06527n52428K36775j53606j52731k52939
3590A2286220l98750K27152j16495j93548R7259J21279l46749K20405K35704j3329
3580A2119148n88293J12318j56016J42263O88608o88121J24620o13811m07906
3571A0732810J22086L42266K55560K1390o04508k14954J42044k16151L06160J07425
3561A0994128k38668n67692K78515o4442m23031N89846J12779O527l15545n54528
3551I817889n77121Q39999M16216M4500k28988K6047j51034k09873J8133m53719
3541I542049l10523M06954J12540K39075N21600J6313L48899J36083L45083l37120
3531A1020953o50826M15060o9744L77614J30599J44613M94032j59054K48845M01849
$$ plain form
3599 13226378 13769475 13876974 13667676 13161149 12608721 12845496 12691890 12539159 12286220
3590 12286220 11887470 12114622 11998127 11804579 11901838 12023117 11676368 11896773 12132477 12119148
3580 12119148 11530855 11643173 11487157 11629420 12318028 11629907 11754527 11140716 10732810
3571 10732810 10854896 11197162 11452722 11474112 10869604 10654650 10796694 10580543 10886703 10994128
3561 10994128 10755460 10187768 10466283 10401841 9978810 10568656 10681435 10687962 10372417 9817889
3551 9817889 9240768 10080767 10496983 10541483 10312495 10338542 10187508 9977635 9995768 9542049
3541 9542049 9231526 9638480 9751020 9990095 10511695 10528008 10876907 11012990 11358073 11020953
3531 11020953 10370127 10785187 10715443 11093057 11223656 11368269 11862301 11703247 11952092 12353941
3521A2353941K86308r5735J26912J79900J12735P40141J43104J79851R37622k86073
3511A4678706N7181k01822P55739N23394o7712l63779P22858M57638J036474N49960
3501A8148637J26298R00441O5952O18387J235054N35029O86962R09389Q64198
3492B4090347R42562J030233J542700J179430J143881J569776K139627J849697
3484C5488253J504080J746109K927085J759352K719523L190642K779142L196580
3476E5310766L228185K867563L187453K827875L156172L000009K622809L455250
3468G9656082J983193K067950K003552J654472J875015J706712K030681R17774
3460I3895431N33211J604011J142362R18548K15808n07717J14153J00519r78970
$$ plain form
3521 12353941 12640249 12544514 12671426 12851326 12964061 13704202 13847306 14027157 14964779 14678706
3511 14678706 14735887 14534065 15289804 15813198 15745486 15381707 16104565 16562203 17598677 18148637
3501 18148637 18274935 19175376 19241328 19859715 21094769 21629798 22316760 23226149 24090347
3492 24090347 25032909 26063142 27605842 28785272 29929153 31498929 33638556 35488253
3484 35488253 36992333 38738442 41665527 43424879 46144402 49335044 52114186 55310766
3476 55310766 58538951 61406514 64593967 67421842 70578014 73578023 76200832 79656082
3468 79656082 81639275 83707225 85710777 87365249 89240264 90946976 92977657 93895431
3460 93895431 94428642 96032653 97175015 98093563 98309371 97801654 97915807 98016326 97037356
3451I7037356j338565j281306j559302j968314k653652k849989k946328l210725
3443G9229175k901147k942203l160097k820531k897794k709738k111323j753398
3435E7932944j909544r83239j215160j397579j169169r80728j5724K21300m21280
3426E0061821N56119P11740M96500J017773R39693J019169P73706N36745J844269
3417E7957535J473160J466107J458070P21689J463378J677902J165866N55775
3409F7939482J163847J88783J311640J007629L36896k36339k4165l93308l28934
3400G0965531M9812o12853j125877j177101j11485j074863j249616q24799j636220
3391F3202529j690685j020605j020746j382320j191539n98247j380164j329781
$$ plain form
3451 97037356 95698791 94417485 92858183 90889869 88236217 85386228 82439900 79229175
3443 79229175 76328028 73385825 70225728 67405197 64507403 61797665 59686342 57932944
3435 57932944 56023400 55040161 53825001 52427422 51258253 50277525 50261801 50483101 50061821
3426 50061821 50617940 51329680 51826180 52843953 53783646 54802815 55576521 56113266 57957535
3417 57957535 59430695 60896802 62354872 63076561 64539939 66217841 67383707 67939482
3409 67939482 69103329 69292112 70603752 71611381 71948277 71711938 71687773 71294465 70965531
3400 70965531 71015343 70402490 69276613 68099512 67988027 66913164 65663548 64838749 63202529
3391 63202529 61511844 60491239 59470493 58088173 56896634 56298387 54918223 53588442
3383E3588442q13833p40640q96593r66138r62081r08078p19400j007074l23943
3374D6250662p81237n64254k11034K5642n51936m71011k15851j27355K16734m67503
3364D3102857o79128k27628J52468m72844J87346N71743O93731j27388L8786N57797
3354D3797740P06079N94102M47589L85778R65323R03196R88989M23735K96222
3345D9508753P91483Q90460O84297K67969N57101J132929N72553M12875N81390
3336E5399810R24693J138840J093092J303331J214220J143046J604244K030870
3328F5852146J213096K237273K500572J718556J747410J935599P05523J626633
3320G9536808J195787L4473M77251r769n39728q88450j869357j971482k042281
$$ plain form
3383 53588442 52774609 52033969 51137376 50171238 49209157 48301079 47581679 46574605 46250662
3374 46250662 45469425 44905171 44694137 44719779 44167843 43696832 43480981 43353626 43570360 43102857
3364 43102857 42423729 42196101 42348569 41875725 42063071 42634814 43328545 43201157 43239943 43797740
3354 43797740 44503819 45097921 45545510 45931288 46896611 47799807 48788796 49212531 49508753
3345 49508753 50300236 51190696 51874993 52142962 52700063 53832992 54405545 54818420 55399810
3336 55399810 56324503 57463343 58556435 59859766 61073986 62217032 63821276 65852146
3328 65852146 67065242 69302515 71803087 73521643 75269053 77204652 77910175 79536808
3320 79536808 80732595 80767068 81244319 81234550 80694822 79806372 77937015 75965533 73923252
3311G3923252k546449k705954l023373l205658l208778l442925l086345l029832
3303D9673938k558316k517551k483161k451789k004959j684097j000343q76278
3295C4097444j188703j314662q80924p65068p64610k67685n42676n11013p97367
3286B7064736m85757k85132n56224r7339L49218L24337k70632k29892m08552J15342
3276B5520105K17770M45107N08466J03461O96983L3673m4267K71611J104671L13292
3266B9170872P78856O62323Q50711J277524J040449J084045J860733Q47349J259728
3257C8832590J713900J927871J954374K043474J804963K238628K026374K082494
3249E4624668L077517K878004K464763L062562L241109K862431L384419M363123
$$ plain form
3311 73923252 71376803 68670849 65647476 62441818 59233040 55790115 52703770 49673938
3303 49673938 47115622 44598071 42114910 39663121 37658162 35974065 34973722 34097444
3295 34097444 32908741 31594079 30713155 29948087 29183477 28915792 28373116 27862103 27064736
3286 27064736 26578979 26293847 25737623 25640284 25989502 26313839 26043207 25813315 25404763 25520105
3276 25520105 25737875 26182982 26691448 26794909 27491892 27525565 27481298 27752909 28857580 29170872
3266 29170872 29949728 30612051 31462762 32740286 33780735 34864780 36725513 37572862 38832590
3257 38832590 40546490 42474361 44428735 46472209 48277172 50515800 52542174 54624668
3249 54624668 57702185 60580189 63044952 66107514 69348623 72211054 75595473 79958596
3241G9958596L690793K537336L407545K632163J836002J510482P59466L5318r14819
3232I5452882j747400j929399k545749l284888m232308m041168l597817m445988
3224F9628165m638382m076885l853147l651482l092932l387082k642257k342499
3216D1943499k520901k141664k329550k409518j554775j397837j279449j471450
3208B6838355j413358j315573j312335o76803r16138j389171n76031n36313p51917
3199A7950716l1342j078790o75080l89542l55756j175767K3821k83594o49628
3190A3335038m41736n55227j85693l99372p32910j02740n3400M11869r2617m98535
3180A0684677k7823k25508q03800K56206K58212o01425O4984k1854j62768o19133
$$ plain form
3241 79958596 83649389 86186725 89594270 92226433 94062435 95572917 96332383 96367701 95452882
3232 95452882 93705482 91776083 89230334 85945446 81713138 77671970 74074153 69628165
3224 69628165 64989783 60912898 57059751 53408269 50315337 46928255 44285998 41943499
3216 41943499 39422598 37280934 34951384 32541866 30987091 29589254 28309805 26838355
3208 26838355 25424997 24109424 22797089 22120286 21204148 19814977 19238946 18702633 17950716
3199 17950716 17919374 16840584 16165504 15775962 15420206 14244439 14268260 13984666 13335038
3190 13335038 12893302 12338075 12152382 11753010 11020100 10917360 10863960 11275829 11183212 10684677
3180 10684677 10656854 10431346 9627546 9883752 10141964 9540539 9605523 9583669 9420901 8801768
3170H801768n11060k16230M33281L66140n01047m705l04800j20410k41462J45055
3160G846530L20799k23146n34546K26916M2487l87587P02201k80633q177j32808
3150G572036m99148l24159j3123o6106M52041P1598L01855q7043p58108j65319
3140F484524j13971J05662l0164L41296l52363K19570K29199N84607q8940o09798
3130F769622N57401j12698j022980l30946J69423J45880M63968m15395j98179
3121F026096l8048r3814R3075K07781K63058L2831q73012o94398L58137J02289
3111E383995j596N76415K91487l25901j67617j14029K24464k87199n53225n2810
3101D973984O43043L3564p39639o8114K89607J21326j54053J34635R2913M51971
$$ plain form
3170 8801768 8290708 8074478 8507759 8873899 8372852 8368147 8063347 7942937 7701475 7846530
3160 7846530 8167329 7944183 7409637 7636553 7679040 7291453 7993654 7713021 7704844 7572036
3150 7572036 7072888 6748729 6735606 6669500 7121541 7193139 7494994 7407951 6649843 6484524
3140 6484524 6370553 6476215 6446051 6787347 6434984 6654554 6883753 7468360 7379420 6769622
3130 6769622 7327023 7214325 6191345 5860399 6029822 6175702 6639670 6224275 6026096
3121 6026096 5988048 5894234 5987309 6195090 6458148 6490979 5617967 4923569 5281706 5383995
3111 5383995 5382399 5958814 6250301 5924400 5756783 5642754 5867218 5580019 5026794 4973984
3101 4973984 5617027 5650591 4910952 4842838 5132445 5253771 5099718 5234353 5327266 5779237
3091E779237j16369j55972j44718N8944j33855J90694M06927q2782o6788J87600
3081E922918q45387j94618j84793j81505L46073Q7648m94994P6638J21260j5848
3071D637392K1959J25819n98282m8212M70251l38214K16189K49534k83906l70778
3061D081752K63472N13221K58185p1504n94656l25607J39032j60370k50243J39975
3051C993257M26178R2760m79000l72730L83589p5539q4701K09914M36106o82917
3041C846917m42406n66945L28190Q29845l7684p07436j66360M56879L02464j97099
3031C646365l65557k47655L93458J97137n02728K21579l45328J6733J30295K65036
3021C409335K32140l31361J21106P4051j00909J28443J77512J54250k35601l67134
$$ plain form
3091 5779237 5662868 5506896 5362178 5421122 5287267 5477961 5884888 5802106 5735318 5922918
3081 5922918 5077531 4882913 4698120 4516615 4862688 4950336 4455342 4531980 4653240 4637392
3071 4637392 4659351 4785170 4186888 4138676 4608927 4270713 4486902 4736436 4452530 4081752
3061 4081752 4345224 4858445 5116630 5045126 4450470 4124863 4263895 4103525 3853282 3993257
3051 3993257 4419435 4512195 4033195 3660465 4044054 3968515 3883814 4093728 4529834 3846917
3041 3846917 3404511 2837566 3165756 3995601 3957917 3250481 3084121 3541000 3843464 3646365
3031 3646365 3280808 3033153 3426611 3623748 3121020 3342599 2997271 3014004 3144299 3409335
3021 3409335 3641475 3310114 3431220 3505271 3404362 3532805 3710317 3864567 3628966 3261832
3011C261832o40508P5522O35137J99808k27256o38232J458o5626K09790J28009
3001B939934R6456N98390N4078n05845k11054L16504L70607o4038m58421n13599
2991B623012j67881K23233R5371K47487j1770J88686K15090K35677k2736m18740
2981C207429k3116R5001k10689j15946K58789k81443J46421N9581J06085P9488
2971C321600k83312k04278k99074N4502J40389n2239J66239m87183j55031J35687
2961B337300K4671P22055J1422k13611L577k02449k58386R6873J91453k84108
2951B428797j585j45236O8307Q0943J99725n78465K30274N2961J09236K1198M7245
2940B513400K88117n18484k60618K82937L24675k30996j68960l23291o2051k63396
$$ plain form
3011 3261832 2621324 2696846 3331983 3531791 3304535 2666303 2667761 2602135 2811925 2939934
3001 2939934 3036390 3634780 3688858 3183013 2971959 3288463 3659070 3595032 3136611 2623012
2991 2623012 2455131 2678364 2773735 3021222 3009452 3198138 3413228 3648905 3626169 3207429
2981 3207429 3184313 3279314 3068625 2952679 3211468 2930025 3076446 3136027 3242112 3321600
2971 3321600 3038288 2834010 2534936 2589438 2729827 2677588 2843827 2356644 2201613 2337300
2961 2337300 2361971 3084026 3095448 2881837 2885414 2682965 2424579 2521452 2712905 2428797
2951 2428797 2427212 2281976 2350283 2431226 2630951 2052486 2282760 2335721 2444957 2466155 2513400
2940 2513400 2801517 2283033 2022415 2305352 2630027 2399031 2230071 1906780 1844729 1581333
2930A581333j46780L74956K58871j22985M24316n02411m87526k64040L11005O49938
2920B076677j75309J99254L69952m14310l09029q9151n9048j12250Q81584m81248
2910A887122l68527L65092k1609k96266J87257r1810J14908M81554P8707o06899
2900A729529l02884L02082O3361O44406k61226k4477J53841K86481p55585p694
2890A827834m9934m71064M19654J98138l80257j08524j20478K97671j82865L1019
2880A461194J63615j09180J10856N05582p0153m01548k72281j20777O11020N654
2870A883982J3657R0035o47672j07410L25785k39740k60543O6133j92992N00009
2860A431244l1373N765L24562k25625k85709K49140o3231m04455K95616L12163
$$ plain form
2930 1581333 1434553 1809509 2068380 1945395 2369711 1867300 1379774 1115734 1426739 2076677
2920 2076677 1901368 2100622 2470574 2056264 1747235 1658084 1599036 1486786 2368370 1887122
2910 1887122 1518595 1883687 1862078 1565812 1753069 1661259 1776167 2257721 2336428 1729529
2900 1729529 1426645 1728727 1792088 2436494 2175268 2150791 2304632 2591113 1835528 1827834
2890 1827834 1777900 1306836 1726490 1924628 1544371 1435847 1315369 1613040 1430175 1461194
2880 1461194 1624809 1515629 1626485 2132067 2061914 1660366 1388085 1267308 1878328 1883982
2870 1883982 1897639 1987674 1340002 1232592 1558377 1318637 1058094 1124227 931235 1431244
2860 1431244 1399871 1405636 1730198 1504573 1218864 1468004 1404773 1000318 1295934 1608097
2850A608097k75795J93721K94675k57700j00022L72602N31813p44698o51089O76698
2840A648302L09014q43573J72726J83234j46999j13582L71238L19430P4081o14181
2830A359690l4041m44869M60647J47096J40036n76594l49303L72191K32045n25369
2820G81529K63392K08288j70122k30709L50875l17113p7639N42576l08732O35541
2810A677886m5097k60528O0447K01431L74839n05501m70445O36818j70006k1595
2800A478249O3487K4885j11713K22919j60648l2722L47587l99433j90885o5271
2790A176455Q8188l3665l29170j08446M40157J39870k48012j90235M777N49994
2780A489913j35030l21800L89581N742m59137N04684j31328K93365J67599J37216
$$ plain form
2850 1608097 1332302 1526023 1820698 1562998 1462976 1835578 2367391 1622693 971604 1648302
2840 1648302 1957316 1113743 1286469 1469703 1322704 1209122 1580360 1899790 1973871 1359690
2830 1359690 1325649 880780 1341427 1488523 1628559 1051965 702662 1074853 1306898 781529
2820 781529 1044921 1253209 1083087 852378 1203253 886140 808501 1351077 1042345 1677886
2810 1677886 1632789 1372261 1432708 1634139 2008978 1503477 1033032 1669850 1499844 1478249
2800 1478249 1541736 1566621 1454908 1677827 1517179 1484457 1832044 1432611 1241726 1176455
2790 1176455 1264643 1230978 901808 793362 1233519 1373389 1125377 935142 939919 1489913
2780 1489913 1354883 1033083 1422664 1428406 969269 1473953 1342625 1635990 1803589 1940805
2770A940805m91957L26777K19763l12583j01073k83066j61521K30908J81001j05764
2760A443290j4381l8209m16654j84829N50426J95265k01062n1716K24261j73504
2750A332887O3061k92344J87403M68576J28567l29962l77878J20255K36528k68289
2740A268804n28858M98827J15217k70436n62j7527K09943R2448k79592J74051
2730A262315P1061l14456N6532O57192l19863L1764m29816K6799J42466l69538
2720H14456j02984L66705J0518m77178P7392L07110K17196M6454K19941J09990
2710A589600m87369l41608K21629J27976M93470j98948k47191J1245M62841n3363
2700A578282l32546l87012K59798K43921l07697J55648j74453P4674k66502j17882
$$ plain form
2770 1940805 1448848 1775625 1995388 1682805 1581732 1298666 1137145 1368053 1549054 1443290
2760 1443290 1428909 1390700 974046 789217 1339643 1534908 1333846 1282130 1506391 1332887
2750 1332887 1395948 1103604 1291007 1759583 1888150 1558188 1180310 1300565 1537093 1268804
2740 1268804 739946 1238773 1353990 1083554 1082992 1065465 1275408 1367856 1088264 1262315
2730 1262315 1333376 1018920 1075452 1732644 1412781 1444545 1014729 1041528 1183994 814456
2720 814456 711472 1078177 1088695 611517 688909 996019 1213215 1259669 1479610 1589600
2710 1589600 1102231 760623 982252 1110228 1603698 1404750 1157559 1168804 1631645 1578282
2700 1578282 1245736 858724 1118522 1362443 1054746 1210394 1035941 1110615 844113 726231
2690G26231l49602J64451M90832j96652K42093K00312m22404k62252J02013N38017
2680A233039J52860k60212k76707J93284K25758K91423l91834m17874m71369q2279
2670A96089L26830K69276l4328P0500j14539k46886N79625L42632M33175J31920
2660A954294k98845n81607k98401l07955N70630n08093j07397m36118K78654J71610
2650D36772K57113K00630j00985k5370K78539j43882j82788k36838J14363L57732
2640I55286M60662k54494l31984l1337K93806j98945p2855K63949J91050p16039
2630E59099l66695R21867Q85949m48463m80580O90737j90448j46476r9489l12116
2620A013385k72355M57834J48338r0533j10049J23508J45961L08607j17964p49483
$$ plain form
2690 726231 376629 541080 1031912 835260 1077353 1277665 855261 593009 695022 1233039
2680 1233039 1385899 1125687 848980 1042264 1268022 1559445 1167611 749737 278368 196089
2670 196089 522919 792195 757867 828367 713828 466942 1046567 1389199 1822374 1954294
2660 1954294 1655449 1073842 775441 467486 1038116 530023 422626 -13492 265162 436772
2650 436772 693885 894515 793530 768160 1046699 902817 720029 483191 597554 955286
2640 955286 1415948 1161454 829470 798133 1091939 892994 820139 1084088 1275138 559099
2630 559099 192404 1114271 2000220 1551757 1071177 1761914 1571466 1424990 1325501 1013385
2620 1013385 741030 1198864 1347202 1256669 1146620 1270128 1416089 1724696 1606732 857249
2610H57249J48992O93827K55838k07409P8204l23558k51807J38929j86897R82536
2600B185904J29021J00911N79719k54480k42484M7158L90290L06951n27O49563
2590C892026m5667j69411n4847n66846j22889m7597l27246j42842L03434k88160
2580B429955k57623J7315m20614J16645j49611N7535l91471n83104l3413K71839
2570A057453L10273R1783r3616K89366p23555m70507k89531N34941P42684m75532
2560I73759m78277L72445k09761N29601L28472m49876n2720p7644j11736k58609
2550E65654k4950M27465O5982k6224j00126l4984O54999k47140j96685M08921
2540A492912J06506p09316J3359P48733J76389o05706j16159j29345j42601L01508
$$ plain form
2610 857249 1006241 1700068 1955906 1748497 1826701 1503143 1251336 1390265 1203368 2185904
2600 2185904 2314925 2415836 2995555 2741075 2498591 2545749 2936039 3242990 3242463 3892026
2590 3892026 3846359 3676948 3622101 3055255 2932366 2884769 2557523 2414681 2718115 2429955
2580 2429955 2172332 2189647 1769033 1885678 1736067 1793602 1402131 819027 785614 1057453
2570 1057453 1367726 1459509 1365893 1655259 931704 461197 171666 706607 1449291 973759
2560 973759 495482 867927 658166 1187767 1516239 1066363 1013643 935999 824263 565654
2550 565654 540704 968169 1034151 1007927 907801 872817 1527816 1280676 1083991 1492912
2540 1492912 1599418 890102 903461 1652194 1828583 1222877 1106718 977373 834772 1136280
2530A136280k27760N67339k60338o27308M85664L2527k3556o72l40207J831L15259
2519A059059K28157J5583k57919j02451l001K7955M85577O3349j12505K5018n88010
2508H40812J06310J81991J038010k15318j24498Q0299k22285N96806k36617J4822
2498B060332k42843o7729L19173j45305r1805j30444l16156P8864j68971J38422
2488A433538M67998o75444M00388l2155k5023N74315K07369r8255J34399p9656
2478B307474k43787m9245M7254P6047j64329O5874R5077O6915N3361j07065k16606
2467A930970k9281L3680J7834k17261l13753j6272N58170J37059k08244J6500
2457A909402k96751Q9395L52698o9843J58386j5498j45232j61921M360Q1490R5848
$$ plain form
2530 1136280 908520 1475859 1215521 588213 1073877 1106404 1082848 1082176 741969 743800 1059059
2519 1059059 1287216 1302799 1044880 942429 939428 967383 1452960 1516309 1403804 1428822 840812
2508 840812 947122 1129113 2167123 1951805 1827307 1907606 1685321 2282127 2045510 2060332
2498 2060332 1817489 1749760 2068933 1923628 1831823 1701379 1385223 1464087 1295116 1433538
2488 1433538 1901536 1226092 1626480 1594325 1569302 2143617 2350986 2252731 2387130 2307474
2478 2307474 2063687 2014442 2061696 2137743 1973414 2039288 2134365 2201280 2254641 2147576 1930970
2467 1930970 1901689 1935369 1953203 1735942 1422189 1405917 1964087 2101146 1892902 1909402
2457 1909402 1612651 1702046 2054744 1984901 2143287 2127789 1982557 1820636 1824996 1906486 2002334
2446B002334j66313M45528Q2907m73895j6359M30817O35935q2194n84825M65330
2436B739265j16324J1357P56308k88675M6335r9877K82639P4639m62460Q9366
2426C032573O00972k41849m61399k83940k20385N35157K51631m93823n1563p9857
2416B587517j94374M36319N36571L55354j9986p636j91058K1108j3771J5196K13644
2405C738884J28467q4774l15530O36304j50638J37428M03977P1992O29678K91487
2395E487275L97373L9800j86618L13973R3178O2701P45929R6467j9440L44796
2385G375434L84182r9661K62679M23190L75952M17694M87363M13207M59526J18710
2375A0618276J68152Q9364K6782P23113N92753K01110M04668L48086L72835K45422
$$ plain form
2446 2002334 1836021 2281549 2364456 1890561 1874202 2305019 2940954 2858760 2273935 2739265
2436 2739265 2622941 2634298 3390606 3101931 3148266 3048389 3331028 3405667 2943207 3032573
2426 3032573 3633545 3391696 2930297 2646357 2425972 2961129 3212760 2718937 2667374 2587517
2416 2587517 2393143 2829462 3366033 3721387 3701401 3693765 3502707 3523815 3510044 3525240 3738884
2405 3738884 3867351 3782577 3467047 4103351 3952713 4090141 4494118 4566110 5195788 5487275
2395 5487275 5884648 5924448 5737830 6051803 6144981 6207682 6953611 7050078 7030638 7375434
2385 7375434 7759616 7659955 7922634 8345824 8721776 9139470 9626833 10040040 10499566 10618276
2375 10618276 10786428 10875792 10902574 11625687 12218440 12419550 12824218 13172304 13545139 13790561
2365A3790561L29647R09656P02439L42383J171098J125821Q97983J061836J412379
2356B1743803R04859J146895J429359J264324J823426J860766K735252L453443
2348C6362127L304167L275302M265035M867409O782735P233292Q528868Q475434
2340H3094369R977872J1376583J4370309J7536463J8546705K0977936K4540279
2333B00420516K7467742L1318407L6216366M0708713M0318211L8076351L1447361
2326D45973667J9903056J1141222L519744n288321j4106227k0984621k2543869
2319D17614651k4864568l1616956l5858195l8907861l5434577l0495549k8396698
2312A92040247k7958621k5698455k0596732j6696127j4368916j1992095j0419426
$$ plain form
2365 13790561 14120208 15029864 15732303 16074686 17245784 18371605 19269588 20331424 21743803
2356 21743803 22648662 23795557 25224916 26489240 28312666 30173432 32908684 36362127
2348 36362127 39666294 42941596 47206631 52074040 58856775 66090067 74618935 83094369
2340 83094369 93072241 104448824 118819133 136355596 154902301 175880237 200420516
2333 200420516 227888258 259206665 295423031 336131744 376449955 414526306 445973667
2326 445973667 465876723 477017945 480537689 475249368 461143141 440158520 417614651
2319 417614651 392750083 361133127 325274932 286367071 250932494 220436945 192040247
2312 192040247 164081626 138383171 117786439 101090312 86721396 74729301 64309875
2305F4309875p653554n695695m847020m102682m201937l444600k359232k391228
2297B9613927k249886j840619j214076j212884j139693j998323j260394r37540
2289A7760512q37224j044463o75646o43414l80481n44520r88309o50292o82302
2280A1313861o27910l30528P7058l28579p27272k24562L2048j44051m19669K72270
2270H892666k15495J36707k08218p01666j63905k8772o03350n81236J71351J57734
2260F855816L77514m43139l97491K31495M80974M5937o22845k77476K72439J48988
2250F672212j81781p22930J95847J60829j04100o8040n9978P1056L35293n01773
2240E796635j65869o31537L46828L69815n6907k30764k87909k57215l68612j19841
$$ plain form
2305 64309875 56656321 50960626 46113606 42010924 37808987 34364387 32005155 29613927
2297 29613927 27364041 25523422 24309346 23096462 21956769 19958446 18698052 17760512
2289 17760512 16923288 15878825 15203179 14559765 14179284 13634764 12646455 11996163 11313861
2280 11313861 10685951 10355423 10432481 10103902 9376630 9152068 9184116 9040065 8620396 8892666
2270 8892666 8677171 8813878 8605660 7903994 7740089 7711317 7107967 6526731 6698082 6855816
2260 6855816 7233330 6790191 6392700 6624195 7105169 7151106 6528261 6250785 6523224 6672212
2250 6672212 6490431 5767501 5963348 6124177 6020077 5952037 5892059 5963115 6298408 5796635
2240 5796635 5630766 4999229 5346057 5715872 5658965 5428201 5140292 4883077 4514465 4394624
2230D394624K62450M31633k15918K18193N989j96210m12385L85308K35878n52468
2220D557094k52163q17365J08278j79693o2087q1506m78343M59940L31428m67164
2210C118419J6212j27152M32221M18486j80169m70450J6348J55440R1817l07786
2200C163386J11046K5893k82116r5241m9934L65957J15885j029123M6641k69747
2190B102647j06683J50210K27473K27791m86392J92578k53941M18319J61926m78312
2180B155616k82130P3661O80264M20033l96566J64926p95710Q7460n26538K88595
2170A869611j05523N0919J45153K22689j32812m56677J11505J27263J58736L7056
2160B027920N4723k58258J57002J91155n5890m24636l46020N08626L27275r9207
$$ plain form
2230 4394624 4657074 5088707 4872789 5090982 5096971 4900761 4488376 4873684 5109562 4557094
2220 4557094 4304931 3487566 3595844 3416151 3354064 3272558 2794215 3254155 3585583 3118419
2210 3118419 3134631 3007479 3439700 3858186 3678017 3207567 3223915 3379355 3471172 3163386
2200 3163386 3274432 3300325 3018209 2922968 2873034 3238991 3354876 2325753 2372394 2102647
2190 2102647 1995964 2146174 2373647 2601438 2115046 2307624 2053683 2472002 2633928 2155616
2180 2155616 1873486 1947147 2627411 3047444 2650878 2815804 2020094 2107554 1581016 1869611
2170 1869611 1764088 1815007 1960160 2182849 2050037 1593360 1704865 1832128 1990864 2027920
2160 2027920 2082643 1824385 1981387 2172542 2116652 1692016 1345996 1854622 2181897 2082690
2150B082690J08752j00521k98296M60725p7977L52245k05262j16788j19360n04992
2140A581216J27660R797N75014L85291N1970o74784j99395P6325P8123n53l31340
2129A679324j24029M57606M08121R3508k29033n39426k07542O49928k29215m13481
2119A545761L25613k1634m93018p0522K46776J30829R6063N38767M12082o7732
2109B642985J85417m07920l23795n5822k41616L46581L99268K49045l78706j86972
2099B228465J89702k79043l62287j24748J31055n994K6275l38439K39889P77201
2089B482076K25406k81154m34796l88000L35456N42826j27609K55453p08440K76760
2079B177978P9567l95272j95551n27773L08342P76092m8494k8016J32150j55503
$$ plain form
2150 2082690 2191442 2090921 1792625 2253350 2175373 2527618 2322356 2205568 2086208 1581216
2140 1581216 1708876 1718673 2293687 2678978 2730948 2056164 1856769 1933094 2011217 2010664 1679324
2129 1679324 1555295 2012901 2421022 2514530 2285497 1746071 1538529 2188457 1959242 1545761
2119 1545761 1871374 1849740 1356722 1286200 1532976 1663805 1759868 2298635 2710717 2642985
2109 2642985 2828402 2420482 2096687 2040865 1799249 2145830 2545098 2794143 2415437 2228465
2099 2228465 2418167 2139124 1776837 1652089 1783144 1777150 1803425 1464986 1704875 2482076
2089 2482076 2707482 2426328 1991532 1603532 1938988 2481814 2354205 2609658 1901218 2177978
2079 2177978 2257545 1862273 1666722 1138949 1447291 2223383 2174889 2146873 2279023 2123520
2069B123520L4450M01880J66980j46549J52508L43035K43379J24880j27817k7525
2059C288741M61638M4174j80449R7161M32968l61547K96122L6002r2258k16246
2049C806306p38055p5778K17225j36388j56221m57634o48400j33383P9845P8889
2039A836406m39284K72888l77146L23160N5604m50256J79969j81175M9329L70423
2029A639918J45467N0654L90958p42636j18142j63667m5444M58622q4837J87330
2019A718223k5019l79103r5971K47933j21084m838P0887j52054M95146n64075
2009A190045J4937j49704P9976P54118K86412J50128p92540k54118K98825r0973
1999A487106l4083r7724M6919K52078n18474M62970J52783j12320j47860p10283
$$ plain form
2069 2123520 2157970 2559850 2726830 2580281 2732789 3075824 3319203 3444083 3316266 3288741
2059 3288741 3750379 3794553 3614104 3711265 4144233 3782686 4078808 4114810 4022552 3806306
2049 3806306 3068251 2992473 3209698 3073310 2917089 2459455 1811055 1677672 1757517 1836406
2039 1836406 1397122 1670010 1292864 1616024 1671628 1221372 1401341 1220166 1269495 1639918
2029 1639918 1785385 1836039 2226997 1484361 1366219 1202552 1157108 1615730 1530893 1718223
2019 1718223 1693204 1314101 1218130 1466063 1344979 1340141 1411028 1258974 1754120 1190045
2009 1190045 1204982 1055278 1135254 1889372 2175784 2325912 1533372 1279254 1578079 1487106
1999 1487106 1453023 1355299 1402218 1654296 1135822 1598792 1751575 1639255 1491395 781112
1989G81112M04893K02491K11934J28680J71028l97307n42533L47350J05551m65959
1979I47240k0962K99401l74039K18104Q3518j30805M48059N99343K3873m19603
1969A674129J21282p5434J24294m01531j95003M74021n43764r5831J44333K6734
1959A253230r032o3689M3716K05516l51756O8965P742j37148M70987p7392J41530
1948A552669l74596j85530R7450j10923K43974o73710k57692P40785r7669L72539
1938A307297j1278J12942n22663j8670j345L33616J29901l96359m13448M0116
1928E60109Q38117q1580p5295l68253L36512j12317j02258N2890M7426L40524
1918A435875k15941J34962k39300N69225K6054p06211K3239m6693O75252m5147
$$ plain form
1989 781112 1186005 1388496 1600430 1729110 1900138 1502831 960298 1307648 1413199 947240
1979 947240 926278 1225679 851640 1069744 1153262 1022457 1470516 2069859 2093732 1674129
1969 1674129 1795411 1719977 1844271 1442740 1247737 1721758 1177994 1082163 1226496 1253230
1959 1253230 1244198 1180509 1224225 1429741 1077985 1146950 1154692 1017544 1488531 1411139 1552669
1948 1552669 1178073 992543 1089993 979070 1223044 549334 291642 1032427 934758 1307297
1938 1307297 1296019 1408961 886298 867628 866283 1199899 1329800 933441 519993 560109
1928 560109 1398226 1316646 1241351 873098 1209610 1097293 995035 1047925 1095351 1435875
1918 1435875 1219934 1354896 1115596 1684821 1710875 1004664 1027903 981210 1656462 1611315
1908A611315j5333q67486j37419K83030L2649l72290j75476N57085O5832K72418
1898A254325J8870q37164J97972L65657M60070k08944J98002m34309K45691L69045
1888A629215K64688J6894j87964n8969l87738K57513k41837J91493k8606q174
1878A446515O77794l62339o36654L65739J02326k92407l06783L31713j51564M871
1868A179211L08068P4377J24005j16614l27393l33294J982p6418l9215Q49679
1858A644388o1914l64504k16554m0561j79281M87838L02128o72325l51143j2580
1848E35492L00225O08021K36979L584j2901j69802n5722j32270j0246q1207m52758
1837G69395N24926M51658K9261r06913Q5376L0066k76978O92550R6973p15795
$$ plain form
1908 1611315 1595982 728496 591077 874107 906756 534466 358990 916075 981907 1254325
1898 1254325 1273195 436031 634003 999660 1459730 1250786 1448788 1014479 1260170 1629215
1888 1629215 1893903 1910797 1722833 1663864 1276126 1533639 1291802 1483295 1454689 1446515
1878 1446515 2124309 1761970 1125316 1491055 1593381 1300974 994191 1325904 1174340 1179211
1868 1179211 1487279 1561656 1685661 1569047 1241654 908360 910342 833924 794709 1644388
1858 1644388 1582474 1217970 1001416 960855 781574 1269412 1571540 899215 548072 535492
1848 535492 835717 1443738 1680717 1684301 1671400 1501598 1445876 1313606 1303360 1222153 769395
1837 769395 1294321 1745979 1775240 868327 953703 983769 706791 1399341 1496314 780519
1827G80519P0089r1583J71567L88180J28410p5092k86013K89235r974k09745j06698
1816A048895K56683J18428k21031r8945j26720j06893j95333L27465M38066m3704
1806A396911K0518l03497j11781N2224j67601l97037J85644j46771M44466k17890
1796G55186o7768o6156L70746J32320l64933n45M97504L00360l59498L83689j48400
1785A432505k59982J68820j36304k26962k2159N38842M89938m33234l10345k25308
1775A015811L127K79591O6804n0155J8028m81943k47188M11641K25971Q5248k9534
1764A297401l42756l3258J57064J292J10843L33550l69051k03587K1261n9682
1754I13077J74274k45317M2628k85882L15419k6881R3675o0971k30269M74143
$$ plain form
1827 780519 850608 759025 930592 1318772 1447182 1372090 1086077 1375312 1365338 1155593 1048895
1816 1048895 1305578 1424006 1202975 1104030 977310 870417 675084 1002549 1440615 1396911
1806 1396911 1417429 1113932 1002151 1054375 886774 489737 675381 528610 973076 755186
1796 755186 687418 621262 992008 1124328 759395 758850 1256354 1556714 1197216 1580905 1432505
1785 1432505 1172523 1341343 1205039 978077 955918 1494760 1984698 1551464 1241119 1015811
1775 1015811 1018938 1298529 1365333 1315178 1333206 851263 604075 1015716 1241687 1326935 1297401
1764 1297401 954645 921387 1078451 1079743 1190586 1524136 1155085 951498 972759 913077
1754 913077 1087351 842034 884662 598780 914199 887318 980993 920022 689753 1163896
1744A163896L62360l80933J23037J42474n50423L90722L00771k72917o36065q7474
1734E55448j0963O69555J38411R7731k54789k56868J22866l2864l14667L94683
1724A108543J26183K91785k63089l20688J98297k83043L75827K29299k79599k98105
1714H85410j67691J26214k86714k40075P32698J03769n68911M15590l00593k44961
1704D54736J78790m4497N73916o21803J23268L15346J48959J71779N4905m01911
1694I53488j51720K05897J42867l65736J0226M67464j71665O9288L7138J811o6068
1683A132990J96911K80156r82928J83464J17442j45820O8121r2483o0001K29196
1673I27048L43924O13010m26402L08958N8756l10199l72596l30235J54057p9118
$$ plain form
1744 1163896 1526256 1145323 1268360 1410834 860411 1251133 1551904 1278987 642922 555448
1734 555448 544485 1214040 1352451 1450182 1195393 938525 1061391 1028527 713860 1108543
1724 1108543 1234726 1526511 1263422 942734 1141031 857988 1233815 1463114 1183515 885410
1714 885410 717719 843933 557219 317144 1049842 1153611 584700 1000290 699697 454736
1704 454736 633526 589029 1162945 541142 664410 979756 1128715 1300494 1355399 953488
1694 953488 801768 1007665 1150532 784796 795022 1262486 1090821 1160109 1197247 1199058 1132990
1683 1132990 1329901 1610057 627129 810593 928035 782215 850336 757853 697852 927048
1673 927048 1270972 1883982 1457580 1766538 1825294 1515095 1142499 812264 966321 887203
1663H87203m7400l74503L84525k03498M80543K06585k07057o3573l8512J72624
1653A196937k56238k90878K59837J95141m02494O8204O37618j68466j91264j39649
1643I08748l61811m80530J00327K753M2682M43507j04038N03199R679p9160L3652
1632A019008J5055J70409l43232n56945J18700J90428J11228R468J04808K66885
1622A105812m86518K7546M9566N4143M00416j64098P7379K62762J79339j9757
1612A486590l44228k01200n98315n5710L77801J12268K99306l9660o3499L78968
1602A352321m29161q9315K00359m34769l89004M47508N0561j79856j14841N38841
1592I52644p3406P5937k58806o34127O70453J39161j49354m15860J18603N23380
$$ plain form
1663 887203 839803 465300 849825 646327 1126870 1333455 1126398 1062825 1024313 1196937
1653 1196937 940699 649821 909658 1104799 702305 770509 1408127 1239661 1048397 908748
1643 908748 546937 66407 166734 169487 212169 655676 551638 1054837 1064516 985356 1019008
1632 1019008 1034063 1204472 861240 304295 422995 613423 724651 734119 838927 1105812
1622 1105812 619294 646840 696406 750549 1150965 986867 1064246 1327008 1506347 1486590
1612 1486590 1142362 941162 342847 287137 664938 777206 1076512 1036852 973353 1352321
1602 1352321 923160 833845 1034204 599435 210431 657939 708500 528644 413803 952644
1592 952644 879238 955175 696369 62242 732695 871856 722502 306642 425245 948625
1582I48625K79351j13264m86587J13025L3392K77765Q7850K12407k8390N26455
1572A850629L88796n52265k41863k38988l78561q9919K9181L61550j38031o11878
1562C78651o5412L1581O24729K96980m54758k99313M48902l21775J05831L82639
1552A128055l5866L07022O1704m21327k91552n2755l03836J74130k9914j43613
1542C92048L23271o652K55161k68960J78246M6835j62104P92227k20788K22542
1532A551826P7253m51562l45515J45828K89642l34312j92025K20890l24680j33072
1522E04273L34632k82613J67682q9461j84671M5583j01147p8486J87751L84167
1512H87710Q2943J73179q3394j98147M3511l98773m09405J8021k60357Q56282
$$ plain form
1582 948625 1227976 1114712 628125 741150 774542 1052307 1140157 1352564 1324174 1850629
1572 1850629 2239425 1687160 1445297 1206309 827748 737829 767010 1128560 990529 378651
1562 378651 313239 344820 969549 1266529 811771 512458 961360 639585 745416 1128055
1552 1128055 1092189 1399211 1460915 1039588 748036 695281 391445 565575 535661 392048
1542 392048 715319 708667 963828 694868 873114 919949 757845 1550072 1329284 1551826
1532 1551826 1629079 1177517 832002 977830 1267472 933160 741135 962025 637345 504273
1522 504273 838905 556292 723974 634513 449842 495425 394278 315792 503543 887710
1512 887710 970653 1143832 1060438 862291 905802 507029 97624 115645 -144712 711570
1502G11570M44535j43217j57970m19951J1567j93217J88667L07153P82309m98368
1492A033078n29435N9139J34174j75104r2250P26121k21309K44738M79649j89314
1482A469487k50302l96870m2393l40399j10500j26814R32177O30219l74785j37492
1472A252328l16162J0684P1498K31266P820r1665l58881p5557R8257o1308k13338
1461E54942K27536M74157m05331m07102K54471L96937m22032M90066j09827r4407
1451I59410M73307n31977l27544j42783m09022J40190J6722M48920J56973j65600
1441F18596N86531k15582Q3959J28614m54507Q7296k92647l99740K28687N53552
1431I24759N00904j33474N248l77801j06565j20347M36572l42869j07780K4141
$$ plain form
1502 711570 1156105 1012888 854918 434967 446534 253317 441984 749137 1531446 1033078
1492 1033078 503643 562782 696956 521852 429602 1155723 934414 1179152 1658801 1469487
1482 1469487 1219185 822315 779922 439523 329023 202209 1134386 1764605 1389820 1252328
1472 1252328 936166 946850 1018348 1249614 1257434 1165769 806888 731331 829588 768280 554942
1461 554942 782478 1256635 851304 444202 698673 1095610 673578 1163644 1053817 959410
1451 959410 1432717 900740 573196 430413 21391 161581 178303 627223 784196 618596
1441 618596 1205127 989545 1073504 1202118 747611 834907 542260 142520 371207 924759
1431 924759 1425663 1292189 1297437 919636 813071 692724 1129296 786427 678647 702788
1421G02788j08210M34873o5375M31925m51531n65175K53033M40227p49534P01582
1411A024603k79541l08708l02275k51583N88453L62467K50146o22236L3881j29109
1401C66098r446K30902Q93909j06326n67250L84612k72658K6810m7838l52666
1391E46147L83351P3102l06365M5904j4181M48394J5399o17922k47628K54837
1381E81038L92125K47282j35272o3519j49116j32509j76219k51866N56386j33377
1371G34953N1427k50227k29255J73078M17765q4973o616m77823K04159P6804n7661
1360E51631N95383l81724K42659O4452j82930j26945o6906O4408l911N84161n2252
1349A288026m30263k3541J66049L7080Q3536r00838L55859P94547m42127l51778
$$ plain form
1421 702788 594578 1029451 964076 1396001 944470 379295 632328 1072555 323021 1024603
1411 1024603 745062 436354 134079 -117504 470949 833416 1083562 461326 495207 366098
1401 366098 356652 587554 1481463 1375137 807887 1192499 919841 946651 898813 546147
1391 546147 929498 1002600 696235 742139 727958 1176352 1191751 573829 326201 581038
1381 581038 973163 1220445 1085173 1021654 872538 740029 563810 311944 868330 734953
1371 734953 786380 536153 306898 479976 897741 812768 806152 328329 532488 609292 551631
1360 551631 1147014 765290 1007949 1072401 889471 762526 695620 760028 756117 1340278 1288026
1349 1288026 857763 834222 1000271 1037351 1120887 220049 575908 1370455 928328 576550
1339E76550K99966K9081J6036l80769N40157J5035m12947j18752J43365N25891
1329A233613j29513o15400J77505J95350M83607k96642m46013L98246J07814L79342
1319A487909P0226q43311J67731K56589l81696K64515j53607l2153K59802l58854
1309G37151j48977K74850o8020j28232q7284P34871o25676o60874K43668Q879
1299B80356J74540M01705J20832P4928m3375j30939J66773l0069P561M40920p82292
1288F80940r6426j94457j22496L03766j64625j16820M92367j89715Q4386m67431
1278B09489m40208K90884P22056j52485m16132J36275L88321L81449N36384m22843
1268A233190j32408l24708L40970L316j48352k79763o06520L17645l37737J90079
$$ plain form
1339 576550 876516 905597 921633 540864 1081021 1096056 683109 564357 707722 1233613
1329 1233613 1104100 488700 666205 861555 1345162 1048520 602507 1000753 1108567 1487909
1319 1487909 1558135 714824 882555 1139144 757448 1021963 868356 836203 1096005 737151
1309 737151 588174 863024 795004 666772 579488 1314359 688683 27809 271477 280356
1299 280356 454896 856601 977433 1052361 1008986 878047 1044820 1014751 1022312 1463232 680940
1288 680940 584514 390057 267561 571327 406702 289882 782249 592534 676920 209489
1278 209489 -230719 60165 782221 629736 213604 349879 738200 1119649 1656033 1233190
1268 1233190 1100782 776074 1117044 1120360 972008 692245 85725 403370 65633 255712
1258B55712K25284N27994J52654l67641l68836N72340q40839L67678K94094MJ1897
1247H30341L20242Q0551k42126K30994m23786M75080k72852J17099p55765o1517
1237B98261J52503o0875K45714L97792O3427O1642j25702k44692O9425K78465
1227A135960J78697m03174J94871J57764j54805j08521J95197J5254m14041L05957
1217A103159n1453j17716m23685j28328M58422j83938L77575l06616l94159j81754
1207A51507L82399j87626K2468Q72590N7403k96487J02613k30916r0807j85646
1197E97498j01281K85996L04085l8924N2597l94829J0581J59365J23000N6492
1187A054580k26455m56639M5543K41739o7057J55349l26426K04610r7582J23650
$$ plain form
1258 255712 480996 1008990 1161644 794003 425167 997507 156668 524346 818440 818444 830341
1247 830341 1150583 1231134 989008 1220002 796216 1271296 998444 1115543 359778 298261
1237 298261 450764 389889 635603 1033395 1096822 1158464 1032762 788070 857495 1135960
1227 1135960 1314657 911483 1106354 1264118 1109313 1000792 1195989 1211243 797202 1103159
1217 1103159 1051706 933990 510305 381977 840399 656461 1034036 727420 333261 151507
1207 151507 533906 346280 368748 1241338 1298741 1002254 1104867 873951 783144 597498
1197 597498 496217 782213 1086298 1047374 1099971 705142 715723 875088 998088 1054580
1187 1054580 828125 371486 417029 658768 591711 747060 420634 625244 527662 651312
1177F51312N22465K14472k07201j71134K83838L41164l65437o66038j02222N14167
1167A015386k31283n16141K23237m42682j72619K89995j76194m21738M48669O15824
1157F32454N6988J00498L62935J63405o0937l57566j00768j54137n9001J9800
1147F03671J98003n0719j58804m59837M40824Q6395L83837N78931l42094K94185
1137A574392o52826j027226J1241N62177J60139k35441J51329K1988k50327J64683
1127D80129L47215L58318k8545o27845j26693M3241k79652N02205P21143p2445
1117A317071p21018J2549L09223K15817L12029L63344j70215p1454o17483k72875
1107F76988k82531J61362M23717l22671k53067j48496L05975K27776M50914k81521
$$ plain form
1177 651312 1173777 1388249 1181048 1009914 1293752 1634916 1269479 603441 501219 1015386
1167 1015386 784103 267962 491199 48517 -124102 165893 -10301 -432039 16630 632454
1157 632454 689442 789940 1152875 1316280 1255343 897777 797009 642872 583871 603671
1147 603671 801674 750955 592151 132314 573138 659533 1043370 1622301 1280207 1574392
1137 1574392 921566 -105660 -94419 467758 627897 392456 543785 565773 315446 480129
1127 480129 827344 1185662 1157117 529272 402579 445820 166168 668373 1389516 1317071
1117 1317071 596053 608602 917825 1133642 1445671 1809015 1638800 1567346 949863 676988
1107 676988 394457 555819 979536 656865 403798 255302 561277 789053 1239967 958446
1097I58446K78185j38905j19932J48077N43914l5196l92765k02845j85571L53060
1087A206468p10352n65788J31023N04691J10736m32940m01098O05436k13519J28248
1077C62905P30842l61294j27929K94597k19030p4129K27405o61419O50130Q50823
1067A672901k37770l91732o39176j92712j11639q1922K40089k75727n5394L8849
1057c4233N98124J17685l90166k45072M1894Q8442L82714J27355l48625K70194
1047F08312K33930q7372n9843M87578L4079N2183o26453k29147K35002j6497O1486
1036F93258J26390N30919J97307p89343m23049J74777K53499l36842R985m03173
1026C3728J31522N24556j07982J05824J91787K07128k87634J14007j50652p300
$$ plain form
1097 958446 1236631 1097726 977794 1125871 1669785 1634589 1241824 1038979 853408 1206468
1087 1206468 496116 -69672 61351 566042 676778 243838 -157260 448176 234657 362905
1077 362905 1093747 732453 604524 899121 680091 605962 833367 171948 822078 1672901
1067 1672901 1435131 1043399 404223 211511 99872 17950 258039 -17688 -73082 -34233
1057 -34233 563891 681576 291410 46338 88232 176674 559388 686743 338118 608312
1047 608312 842242 754870 695027 1182605 1216684 1268867 642414 413267 648269 631772 693258
1036 693258 819648 1350567 1547874 758531 335482 510259 763758 426916 436901 33728
1026 33728 165250 689806 581824 687648 879435 1086563 798929 912936 762284 754984
1016G54984M24769J4831l98394r9462J59879m52707K35235L17703M04328l29340
1006A031826r350j03978O02015n26362l60971N1766M3216j59953R6661L08039
996I72909m95907m77837J64650M07288J34053K16171k96260K63640O22960K00291
986A711958k64106n02052n54704K2077M17640L72635n4875l39152p5358L10824
976A044887K34683o03237J13693M08979j83591p6305L60028j97372q72946n1458
966A77361M75248N25741k61736J32081j70660o8905L50129M7898m99438K40782
956I48501k3411J7236k62453l68437k12112o7981M720O2424J70937M86573K03712
945I59709j59343n20107K83225O970K56524k861Q2677J02061l82195p4391O53530
$$ plain form
1016 754984 1179753 1194584 796190 696728 856607 403900 639135 956838 1361166 1031826
1006 1031826 1022476 918498 1520513 994151 633180 684946 728162 568209 664870 972909
996 972909 477002 -835 163815 571103 705156 921327 625067 888707 1511667 1711958
986 1711958 1447852 945800 391096 413173 830813 1203448 1148573 809421 734063 1044887
976 1044887 1279570 676333 790026 1199005 1015414 939109 1299137 1101765 228819 177361
966 177361 652609 1178350 916614 1048695 878035 809130 1159259 1207157 707719 948501
956 948501 925090 942326 679873 311436 99324 31343 36063 98487 269424 755997 959709
945 959709 800366 280259 563484 570454 826978 824117 906794 1008855 626660 552269 1205799
934A205799l04637r2504J83747j09244J92872J98167m77216l56354L30413P8635
924H49678M40932k85262k23106Q628j89186j32384M62203l37803k18553O33921
914A009068l1927l41310K49496K22732l06056j11961J58445q45026J6341J64169
904A83971K71304N72022j99299J46814m50258j79464k97141M57190K83847m41158
894C47828K41786q754l34456L22923K22620K37897o08946J02801K91752L04691
884A120142n6528l1827N2902j94023L36810j60427L38382k21487l15641L65719
874A234022l5588l33964M91829j18855o55812l1373r9163k44465k36345R6817
864F7103O61015j33029L38311j21552j02973k32810K86542J81728M2709k29741
$$ plain form
934 1205799 901162 808658 992405 883161 1076033 1274200 796984 440630 771043 849678
924 849678 1290610 1005348 782242 790870 601684 469300 931503 593700 375147 1009068
914 1009068 977141 635831 885327 1108059 802003 690042 848487 3461 19802 183971
904 183971 455275 1027297 827998 974812 524554 345090 47949 505139 788986 347828
894 347828 589614 580860 246404 569327 791947 1029844 420898 523699 815451 1120142
884 1120142 1063614 1031787 1084689 890666 1227476 1067049 1405431 1183944 868303 1234022
874 1234022 1198434 864470 1356299 1237444 581632 550259 451096 206631 -29714 67103
864 67103 728118 595089 933400 811848 708875 476065 762607 944335 987044 757303
854G57303J90898J50274l75029m12411J74656j05432K21120L90654j07271J36493
844A021255n07054n2210J70400L4494m31384N41298J16270j54122N06304J80271
834A425522m12944n66037k4343m9673J75438j42307P77591J87886L12970k51664
824A432439l19415L03147j32378j15993l47021p0051Q8120j6157l94399n11545
814h3253j81032O21304O45138m89947l5010l00679L09150K47310k16328J57269
804F73922l4022M51470k74685l05536J04167l78751J7784N01619L81154L25231
794A462353k75852l86428k1159j26550o44383L9366K77694k0143Q9909L67323
784G62130J17338K89154j68648q06598k52847l09546R73236L6443J77324N52119
$$ plain form
854 757303 948201 1098475 723446 311035 485691 380259 601379 992033 884762 1021255
844 1021255 514201 461991 632391 666885 235501 776799 893069 738947 1245251 1425522
834 1425522 1012578 446541 422198 372525 547963 405656 1183247 1371133 1684103 1432439
824 1432439 1113024 1416171 1283793 1167800 820779 750728 838848 822691 428292 -83253
814 -83253 -264285 357019 1002157 512210 477200 176521 485671 732981 516653 673922
804 673922 639900 1091370 816685 511149 615316 236565 254349 755968 1137122 1462353
794 1462353 1186501 800073 778914 652364 7981 47347 325041 304898 394807 762130
784 762130 879468 1168622 999974 193376 -59471 -369017 604219 640662 817986 1370105
774A370105l90556K63348l58560j65038N61360j24869j045030J71639l12190K7806
764a985O99708Q6434j05801q8861o768q2781L00484J3401M0449j05799n43874
753B04607j6027n40654M67999P05062J33025N2491L51651p90816R6031o6781j93266
742D03322l9998K54226J20171J54986J84771J60946L90187r35255n8731k5442
732F09183M42181P4737J33751j51357k26511J71970l06856J5571N13982l44846
722I31805m34111J14871j86599j53892k8913L63566m9762Q8488q44J83804l14082
711E14331J43136k6620j76871N37722n79312l16821J93202N41500q841p0400o9329
700F81697k34951k57651k7920k18767J75792L34218M41031j14483j82900N9544
$$ plain form
774 1370105 979549 1242897 884337 719299 1280659 1155790 110760 282399 -29791 -1985
764 -1985 697723 784157 678356 589495 582727 499946 800430 813831 854280 748481 204607
753 204607 188580 -352074 115925 820987 954012 1006503 1358154 567338 663369 596588 403322
742 403322 363324 617550 737721 892707 1077478 1238424 1628611 693356 634625 609183
732 609183 1051364 1126101 1259852 1108495 881984 1053954 747098 762669 1276651 931805
722 931805 497694 612565 425966 272074 243161 606727 556965 645453 644609 828413 514331
711 514331 657467 630847 453976 991698 412386 95565 288767 830267 821426 751026 681697
700 681697 446746 189095 161175 -57592 118200 452418 893449 778966 596066 655610
690F55610M85943j5554l75639j82293l69349J97432l60788O14564K0992J87177
680H58095L5290l09412n20n0260O11516o64217L48082J48501k45728M4188N9470
669H35005L8314R3964K77193m32815q58059K30889N51730k81752K37892J75719
659H68080l50903J0607Q6586r1741L85840m1155l96835k4134l08348J98422L86245
648G22664m93436k14886J72285Q85079j86344j17413l7056K40311K05723k45963
638I30964j61609p7589L26933j50107l76659k5071N23771K4556n0352k96452l39017
627C29368L76606k64255J69491j80902M55719J59643l56075N3925N4573m6860
617G51233N5018j0623K79363J81576O4570p34164l26031Q91655n35971j05929
$$ plain form
690 655610 1141553 1125999 750360 568067 198718 396150 35362 649926 670918 858095
680 858095 893385 583973 583453 533193 1144709 480492 828574 977075 731347 775535 835005
669 835005 873319 967283 1244476 811661 -46398 184491 736221 454469 692361 868080
659 868080 517177 527784 614370 522629 908469 867314 470479 446345 137997 336419 722664
648 722664 229228 14342 186627 1071706 885362 767949 730893 971204 1176927 930964
638 930964 769355 691766 1018699 868592 491933 466862 990633 1015189 964837 668385 329368
627 329368 705974 441719 611210 430308 886027 1045670 689595 743520 798093 751233
617 751233 806251 795628 1074991 1256567 1321137 586973 260942 1152597 616626 510697
607E10697p0396j17573K00921L50587k41108k18058k0330j43219J9105O09920
597H80546o5654N52373J72749m50417n18991k29191O78702L15196j63225p17203
587D54885l7784P77409j09240j59728j92759J00309J33002r1862K8663K3890K1508
576I48293Q9799j87189J49791l87319j75733L85948k24824m13099p5801J70133
566B79999l4761P6473j90215M34503O0795K52750N38406n09892k00381j03786
556F03891m36413L53209K43803k39923J28407j56229N82K10636J73678j91261
546F90380o10137K69724q4272j88164L61852L95573l83672K13434L69689k56863
536G77544L9434J60343l9031l65396K65487M39984k31714j87691K55220l44187
$$ plain form
607 510697 440301 322728 523649 874236 633128 415070 394740 251521 270626 880546
597 880546 814892 1367265 1540014 1089597 570606 341415 1020117 1335313 1172088 454885
587 454885 417101 1194510 1085270 925542 732783 833092 966094 874232 902895 926785 948293
576 948293 1038092 850903 1000694 613375 437642 823590 598766 185667 109866 279999
566 279999 245238 321711 131496 565999 626794 879544 1417950 908058 707677 603891
556 603891 167478 520687 764490 524567 652974 496745 497327 707963 881641 690380
546 690380 80243 349967 265695 77531 439383 834956 451284 664718 1034407 777544
536 777544 816978 977321 938290 572894 838381 1278365 1046651 858960 1114180 769993
526G69993k00059j10767R5152K12380O6086M9732p86l67291k68503k5473K21977
515D42441M78271K95684n44385m87087J51976K19447l9160J90037l490k37387
505D66347L87619R5275n36883j90245M58953r9124K98333k12607p60739K97870
495B04799M65443K37017o5414l76447K77880o9538k35138l05350m4259L84013
485D73006Q6983m16166J22300M45629p6961m86754O23124j40039Q74258P5273
475A580653q07185l3490j83135n45391M802K97046l01486J90289p6927K47534
465C72710J41982j28134j03697j1280K76P26721m91697j26053m25856K82879N88883
454H26734j42287k38084K40077L27300j63069k3104j60209k98484K36093L75797
$$ plain form
526 769993 569934 459167 554319 766699 832785 882517 881731 514440 245937 220464 442441
515 442441 920712 1216396 672011 184924 336900 556347 517187 707224 703734 466347
505 466347 853966 949241 412358 222113 681066 581942 880275 667668 -93071 204799
495 204799 670242 907259 841845 465398 743278 673740 438602 133252 88993 473006
485 473006 559989 143823 266123 711752 634791 148037 771161 631122 1505380 1580653
475 1580653 773468 739978 556843 11452 16254 313300 11814 202103 125176 372710
465 372710 514692 386558 282861 271581 271857 998578 506881 380828 -45028 237851 826734
454 826734 684447 446363 686440 1013740 850671 827567 667358 368874 604967 980764
444I80764O1099L76915k34232j67851l74386n96054N73607R6554P1233j00520
434F87129n22181M97910J37800O8481P6176J48002l42708J83923j55375k21781
424E57376M48138p7735n29064K53702L65992M87445j13239n02094M5607J02415
414A038543K29306o84763l25621M00464K43558J98648k73801o20286l7952Q73360
404A041456m78751O650J49183m42066K57612L96605P1259p1447k86758K83442
394I27185J57502k6490P0631m45319j23205J54685k02657k97034J50848K77024
384F43170j267p6839J78606k59808k26437K07574k378Q645K92744K05146n97855
373C71301l67699Q2151l9565L39707r2230O51962M05939l72644k28571n28142
$$ plain form
444 980764 1041863 1418778 1184546 1016695 642309 46255 619862 716416 787649 687129
434 687129 164948 662858 800658 869139 945315 1093317 750609 934532 779157 557376
424 557376 1005514 927779 398715 652417 1018409 1505854 1392615 890521 936128 1038543
414 1038543 1267849 583086 257465 657929 901487 1100135 826334 206048 168096 1041456
404 1041456 562705 569355 718538 276472 534084 930689 1001948 930501 643743 927185
394 927185 1084687 1058197 1128828 683509 560304 714989 512332 215298 366146 643170
384 643170 641903 565064 743670 483862 257425 464999 462621 471266 764010 969156 371301
373 371301 3602 85753 46188 385895 293665 945627 1351566 978922 750351 222209
363B22209j9585M50596K56942j2030m1402K30545j34134J7123m81126j61009o3522
352B64607M30842L43571q1442j97119K43047k03316N5552N9268l82705l2083L47568
341H47790l39454j55100o1444j07676n17547L83565L91863P4697R9444k84201
331C31937O2501j3355j89693l89800R0267Q26835m1978K36366M01619o94709n10928
320A09062m3069j92409K59658N9200R4169L71278N0875J82971J35663k03999p27274
309I6125K25600M84308l20850n80723K99985M30209J8219p263o26694l10666M02669
298A10919K9349j29599K40088J36683n6389K83254j77903p0476L54557m55571
288B64912P91034K2624l329k4632p63094K39856j06580J02821L5481L4462l09792
$$ plain form
363 222209 202624 653220 910162 898132 856730 1087275 953141 970264 489138 328129 264607
352 264607 695449 1039020 957578 760459 1003506 800190 855742 915010 532305 500222 847790
341 847790 508336 353236 291792 184116 -333431 50134 441997 516694 616138 331937
331 331937 394438 381083 191390 -198410 -108143 718692 676714 913080 1314699 619990 109062
320 109062 65993 -126416 133242 192442 286611 657889 708764 891735 1027398 823399 96125
309 96125 321725 806033 485183 -95540 204445 634654 652873 645610 18916 -291750 110919
298 110919 140268 10669 250757 387440 331051 614305 436402 365926 720483 264912
288 264912 1055946 1078570 1075241 1050609 287515 527371 420791 523612 559093 593555 283763
277B83763K84599K22413M79187l4233n22512o03074K13372p7453L52464R6170
267F94696K59274K78818J83386m50401o3573M78709J75265j56871r51910o15794
257a68401O01367N8776K35398k25997L0353N56588M20132n60770o28187k21363
247I7896l08933O31003J49786P60349j65679r62103m058J40917L09611n38708
237A10081L10681k72797j77373L34306J44179m88063k89910K72835j71363N38745
227C11321j59208n5926L20016m42393K7841N15462j54391k5416K22672l25139
217B34839J4924p3689L26594J75417k97337L67652L77730m00585l26232J17334
207E16647k18807k69930k33095K98778j94429O02828J5532m5059P1929L19063
$$ plain form
277 283763 568362 790775 1269962 1235729 713217 110143 323515 246062 598526 694696
267 694696 953970 1232788 1416174 965773 902200 1380909 1556174 1399303 447393 -168401
257 -168401 432966 491742 727140 501143 531496 1088084 1508216 947446 319259 97896
247 97896 -211037 419966 569752 1330101 1164422 202319 198261 339178 648789 110081
237 110081 420762 147965 -29408 304898 449077 -38986 -328896 -56061 -227424 311321
227 311321 152113 96187 416203 -26190 1651 517113 362722 337306 559978 234839
217 234839 249763 176074 502668 678085 380748 748400 1126130 725545 399313 516647
207 516647 297840 27910 -205185 93593 -100836 501992 517524 472465 544394 863457
197H63457L35379J14370o66632p1599J35141J70735l97751k25212j94753N30509
187E93644K95296j14695l03018k05814l96208L01584L78506J96761l58686P6368
177D63738K83470n03899M46459j78581j41069L32135j10190k66453O0200j55506
167B30304M3479M52676k13446k28396j05977K33418J52333l63483m8522M1069
157A93455K34070l76818J35949Q7409k84500j40940J16136J29417P8572l85609
147b12859J88323l9053P5555K79497J42116L16827J44291o30k83300k29730J04886
136D85923K6331M4113k6092j17675J55529p4525l91383p02295M82998N47275j14098
125C16101k7788J97665k74832l24599K68840j56758N64281k55554m42424N92242
$$ plain form
197 863457 1198836 1313206 646574 574975 710116 880851 483100 257888 63135 593644
187 593644 888940 774245 471227 265413 -130795 170789 549295 746056 387370 463738
177 463738 747208 243309 689768 511187 370118 702253 592063 325610 385810 230304
167 230304 273783 726459 513013 284617 178640 412058 564391 200908 152386 193455
157 193455 427525 50707 186656 274065 -10435 -151375 -35239 94178 172750 -212859
147 -212859 -24536 -63589 11966 291463 433579 750406 894697 894067 610767 381037 485923
136 485923 512254 556367 530275 412600 568129 493604 102221 -600074 -117076 430199 316101
125 316101 288313 485978 211146 -113453 155387 -1371 562910 307356 -135068 457174
115D57174L77093n1358p6169k07185j81119K87755k43624k81550M30094L1349
105E42460L4990M90961l58179j97813j47260l8924J00358l31022N9882L83671
95E39124l52221L8217L59545j13548m60650n0216M51094N71873j05032m06174
85D72012k5079j7243L05533l6812k03407k74787O1486M08126p2470l55768l9405
74B22186J12405n5464j29270M61230k45563m26360l45978M43732J98657Q9505
64C25080j23270j79126L8423k22826K88097J34849j53286K9527J67123m2410n9629
53B02552n1195J95224l29950N52709K43577n05775j48211j19589j59383N51509
43D31468r5092k70607K34877k7004J8083J45187K96932m23599J23466M7488j74052
$$ plain form
115 457174 834267 782909 706740 499555 318436 606191 362567 81017 511111 542460
105 542460 577450 1068411 710232 512419 365159 326235 426593 95571 155453 539124
95 539124 186903 225120 584665 471117 10467 -39749 411345 983218 878186 472012
85 472012 446933 429690 735223 698411 495004 220217 281703 689829 617359 261591 222186
74 222186 334591 279127 149857 611087 365524 -60836 -406814 36918 235575 325080
64 325080 201810 22684 61107 -161719 126378 261227 107941 137468 304591 262181 202552
53 202552 151357 346581 16631 569340 812917 307142 158931 39342 -120041 431468
43 431468 336376 65769 300646 273642 291725 436912 733844 310245 433711 481199 307147
32C07147m02605p0553L27775n9014m44968M33956J05740J91610k66009m4540P024
21H5563l49222M80494k75804j16741l4512M10256q3649j37893K2063N84219k17230
10C67544l49677K7713m9176L51759m40981p6286q1877m4930J92580O9037
0c4294
$$ plain form
32 307147 -95458 -166011 161764 102750 -342218 91738 197478 389088 123079 78539 85563
21 85563 -263659 216835 -58969 -175710 -210222 200034 116385 -21508 555 584774 367544
10 367544 17867 45580 -3596 348163 -92818 -169104 -250981 -295911 -103331 -34294
0 -34294
$$ Imaginary data points
##PAGE= N=2
##DATA TABLE= (X++(I..I)), XYDATA
16383b112567l11098J58285J65739J07567L35614k01938o6791R2325K03312q2217
16373a711769j37338q4734j67000M63604j04085k39282J60498m01968P8837r1471
16363b234708O00512N50180m00513q6536N40649J16153k66164q0689J37100m50509
16353a574525n0510K53705O8538J13577J79038J00192j9646L11531J79407j30122
16343e68815l60210J10363O14018J20699k12116l10435m54647L13260O56521l13765
16333d05127j43789J13468J51519J06437k16500M5398l70581j22610P1126k74821
16323a045480N48198L65227k04186l27116K56422K68167k64525J35185o3575p0266
16313d01949L99997J63274j9928N7886M36417j45343Q5050j62084n76286j31162
$$ plain form
16383 -2112567 -2423665 -2265380 -2099641 -1992074 -1656460 -1858398 -1925189 -1832864 -1629552 -1711769
16373 -1711769 -1849107 -1933841 -2100841 -1637237 -1741322 -1980604 -1820106 -2222074 -2143237 -2234708
16363 -2234708 -1634196 -1084016 -1484529 -1571065 -1030416 -914263 -1180427 -1261116 -1124016 -1574525
16353 -1574525 -1625035 -1371330 -1302792 -1189215 -1010177 -909985 -929631 -618100 -438693 -568815
16343 -568815 -929025 -818662 -204644 -83945 -296061 -606496 -1061143 -747883 -91362 -405127
16333 -405127 -548916 -435448 -283929 -177492 -393992 -348594 -719175 -841785 -770659 -1045480
16323 -1045480 -497282 -132055 -336241 -663357 -406935 -138768 -403293 -268108 -331683 -401949
16313 -401949 -1952 161322 141394 199280 635697 490354 575404 413320 -162966 -294128
16303b94128m8740J74320L89977J01859o00972j73677M94652J00339r393J47151
16293B81388J37793O8435l05809J31548j63892K65136j99884j51907L00469q2308
16283B80969N03770m66015K15077M29978j61711M80953l10618l88734l3088j05150
16273D45431L43296M5082n52658L37366O41804K91766k07194m9322m70830L20941
16263A145682P2357L90450L26426o95506r5676j98695j17351L91919k31121j94224
16253G94261j73045P763J52823N12540K18425n0582J09081m3554J03034j79089
16243A451657P7442J90269J82492k78057K93703J5469Q4865k02591j44960L42640
16233B012929l09745k35161l75279L95221L54184K98302K6570l42458k61159N449
$$ plain form
16303 -294128 -342868 -168548 221429 323288 -277684 -451361 43291 143630 134237 281388
16293 281388 419181 487616 181807 313355 149463 414599 214715 62808 363277 280969
16283 280969 784739 318724 533801 963779 802068 1283021 972403 583669 550581 445431
16273 445431 788727 833809 281151 618517 1260321 1552087 1344893 1295571 824741 1145682
16263 1145682 1218039 1608489 1934915 1239409 1143733 945038 827687 1219606 988485 794261
16253 794261 621216 628979 781802 1294342 1512767 1462185 1571266 1527712 1630746 1451657
16243 1451657 1529099 1719368 1901860 1623803 1917506 1932975 2017840 1815249 1670289 2012929
16233 2012929 1703184 1468023 1092744 1487965 1842149 2140451 2167021 1824563 1563404 1568853
16223A568853k20449O31391J94400l0209k02331n74597K02300K50176K1062K699
16213A843295o6199m87290L15386j26880J5733L63135m20012J36175N54316K89925
16203B417584j71014n99218k29700J646J80337r0836J98901O67429L5826k94753
16193B116202m38846K00595K55606k90129m6651J91553M93470m2849O1387Q6163
16183B586501K17844k40155r3536k47177j17115m9246J12287J12522o35869R5546
16173A741602K01600k49016L58466J88380L1126J9802R435K82939N29327l09729
16163B803932r0652J88592j25713K21461l40868l38410k04140M6335L54121p1993
16153B442665M2201n1563m17929r5498O87163M18204o50545J72019k69131J2633
$$ plain form
16223 1568853 1348404 1979795 2174195 2143986 1941655 1367058 1569358 1819534 1840596 1843295
16213 1843295 1777096 1289806 1605192 1478312 1494045 1857180 1437168 1573343 2127659 2417584
16203 2417584 2246570 1647352 1417652 1419298 1599635 1508799 1707700 2375129 2410955 2116202
16193 2116202 1677356 1877951 2133557 1843428 1796777 1988330 2481800 2438951 2500338 2586501
16183 2586501 2804345 2564190 2470654 2223477 2106362 2057116 2169403 2281925 1646056 1741602
16173 1741602 1943202 1694186 2052652 2241032 2272158 2291960 2301395 2584334 3113661 2803932
16163 2803932 2713280 2901872 2776159 2997620 2656752 2318342 2114202 2160537 2514658 2442665
16153 2442665 2484866 2433303 2015374 1919876 2607039 3025243 2374698 2546717 2277586 2290219
16143B290219N19991l20539j20598k0701J56510j96376j96765J50477K3186M08660
16133B694064L72267k50521K00989M79684n64386k00030O9601k87307J72921o72020
16123B015262O2167N21972m91415j47157N07103k03188J27822K44216k79784J009
16113B358007J01518j5426j62910K69563K33164J84150M52460j91624n26915j85269
16103B516718m54985L89189P46821k81008J39895j86182l53661k58986K9480L635
16093B290916J79192j82855K5410L22294k5794J93183j78276J30824K91K61927
16083C017112n22479p47440P28068L97232l82666J63119j27851K13546M15281
16074C153922k24730l74568M19497q9268j31331N59772j05795k77292k51583O1801
$$ plain form
16143 2290219 2810210 2489671 2369073 2348372 2504882 2308506 2111741 2262218 2285404 2694064
16133 2694064 3066331 2815810 3016799 3496483 2932097 2732067 2801668 2514361 2687282 2015262
16123 2015262 2077429 2599401 2107986 1960829 2467932 2264744 2392566 2636782 2356998 2358007
16113 2358007 2459525 2444099 2281189 2550752 2783916 2968066 3420526 3228902 2701987 2516718
16103 2516718 2061733 2450922 3197743 2916735 3056630 2870448 2516787 2257801 2287281 2290916
16093 2290916 2470108 2287253 2312663 2634957 2609163 2802346 2624070 2754894 2755185 3017112
16083 3017112 2494633 1747193 2475261 2872493 2489827 2652946 2525095 2738641 3153922
16074 3153922 2929192 2554624 2974121 2884853 2753522 3313294 3207499 2930207 2678624 2740425
16064B740425J42005j01213m9270J76841J05835M3396M67341k7561o64731o37965
16054B195103K58170K17285K75101l52182M65750k79186K00325j97216J42469
16045B925619O12949j28123k79154j82615l56088k97709J89240J58581O37218
16036C279918n50923n96348L91731J00238J34081M74904K78589j20371l88366
16027C003453k91152j18200k81534N36078M4066k21422M49424r4651M37778k02865
16017C260975l02181k52584j10311l21528r8571Q7114M19243m19740P651k98762
16007A971306N94389M4915m86889L11111l22342k86321K61652L03587J70366q8470
15997B473304K36689k9289k67180l46486j51761M24005M53405j28961O5063K26282
$$ plain form
16064 2740425 2882430 2781217 2731947 2908788 3014623 3058019 3525360 3497799 2833068 2195103
16054 2195103 2453273 2670558 2945659 2593477 3059227 2780041 2980366 2783150 2925619
16045 2925619 3538568 3410445 3131291 2948676 2592588 2294879 2484119 2642700 3279918
16036 3279918 2728995 2132647 2524378 2624616 2758697 3233601 3512190 3391819 3003453
16027 3003453 2712301 2594101 2312567 2848645 2892711 2671289 3120713 3026062 3463840 3260975
16017 3260975 2958794 2706210 2595899 2274371 2175800 2262914 2682157 2262417 2270068 1971306
16007 1971306 2565695 2610610 2123721 2434832 2112490 1826169 2087821 2391408 2561774 2473304
15997 2473304 2709993 2680704 2413524 2067038 1915277 2339282 2792687 2663726 2728789 2955071
15987B955071k7341k36276J25652K24043n008l6535j87080L33266j03362j56306
15977B886124M0443J81939K79260m93732k32000M96687k67625m92826J34138J63118
15967B695526L22842J0884k55124j44211K55012M5791p3154Q3713n07348L01322
15957B735253j94645j78942M59881j04447k92714N93480J01986l93709J56190
15948B882333K13230m52573j75237L95962k62508m99235j2093K10159J00285l3249
15938B367074J42579q7712m93883J47141Q09774J57931l2080j48093O15600p9387
15928C398944l71393j04962K27858j58961l07498L24041j16501k85291l11450
15919B294787K41549L80948J60826k9582j26817N4381n80012K35239O8060k17624
$$ plain form
15987 2955071 2927730 2691454 2817106 3041149 3036141 2999606 2812526 3145792 3042430 2886124
15977 2886124 2926567 3108506 3387766 2894034 2662034 3158721 2891096 2398270 2532408 2695526
15967 2695526 3018368 3029252 2774128 2629917 2884929 2930720 2857566 2941279 2433931 2735253
15957 2735253 2540608 2361666 2821547 2717100 2424386 3017866 3119852 2726143 2882333
15948 2882333 3095563 2642990 2467753 2863715 2601207 2101972 2089879 2300038 2400323 2367074
15938 2367074 2509653 2421941 1928058 2075199 2884973 3042904 3010824 2862731 3478331 3398944
15928 3398944 3027551 2922589 3150447 2991486 2683988 3008029 2891528 2606237 2294787
15919 2294787 2536336 2917284 3078110 3048528 2921711 2976092 2396080 2631319 2699379 2481755
15909B481755J87123K14173O36357l01498m34635m21912k22648N53004M5384L66991
15899C104094j39290k96600q208R523L17159P3227J16343m38115M46541n32884
15889B651790K3115K69527j09446q7027k39135J026955m6982j30394j90970o8894
15879C098539n00294j81342K88409N38800j17403J03221P9595J31372k1391j91967
15869C227539J23542q15555n116l71758N03088L86573L01731k95661l01671l7102
15859B715610J68414l70655J88893L47560p4830m27159j16737O3332J1599l72976
15849B133051j8855M59683j97277l09006M11980P43904n58363k36252l20689P9547
15839B187723J23644K58058j45893l96256K91744p1835K53670K81180L9515l83555
$$ plain form
15909 2481755 2668878 2883051 3519408 3217910 2783275 2361363 2138715 2691719 2737103 3104094
15899 3104094 2964804 2668204 2659996 2669519 2986678 3059905 3176248 2738133 3184674 2651790
15889 2651790 2674905 2944432 2834986 2747959 2508824 3535779 3488797 3358403 3167433 3098539
15879 3098539 2598245 2416903 2705312 3244112 3126709 3229930 3309525 3440897 3419506 3227539
15869 3227539 3351081 2535526 2530410 2158652 2661740 3048313 3350044 3054383 2752712 2715610
15859 2715610 2884024 2513369 2702262 3049822 2974992 2547833 2431096 2494428 2506027 2133051
15849 2133051 2114196 2573879 2376602 2067596 2479576 3223480 2665117 2428865 2108176 2187723
15839 2187723 2311367 2569425 2423532 2027276 2319020 2247185 2500855 2782035 2821550 2437995
15829B437995M3561J77255p6308k78946K8095M24591j02093K95684L90125k029
15819C337930l00451R3509k2801j98397k75388L04539J15171L6372O30506p5879
15809C645111k47241p73038j62707O90201l13779m0795J37223J88496N4218m05295
15799B772394k13388P0234P52345k000k28745k29990Q7081p7568k12870k38907
$$ plain form
15829 2437995 2481556 2658811 2582503 2303557 2331652 2756243 2654150 2949834 3339959 3337930
15819 3337930 3037479 3130988 3108187 2909790 2634402 2938941 3054112 3090484 3720990 3645111
15809 3645111 3397870 2624832 2462125 3152326 2838547 2797752 2934975 3123471 3177689 2772394
15799 2772394 2559006 2629240 3381585 3379585 3150840 2920850 3007931 2930363 2717493 2478586
$$ [...]
##END NTUPLES=NMR SPECTRUM
##END=
