##TITLE=1H_DE-80H_X3
 200.13MHz, d2o
 8 sc
 
 19ns.26.2.2025
##JCAMPDX= 6.0         $$ Bruker NMR JCAMP-DX V2.0
##DATA TYPE= NMR SPECTRUM
##DATA CLASS= NTUPLES
##ORIGIN= UXNMR, Bruker Analytische Messtechnik GmbH
##OWNER= pz
$$ XWIN-NMR		Version 3.5
$$ Fri Mar 20 10:52:33 2026 Russian Standard Time (UT+4h)  Yarkov@DPX200
##.OBSERVE FREQUENCY= 200.1313
##.OBSERVE NUCLEUS= ^1H
##.ACQUISITION MODE= SIMULTANEOUS
##.ACQUISITION SCHEME= undefined
##.AVERAGES= 8
##.DIGITISER RES= 18
##SPECTROMETER/DATA SYSTEM= spect
##.PULSE SEQUENCE= zg30
##.SOLVENT NAME= DMSO
##.SHIFT REFERENCE= (INTERNAL, DMSO, 0, 15.4891)
##AUDIT TRAIL= $$ (NUMBER, WHEN, WHO, WHERE, WHAT)
$$ ##TITLE= Audit trail, XWIN-NMR		Version 3.5
$$ ##JCAMPDX= 5.01
$$ ##ORIGIN= Bruker BioSpin GmbH
$$ ##OWNER= Yarkov
$$ C:/Bruker/XWIN-NMR/data/yarkov2/nmr/H-C/1/pdata/1/auditp.txt
$$ ##AUDIT TRAIL=  $$ (NUMBER, WHEN, WHO, WHERE, WHAT)
(   1,<2026-03-20 10:51:49.46 +0400>,<Yarkov>,<DPX200>,
      <created by zg, POWCHK disabled, PULCHK disabled
       configuration hash MD5:
       00 E9 B6 7A A2 85 ED C7 34 08 36 98 17 FE 4E 26
       data hash MD5: 16K
       1B 53 86 CA 50 3C 0D 7F B7 E9 6F B2 8A 6C 6D D3>)
(   2,<2026-03-20 10:51:56.01 +0400>,<Yarkov>,<DPX200>,
      <Start of raw data processing
       efp BC_mod = 2 LB = 0.25 FT_mod = 6 PKNL = 1 PHC0 = -5299.148 PHC1 = 6.821927 SI = 16K 
       data hash MD5: 16K
       83 B9 07 5A 76 1D AD C9 E2 F3 05 82 24 D5 14 51>)
$$ ##END=
$$ 
$$ hash MD5
$$ 35 90 A1 3C 4B 14 0C 75 0B EE 1A 54 A9 C7 E6 BE
##$RELAX= 
##$RELAX= 
##$RELAX= 
##$RELAX= 
##$RELAX= 
##$RELAX= 
$$ Bruker specific parameters
$$ --------------------------
##$DU= <C:/Bruker/XWIN-NMR>
##$EXPNO= 1
##$NAME= <H-C>
##$PROCNO= 1
##$TYPE= <nmr>
##$USER= <yarkov2>
##$AMP= (0..31)
100 100 100 100 100 100 100 100 100 100 100 100 100 100 100 100 100 100 
100 100 100 100 100 100 100 100 100 100 100 100 100 100 
##$AQSEQ= 0
##$AQ_mod= 1
##$AUNM= <au_zg>
##$AUTOPOS= <>
##$BF1= 200.13
##$BF2= 200.13
##$BF3= 200.13
##$BF4= 200.13
##$BF5= 200.13
##$BF6= 200.13
##$BF7= 200.13
##$BF8= 200.13
##$BYTORDA= 1
##$CFDGTYP= 0
##$CFRGTYP= 5
##$CHEMSTR= <none>
##$CNST= (0..31)
1 1 145 1 1 1 1 1 1 1 1 1 1 1 1 1 1 1 1 1 1 1 1 1 1 1 1 1 1 1 1 1 
##$CPDPRG= <>
##$CPDPRG1= <>
##$CPDPRG2= <>
##$CPDPRG3= <>
##$CPDPRG4= <mlev>
##$CPDPRG5= <mlev>
##$CPDPRG6= <mlev>
##$CPDPRG7= <mlev>
##$CPDPRG8= <mlev>
##$CPDPRGB= <>
##$CPDPRGT= <>
##$D= (0..31)
0 0.7 0 0 0 0 0 0 0 0 0 0.03 0 0 0 0 0 0 0 0 0 0 0 0 0 0 0 0 0 0 0 0 
##$DATE= 1773989508
##$DBL= (0..7)
120 120 120 120 120 120 120 120 
##$DBP= (0..7)
150 150 150 150 150 150 150 150 
##$DBP07= 0
##$DBPNAM0= <>
##$DBPNAM1= <>
##$DBPNAM2= <>
##$DBPNAM3= <>
##$DBPNAM4= <>
##$DBPNAM5= <>
##$DBPNAM6= <>
##$DBPNAM7= <>
##$DBPOAL= (0..7)
0.5 0.5 0.5 0.5 0.5 0.5 0.5 0.5 
##$DBPOFFS= (0..7)
0 0 0 0 0 0 0 0 
##$DE= 6
##$DECBNUC= <off>
##$DECIM= 32
##$DECNUC= <off>
##$DECSTAT= 4
##$DIGMOD= 1
##$DIGTYP= 9
##$DL= (0..7)
0 120 120 120 120 120 120 120 
##$DP= (0..7)
$$ [...]
##$SUBNAM2= <"">
##$SUBNAM3= <"">
##$SUBNAM4= <"">
##$SUBNAM5= <"">
##$SUBNAM6= <"">
##$SUBNAM7= <"">
##$SUBNAM8= <"">
##$SUBNAM9= <"">
##$SW= 18.0517328524113
##$SWIBOX= (0..15)
0 0 2 0 0 0 0 0 0 0 0 0 0 0 0 0 
##$SW_h= 3612.71676300578
##$TD= 16384
##$TD0= 1
##$TE= 0
##$TE2= 300
##$TE3= 300
##$TEG= 300
##$TL= (0..7)
0 120 120 120 120 120 120 120 
##$TP= (0..7)
150 150 150 150 150 150 150 150 
##$TP07= 0
##$TPNAME0= <>
##$TPNAME1= <>
##$TPNAME2= <>
##$TPNAME3= <>
##$TPNAME4= <>
##$TPNAME5= <>
##$TPNAME6= <>
##$TPNAME7= <>
##$TPOAL= (0..7)
0.5 0.5 0.5 0.5 0.5 0.5 0.5 0.5 
##$TPOFFS= (0..7)
0 0 0 0 0 0 0 0 
##$TUNHIN= 0
##$TUNHOUT= 0
##$TUNXOUT= 0
##$USERA1= <user>
##$USERA2= <user>
##$USERA3= <user>
##$USERA4= <user>
##$USERA5= <user>
##$V9= 5
##$VALIST= <valist>
##$VCLIST= <CCCCCCCCCCCCCCC>
##$VD= 0
##$VDLIST= <DDDDDDDDDDDDDDD>
##$VPLIST= <PPPPPPPPPPPPPPP>
##$VTLIST= <TTTTTTTTTTTTTTT>
##$WBST= 1024
##$WBSW= 4
##$XGAIN= (0..3)
0 0 0 0 
##$XL= 0
##$YL= 0
##$YMAX_a= 105000
##$YMIN_a= -95736
##$ZGOPTNS= <>
##$ZL1= 120
##$ZL2= 120
##$ZL3= 120
##$ZL4= 120
##$ABSF1= 0
##$ABSF2= 0
##$ABSG= 0
##$ABSL= 0
##$ALPHA= 0
##$AQORDER= 0
##$ASSFAC= 0
##$ASSFACI= 0
##$ASSFACX= 0
##$ASSWID= 0
##$AUNMP= <proc_1d>
##$AZFE= 0.1
##$AZFW= 0.1
##$BCFW= 0
##$BC_mod= 2
##$BYTORDP= 0
##$COROFFS= 0
##$CY= -3
##$DATMOD= 1
##$DC= 0
##$DFILT= <>
##$DTYPP= 0
##$F1P= 0
##$F2P= 0
##$FCOR= 1
##$FTSIZE= 16384
##$FT_mod= 6
##$GAMMA= 0
##$GB= 0
##$INTBC= 1
##$INTSCL= 3.241238e-09
##$ISEN= 128
##$LB= 0.25
##$LEV0= 0
##$LPBIN= 0
##$MAXI= 10000
##$MC2= 0
##$MEAN= 0
##$ME_mod= 0
##$MI= 1.114404
##$NCOEF= 0
##$NC_proc= -8
##$NLEV= 6
##$NOISF1= 3.799351
##$NOISF2= 2.8
##$NSP= 0
##$NTH_PI= 0
##$NZP= 0
##$OFFSET= 15.48907
##$PC= 1
##$PHC0= -5299.148
##$PHC1= 6.821927
##$PH_mod= 1
##$PKNL= yes
##$PPARMOD= 0
##$PSCAL= 0
##$PSIGN= 0
##$REVERSE= no
##$SF= 200.130006531173
##$SI= 16384
##$SIGF1= 3
##$SIGF2= 2
##$SINO= 0.751879
##$SIOLD= 32768
##$SREGLST= <19F.Aceton>
##$SSB= 0
##$STSI= 16384
##$STSR= 0
##$SW_p= 3612.71676300578
##$SYMM= 0
##$S_DEV= 0
##$TDeff= 16384
##$TDoff= 0
##$TI= <>
##$TILT= no
##$TM1= 0
##$TM2= 0
##$TOPLEV= 0
##$USERP1= <user>
##$USERP2= <user>
##$USERP3= <user>
##$USERP4= <user>
##$USERP5= <user>
##$WDW= 1
##$XDIM= 16384
##$YMAX_p= 435714127
##$YMIN_p= -1239982
$$ End of Bruker specific parameters
$$ ---------------------------------
##NTUPLES= NMR SPECTRUM
##VAR_NAME=  FREQUENCY,     SPECTRUM/REAL,   SPECTRUM/IMAG
##SYMBOL=    X,             R,               I
##VAR_TYPE=  INDEPENDENT,   DEPENDENT,       DEPENDENT
##VAR_FORM=  AFFN,          ASDF,            ASDF
##VAR_DIM=   16384,         16384,           16384
##UNITS=     HZ,            ARBITRARY UNITS, ARBITRARY UNITS
##FACTOR=    0.220516191357247, 1,           1
##FIRST=     3099.82766798575, 0,            0
##LAST=      -512.889095020026, 0,           0
##MIN=       -512.889095020026, -1239982,    0
##MAX=       3099.82766798575, 435714127,    0
$$ Real data points
##PAGE= N=1
##DATA TABLE= (X++(R..R)), XYDATA
$$ [...]
5161B2480527K38217J37577J18133j21242j02217M96032L72084N9055j85083k16534
$$ 22480527 22718744 22856321 22974454 22853212 22750995 23247027 23619111 23678166 23493083 23276549
5151B3276549N5871j5140J16963k57786n9887J86562K43828J25475j08384k68298
$$ 23276549 23332420 23317280 23434243 23176457 23116570 23303132 23546960 23672435 23564051 23295753
5141B3295753k85601r0081J71443n0738j48988k59492q9757m4152l84843J86969
$$ 23295753 23010152 22920071 23091514 23040776 22891788 22632296 22542539 22498387 22113544 22300513
5131B2300513J25385k29854o09632j15131j38390o61974l69007L5170j24588l20176
$$ 22300513 22425898 22196044 21586412 21471281 21332891 20670917 20301910 20337080 20212492 19892316
5121A9892316q4733r5080n56211l36885K24625l85865l58908K985m2004m52919
$$ 19892316 19807583 19712503 19156292 18819407 19044032 18658167 18299259 18302244 18260240 17807321
5111A7807321K5520M4408n42835j74687m10901l14856l2371J00251j38053n14910
$$ 17807321 17832841 17877249 17334414 17159727 16748826 16433970 16401599 16501850 16363797 15848887
5101A5848887j81386j17700r9527K01088j56819k53433n2357p5318k24575J83372
$$ 15848887 15667501 15549801 15450274 15651362 15494543 15241110 15188753 15113435 14888860 15072232
5091A5072232L3027j92362Q2711j35286k55078k36187o2167J75539k60737K86733
$$ 15072232 15105259 14912897 14995608 14860322 14605244 14369057 14306890 14482429 14221692 14508425
5081A4508425k27659j66770O3844l6913K51013j23596k69391K5851J51279k32665
$$ 14508425 14280766 14113996 14177840 14140927 14391940 14268344 13998953 14024804 14176083 13943418
5071A3943418J12109J2513l1306r3708j44041L963j84k33813L7621N6645m3007
$$ 13943418 14055527 14068040 14036734 13943026 13798985 13802948 13802764 13568951 13606572 13663217 13620210
5060A3620210k25558j5686k449j88058q4519L9003J34579l7662j28680J10529
$$ 13620210 13394652 13378966 13376517 13188459 13103940 13142943 13277522 13239860 13111180 13221709
5050A3221709J21956L38530j1154P0466l10417K0658J38266J7747r8521L4893
$$ 13221709 13343665 13682195 13671041 13741507 13431090 13451748 13590014 13607761 13509240 13544133
5040A3544133K74069K24167J22281l4616j48056J8215L58205M55769j37485P7391
$$ 13544133 13818202 14042369 14164650 14130034 13981978 14000193 14358398 14814167 14676682 14754073
5030A4754073J74698K92788M17034j16433O5805J98888M8570J16420K58412M5841
$$ 14754073 14928771 15221559 15638593 15522160 15587965 15786853 15835423 15951843 16210255 16256096
5020A6256096p2176Q4979M45224J22603Q9322J05384O4109J10126J73414n4205
$$ 16256096 16183920 16268899 16714123 16836726 16926048 17031432 17095541 17205667 17379081 17324876
5010A7324876m4197R2017J40114J53788L30107n2578J37129J92481L01325j29995
$$ 17324876 17280679 17372696 17512810 17666598 17996705 17944127 18081256 18273737 18575062 18445067
5000A8445067L89416M32028M09536J91055K04334j71118j02105l59801j16210
$$ 18445067 18834483 19266511 19676047 19867102 20071436 19900318 19798213 19438412 19322202
4991A9322202n04161l50696r4245m356l46478P7582K6499j70185K05176l7677
$$ 19322202 18818041 18467345 18373100 18368744 18022266 18099848 18126347 17956162 18161338 18123661
4981A8123661O2622K7739j5893j09623K98875J0485j01823k7753J26820M13826
$$ 18123661 18186283 18214022 18198129 18088506 18387381 18397866 18296043 18268290 18395110 18808936
4971A8808936N2036j80870O1318m2756m7766K78012J32577k9582J86233q2947
$$ 18808936 18860972 18680102 18741420 18698664 18650898 18928910 19061487 19031905 19218138 19135191
4961A9135191P4400k13620j70064M74862K68898n4477J70987k2344Q7429J01050
$$ 19135191 19209591 18995971 18825907 19300769 19569667 19515190 19686177 19663833 19751262 19852312
4951A9852312M51761k64704j79945J49281j4870j01830J23836O3888j42393M9572
$$ 19852312 20304073 20039369 19859424 20008705 19993835 19892005 20015841 20079729 19937336 19986908
4941A9986908K5620k56146j66752r2853L899j05660M9379p4800N6436R899J50524
$$ 19986908 20012528 19756382 19589630 19496777 19500676 19395016 19444395 19369595 19426031 19435930 19586454
4930A9586454N203L05278J51869j12634J01180M84867L72010K90075L1650K68509
$$ 19586454 19591657 19896935 20048804 19936170 20037350 20522217 20894227 21184302 21215952 21484461
4920B1484461M72530R241J0719J76698K53761M41540M26646K98634K14460L93477
$$ 21484461 21956991 21966232 21976951 22153649 22407410 22848950 23275596 23574230 23788690 24182167
4910B4182167M09707M33631O75630N46973P20524M14244P69521O80230L97013
$$ 24182167 24591874 25025505 25701135 26248108 26968632 27382876 28152397 28832627 29229640
4901B9229640Q35960N01138L69351N23381J45336J0091M76006M60717J25996l6217
$$ 29229640 30065600 30566738 30936089 31459470 31604806 31614897 32090903 32551620 32677616 32641399
4891C2641399j05838j4259K09128K23001N23402K82619P8605K42987L58152N13862
$$ 32641399 32535561 32521302 32730430 32953431 33476833 33759452 33838057 34081044 34439196 34953058
4881C4953058M89625K47936J6271L59107L89908L75459O4562K27759J00033m05842
$$ 34953058 35442683 35690619 35706890 36065997 36455905 36831364 36895926 37123685 37223718 36817876
4871C6817876l54850L7095j14533n38561m04197k45510n33931n73231m7273P8681
$$ 36817876 36463026 36500121 36385588 35847027 35442830 35197320 34663389 34090158 34042885 34121566
4861C4121566k49616J25191j26073j57129k76811n02460l27596j97452j15578
$$ 34121566 33871950 33997141 33871068 33713939 33437128 32934668 32607072 32409620 32294042
4852C2294042j609j03411K9063j5104N8200K99720J34810L58901L43321N59327
$$ 32294042 32292433 32189022 32218085 32202981 32261181 32560901 32695711 33054612 33397933 33957260
4842C3957260N73934L87913P72252M65491N88854J041149J550659J804293K716375
$$ 33957260 34531194 34919107 35691359 36156850 36745704 37786853 39337512 41141805 43858180
4833D3858180L998489P021121J1797915J3957058R420483K026710m997152q513075
$$ 43858180 47856669 54877790 66675705 80632763 90053246 92079956 87082804 78569729
4825G8569729r835773r008524p240856n546556l745394k694225k001998j497782
$$ 78569729 68733956 59725432 52484576 46938020 43192626 40498401 38496403 36998621
4817C6998621j097589j127207r42056r02007m01492l26211m85467r47671p44528
$$ 36998621 35901032 34773825 33831769 32929762 32528270 32202059 31716592 30768921 30024393
4808C0024393n05974r79747r45720l79291o76025p20633m05583n39725o30006
$$ 30024393 29518419 28538672 27592952 27213661 26537636 25817003 25411420 24871695 24241689
4799B4241689k05991P5479n21877p51527r9372k43241j00697k05222l60325q0824
$$ 24241689 24035698 24111177 23589300 22837773 22738401 22495160 22394463 22189241 21828916 21748092
4789B1748092J9823j85299l29346j12748n1661j66084m38981m20733L0369j88746
$$ 21748092 21767915 21582616 21253270 21140522 21088861 20922777 20483796 20063063 20093432 19904686
4779A9904686j03678P8612l79314j36497L0607k05618k27712L8243K55808K6784
$$ 19904686 19801008 19879620 19500306 19363809 19394416 19188798 18961086 18999329 19255137 19281921
4769A9281921k5372J78567L22825L58225K73333N15811N62895J44863M04400L99947
$$ 19281921 19256549 19435116 19757941 20116166 20389499 20905310 21468205 21613068 22017468 22417415
4759B2417415J53706L15579O94417P73875O10206N09608M37550M99115L45851
$$ 22417415 22571121 22886700 23581117 24354992 24965198 25474806 25912356 26411471 26757322
4750B6757322P42389P73735O70578J241947Q59629P72387J059644R56062J427487
$$ 26757322 27499711 28273446 28944024 30185971 31045600 31817987 32877631 33833693 35261180
4741C5261180J577368J228525J500513J044847J603831J428530J332526R62797
$$ 35261180 36838548 38067073 39567586 40612433 42216264 43644794 44977320 45940117
4733D5940117J293855J160407R19560Q55910O92090O81380O84359K59385p2219
$$ 45940117 47233972 48394379 49313939 50169849 50861939 51543319 52227678 52487063 52414844
4724E2414844L98677k18269L79394M24304O32196P40768P86130P77955P25322
$$ 52414844 52813521 52595252 52974646 53398950 54031146 54771914 55558044 56335999 57061321
4715E7061321N95217J102272J190258J411125J782450J570585J747077J481379
$$ 57061321 57656538 58758810 59949068 61360193 63142643 64713228 66460305 67941684
4707F7941684J782633J590063Q74694Q46305M71286J7512n77869q04386j006743
$$ 67941684 69724317 71314380 72189074 73035379 73506665 73524177 72946308 72141922 71135179
4698G1135179j778512j520141j963250j811564j966892j605744j833282j951359
$$ 71135179 69356667 67836526 65873276 64061712 62094820 60489076 58655794 56704435
4690E6704435j221508j287806j262055j476794j049012n77182n55265p22755p90443
$$ 56704435 55482927 54195121 52933066 51456272 50407260 49830078 49274813 48552058 47761615
4681D7761615r89696q33144q16078n35604q42413j233537j422591j356116j514053
$$ 47761615 46771919 45938775 45122697 44587093 43744680 42511143 41088552 39732436 38218383
4672C8218383j757262j711532j774782j495005j572965j492491j500121j387190
$$ 38218383 36461121 34749589 32974807 31479802 29906837 28414346 26914225 25527035
4664B5527035j136134j047859j202957j165934q52376q49980o40449p45394l84558
$$ 25527035 24390901 23343042 22140085 20974151 20121775 19271795 18631346 17885952 17501394
4655A7501394n40746m51583m22738m52938n28526m28788j79367l11910k21496
$$ 17501394 16960648 16509065 16086327 15633389 15104863 14676075 14496708 14184798 13963302
4646A3963302k26869j90367j78875l8716q9139M071J36042k16823O4145q5611
$$ 13963302 13736433 13546066 13367191 13328475 13239336 13243407 13379449 13162626 13226771 13141160
4636A3141160o3788J22021M75016M63312L16092M10260J378776K173359K396270
$$ 13141160 13077372 13199393 13674409 14137721 14453813 14864073 16242849 18416208 20812478
4627B0812478K020340R97772J43546o31960j254466j587765j575513j305485o69070
$$ 20812478 22832818 23830590 23974136 23342176 22087710 20499945 18924432 17618947 16949877
4618A6949877k84736j82106j67846J96629M08129P67773J156465J298186J465129
$$ 16949877 16665141 16483035 16315189 16511818 16919947 17687720 18844185 20142371 21607500
4609B1607500J027829N99292J121970R66255P78478J300296J625539K016318J624110
$$ 21607500 22635329 23234621 24356591 25322846 26101324 27401620 29027159 31043477 32667587
4600C2667587J505990R89163K86868N7363N46347J151428J418529J762393J157721
$$ 32667587 34173577 35162740 35449608 35506971 36053318 37204746 38623275 40385668 41543389
4591D1543389J81512r38866j410679j602141j517290j029431l69715j65211p09165
$$ 41543389 41724901 40786035 39375356 37773215 36255925 35226494 34856779 34691568 33982403
4582C3982403j351131k098803k034097k032206j806746j351404j028414r78127
$$ 33982403 32631272 30532469 28498372 26466166 24659420 23308016 22279602 21301475
4574B1301475j226795j627261j636962j406644j648284j261801j131534p97839
$$ 21301475 20074680 18447419 16810457 15403813 13755529 12493728 11362194 10564355
4566A0564355n87318n19009o24368k91408m07818k19450k82769m7010k39129l47450
$$ 10564355 9977037 9458028 8833660 8542252 8134434 7914984 7632215 7585205 7346076 6998626
4556F998626k31842K14139K05149j88344j73694j80299r8300k91606k15246J201
$$ 6998626 6766784 6980923 7186072 6997728 6824034 6643735 6545435 6253829 6038583 6039784
4546F039784L3139l76247j93406k7350j33164j19690j31271J30038l7618k87771
$$ 6039784 6072923 5696676 5503270 5475920 5342756 5223066 5091795 5221833 5184215 4896444
4536D896444J16754Q3246j59561p7649K36038j72466j69744j43900J3098J77344
$$ 4896444 5013198 5096444 4936883 4859234 5095272 4922806 4753062 4609162 4622260 4799604
4526D799604p6989N1198O6853K48846k12399k39793J55211R1564l11318J79195
$$ 4799604 4722615 4773813 4840666 5089512 4877113 4637320 4792531 4884095 4572777 4751972
4516D751972Q0437k17845J94137K73593N1574j77328p7064N5979q4818k03328
$$ 4751972 4832409 4614564 4808701 5082294 5133868 4956540 4879476 4935455 4850637 4647309
4506D647309j9498P3823k37690L9088J06443q5228j57457L47839N0735o1900k46168
$$ 4647309 4627811 4701634 4463944 4503032 4609475 4524247 4366790 4714629 4765364 4703464 4457296
4495D457296L266J59534j49945r3644q304j7071j7295R937j1979p5436l93034
$$ 4457296 4460562 4620096 4470151 4376507 4368203 4351132 4333837 4343774 4331795 4256359 3863325
4484C863325n3573k82302L4109J22697j18768k8658K44035k16396l71226n2773
$$ 3863325 3809752 3527450 3561559 3684256 3565488 3536830 3780865 3564469 3193243 3140470
4474C140470J87719n9417j54849j66125O2638j19342j69563l10292m7001K75901
$$ 3140470 3328189 3268772 3113923 2947798 3010436 2891094 2721531 2411239 2364238 2640139
4464B640139J80665r1938M5943j77822N718k8475m2470m0553J27027J09255j32663
$$ 2640139 2820804 2728866 2774809 2596987 2602705 2574230 2531760 2491207 2618234 2727489 2594826
4453B594826J99601N2243k95979K36833J77863m20126K07783J0498j58739l73097
$$ 2594826 2794427 2846670 2550691 2787524 2965387 2545261 2753044 2763542 2604803 2231706
4443B231706r8850O9336j28347K10075K0636Q785j52520L69253j04713q4758j14483
$$ 2231706 2132856 2202192 2073845 2283920 2304556 2313341 2160821 2530074 2425361 2340603 2226120
4432B226120p5262j68270Q5794P5146J17778K11818P455j49409j38901R8538k40515
$$ 2226120 2150858 1982588 2068382 2143528 2261306 2473124 2480579 2331170 2192269 2290807 2050292
4421B050292K8255K40365J2405k74537K35451K70230N0512J5690O3960k41182
$$ 2050292 2078547 2318912 2331317 2056780 2292231 2562461 2612973 2628663 2692623 2451441
4411B451441J42782n8434P4941n2736q8387J79595K0119O5656J42988L1530K13583
$$ 2451441 2594223 2535789 2610730 2557994 2469607 2649202 2669321 2734977 2877965 2909495 3123078
4400C123078p676q8331l73926j24394K27633k23844N9539q0598k4043r6680k08648
$$ 3123078 3115402 3027071 2653145 2528751 2756384 2532540 2592079 2511481 2487438 2390758 2182110
4389B182110L34346J94951k4588r2857J065k56835o2271K8993L34340j44840P4874
$$ 2182110 2516456 2711407 2686819 2593962 2595027 2338192 2275921 2304914 2639254 2494414 2569288
4378B569288J46425K534Q0114o4469J90174J32962J63573k21396L3733j16927
$$ 2569288 2715713 2718247 2798361 2733892 2924066 3057028 3220601 2999205 3032938 2916011
4368B916011M6077j76051L34854P36033K22564L23860O59989P40537N65622L309
$$ 2916011 2962088 2786037 3120891 3856924 4079488 4403348 5063337 5803874 6369496 6372805
4358F372805l04900j07131l21050k94174m44175n36022l70900J44731j0214k15657
$$ 6372805 6067905 5960774 5639724 5345550 4901375 4365353 3994453 4139184 4128970 3913313
4348C913313M8427j07785K0957J03663j2294j64663p322K31469R1955K532J19759
$$ 3913313 3961740 3853955 3874912 3978575 3966281 3801618 3794296 4025765 4117720 4120252 4240011
4337D240011J63630k56789j27711k1476K74031j930q7206N8872n6084n947J12595
$$ 4240011 4403641 4146852 4019141 3997665 4271696 4269766 4182560 4241432 4185348 4179401 4291996
4326D291996K6437R1263j32973o9337k4733L64271j23276j5000j71211j22239
$$ 4291996 4318433 4409696 4276723 4207386 4182653 4546924 4423648 4408648 4237437 4115198
4316D115198J79325K90581j08726j24771K78869j6488J76456L5241O419j12425
$$ 4115198 4294523 4585104 4476378 4351607 4630476 4613988 4790444 4825685 4832104 4719679
4306D719679n7926o1516N79524M7558l32823o6891L91127L19416m4140K10224
$$ 4719679 4661753 4600237 5179761 5227319 4894496 4827605 5218732 5538148 5494008 5704232
4296E704232J35102q791L8579j28642K91452k0064j09570j07936O0225j2239J80301
$$ 5704232 5839334 5830543 5869122 5740480 6031932 6011868 5902298 5794362 5854587 5842348 6022649
4285F022649k43283Q2358r4680M0159n9970j00718l98713k11441L10197Q5905
$$ 6022649 5779366 5861724 5767044 5807203 5747233 5646515 5247802 5036361 5346558 5432463
4275E432463k93079j32635R4833L2475j16276l407J592j06754l2874k8861L4774
$$ 5432463 5139384 5006749 5101582 5134057 5017781 5014374 5015966 4909212 4876338 4847477 4882251
4264D882251M2120L95984K53312J93039L36389K40034J77008L09914k900J85504
$$ 4882251 4924371 5320355 5573667 5766706 6103095 6343129 6520137 6830051 6827151 7012655
4254G012655j56898k30928j91436l8276J38007L8604l9258M5210N0791K5166k93468
$$ 7012655 6855757 6624829 6433393 6395117 6533124 6571728 6532470 6577680 6628471 6653637 6360169
4243F360169K8661N3586j53495p717J73364M06405L81919M57045R68706J301649
$$ 6360169 6388830 6442416 6288921 6281204 6454568 6860973 7242892 7699937 8668643 9970292
4233I970292K152060K447096J406228j49692j213969j713221j959101j689101
$$ 9970292 12122352 14569448 15975676 15825984 14612015 12898794 10939693 9250592
4225I250592j237180r29865o16935o21819n00845j52697Q2271m79595O9791L09329
$$ 9250592 8013412 7083547 6466612 5844793 5343948 5191251 5273522 4793927 4863718 5173047
4215E173047P9724m64237j99340k0961m41806J75453r7246L8879k29965k962k3006
$$ 5173047 5252771 4788534 4589194 4568233 4126427 4301880 4204634 4243513 4013548 4010586 3987580
4204C987580j60739l5338Q0242J04420l2651n9164J75319J36977l10032J56608
$$ 3987580 3826841 3791503 3871745 3976165 3943514 3884350 4059669 4196646 3886614 4043222
4194D043222J54744J6562k08602j49021J48142K8418O0922R0056K22612N186j20952
$$ 4043222 4197966 4214528 4005926 3856905 4005047 4033465 4094387 4184443 4407055 4412241 4291289
4183D291289M6400J1426o3704J75764M7277j39475k3705k6727L645J62529J29401
$$ 4291289 4337689 4349115 4285411 4461175 4508452 4368977 4345272 4318545 4322190 4484719 4614120
4172D614120M5711M18017m1371J18137J39621O1893j5504r8731L95072k6419k0053
$$ 4614120 4659831 5077848 5036477 5154614 5294235 5356128 5340624 5241893 5636965 5610546 5590493
4161E590493k5417M71509j01005K13909J70493j20118J88450K81557L41520L3541
$$ 5590493 5565076 6036585 5935580 6149489 6319982 6199864 6388314 6669871 7011391 7044932
4151G044932O4110P4979L05235J16328L04173L08141j16871J99072J95852K74505
$$ 7044932 7109042 7184021 7489256 7605584 7909757 8217898 8101027 8300099 8495951 8770456
4141H770456L80324J97865K05982M95249M3655K26391M63129L26319J39340M67662
$$ 8770456 9150780 9348645 9554627 10049876 10093531 10319922 10783051 11109370 11248710 11716372
4131A1716372P69267K69965K37067M08688O75336L15855M44228L63643L87820
$$ 11716372 12485639 12755604 12992671 13401359 14076695 14392550 14836778 15200421 15588241
4122A5588241O05026P12530M00365K48526L98926K93195M88768Q93767M18478
$$ 15588241 16193267 16905797 17306162 17554688 17953614 18246809 18735577 19629344 20047822
4113B0047822N09496P30568O67125M61501O50411R56781N93174N59203M91073
$$ 20047822 20557318 21287886 21955011 22416512 23066923 24023704 24616878 25176081 25667154
4104B5667154N18245P89951N37315N42848M09491R31213N99845O73810N63504
$$ 25667154 26185399 26975350 27512665 28055513 28465004 29396217 29996062 30669872 31233376
4095C1233376N45186N39056P27783Q19828Q65452Q30001P05902P32855Q23510
$$ 31233376 31778562 32317618 33045401 33865229 34730681 35560682 36266584 36999439 37822949
4086C7822949J121489P51681O40419P46908P28927J056196Q93533N11626L69872
$$ 37822949 38944438 39696119 40336538 41083446 41812373 42868569 43762102 44273728 44643600
4077D4643600M42992N02806M36962N27380N94625L54655K52558N12690K82113
$$ 44643600 45086592 45589398 46026360 46553740 47148365 47503020 47755578 48268268 48550381
4068D8550381O78385N73840P65808O31264N51277J012618J042677J159168J653067
$$ 48550381 49228766 49802606 50568414 51199678 51750955 52763573 53806250 54965418 56618485
4059E6618485K419255K159184J649932J080189O71679L38555k58282K78354M22043
$$ 56618485 59037740 61196924 62846856 63927045 64598724 64937279 64678997 64957351 65379394
4050F5379394M54541M89932L71121P21420O70399L89245N78042J18028L75527
$$ 65379394 65833935 66323867 66694988 67416408 68086807 68476052 69054094 69172122 69547649
4041F9547649K11457L49165M84793N66731L25187N79442J76452M97260L89190
$$ 69547649 69759106 70108271 70593064 71159795 71484982 72064424 72240876 72738136 73127326
4032G3127326N96112L84684K04571L09588J20207M53347N63380o9235m68101k17469
$$ 73127326 73723438 74108122 74312693 74622281 74742488 75195835 75759215 75689980 75221879 75004410
4022G5004410R7061o3628m14719k12109k39902m5444j4651m38586k69125j83777
$$ 75004410 75101471 75037843 74623124 74411015 74171113 74125669 74111018 73672432 73403307 73219530
4012G3219530o5843k99893m59815k91037l17915m38195m50564k17675n05973p03817
$$ 73219530 73153687 72853794 72393979 72102942 71785027 71346832 70896268 70678593 70172620 69468803
4002F9468803r52990p07725j081050r36765j108299j141136j009441r71107q96228
$$ 69468803 68515813 67808088 66727038 65790273 64681974 63540838 62531397 61560290 60664062
3993F0664062p03057j015778n01379m33721m81020n35801n97744m91549o10971
$$ 60664062 59961005 58945227 58443848 58010127 57529107 56993306 56395562 55904013 55293042
3984E5293042l04654o36726n40886p23529l06275m75537l73513n42757o23939
$$ 55293042 54988388 54351662 53810776 53087247 52780972 52305435 51931922 51389165 50765226
3975E0765226l55628m97062o47921n31686p97293j150974q64986j055842o80899
$$ 50765226 50409598 49912536 49264615 48732929 47935636 46784662 45919676 44863834 44182935
3966D4182935p76779o36605p95767L3461k95345j06892N26334J382143J869790
$$ 44182935 43406156 42769551 41973784 42007245 41711900 41605008 42131342 43513485 45383275
3957D5383275J456374O50384q24183j693286j468851j602441j344241j144842
$$ 45383275 46839649 47490033 46665850 44972564 43503713 41901272 40557031 39412189
3949C9412189m96010n64709n49135l67765K0342l9847k92629j70472n1995k53257
$$ 39412189 38916179 38351470 37802335 37434570 37454912 37415065 37122436 36951964 36899969 36646712
3939C6646712j85262j98477l74652m02417m42450l05851o45199k52638L04622
$$ 36646712 36461450 36262973 35888321 35485904 35043454 34737603 34092404 33839766 34144388
3930C4144388J62772K44300P82076J098311J187833J67264r30668j791884k338730
$$ 34144388 34307160 34551460 35333536 36431847 37619680 37786944 36856276 35064392 32725662
3921C2725662k310818k042429j643798j189080r02706q69478j114668n89853l28717
$$ 32725662 30414844 28372415 26728617 25539537 24636831 23767353 22652685 22062832 21734115
3912B1734115l56424m32070k28737l43074j74045m2337r7932j87017J4205k11039
$$ 21734115 21377691 20945621 20716884 20373810 20199765 20157428 20059496 19872479 19886684 19675645
3902A9675645P1672j11666J44653J20450p9560P9627M643K52433L48545Q4814
$$ 19675645 19747317 19635651 19780304 19900754 19821194 19900821 19905464 20157897 20506442 20591256
3892B0591256l15110k3665m9433K9844K73623j45989j22575J06265j15131j57986
$$ 20591256 20276146 20252481 20203048 20232892 20506515 20360526 20237951 20344216 20229085 20071099
3882B0071099M9897r8264K10780O4093J06846J74507r6427o9367P2674j4122J78537
$$ 20071099 20120996 20022732 20233512 20297605 20404451 20578958 20482531 20413164 20485838 20471716 20650253
3871B0650253K37148p8720K08891M40484J90244J26188L99077Q01058P02269N60160
$$ 20650253 20887401 20808681 21017572 21458056 21648300 21774488 22173565 22974623 23676892 24237052
3861B4237052M76689O84649Q68844Q08241J258767Q84366N12732Q03712P97081
$$ 24237052 24713741 25398390 26267234 27075475 28334242 29218608 29731340 30535052 31332133
3852C1332133L80160M67499M59521L51974L47781L82140L57998L29088L35898
$$ 31332133 31712293 32179792 32639313 32991287 33339068 33721208 34079206 34408294 34744192
3843C4744192K42467N74522N97678O90973L37517M04446N04137l5096J48785J45266
$$ 34744192 34986659 35561181 36158859 36849832 37187349 37591795 38095932 38060836 38209621 38354887
3833C8354887j2149l99752k43953k23187n51971n21324l31727k65404n37461m31814
$$ 38354887 38342738 37942986 37699033 37475846 36923875 36402551 36070824 35805420 35267959 34836145
3823C4836145l59898p20085n02524k83683k53708l29484k85699l39452p50889
$$ 34836145 34476247 33756162 33253638 32969955 32716247 32386763 32101064 31761612 31010723
3814C1010723l12208J01139k5687r0137l939J56787j32457n252M5783M9011o923
$$ 31010723 30698515 30799654 30773967 30683830 30679891 30836678 30704221 30698969 30744752 30793763 30786840
3803C0786840J01364j91022j30316p9881j90243j3902K60793K03945K11646O09994
$$ 30786840 30888204 30697182 30566866 30486985 30296742 30282840 30543633 30747578 30959224 31569218
3793C1569218K47517O86247N96916L04096J27359K73901K79566M02113r6236j12958
$$ 31569218 31816735 32502982 33099898 33403994 33531353 33805254 34084820 34486933 34390697 34277739
3783C4277739j46354m53620o19576n65408m26319o95356m08082q15244o14191
$$ 34277739 34131385 33677765 33058189 32492781 32066462 31371106 30963024 30147780 29533589
3774B9533589n08211m11589o73209p26676n14627p23423p94835p20628p11395
$$ 29533589 29025378 28613789 27940580 27213904 26699277 25975854 25181019 24460391 23748996
3765B3748996n76398p76956o22998n80676q68460m69580m03355n70832k95247
$$ 23748996 23172598 22395642 21772644 21191968 20323508 19853928 19450573 18879741 18584494
3756A8584494m11443m97666l71762m60066l06830k72640m71245k82270k57688
$$ 18584494 18173051 17675385 17303623 16843557 16536727 16264087 15792842 15510572 15252884
3747A5252884j46949j19332j11941k53589m93584k2769k39663J28278M09671m72586
$$ 15252884 15105935 14986603 14874662 14621073 14127489 14104720 13865057 13993335 14403006 13930420
3737A3930420k17208n6697j03516P3959k20403j93075J90820L34581j9646k84813
$$ 13930420 13713212 13656515 13552999 13626958 13406555 13213480 13404300 13738881 13719235 13434422
3727A3434422l0749K69297J36983J7969O1006Q0081J11177k0094J53325j33686
$$ 13434422 13403673 13672970 13809953 13827922 13888928 13969009 14080186 14060092 14213417 14079731
3717A4079731O4936K98970k06197Q1820k10565l29060p9225j21537j5369L01887
$$ 14079731 14144667 14443637 14237440 14319260 14108695 13779635 13700410 13578873 13563504 13865391
3707A3865391k53050L9775J05810q6177J85125L11891J08410j29699J26209j3835
$$ 13865391 13612341 13652116 13757926 13671749 13856874 14168765 14277175 14147476 14273685 14259850
3697A4259850L21032n6180J01359j28887j7523j14954K02562N2394l2433J84801
$$ 14259850 14580882 14524702 14626061 14497174 14479651 14364697 14567259 14619653 14587220 14772021
3687A4772021j19939J70171L42359J74938Q8052K00867J51303K65120L13446L22482
$$ 14772021 14652082 14822253 15164612 15339550 15427602 15628469 15779772 16044892 16358338 16680820
3677A6680820J7729K34049J85529n5571j19117k19072p7046L3007k69960n0593
$$ 16680820 16698549 16932598 17118127 17062556 16943439 16724367 16647321 16680328 16410368 16359775
3667A6359775j15403j56234o7056O8784l3956k20710K13136Q7305m6885j75233
$$ 16359775 16244372 16088138 16021082 16089866 16055910 15835200 16048336 16135641 16088756 15913523
3657A5913523N4655m1920n0972L27383k32352J14983J77210j9244m14763k64963
$$ 15913523 15968178 15926258 15875286 16202669 15970317 16085300 16262510 16243266 15828503 15563540
3647A5563540r8279q0534j40366m710j24263k515J70000l45196R875Q2069J12708
$$ 15563540 15465261 15384727 15244361 15239651 15115388 15112873 15282873 14937677 14947552 15029621 15142329
3636A5142329k18678j70344n2254n0229K21141J27674N0671J28726k55278O7154
$$ 15142329 14923651 14753307 14701053 14650824 14871965 14999639 15050310 15179036 14923758 14990912
3626A4990912j23165j08147M12263o5630k2458J38481K98593r9935m8210l39L6038
$$ 14990912 14867747 14759600 15171863 15106233 15083775 15222256 15520849 15420914 15372704 15372365 15408403
3615A5408403J79872N0131j10604j10326m7387J9132n4974P5016O132K1106j6190
$$ 15408403 15588275 15638406 15527802 15417476 15370089 15389221 15334247 15409263 15415395 15436501 15420311
3604A5420311n1188K85458j59554j25875J86632m05791K3446J24199k271k10210
$$ 15420311 15369123 15654581 15495027 15369152 15555784 15149993 15173439 15297638 15295367 15085157
3594A5085157k99996k16234j44854m6017k05452K27184k50843l34070q3760J58975
$$ 15085157 14785161 14568927 14424073 14378056 14172604 14399788 14148945 13814875 13731115 13890090
3584A3890090j17487o4020o4930p1111O981n7834K13727K02550n4786k71091j83545
$$ 13890090 13772603 13708583 13643653 13572542 13579523 13521689 13735416 13937966 13883180 13612089 13428544
3573A3428544J35814K14460K67088Q86j66673j22430k9475J34000j14326L94741
$$ 13428544 13564358 13778818 14045906 14046792 13880119 13757689 13728214 13862214 13747888 14142629
3563A4142629J18296L5000o410p7835j61408J05115Q0906j7267Q1618Q2822J26643
$$ 14142629 14260925 14295925 14289515 14211680 14050272 14155387 14236293 14219026 14300644 14383466 14510109
3552A4510109n3436K31427K49126k24677j35J39343n1427q151K4115K7630l10395
$$ 14510109 14456673 14688100 14937226 14712549 14712414 14851757 14800330 14792179 14816294 14843924 14533529
3541A4533529O6811L11201K12808j2670K92066j28710J55128M23259K11848L37781
$$ 14533529 14600340 14911541 15124349 15111679 15403745 15275035 15430163 15853422 16065270 16403051
3531A6403051K69133L14257L50013J37181J15700L66988M47616J92280M44594
$$ 16403051 16672184 16986441 17336454 17473635 17589335 17956323 18403939 18596219 19040813
3522A9040813L79481N84469M48758N92386K17579N21044M67801O10054R24322
$$ 19040813 19420294 20004763 20453521 21045907 21263486 21784530 22252331 22862385 23786707
3513B3786707L00465O43799O13918P48212P17627Q80056P97533R88409J288193
$$ 23786707 24087172 24730971 25344889 26093101 26810728 27690784 28488317 29476726 30764919
3504C0764919J514528J540627J320463J749311K091016K437502K300024K778196
$$ 30764919 32279447 33820074 35140537 36889848 38980864 41418366 43718390 46496586
3496D6496586L104544L895977M327662M774433N199159O116100O701609O647043
$$ 46496586 49601130 53497107 57824769 62599202 67798361 73914461 80616070 87263113
3488H7263113O525570M827461L796642K315468O53463k5269n70904n79520M92367
$$ 87263113 93788683 98616144 102412786 104728254 105381717 105356448 104785544 104206024 104698391
3479A04698391J486931K543629L211879M144923M354553M524480L766411K379905
$$ 104698391 106185322 108728951 111940830 116085753 120440306 124964786 128731197 131111102
3471A31111102O19836j624158l418918n168869o173740o723103o513055o112086
$$ 131111102 131730938 130106780 126687862 121518993 115345253 108622150 102109095 95997009
3463I5997009n269383l961443l817772l183822k096063j628198j320265q37999
$$ 95997009 90727626 86766183 82948411 79764589 77668526 76040328 74720063 73882064
3455G3882064p31098l32009k67956p05065j187338j734465k358746j939604k060086
$$ 73882064 73150966 72818957 72551001 71845936 70658598 68924133 66565387 64625783 62565697
3446F2565697j705877j009208o61588k61024L68718L36873J181139J759158J454683
$$ 62565697 60859820 59850612 59189024 58928000 59296718 59633591 60814730 62573888 64028571
3437F4028571K256985K636991L096046L545989M256421M088896L512578L652603
$$ 64028571 66285556 68922547 72018593 75564582 79821003 83909899 87422477 91075080
3429I1075080L688450K926955J544951P70761k27453j021784j929873k875699
$$ 91075080 94763530 97690485 99235436 100006197 99778744 98756960 96827087 93951388
3421I3951388l187370l542847l487399l695346l538255l209935l046373l135591
$$ 93951388 90764018 87221171 83733772 80038426 76500171 73290236 70243863 67108272
3413F7108272k524436j674699j375910j338217j498523j443685p15502j218361
$$ 67108272 64583836 62909137 61533227 60195010 58696487 57252802 56537300 55318939
3405E5318939j474093j011596j108395j016166q96350r22196o23092n11326o62735
$$ 55318939 53844846 52833250 51724855 50708689 49812339 48890143 48267051 47755725 47092990
3396D7092990n08012m91114n28318m03372n8474l26388l68879O6853m4616L4471
$$ 47092990 46584978 46093864 45565546 45162174 45103700 44777312 44408433 44475286 44430670 44465141
3386D4465141n9620J81843Q19334N25792L82294O30213O53534P57189K19486o4309
$$ 44465141 44405521 44587364 45406698 45932490 46314784 46944997 47598531 48355720 48575206 48510897
3376D8510897J33818J12656N8535j85127m37292o80448j128634r30527j015381
$$ 48510897 48644715 48757371 48815906 48630779 48193487 47513039 46384405 45453878 44438497
3367D4438497q93282l77801l69348N4729J04571o7695K11524L43590L22386K51442
$$ 44438497 43545215 43167414 42798066 42852795 42957366 42889671 43101195 43444785 43767171 44018613
3357D4018613K47246M00462P68416N40685K20905N03017N23717N38227O38751
$$ 44018613 44265859 44666321 45434737 45975422 46196327 46699344 47223061 47761288 48400039
3348D8400039N38544M36404M42286M57965Q12199R82652J001252R13450J171685
$$ 48400039 48938583 49374987 49817273 50275238 51087437 52070089 53071341 53984791 55156476
3339E5156476J593146K056127K555805K945048K999736L775037M642218M573183
$$ 55156476 56749622 58805749 61361554 64306602 67306338 71081375 75723593 80296776
3331H0296776M569234M380055L414564K406436J276889l82295j963172l237541
$$ 80296776 84866010 89246065 92660629 95067065 96343954 95961659 93998487 90760946
3323I0760946m268701m678612m882942m767812m170269l436929l389489l140394
$$ 90760946 86492245 81813633 76930691 72162879 67992610 64555681 61166192 58025798
3315E8025798k438450j869109j492071j220657p36658p86794m079M5523O1594
$$ 58025798 55587348 53718239 52226168 51005511 50268853 49482059 49477980 49523503 49585097
3306D9585097N13031K25262o72118j124710j112235o09609M2680J039906J436350
$$ 49585097 50098128 50323390 49651272 48526562 47414327 46804718 46847398 47887304 49323654
3297D9323654P68706k07191j337812k037337k293139k168130j786311j439065
$$ 49323654 50092360 49885169 48547357 46510020 44216881 42048751 40262440 38823375
3289C8823375r77154n00009j85672k37196J16624L49463J84092N88144N01128
$$ 38823375 37846221 37346212 37160540 36923344 37039968 37389431 37573523 38161667 38662795
3280C8662795Q05953J107499J224119J693462J658601K033978K385279K907006
$$ 38662795 39468748 40576247 41800366 43493828 45152429 47186407 49571686 52478692
3272E2478692L665439M659225N084227M262993K994925K226562J717857J734629
$$ 52478692 56144131 60803356 65887583 70150576 73145501 75372063 77089920 78824549
3264G8824549J445054J370994J443889J158809K26311k72392l63318n74661r60931
$$ 78824549 80269603 81640597 83084486 84243295 84469606 84197214 83833896 83259235 82298304
3255H2298304j690877r47909p94798m01108K16812M05221O57521J388220J972967
$$ 82298304 80607427 79659518 78864720 78463612 78680424 79085645 79743166 81131386 83104353
3246H3104353J931927J375871J004838j42185j552235k675436l639062m493704
$$ 83104353 85036280 86412151 87416989 87274804 85722569 83047133 79408071 74914367
3238G4914367m892566m729774l966279l883819l552671l066392k794300k231934
$$ 74914367 70021801 65292027 61325748 57441929 53889258 50822866 48028566 45796632
3230D5796632k231213k050169j449197r72589k58845J76140o1766n87824o27932
$$ 45796632 43565419 41515250 40066053 39093464 38834619 39010759 38948993 38361169 37733237
3221C7733237r93788j186669j056378q56411l24703l83256p67289r55528j464841
$$ 37733237 36739449 35552780 34496402 33639991 33315288 32932032 32164743 31209215 29744374
3212B9744374j577752j558341j434530j499327j466426j252372q85958o60629
$$ 29744374 28166622 26608281 25173751 23674424 22207998 20955626 20069668 19409039
3204A9409039n13648o07464p01934n64856o20963m37729l30325k21160k67430
$$ 19409039 18895391 18287927 17585993 17021137 16400174 15962445 15632120 15410960 15143530
3195A5143530l11677n85826k46616k80869l66604k8343l20865l79782M2551J20881
$$ 15143530 14831853 14246027 13999411 13718542 13351938 13323595 13002730 12622948 12665499 12786380
3185A2786380k71341j62990n0241Q3500k03419m65935K03635k95950o3055p8987
$$ 12786380 12515039 12352049 12301808 12385308 12181889 11715954 11919589 11623639 11560584 11481597
3175A1481597M54676r9736j11373M4950N9335K05279l5319J5036K21578K22944
$$ 11481597 11936273 11836537 11725164 11770114 11829449 12034728 11999409 12014445 12236023 12458967
3165A2458967j13581J2919K23220J43209M27982K46957k66689K84918l5523O8731
$$ 12458967 12345386 12358305 12581525 12724734 13152716 13399673 13132984 13417902 13382379 13451110
3155A3451110j42766l5299l28542J50468l3276k2860p2724j66954L98468J36110
$$ 13451110 13308344 13273045 12944503 13094971 13061695 13038835 12966111 12799157 13197625 13333735
3145A3333735J19810j22733K23928N6220k64002k64741K06081M26862N65319L88543
$$ 13333735 13453545 13330812 13554740 13610960 13346958 13082217 13288298 13715160 14280479 14669022
3135A4669022P20880Q12124J129419R93680O74759k44728o42937q23314j063287
$$ 14669022 15389902 16202026 17331445 18325125 18999884 18755156 18112219 17288905 16225618
3126A6225618j100820o45551n21738q35662o00634o67270m19710l18678k88464
$$ 16225618 15124798 14479247 13957509 13121847 12521213 11853943 11434233 11115555 10827091
3117A0827091l59355J7087j25519p4855j58219m32807j93997K4882p3507r949
$$ 10827091 10467736 10484823 10359304 10284449 10126230 9693423 9499426 9524308 9450801 9440852
3107I440852J50020Q5689q7927K35963L04022K22043J82655M8003k6679l075j98511
$$ 9440852 9590872 9676561 9588634 9824597 10128619 10350662 10533317 10581320 10554641 10551566 10353055
3096A0353055k16166m92769k32076n5699m62021l33470j13058k73721k86966k10788
$$ 10353055 10136889 9644120 9412044 9356345 8894324 8560854 8447796 8174075 7887109 7676321
3086G676321j81800j39953j43559r3399j58174j64996J5037o9333k44304k83447
$$ 7676321 7494521 7354568 7211009 7117610 6959436 6794440 6809477 6740144 6495840 6212393
3076F212393l14575J582J92764J15600j2332r6032m9769Q8682L02445k72349K34762
$$ 6212393 5897818 5899400 6092164 6207764 6195432 6099400 6049631 6138313 6440758 6168409 6403171
3065F403171J21175L89543p6986k86321p7722l23951k87981q6463r7296m35203
$$ 6403171 6524346 6913889 6836903 6550582 6472860 6148909 5860928 5774465 5677169 5241966
3055E241966k3271J88k02376k2635k701j6634k5513j11355j47561k07389J87461
$$ 5241966 5218695 5218883 5016507 4993872 4991171 4974537 4949024 4837669 4690108 4482719 4670180
3044D670180n4204j07424j29021P6484J22732k01387j35168J54344p9701p5317
$$ 4670180 4615976 4508552 4379531 4456015 4578747 4377360 4242192 4396536 4316835 4241518
3034D241518l07857L5501K1347j73732q9357K47078N1364k16860j38526p1465
$$ 4241518 3933661 3969162 3990509 3816777 3727420 3974498 4025862 3809002 3670476 3599011
3024C599011L2613m2446r9185J19513r2720j46838K4493Q91K16955j8768L453
$$ 3599011 3631624 3589178 3489993 3609506 3516786 3369948 3394441 3395332 3612287 3593519 3596972
3013C596972l5433j8522J85981J03036m3967K47780J05505R8897P6317m5914K2011
$$ 3596972 3561539 3543017 3728998 3832034 3788067 4035847 4141352 4240249 4316566 4270652 4292663
3002D292663J97843j52172j39562L828k64020k85878k7388j36694j63710M0819
$$ 4292663 4490506 4338334 4198772 4202600 3938580 3652702 3625314 3488620 3324910 3365729
2992C365729k33954J55945M9518k08136j64644J00498L5729L15749m659j85811
$$ 3365729 3131775 3287720 3337238 3129102 2964458 3064956 3100685 3416434 3411775 3225964
2982C225964L9758R4018K57514r4964j2599K87449j22300j43373j55689N7572
$$ 3225964 3265722 3359740 3617254 3522290 3509691 3797140 3674840 3531467 3375778 3433350
2972C433350k15718r6478L0687j11856k04806K8207J15270k12496n8730l7770
$$ 3433350 3217632 3121154 3151841 3039985 2835179 2863386 2978656 2766160 2707430 2669660
2962B669660Q3789m1318l93190j43501K5580L41660R1313k69298j81628j12422
$$ 2669660 2753449 2712131 2318941 2175440 2201020 2542680 2633993 2364695 2183067 2070645
2952B070645J53282j30766r4645J58339j29698p17M0048L174k47549n9460j618
$$ 2070645 2223927 2093161 1998516 2156855 2027157 2026440 2066488 2069662 1822113 1762653 1761035
2941A761035K1355j45197R1554m4319j45039J02986J2714o6360J03269M5850k89625
$$ 1761035 1782390 1637193 1728747 1684428 1539389 1642375 1655089 1588729 1691998 1737848 1448223
2930A448223J97960j38835m3594J4933J67668q3348N780j30689M776M1167L02464
$$ 1448223 1646183 1507348 1463754 1478687 1646355 1563007 1568787 1438098 1442874 1484041 1786505
2919A786505J84911n4416j27315j77074k17258r0442o2908K0790n3066J40193
$$ 1786505 1971416 1917000 1789685 1612611 1395353 1304911 1242003 1262793 1209727 1349920
2909A349920l28027J15715j94365j79765M0271L32373M7073J09465m9836r8541
$$ 1349920 1021893 1137608 943243 763478 803749 1136122 1183195 1292660 1242824 1144283
2899A144283K07j14524K4013K06366j10791J1182P0927j49026m9783j02000J00098
$$ 1144283 1144490 1029966 1053979 1260345 1149554 1160736 1231663 1082637 1032854 930854 1030952
2888A030952j3201j30281J82397L85507p7798J18602m16743m7423j48377J38617
$$ 1030952 1017751 887470 1069867 1455374 1377576 1496178 1079435 1032012 883635 1022252
2878A022252K55268r3572j6508p4593P9490j31470q0372J14823J92554j44196
$$ 1022252 1277520 1183948 1167440 1092847 1172337 1040867 960495 1075318 1267872 1123676
2868A123676L63048j19118j42847j95718k49887M00650L2618j59717l31245L53147
$$ 1123676 1486724 1367606 1224759 1029041 779154 1179804 1212422 1052705 721460 1074607
2858A074607j09981o4200k0231J39053N614l1317J67238K3429j02594l2124L1517
$$ 1074607 964626 900426 880195 1019248 1024862 993545 1160783 1184212 1081618 1049494 1081011
2847A081011J17627p1511O0474j69930O627k1235K36473j0811l90405M74205k30391
$$ 1081011 1198638 1127127 1187601 1017671 1024298 1003063 1239536 1228725 838320 1312525 1082134
2836A082134j19935L68435j86897N3167j00098j8698j35340J34210J3119P3501
$$ 1082134 962199 1330634 1143737 1196904 1096806 1078108 942768 1076978 1090097 1163598
2826A163598L1738M5207k01535O5134K2578k10030O7373J49178p1384k27881j37758
$$ 1163598 1195336 1240543 1039008 1104142 1126720 916690 984063 1133241 1061857 833976 696218
2815F96218K86571J55898k44667Q2311J00034j06623n7878k7297J05091k86827
$$ 696218 982789 1138687 894020 976331 1076365 969742 911864 884567 989658 702831
2805G02831L7675O1237j61317l5676L58207K77888j98479j38783k38887o71O9089
$$ 702831 740506 801743 640426 604750 962957 1240845 1042366 903583 664696 664025 733114
2794G33114J02223k84306P8114L59487n3710m0720N1530K3763P8676P0357r9813
$$ 733114 835337 551031 629145 988632 934922 894202 945732 969495 1048171 1118528 1018715
2783A018715k53438J87290k43596n3776L85399n091p0510Q3562p5530Q7107k82291
$$ 1018715 765277 952567 708971 655195 1040594 1035503 964993 1048555 973025 1060132 777841
2772G77841R3650J46242m4285l02916J65750k43975J5945J74036J55543J27116
$$ 777841 871491 1017733 973448 670532 836282 592307 608252 782288 937831 1064947
2762A064947p4890k25925J91407K95230l32848J18140j19818L9478j16547j2041
$$ 1064947 990057 764132 955539 1250769 917921 1036061 916243 955721 839174 827133
2752H27133K19792k02277j49237O8324J44502j49120J00916J83816k18095K2403
$$ 827133 1046925 844648 695411 763735 908237 759117 860033 1043849 825754 848157
2742H48157R9434K6731j42283j17624J2127q8289K3937O0691K0411J26318j8178
$$ 848157 947591 974322 832039 714415 726542 638253 662190 722881 743292 869610 851432
2731H51432j68489l9450J04754J20366J42473j41115O4411j71581k13579K85991
$$ 851432 682943 643493 748247 868613 1011086 869971 934382 762801 549222 835213
2721H35213O4623L4142k97393J2577M3316O7734K1697j81864j45788K52561m7517
$$ 835213 899836 933978 636585 649162 692478 760212 781909 600045 454257 706818 659301
2710F59301k01660M7079J16513j79469l0402k4198J18247J72941J36993K63002
$$ 659301 457641 504720 621233 441764 411362 387164 505411 678352 815345 1078347
2700A078347J27315k46879j21445k19402k60620J1750J86891K38636p641j30484
$$ 1078347 1205662 958783 837338 617936 357316 369066 555957 794593 786952 656468
2690F56468L8954j00081L3515P9983l34040j4672L9748L72659j32130j75854m6045
$$ 656468 695422 595341 628856 708839 374799 360127 399875 772534 640404 464550 418505
2679D18505K01936J84335K4056k545j24712O6729j2698O308k44413j9837R492
$$ 418505 620441 804776 828832 826287 701575 768304 755606 761914 517501 497664 507156
2668E07156k50942R7882r4774K03844L14880J91444j60486K0629j36064L64582
$$ 507156 256214 354096 259322 463166 778046 969490 809004 829633 693569 1058151
2658A058151j89327p8711j60117q7379J00852Q1057j56543p6502j5924O4758j71971
$$ 1058151 868824 790113 629996 542617 643469 724526 567983 491481 475557 540315 368344
2647C68344J3294L67823l1986o9019j21478K036J39903K96L06886j41298j5647
$$ 368344 381638 749461 717475 648456 526978 529014 668917 669213 976099 834801 819154
2636H19154m0781J39003K21743j4339p8057k11206K22688q0016m0338o6907J11948
$$ 819154 778373 917376 1139119 1124780 1046723 835517 1058205 978189 937851 870944 982892
2625I82892m9245M2258l6554Q0779n6914k22140l5327Q6940j39313P2178j28824
$$ 982892 933647 975905 939351 1020130 963216 741076 705749 792689 653376 725554 596730
2614E96730J08491J31601J06179N7658k22298n5642N6591j11819j2547k489O8928
$$ 596730 705221 836822 943001 1000659 778361 722719 779310 667491 654944 652455 721383
2603G21383l8611K37682J28065J04783K07507M3680M54559J90437L06870M67170
$$ 721383 682772 920454 1048519 1153302 1360809 1404489 1859048 2049485 2356355 2823525
2593B823525N3603K52j96924k53290m05089k34045l23018l6921j61448p5959k01802
$$ 2823525 2877128 2877380 2680456 2427166 2022077 1788032 1465014 1428093 1266645 1190686 988884
2582I88884M0823J19938l5657J98446k42519l05952J64338l3532j90991J38467
$$ 988884 1029707 1149645 1113988 1312434 1069915 763963 928301 894769 703778 842245
2572H42245M8240l2575M5402j66040J10403L11556p3150o0809K3473j4728k36000
$$ 842245 890485 857910 903312 737272 847675 1159231 1086081 1025272 1048745 1034017 798017
2561G98017j94703j06617M39952K21464j22727j93256J97879M1249l5544j00411
$$ 798017 603314 496697 936649 1158113 1035386 842130 1040009 1081258 1045714 945303
2551I45303J0771L8787l8524l30613q3616L21490j62664L6234m0738j415J03552
$$ 945303 956074 994861 956337 625724 542108 863598 700934 737168 696430 695015 798567
2540G98567Q3598m33851J77081M3386N4967n5213l58382M07137J7006r8355p5451
$$ 798567 882165 448314 625395 668781 723748 668535 310153 717290 734296 635941 560490
2529E60490K03056j39119m4207o1736k2978L10869R4254N513r15p7915P7671O996
$$ 560490 763546 624427 580220 518484 495506 806375 900629 906142 905227 827312 904983 911979
2517I11979j18177l36712J23632K39749k32142j09787q6148j58830j09370J09738
$$ 911979 793802 457090 580722 820471 588329 478542 392394 233564 124194 233932
2507B33932J51243j47198J05912K55265l2988Q0489P2718j48140L2462O1505j23209
$$ 233932 385175 237977 343889 599154 566166 646655 719373 571233 603695 665200 541991
2496E41991q7116J18802J99325P9711k04605j64778m2227M2620M1834r7239L8879
$$ 541991 454875 573677 773002 852713 648108 483330 441103 483723 525557 428318 467197
2485D67197l03488K48949M31364p488M0776J57175J85679k76936j8945O0597j9727
$$ 467197 163709 412658 844022 836534 877310 1034485 1220164 943228 924283 984880 965153
2474I65153K54839n3832j14625j15791O7079l04028n1379p334K52707K38730J2782
$$ 965153 1219992 1166160 1051535 935744 1002823 698795 647416 640082 892789 1131519 1144301
2463A144301J84R2688l1795K13420K53369n713j63892m5836j03150M1845l6743
$$ 1144301 1144485 1237173 1205378 1418798 1672167 1666454 1502562 1456726 1353576 1395421 1358678
2452A358678l741q5843J17807L15160k67508j47888o6285N1794K45986M00675
$$ 1358678 1354937 1269094 1386901 1702061 1434553 1286665 1220380 1272174 1518160 1918835
2442A918835n3003p3234Q0464L61667J82011j86539l70614M5584K07831k29353
$$ 1918835 1865832 1792598 1873062 2234729 2416740 2230201 1859587 1905171 2113002 1883649
2432A883649j07915M6426K6569j10375R6256J82805J41628m1933m26503j55888
$$ 1883649 1775734 1822160 1848729 1738354 1834610 2017415 2159043 2117110 1690607 1534719
2422A534719L35199J36707j51088J62089J55873R9350k23997k8441k34637K3694
$$ 1534719 1869918 2006625 1855537 2017626 2173499 2272849 2048852 2020411 1785774 1809468
2412A809468N13653K6292J63050J69128R1598K17476j64356K22682J69249K5501
$$ 1809468 2323121 2349413 2512463 2681591 2773189 2990665 2826309 3048991 3218240 3243741
2402C243741j94998J61163N105Q261j54711k01508J70184J45844K03478J50103
$$ 3243741 3048743 3209906 3215011 3223272 3068561 2867053 3037237 3183081 3386559 3536662
2392C536662R6737m6234J97568n8593J92030K19758j06813J80196K89565j30373
$$ 3536662 3633399 3587165 3784733 3726140 3918170 4137928 4031115 4211311 4500876 4370503
2382D370503j70675R7679O7566M37571M2237J12395K60301K22889l8996j02993
$$ 4370503 4199828 4297507 4365073 4802644 4844881 4957276 5217577 5440466 5401470 5298477
2372E298477L04485L86263k27330L53473M14556M07668M82115N01130O72927K44590
$$ 5298477 5602962 5989225 5761895 6115368 6529924 6937592 7419707 7920837 8593764 8838354
2362H838354L98198J77521p0967J42179M75886L87921N37498Q69683J218187J210292
$$ 8838354 9236552 9414073 9343106 9485285 9961171 10349092 10886590 11756273 12974460 14184752
2352A4184752Q98409J164189J268406J206242J366803J463723J420506K792599
$$ 14184752 15083161 16247350 17515756 18721998 20088801 21552524 22973030 25765629
2344B5765629M228513M474307M119498L005162K118749J895873K369992K980695
$$ 25765629 29994142 34468449 38587947 41593109 43711858 45607731 47977723 50958418
2336E0958418N262795P468106J0575417J4996495K0408533K9882120N1818787
$$ 50958418 56221213 63689319 74264736 89261231 109669764 139551884 191370671
2329A91370671Q3059605R4697466O0075914O510471l9192696n8645832o4641189
$$ 191370671 274430276 369127742 429203656 435714127 396521431 337875599 273234410
2322B73234410o1375820m7912202l6556557k5355101j8076280j3204712j0095044
$$ 273234410 211858590 163946388 127389831 102034730 83958450 70753738 60658694
2315F0658694o874740m898456l100739k952237k998707l734335l779672l347729
$$ 60658694 53783954 48885498 45784759 42832522 39833815 36099480 32319808 28972079
2307B8972079k800095k765657j778861j805556j360689j315773r63023l80231
$$ 28972079 26171984 23406327 21627466 19821910 18461221 17145448 16182425 15802194
2299A5802194k72694l94421o36568n82959l50307o64216p62366o02173o45254
$$ 15802194 15529500 15135079 14498511 13915552 13565245 12901029 12138663 11536490 10891236
2290A0891236m35387k26655k07223k53983n1708p3161m0192j21868o6791k87690
$$ 10891236 10455849 10229194 10021971 9767988 9716280 9643119 9602927 9481059 9414268 9126578
2280I126578j42650m52998l31293n07562m10227j11402l76655l17408K14992j28415
$$ 9126578 8983928 8530930 8199637 7692075 7281848 7170446 6793791 6476383 6691375 6562960
2270F562960l97688j38017r6516k35164L84l36328k60333J34438k02551j98463
$$ 6562960 6165272 6027255 5930739 5695575 5695959 5359631 5099298 5233736 5031185 4832722
2260D832722l95224P0921J24449K96899k9664j90649k49070j27036m37725j31171
$$ 4832722 4437498 4508419 4632868 4929767 4900103 4709454 4460384 4333348 3895623 3764452
2250C764452k74049k54158N1409j26017l22939J51208L31212j31801j85183K92147
$$ 3764452 3490403 3236245 3287654 3161637 2838698 2989906 3321118 3189317 3004134 3296281
2240C296281K10927k06949k6778K50629k58980k97323R6348l50757m8338J00099
$$ 3296281 3507208 3300259 3273481 3524110 3265130 2967807 3064155 2713398 2665060 2765159
2230B765159p2989j79148L3564k50200j3248R2104j03837M356r9158J27258j59565
$$ 2765159 2692170 2513022 2546586 2296386 2283138 2375242 2271405 2275761 2176603 2303861 2144296
2219B144296J47556K42775k76279j87739j31681L69q1428k03281N1834K79321
$$ 2144296 2291852 2534627 2258348 2070609 1938928 1939297 1857869 1654588 1706422 1985743
2209A985743L4051L6075r5865k5749P2949j64750J22791j7943j83843j36568j61427
$$ 1985743 2019794 2055869 1960004 1934255 2007204 1842454 1965245 1947302 1763459 1626891 1465464
2198A465464K72083K920J0497k61735L47406K25286k32480J79210K5074m5566
$$ 1465464 1737547 1740467 1750964 1489229 1836635 2061921 1829441 2008651 2033725 1988159
2188A988159J70885j66198m09698K42814L8449l22335K2233m6636j5429J2522
$$ 1988159 2159044 1992846 1583148 1825962 1864411 1542076 1564309 1517673 1502244 1514766
2178A514766j69972k65420k39588K93976K6691j90617L83457P4527J18814l1432
$$ 1514766 1344794 1079374 839786 1133762 1160453 969836 1353293 1427820 1546634 1515202
2168A515202J34960J11413k40510n5877J38712j0170r6412j23377n04058J98878
$$ 1515202 1650162 1761575 1521065 1465188 1603900 1593730 1497318 1373941 869883 1068761
2158A068761K48318O6358J84957j0878m16213j87149R1827L17595O0178l69472
$$ 1068761 1317079 1383437 1568394 1557516 1141303 954154 1045981 1363576 1423754 1054282
2148A054282J74588l42J37312M8101M430p4027j48206O8223l93425K9326M01175
$$ 1054282 1228870 1228528 1365840 1413941 1418371 1344344 1196138 1264361 870936 900262 1301437
2137A301437J50549j37509l35092l22597O0492J12575j75896k59792J75758M05941
$$ 1301437 1451986 1314477 979385 656788 717280 829855 653959 394167 569925 975866
2127I75866J56133R8883k15736L8804L2242l0902q7417k20805P9081j38893J15848
$$ 975866 1131999 1230882 1015146 1053950 1086192 1055290 967873 747068 826149 687256 803104
2116H03104L9627k24372J03838j67011J69876J857P521J44690k73630J43218J59978
$$ 803104 842731 618359 722197 555186 725062 726919 734440 879130 605500 748718 908696
2105I08696j5070K2330K06970j41985k70383J2904M1121m781r0504L5498J03825
$$ 908696 893626 915956 1122926 980941 710558 723462 764583 759802 669298 704796 808621
2094H08621j62312l8992K43102K13136k32557o30j12152k66190l2438P4794J80594
$$ 808621 646309 607317 850419 1063555 830998 830368 718216 452026 419588 494382 674976
2083F74976R4496k03634q6421o7441J61585j4747k3276J27208J56345R0837l94348
$$ 674976 769472 565838 479417 411976 573561 558814 535538 662746 819091 909928 515580
2072E15580J0414J32524j4785J21651j42619q6777K8243J99704J69326L4337O859
$$ 515580 525994 658518 643733 765384 622765 535988 564231 763935 933261 967598 974457
2061I74457O4975L97666O44219N58489N6838l71782l03291j05470j62581k54702
$$ 974457 1039432 1437098 2081317 2639806 2696644 2324862 2021571 1916101 1753520 1498818
2051A498818l12663j85498J2341J80258k36311J7210O2099j18183n08342J92936
$$ 1498818 1186155 1000657 1012998 1193256 956945 974155 1036254 918071 409729 602665
2041F02665J61919l17301k46989M94446R0648j96476M7147q1173L8287K541o7265
$$ 602665 764584 447283 200294 694740 785388 588912 636059 554886 593173 595714 528449
2030E28449m14753J14013J9053K56770j4912o8249k91174j05174K00839R1649
$$ 528449 113696 227709 246762 503532 488620 420371 129197 24023 224862 316511
2020C16511m525L304l3050j19980J90751n9432K38431j57460m3070K9394N8594
$$ 316511 311986 315290 282240 162260 353011 293579 532010 374550 331480 360874 419468
2009D19468Q4685m0607r8914k80790j4428J70321J33251j30150K54296L271l77232
$$ 419468 504153 463546 364632 83842 69414 239735 372986 242836 497132 500403 123171
1998A23171j65394L7848M00794N7468j00551m3551P438J19609l1771P757j10593
$$ 123171 -42223 -4375 396419 453887 353336 309785 317223 436832 405061 412818 302225
1987C02225M8814m3291J80698l5407M8049l7034N4214O8849j283J0269l99242
$$ 302225 351039 307748 488446 453039 501088 464054 518268 587117 585834 596103 196861
1976A96861K34024P2565M5130N190k3424m8002j19505j88456J52330J51872Q0551
$$ 196861 430885 503450 548580 553770 530346 482344 362839 174383 326713 478585 559136
1965E59136k5821N6932L1663j67818J3136p1219J2267J87520P8627j99421K14281
$$ 559136 533315 590247 621910 454092 467228 396009 408276 595796 674423 475002 689283
1954F89283j28919j09782p8861j03140J60046k4398p9120l6821j79764R0358j23021
$$ 689283 560364 450582 371721 268581 428627 404229 325109 288288 108524 198882 75861
1943G5861j966J25120K10064K05044j0961j7432j75874P8810q0404l73616q9931
$$ 75861 73895 199015 409079 614123 603162 585730 409856 488666 408262 34646 -55285
1932e5285L07684k9267J29317K81503N1426j07946k86802o2332o835O2172n6709
$$ -55285 252399 223132 352449 633952 685378 577432 290630 228298 221463 283635 226926
1921B26926k6053O4388p103r7444m4291j4843K48751O7608K2162j29428o1667
$$ 226926 200873 265261 258158 160714 116423 101580 350331 417939 440101 310673 249006
1910B49006N6312m1650R3426j57327J04274k52682j15316K36999J36239k45754
$$ 249006 305318 263668 357094 199767 304041 51359 -63957 173042 309281 63527
1900F3527r1316M98735N5043j46590J35317p3804J67180O9228O8440J4691k46902
$$ 63527 -27789 470946 525989 379399 514716 440912 608092 677320 745760 760451 513549
1889E13549j96677j2383Q2906j02227k67880J43256J38412m6997j26416j74697
$$ 513549 316872 304489 387395 285168 17288 160544 298956 251959 125543 -49154
1879d9154J13237O1494j8050J61417L3820j07614R6624q8758j7520J41272J09965
$$ -49154 64083 125577 107527 268944 302764 195150 291774 203016 185496 326768 436733
1868D36733O4861j81877j41682L19351K5330k14763j61998k922J35890J58832
$$ 436733 501594 319717 178035 497386 522716 307953 145955 143033 278923 437755
1858D37755j26280j06272P4011m9147k0910l4670J62224O3929k37342J69036Q7179
$$ 437755 311475 205203 279214 230067 209157 174487 336711 400640 163298 332334 419513
1847D19513J30974P555O404q743j79476p5470m3783L1145o6460k4469j39182J64576
$$ 419513 550487 558042 564446 555703 376227 300757 256974 288119 221659 197190 58008 222584
1835B22584n0866L0438K87761m5836J29316k9145j28459q4673n2373j61462J22413
$$ 222584 171718 202156 489917 444081 573397 544252 415793 331120 278747 117285 239698
1824B39698M4585o1823m3296q8401n0884o3904J42770r0997J30768J87881M9845
$$ 239698 284283 222460 179164 90763 39879 -24025 118745 27748 158516 346397 396242
1813C96242m14720P8798k3592J05504K07092k7548R2051o6208n7216L2576j24535
$$ 396242 -18478 60320 36728 142232 349324 321776 413827 347619 290403 322979 198444
1802A98444j68022J14468j05687j3455L26855J61402J54458j19738j95957N5533
$$ 198444 30422 144890 39203 25748 352603 514005 668463 548725 352768 408301
1792D08301k80048p4782L24540r5773p2497P8080k59313L34756K36266j67177
$$ 408301 128253 53471 378011 282238 209741 287821 28508 363264 599530 432353
1782D32353P5472J22405k05597K44226K55780k5570l80906l79082K42111L31817
$$ 432353 507825 630230 424633 668859 924639 899069 518163 139081 381192 713009
1772G13009O408j53199p6078P828N2157M6663m1971j46799J04047L8294N907L6171
$$ 713009 719417 566218 490140 497968 550125 596788 554817 408018 512065 550359 556266 592437
1760E92437k87356R904L01319j26606J32972J89756j02948j86419j98368j40184
$$ 592437 305081 314985 616304 489698 622670 812426 709478 523059 324691 184507
1750A84507j34454J82645j5990L1018J76939j1337j20119n9995R740K34552M95
$$ 184507 50053 232698 216708 247726 424665 413328 293209 233214 242954 477506 478001
1739D78001k70762k24865K35872R9775j22713M07174j26081m9455p0121j06064
$$ 478001 207239 -17626 218246 318021 195308 602482 476401 426946 356825 250761
1729B50761l4531j26833j75676q6621J54926R6934O9871L44445K3613j26675J7443
$$ 250761 216230 89397 -86279 -172900 -17974 78960 148831 493276 516889 390214 407657
1718D07657L4954k689j2016N8174j1787k03389j56606r204J75284J90887n3690
$$ 407657 442611 439922 427906 486080 474293 270904 114298 105094 280378 471265 417575
1707D17575J37245l7544j34590k5805j36039P7455j60032J28375j20340L0801
$$ 417575 554820 517276 382686 356881 220842 298297 138265 266640 146300 177101
1697A77101p0188R1299o7848j686j5163j49058L06225j62922M30537j92772l85584
$$ 177101 106913 198212 130364 128678 113515 -35543 270682 107760 538297 345525 -40059
1686d0059R5076J71462k58336l4928J77516k34285K673L46037k32488l49217J19755
$$ -40059 55017 226479 -31857 -66785 110731 -123554 -120881 225156 -7332 -356549 -236794
1675b36794J63666k7743P5226K87010J94749N3939j71393l45636J09576q3158
$$ -236794 -73128 -100871 -25645 261365 456114 510053 338660 -6976 102600 19442
1665A9442K296J71210m8130k5216J66475j99774j01896J23427m3429L7646J63150
$$ 19442 21738 192948 144818 119602 286077 86303 -15593 107834 64405 102051 265201
1654B65201O1318L29979l10047m8535K33903j73443k38152k33739j30205L51808
$$ 265201 326519 656498 346451 297916 531819 358376 120224 -113515 -243720 108088
1644A08088p759j10243K78315P4605K20615J16303j78920m22419j48472j9197
$$ 108088 100329 -9914 268401 343006 563621 679924 501004 78585 -69887 -89084
1634h9084J49500J86754R258J63719n53j05802J16399j02873j67274q4114L3101
$$ -89084 60416 247170 256428 420147 419594 313792 430191 327318 160044 75930 109031
1623A09031q0225J66994p5464L6980L602q0746R085J4400j21502O3534j19427
$$ 109031 28806 195800 120336 157316 160918 80172 89257 103657 -17845 45689 -73738
1612g3738J68657Q1532L3226q3948j14465L31191J64718q8339K60216n2115o3992
$$ -73738 94919 176451 209677 125729 11264 342455 507173 418834 679050 626935 562943
1601E62943j64312j67158K14642J97502k03865k64429k11968J08343j82444K86785
$$ 562943 398631 231473 446115 643617 439752 175323 -36645 71698 -110746 176039
1591A76039J73925j55387J3472r2877K11480o6866k45644M8109N176J18667l3616
$$ 176039 349964 194577 208049 115172 326652 259786 14142 62251 67427 186094 152478
1580A52478R1433K4917O5016p7411r493o1347L2089K1612m7364Q7704P3348q6701
$$ 152478 243911 268828 333844 256433 246940 185593 217682 239294 191930 279634 352982 266281
1568B66281k4994p0294K4885J32515j38998M18051j62405j84404q8047J23171
$$ 266281 241287 170993 195878 328393 189395 607446 445041 260637 172590 295761
1558B95761P5854K08361m8386p6842m0820r3505l87023Q5920K0112K12222k82686
$$ 295761 371615 579976 531590 454748 413928 320423 -66600 19320 39432 251654 -31032
1547c1032l0728M03120o932k07568L9599K25046J1001o1900L22982k64459l07546
$$ -31032 -61760 341360 334428 126860 166459 391505 402506 340606 663588 399129 91583
1536I1583k63305o4177K96179K97918J47102J6604l38108j19477L02717j4408
$$ 91583 -171722 -235899 60280 358198 505300 521904 183796 64319 367036 352628
1526C52628k9436q3149j45877N7677N9574m2237k44687q6899N34691l5863j59988
$$ 352628 323192 240043 94166 151843 211417 169180 -75507 -162406 372285 336422 176434
1515A76434M399J58659J18944j47351q2750O2581n8345J52384n8085j85807L20171
$$ 176434 180833 339492 458436 311085 228335 290916 232571 384955 326870 141063 461234
1504D61234j13171k07697K33790k27677l60152K87480K61604Q2848N2826j14261
$$ 461234 348063 140366 374156 146479 -213673 73807 335411 418259 471085 356824
1494C56824n1529k76915p3756J13816R5722k887k0476L29328j28766m29090K08344
$$ 356824 305295 28380 -45376 68440 164162 161275 140799 470127 341361 -87729 120615
1483A20615K4083M6309k4850k99886j24011J99763K08143o2645j21906q8099j31355
$$ 120615 144698 191007 166157 -133729 -257740 -57977 150166 87521 -34385 -122484 -253839
1472b53839J84416J52408J93085P4604j95289k48825j94015L27524J74273K28544
$$ -253839 -69423 82985 276070 350674 155385 -93440 -287455 40069 214342 442886
1462D42886j85636l2843R8029L658J35119j62261m7502j19611j19951K73186K16992
$$ 442886 257250 224407 322436 326094 461213 298952 251450 131839 11888 285074 502066
1451E02066m85678L64696L263j64857O1513J23453J7610l57655k0924L16649j73616
$$ 502066 16388 381084 384347 219490 281003 404456 422066 64411 43487 360136 186520
1440A86520J45380L8608j64898j11793J76307k0109j41930J10362j78883K4209
$$ 186520 331900 370508 205610 93817 270124 250015 108085 218447 39564 63773
1430F3773j23365J37816L4052n0877K3675J18192N9570J52532j54874J36333P2493
$$ 63773 -59592 78224 112276 61399 85074 203266 262836 415368 260494 396827 469320
1419D69320r7511k39857J52622L88987k78662j04772p7743J49386O5997j50690
$$ 469320 371809 131952 284574 673561 394899 290127 212384 361770 427767 277077
1409B77077p1940J32832J8328j19948J98570O008o9940K00132k08250j48056q5086
$$ 277077 205137 337969 356297 236349 434919 440927 370987 571119 362869 214813 129727
1398A29727K46329K3459l11711M4414J70873O9498K9939j25700K24015k46823
$$ 129727 376056 399515 87804 132218 303091 372589 402528 276828 500843 254020
1388B54020m7977l83390n1009J96762J6424J30956Q1244P7133j80098j32401K40098
$$ 254020 206043 -177347 -228356 -31594 -15170 115786 197030 274163 94065 -38336 201762
1377B01762K98693k36979J45275q704r993J05076J28574l67534J160j06740j00076
$$ 201762 500455 263476 408751 400047 390054 495130 623704 256170 257330 150590 50514
1366E0514L3854p6623J37365K87600k80096j63399k6207K41853n71K8081K3166
$$ 50514 84368 7745 145110 432710 152614 -10785 -36992 204861 204290 232371 255537
1355B55537l57284K76560k097n012M15002l25835j41057j55515K17226K03664
$$ 255537 -101747 174813 172716 167704 582706 256871 115814 -39701 177525 381189
1345C81189K24904L9537Q624j11579k52729L13365o0161j69874q1568r8978J47640
$$ 381189 606093 645630 654254 542675 289946 603311 543150 373276 291708 192730 340370
1334C40370J12872Q8036q7860k52805j72070l2165K4119J59682J873p8723q5887
$$ 340370 453242 541278 453418 200613 28543 -3622 20497 180179 182052 103329 17442
1323A7442o4145J45604J68548J79860j63579j71955M7993L0759j51321j00697
$$ 17442 -46703 98901 267449 447309 283730 111775 159768 190527 39206 -61491
1313f1491Q2329j21547j00229J2375K02297L15676O780r9028Q7284n0018j01018
$$ -61491 20838 -100709 -200938 -188563 13734 329410 336190 237162 324446 274428 173410
1302A73410O2050Q6738o8029R2348k15602J16946J67194j11385j00599R1626k09477
$$ 173410 235460 322198 254169 346517 130915 247861 415055 303670 203071 294697 85220
1291H5220q9758P1987J46858J34184m78698Q3527k4739J236L7650K0095n8412
$$ 85220 -4538 67449 214307 348491 -130207 -46680 -71419 -70183 -32533 -12438 -70850
1280g0850K7133L1838L7985Q7345K45430K6121l9500j97552J8757P9397j02665
$$ -70850 -43717 -11879 26106 113451 358881 385002 345502 147950 166707 246104 143439
1269A43439L5880K1781J71656k5137j18678j07893j35542L78002P8618N6835q2551
$$ 143439 179319 201100 372756 347619 228941 121048 -14494 363508 442126 498961 416410
1258D16410N7203m658j21011j41829J89426k57624m49143j79284M04828k3921
$$ 416410 473613 468955 347944 206115 395541 137917 -311226 -490510 -85682 -109603
1248a09603K92552K47771j36599k08415k7538j0694J4832K69510M6209K8462j91333
$$ -109603 182949 430720 294121 85706 58168 47474 62306 331816 378025 406487 215154
1237B15154k18747K48091K6940J91587j22973j85161j8464J46626J90955j22912
$$ 215154 -3593 244498 271438 463025 340052 154891 136427 283053 474008 351096
1227C51096j60918o529j84299O3790J62917N0927J1958M896J29981k63593J65845
$$ 351096 190178 183649 -650 63140 226057 276984 288942 293838 423819 160226 326071
1216C26071j09879k4817j30744K45009K80528j01857j24841p2143o0532j15130
$$ 326071 216192 191375 60631 305640 586168 484311 359470 287327 226795 111665
1206A11665o9716O6475k33914J42939K58366q6176j4889j92382k5947L37503j80060
$$ 111665 41949 108424 -125490 17449 275815 189639 174750 -17632 -43579 293924 113864
1195A13864J31021j32636Q7938j34045R7466N9363p9045M4637J98255P7658o8129
$$ 113864 244885 112249 200187 66142 163608 222971 143926 188563 386818 464476 396347
1184C96347J66087l49987k92266J32297P4607k05567L2853J70340K98632n3514
$$ 396347 562434 212447 -79819 52478 127085 -78482 -45629 124711 423343 369829
1174C69829j92307R2208P29j46138M0390M6372j09429l8880j03505K03077L1573
$$ 369829 177522 269730 270459 124321 164711 211083 101654 62774 -40731 162346 193919
1163A93919O9714K57189r0752k79784J41133j96203l9919k22595N924K39453N3868
$$ 193919 263633 520822 430070 150286 291419 95216 55297 -167298 -161374 78079 131947
1152A31947p0452J35226j42670J46074J91932o0385j64300J16308n8973l61399
$$ 131947 61495 196721 54051 200125 392057 331672 167372 283680 224707 -136692
1142a36692K48311Q580K2965J08827R7970j88400O8185m4345P471J79468J198
$$ -136692 111619 120199 143164 251991 349961 161561 229746 185401 192872 372340 373538
1131C73538k57710j79026R4456K58598J03327j62816J16971j26008M3121J72866
$$ 373538 115828 -63198 31258 289856 393183 230367 347338 221330 264451 437317
1121D37317k74429r9701O0672J20794n848q299j77081J32713J43399o4775j29013
$$ 437317 162888 63187 123859 244653 238805 230506 53425 186138 329537 264762 135749
1110A35749o7828O1584K7115j0377m8926K30954l4774j46227P1686J61231j99242
$$ 135749 67921 129505 156620 146243 97317 328271 293497 147270 218956 380187 180945
1099A80945k79252K45665P3760K94144k22788P4013l2821J50824j00473j78581
$$ 180945 -98307 147358 221118 515262 292474 366487 333666 484490 384017 205436
1089B05436L7334l0090o4876l7795l7551k754J52049K6179J79540k37034l0515
$$ 205436 242770 212680 147804 110009 72458 69704 221753 247932 427472 190438 159923
1078A59923L0853k6010J23762J7824j53574M5006k55354p7962J75886J36697k9597
$$ 159923 190776 164766 288528 306352 152778 197784 -57570 -135532 40354 177051 147454
1067A47454j4757L172M0256r0374j58116n2827o0981K49609J94033K6278l4925
$$ 147454 132697 135869 176125 85751 -72365 -125192 -186173 63436 257469 283747 248822
1056B48822r9572j61425J72938j72773L9314L44160k03544n4724K13910j56772
$$ 248822 149250 -12175 160763 -12010 27304 371464 167920 113196 327106 170334
1046A70334j8529P387m1512l50182j7110J84009J84063K79415J85596j52669j65845
$$ 170334 151805 159192 117680 -232502 -249612 -65603 118460 397875 583471 430802 264957
1035B64957j80357K96623K0603p0562J8110l1060k23828K694L3236Q192j04617
$$ 264957 84600 381223 401826 331264 349374 318314 94486 97180 130416 138608 33991
1024C3991j35707K04918n7361K8344l36381J6465L88889L10880r3954j62685J28084
$$ 33991 -101716 103202 45841 74185 -262196 -245731 143158 454038 360084 197399 325483
1013C25483j93827j41893K8341k40185r51J16474M18261k57727j55941J87096
$$ 325483 131656 -10237 18104 -222081 -223032 -106558 311703 53976 -101965 85131
1003H5131J159j56216N8803K14611P6056j7292j35197K48472r9812m1062k4900
$$ 85131 86290 -69926 -11123 203488 279544 262252 127055 375527 275715 234653 209753
992B09753q7425n8459R4273K33683j2931j02086j89007L5214k8708R8768J48179
$$ 209753 122328 63869 158142 391825 378894 276808 87801 123015 94307 193075 341254
981C41254p2852Q4445J67168k684j72017j08597J31248J56435j05607m85948J43656
$$ 341254 268402 352847 520015 517331 345314 236717 367965 524400 418793 -67155 76501
970G6501J80694M7585Q6848k57167K43637r1524k88715J02816J21872L07785k92797
$$ 76501 257195 304780 391628 134461 378098 286574 -2141 100675 222547 530332 237535
959B37535O4374R8300k59323n02615K44802K76334J1276J51486j39799K7183J71847
$$ 237535 301909 400209 140886 -361729 -116927 159407 170683 322169 182370 209553 381400
948C81400k02794k4336K5844q7625L2516O717n9518J2716K6164J73910q1630j73172
$$ 381400 178606 154270 180114 92489 125005 131722 72204 84920 111084 284994 203364 30192
936C0192K36024J52239r3148j8780p6208l0674o8125P0744j55305j53167o1274
$$ 30192 266216 418455 325307 306527 230319 199645 131520 202264 46959 -106208 -167482
925a67482J33663l4022k5424J00676R8363L5051m6328K83792l1732J04779J8124
$$ -167482 -33819 -67841 -93265 7411 105774 140825 94497 378289 346557 451336 469460
914D69460r7092j5621P4405j44819m2050M9235K3195J03890k2263l65305q6338
$$ 469460 372368 356747 431152 286333 244283 293518 316713 420603 398340 33035 -53303
903e3303n6962K12557j60936J97147J75014k60562M4816k0314k82870J51255M37606
$$ -53303 -110265 102292 -58644 138503 313517 52955 97771 77457 -205413 -54158 383448
892C83448J63727j33073l81486J89208r1510j78546J47556J24729j58577J79933
$$ 383448 547175 414102 32616 221824 130314 -48232 99324 224053 65476 245409
882B45409K23260k42967q8758J16686j18121j46119J66678J6255j68562j36301
$$ 245409 468669 225702 136944 253630 135509 -10610 156068 172323 3761 -132540
872a32540K90984J05751j03784R9255j20783J79127K7297j23486j6336L1084K02245
$$ -132540 158444 264195 160411 259666 138883 318010 345307 221821 205485 236569 438814
861D38814l5128l8171l08056o450k20117J49506L47819q6770j58449o3461m2329
$$ 438814 403686 365515 57459 51009 -169108 -19602 328217 241447 82998 19537 -22792
850b2792q7683J46820L74600m8525j50124j23862m3159K01512j49955J58785J79692
$$ -22792 -110475 36345 410945 362420 212296 88434 45275 246787 96832 255617 435309
839D35309j90196j85109N6658K81820k16177J10990J37055j31210Q1244K86464
$$ 435309 245113 60004 116662 398482 182305 293295 430350 299140 380384 666848
829F66848j03329k55210j19627j90896k47614J83505K12846J6584k22028j2913
$$ 666848 563519 308309 188682 -2214 -249828 -66323 146523 163107 -58921 -71834
819g1834o2406L48786k8302J501j55204N0834r1984n9643K91419j59835J3989
$$ -71834 -134240 214546 186244 187745 32541 83375 -8609 -68252 223167 63332 77321
808G7321r2547J02047J68948j06665k98207J59483q4188J85435M18042n2674r711
$$ 77321 -15226 86821 255769 149104 -149103 10380 -73808 111627 529669 476995 467284
797D67284q5480n30005p470l9849l93812K40763K89156p6460J55901J0090J81425
$$ 467284 381804 -148201 -155671 -195520 -589332 -348569 -59413 -135873 20028 30118 211543
786B11543K74967R9878l09672j66698k70726J28810m0125L1129J03136n1100J4623
$$ 211543 486510 586388 276716 110018 -160708 -31898 -72023 -40894 62242 11142 25765
775B5765J65034J28742m3893k49907J51319O1350j58271j76400j53927o9402J92076
$$ 25765 190799 319541 275648 25741 177060 238410 80139 -96261 -250188 -319590 -127514
764a27514M45322l1269j18066r8279j14053J72098j50597J14071J08561q779j55824
$$ -127514 317808 286539 168473 70194 -43859 128239 -22358 91713 200274 191495 35671
753C5671J09813J17193J42846j67605j41752K13009j14604Q098j17386j14304
$$ 35671 145484 262677 405523 237918 96166 309175 194571 202669 85283 -29021
743b9021K6259M7810p6048L6718r9711J1510Q518L02180O1030J0845j00991r7543
$$ -29021 -2762 45048 -31000 5718 -93993 -82483 -73965 228215 289245 300090 199099 101556
731A01556P1145n5037O6837j10128K15241M0612j1447j15743K7305o561j81965
$$ 101556 172701 117664 184501 74373 289614 330226 318779 203036 230341 223780 41815
720D1815q2063j18828J88791m8999K84091l30045J36172K23701l64185j24682
$$ 41815 -40248 -159076 29715 -19284 264807 -65238 70934 294635 -69550 -194232
710a94232J24329K45309m4675K56254j53407J8866j764j81747K71144q0020k52349
$$ -194232 -69903 175406 130731 386985 233578 252444 250680 68933 340077 260057 7708
699G708R0116R6019k22071K09036J97755l15982M8274J79110k97986J19674j0838
$$ 7708 97824 193843 -28228 180808 378563 62581 110855 289965 -8021 111653 100815
688A00815L2375j52119o9879K51523p4555K50944k97270L8382J39948o6191j10597
$$ 100815 133190 -18929 -88808 162715 88160 339104 41834 80216 220164 153973 43376
677D3376k3574J97983K24337r5129J02794k56959Q6849M05677k73907m36759k4442
$$ 43376 19802 217785 442122 346993 449787 192828 279677 685354 411447 -25312 -49754
666d9754K15807L7269K50388M3923N2747j12264l57299k63949J48048K17822R0174
$$ -49754 166053 203322 453710 497633 550380 438116 80817 -183132 -35084 182738 272912
655B72912o2474Q7284o0147l02231j64613J17293N8819Q6402J84731M50110m6634
$$ 272912 210438 297722 237575 -64656 -229269 -111976 -53157 33245 217976 668086 621452
644F21452m11472Q2690k28022k54792J74665K5954p5586R3958O2595Q3557j92807
$$ 621452 209980 292670 64648 -190144 -15479 10475 -65111 28847 91442 174999 -17808
633a7808J02658L57196k49574K60565p4433N5216M70q2837Q7375j64295k02148
$$ -17808 84850 442046 192472 453037 378604 433820 434290 351453 438828 274533 72385
622G2385K44293K3368j91752j59961K13603k11385j59630M14662M6333o3854j86335
$$ 72385 316678 340046 148294 -11667 201936 -9449 -169079 245583 291916 228062 41727
611D1727j46569l9486J07618o5414K36414j57745j40495L08348J65097J53201
$$ 41727 -104842 -144328 -36710 -102124 134290 -23455 -163950 144398 309495 462696
601D62696k01260o3056j28641j08907N0072J74863O9867k40r8337L8167J35106
$$ 462696 261436 198380 69739 -39168 10904 185767 255634 255394 157057 195224 330330
590C30330r566k51N1919j78550l27512L0624K75156j29994j64073J83863J84567
$$ 330330 320764 320513 372432 193882 -133630 -103006 172150 42156 -121917 61946 246513
579B46513J9081n7284O1255k94165J74366J36015j0611j94428j91427J95994M83877
$$ 246513 265594 208310 269565 -24600 149766 285781 275170 80742 -110685 85309 569186
568E69186k21601Q284J51694j35304L5878k16132k22547J25375O0739Q0469M2589
$$ 569186 347585 355869 507563 372259 408137 192005 -30542 94833 155572 236041 278630
557B78630j83668K77277Q1568k76921p6499J45407l7249o657J19278o3509j73988
$$ 278630 94962 372239 453807 176886 100387 245794 208545 201888 321166 257657 83669
546H3669j63074K48048P9764l14790m4739r8166M21686k2455P0347J14502j76267
$$ 83669 -79405 168643 248407 -66383 -111122 -209288 212398 189943 260290 374792 198525
535A98525K13552O4572l52854j17126J80324k38423J71502K75117J19693k54211
$$ 198525 412077 476649 123795 6669 186993 -51430 120072 395189 514882 260671
525B60671K17101p356j67854k28357K79585q8089j99756K99138K9371p5067l17077
$$ 260671 477772 470416 302562 74205 353790 265701 65945 365083 394454 319387 2310
514B310r9611K04878j38229j4593J33710K01657K61256l79703j10803J80323j07253
$$ 2310 -97301 107577 -30652 -45245 88465 290122 551378 171675 60872 241195 133942
503A33942N2822J44598q5013J18839o1941k10549M4317j57853L4225M1597K60620
$$ 133942 186764 331362 246349 365188 303247 92698 137015 -20838 13387 54984 315604
492C15604k26995l4110N5227N3656P7696M0566J08687j35669M5121k05951m95
$$ 315604 88609 54499 109726 163382 241078 281644 390331 254662 299783 93832 93337
481I3337L7330L6945J06355j24334J96185j67474k57927M409J34228k2456K54663
$$ 93337 130667 167612 273967 149633 345818 178344 -79583 -75174 59054 36598 291261
470B91261P7650q4781o7373J5089j6318k0167k14283j51976j03811J82468L9587
$$ 291261 368911 284130 216757 231846 215528 195361 -18922 -170898 -274709 -92241 -52654
459e2654m4722K43205j80655p3603k6527j49514l7388J72801k0651K72636J29507
$$ -52654 -97376 145829 -34826 -108429 -134956 -284470 -321858 -149057 -169708 102928 232435
448B32435n709p2506J16661o4844M9517l39006K9919K05676J61617o9510n0149
$$ 232435 226726 154220 270881 206037 255554 -83452 -53533 152143 313760 244250 194101
437A94101k83928K0420j61809L36857j60683p7095K44536r2981J80334J31320
$$ 194101 -89827 -69407 -231216 105641 -55042 -132137 112399 19418 199752 331072
427C31072j20416k190J57581j83324k32560k34136K15431m8815j95505J29242
$$ 331072 210656 208466 366047 182723 -49837 -283973 -68542 -117357 -312862 -183620
417a83620j4147J59646J77109J46978q9350K12260M0084J07299N059l01449k68937
$$ -183620 -197767 -38121 138988 285966 196616 408876 448960 556259 561318 259869 -9068
406i068q3745M2863J01404J42793J34434J91756k30255J07582J14843m76302J33537
$$ -9068 -92813 -49950 51454 194247 328681 520437 290182 397764 512607 36305 169842
395A69842J6013J65327k98374j01800L31366j09122j78860J06515J21662J8837
$$ 169842 185855 351182 52808 -48992 282374 173252 -5608 100907 222569 241406
385B41406k20572j03504l42149J55454P15565l45854k35278j17077J59057K48347
$$ 241406 20834 -82670 -424819 -269365 446200 100346 -134932 -252009 -92952 155395
375A55395J97795j55604q354J40876J78775j21875k26038k36743J52747Q031m1903
$$ 155395 353190 197586 189232 330108 508883 387008 160970 -75773 76974 85005 43102
364D3102K00319P1059l01853J92272M0064L7398J95134O0578j30571j70215L249
$$ 43102 243421 314480 12627 204899 244963 282361 477495 538073 407502 237287 240536
353B40536R2891j7498J13487L685j30677k06913L0225l1865K52532J55715l33374
$$ 240536 333427 315929 429416 433101 302424 95511 125736 93871 346403 502118 168744
342A68744q6146P0247K07928j9555j57956M7401j00015j26122P7707J2928r2112
$$ 168744 82598 152845 360773 341218 183262 230663 130648 4526 82233 95161 3049
331C049J13410M1640l6102j53100p2830J04849q998L6466J15154L8029O2708j39261
$$ 3049 116459 158099 121997 -31103 -103933 916 -8082 28384 143538 181567 244275 105014
319A05014m3860J25199j85492K8817L42126j85702k48086j31271M36485n7693
$$ 105014 61154 186353 861 29678 371804 186102 -61984 -193255 243230 185537
309A85537j39329m3485J29737L4187J00641j46827R4543R8603K5534j79890r3215
$$ 185537 46208 2723 132460 166647 267288 120461 215004 313607 339141 159251 66036
298F6036L53835q9172n9914j91533l4049k37550q7145K6143r5658J93691K75965
$$ 66036 419871 330699 270785 79252 45203 -192347 -279492 -253349 -349007 -155316 120649
287A20649R8146n4874L6124K6125k36139L25664j01818r3886n045K67976J37334
$$ 120649 218795 163921 200045 226170 -9969 315695 213877 119991 114946 382922 520256
276E20256r9150k30333k03358J55331j26224j7619J50273L884J06004n53N6320
$$ 520256 421106 190773 -12585 142746 16522 -1097 149176 153060 259064 258511 314831
265C14831j62532j84518J7218K08477p4981J0048l13923j46289J62284K51450
$$ 314831 152299 -32219 -15001 193476 118495 128543 -185380 -331669 -169385 82065
255H2065K87629l7762j64345j13754P1120K04414l348j64154j56166J04103o8912
$$ 82065 369694 331932 167587 53833 124953 329367 326019 161865 5699 109802 40890
244D0890m4473R0623Q4984k65706j00987J65669J79865j84095n7829L47310J11759
$$ 40890 -3583 87040 172024 -93682 -194669 -29000 150865 -33230 -91059 256251 368010
233C68010j79681K31509n2200N61p7115R8093o4630k93586j38641K5231J65825
$$ 368010 188329 419838 367638 368199 291084 389177 324547 30961 -107680 -82449 83376
222H3376Q7912p4089J8961j04938k68356J86460k365J09544O6049p7545j01608
$$ 83376 171288 97199 116160 11222 -257134 -70674 -73039 36505 102554 25009 -76599
211g6599J88575r9623J07814k3928k01100N1886l519j24587J18692J4110k42166
$$ -76599 111976 12353 120167 96239 -104861 -52975 -56494 -181081 -62389 -48279 -290445
200b90445m67308K88259J98707K70862k9828J07058P8577q5931K28977Q176j56501
$$ -290445 -757753 -469494 -270787 75 -29753 77305 155882 69951 298928 307104 150603
189A50603j23462j52131K13582J43446l6787k60367J12787q2777K6272J19198
$$ 150603 27141 -124990 88592 232038 195251 -65116 47671 -35106 -8834 110364
179A10364m1845q8986j42732J18004m9865P1792J63270R2828q2900J89747K0780
$$ 110364 68519 -20467 -163199 -45195 -95060 -23268 140002 232830 149930 339677 360457
168C60457k58961j200L8589l05705K63012o5070j28257Q5644n8655j53877M7204
$$ 360457 101496 100296 138885 -166820 96192 31122 -97135 -11491 -70146 -224023 -176819
157a76819K01849P4560j10745l06936J84999J07540L5839O3314j06004J24561
$$ -176819 25030 99590 -11155 -318091 -133092 -25552 10287 73601 -32403 92158
147I2158k27503K47343J35877o3408l07731j42974J34827K20446M028J21674M2423
$$ 92158 -135345 111998 247875 184467 -123264 -266238 -131411 89035 93063 214737 257160
136B57160j9379r2325o9972q0550K22379k14104p3175j07624J76830m8856k4328
$$ 257160 237781 145456 75484 -5066 217313 3209 -69966 -177590 -760 -49616 -73944
125g3944P725j07688J35949p5856J45110k82355M541J8785K57010J67337J53934
$$ -73944 -66219 -173907 -37958 -113814 31296 -251059 -246518 -227733 29277 196614 350548
114C50548p0214j80412j95803l6016l1735l4348J19746K13595m8875O3415k23300
$$ 350548 280334 99922 -95881 -131897 -163632 -197980 -78234 135361 86486 149901 -73399
103g3399L3475n3425K73444o0443J58358P9906j84759k59790P187J4020j14713
$$ -73399 -39924 -93349 180095 119652 278010 357916 173157 -86633 -79446 -65426 -180139
92a80139k08550Q6320K9128j80840J6823L1295P0547r6193J20883J65616J10653
$$ -180139 -388689 -302369 -273241 -454081 -437258 -405963 -335416 -431609 -310726 -145110 -34457
81c4457j05036l5903J69626k0352j51505o9967J15507L6303j36728N8101j10152
$$ -34457 -139493 -175396 -5770 -26122 -177627 -247594 -132087 -95784 -232512 -174411 -284563
70b84563k9737J92700p8872L5931O3443Q2343P1862k14431j62706L2040P0678
$$ -284563 -314300 -121600 -200472 -164541 -101098 -18755 53107 -161324 -324030 -291990 -221312
59b21312O458o0757K0525J63719P7706J35685j55428k94827j36142J18908R7223
$$ -221312 -214854 -275611 -255086 -91367 -13661 122024 -33404 -328231 -464373 -345465 -248242
48b48242J36699m5107J41379j06016N7490M6663m8085j62354K09609J41521j26978
$$ -248242 -111543 -156650 -15271 -121287 -63797 -17134 -65219 -227573 -17964 123557 -3421
37c421K2319j01048k75779J05225N3286j41333J94384N696k5317k41525J79467
$$ -3421 18898 -82150 -357929 -252704 -199418 -340751 -146367 -140671 -165988 -407513 -228046
26b28046j14727j93535R2641P7280j2747O9964R3921j33159Q2773J63361p7832
$$ -228046 -342773 -536308 -443667 -366387 -379134 -309170 -215249 -348408 -265635 -102274 -180106
15a80106j23933k6561P7167J40835Q2275j31551m5987O867m0180m7916q0649K34788
$$ -180106 -304039 -330600 -253433 -112598 -30323 -161874 -207861 -200994 -241174 -289090 -369739 -134951
3a34951M1134k596r6555
$$ -134951 -93817 -96413 -192968
0a92968
$$ -192968
$$ Imaginary data points
##PAGE= N=2
##DATA TABLE= (X++(I..I)), XYDATA
16383b213844J64705o332K06099J22441j33541R3836k7184o3387K3300J19173
$$ -2213844 -2049139 -2055471 -1849372 -1726931 -1860472 -1766636 -1793820 -1857207 -1833907 -1714734
16373a714734Q3162j0490L6964P5049Q1788K5294q9572J7250J17445K88747k15526
$$ -1714734 -1631572 -1642062 -1605098 -1530049 -1448261 -1422967 -1512539 -1495289 -1377844 -1089097 -1304623
16362a304623P7993J2881Q6089K4050q1465J68477N1675o2406M7134m6182j78254
$$ -1304623 -1226630 -1213749 -1127660 -1103610 -1185075 -1016598 -964923 -1027329 -980195 -1026377 -1204631
16351a204631M8026K9241K12653J25088r8830J3027K6788l3469P716p291R0825
$$ -1204631 -1156605 -1127364 -914711 -789623 -888453 -875426 -848638 -882107 -874391 -881682 -790857
16340g90857l043j57361J72471K82889l3444j37279J36337K0616L1002J15598
$$ -790857 -793900 -951261 -778790 -495901 -529345 -666624 -530287 -509671 -478669 -363071
16330c63071K5964o4395K14649p6582j84426K72631J59341r8737j55617J96500
$$ -363071 -337107 -401502 -186853 -263435 -447861 -175230 -15889 -114626 -270243 -73743
16320g3743L2328K4610L4108k01787m8205K40171K69o6265P5355n9492K42708
$$ -73743 -41415 -16805 17303 -184484 -232689 7482 7751 -58514 16841 -42651 200057
16309B00057k2783k36228l7859M104J90752P7027J87412L5639j22615R2326K91898
$$ 200057 177274 -58954 -96813 -92709 98043 175070 362482 398121 275506 367832 659730
16298F59730j3176l4366K6259k09275J40090j47826M6039R3153j58888L1992J65093
$$ 659730 646554 612188 638447 429172 569262 421436 467475 560628 401740 433732 598825
16287E98825J06521j89228R8176J08681j3008K9575j1668J50960j67765J10533
$$ 598825 705346 516118 614294 722975 709967 739542 727874 878834 711069 821602
16277H21602j77770J8466L75459n346l9119K3792l1206J57473O5486N0157k72235
$$ 821602 643832 662298 1037757 1032411 993292 1017084 985878 1143351 1208837 1258994 986759
16266I86759k10275J49860L22062o0711r7182j05766K6530R9875J46850q9018
$$ 986759 776484 926344 1248406 1187695 1090513 984747 1011277 1111152 1258002 1168984
16256A168984l2550J31649m1277O7867j22809O5467J18484L057k5927J46049J42348
$$ 1168984 1136434 1268083 1226806 1294673 1171864 1237331 1355815 1358872 1332945 1478994 1621342
16245A621342J31032j65631O5112p7974L2784j31412N0538r2315Q5616Q2079M5583
$$ 1621342 1752374 1586743 1651855 1573881 1606665 1475253 1525791 1433476 1519092 1601171 1646754
16234A646754k77031N111K25222L7849J2149l5507k3505r2676p618J11520R9340
$$ 1646754 1369723 1374834 1600056 1637905 1650054 1614547 1591042 1498366 1490748 1602268 1701608
16223A701608J89655n8867j44911n6835M6723K26206K08352j06091j54440J86582
$$ 1701608 1891263 1832396 1687485 1630650 1677373 1903579 2111931 2005840 1851400 2037982
16213B037982n2857M4517Q3903k23482m5144J47814J97722J56788l77195m18753
$$ 2037982 1985125 2029642 2113545 1890063 1844919 1992733 2190455 2347243 1970048 1551295
16203A551295J75969K07346k83025J79177O137J59510R9359R9849J04113o6132
$$ 1551295 1727264 1934610 1651585 1830762 1836899 1996409 2095768 2195617 2299730 2233598
16193B233598r9262O3820J89086q466J47130M7537r2741l44915j6649L4558J25454
$$ 2233598 2134336 2198156 2387242 2378776 2525906 2573443 2480702 2135787 2119138 2153696 2279150
16182B279150k9094o49k30290j5190P4381l9197K49529j61602K31015J75022l2902
$$ 2279150 2250056 2249407 2019117 2003927 2078308 2039111 2288640 2127038 2358053 2533075 2500173
16171B500173j57539j03566K0188L9523j00255j46918m528J74630J19972j09963
$$ 2500173 2342634 2239068 2259256 2298779 2198524 2051606 2047078 2221708 2341680 2231717
16161B231717L14010k81811N1966J08543O1571J11675j5325O9392j10550l79326
$$ 2231717 2545727 2263916 2315882 2424425 2485996 2597671 2582346 2651738 2541188 2161862
16151B161862L3890L10012K4639n7588J44546J73336o9141j68642n1808J20357
$$ 2161862 2195752 2505764 2530403 2472815 2617361 2790697 2721556 2552914 2501106 2621463
16141B621463K64946O5355k66384j92198k48875J21678m040J56163K61194k94458
$$ 2621463 2886409 2951764 2685380 2493182 2244307 2365985 2361945 2518108 2779302 2484844
16131B484844j61098J30065J69753k25965M3293J28043o7042Q8187j71641K26277
$$ 2484844 2323746 2453811 2623564 2397599 2440892 2568935 2501893 2590080 2418439 2644716
16121B644716j52056J14192J10535R2344j46526j45765J5935J55711J73773k73403
$$ 2644716 2492660 2606852 2717387 2809731 2663205 2517440 2533375 2689086 2862859 2589456
16111B589456K55203R0106k37927J53424k63314j77826j3674J33940M7903J96110
$$ 2589456 2844659 2934765 2696838 2850262 2586948 2409122 2395448 2529388 2577291 2773401
16101B773401k68542j27315j28363J56099J98433O5929L2271j82847R9622R2657
$$ 2773401 2504859 2377544 2249181 2405280 2603713 2669642 2701913 2519066 2618688 2711345
16091B711345O1035k5382o5925J9574J33475J63571q9236k02001K13381j51307
$$ 2711345 2772380 2746998 2681073 2700647 2834122 2997693 2908457 2706456 2919837 2768530
16081B768530m3217o2299K9386J11341p4616k95051l2461O5368K44475J67733
$$ 2768530 2725313 2663014 2692400 2803741 2729125 2434074 2401613 2466981 2711456 2879189
16071B879189p0745k07281j36424J22542o8523j53744K4535J49602J47258q4300
$$ 2879189 2808444 2601163 2464739 2587281 2518758 2365014 2389549 2539151 2686409 2602109
16061B602109L31316J53402l37881j86521K18360m5516K0090k1014K13788M4187
$$ 2602109 2933425 3086827 2748946 2562425 2780785 2735269 2755359 2734345 2948133 2992320
16051B992320k37239j4727K28499R2391j07281P7048q4091j76939j53678J29683
$$ 2992320 2755081 2740354 2968853 3061244 2953963 3031011 2946920 2769981 2616303 2745986
16041B745986q990K96891r9167l06994R6471j53596p357J41469J2306l9667J57257
$$ 2745986 2736996 3033887 2934720 2627726 2724197 2570601 2563244 2704713 2717019 2677352 2834609
16030B834609j5020j24558j82975l4662K14269j83699Q524j39813p581P349K03294
$$ 2834609 2819589 2695031 2512056 2477394 2691663 2507964 2516488 2376675 2369094 2376443 2579737
16019B579737K86273J5334P5866P4566L2223p9215p206J4724l36604j53675J69555
$$ 2579737 2866010 2881344 2957210 3031776 3063999 2984784 2977578 2992302 2655698 2502023 2671578
16008B671578N540O3255o7100j81291K15193q0731J66972N4390N4644j79802r047
$$ 2671578 2677118 2740373 2673273 2491982 2707175 2626444 2793416 2847806 2902450 2722648 2713601
15997B713601p7240J90182j2041k88951J33678j17692o4410l1068J6781j9006
$$ 2713601 2636361 2826543 2814502 2525551 2659229 2541537 2477127 2446059 2462840 2443834
15987B443834K21171L4816J03465M6887K32620k01014J1948J39423L8541k02032
$$ 2443834 2665005 2699821 2803286 2850173 3082793 2881779 2893727 3033150 3071691 2869659
15977B869659j15758j15198K75383J47236l62950n5157j0558L69455K92773q1629
$$ 2869659 2753901 2638703 2914086 3061322 2698372 2643215 2632657 3002112 3294885 3213256
15967C213256m6790j38263o7926o5681Q5838J06775K32442n8423k80170J34188
$$ 3213256 3166466 3028203 2960277 2894596 2980434 3087209 3319651 3261228 2981058 3115246
15957C115246O754l76604J08981J69818n8770j02556P6612K058j050j8454J02418
$$ 3115246 3122000 2745396 2854377 3024195 2965425 2862869 2939481 2941539 2940489 2922035 3024453
15946C024453j07026j53319k54480J3937O7883J93587K32852K56011m23017l20672
$$ 3024453 2917427 2764108 2509628 2523565 2591448 2785035 3017887 3273898 2850881 2530209
15936B530209j2532l3567L60699Q8922m4042j30002J21339n4062l0455j18685
$$ 2530209 2517677 2484110 2844809 2933731 2889689 2759687 2881026 2826964 2796509 2677824
15926B677824J40946R7512M356k58621n4677j1655L28253j39232J04553j17529
$$ 2677824 2818770 2916282 2920638 2662017 2607340 2595685 2923938 2784706 2889259 2771730
15916B771730j05484K48672p1239k721P1046j38483j61061r1863J40954K2630
$$ 2771730 2666246 2914918 2843679 2840958 2912004 2773521 2612460 2520597 2661551 2684181
15906B684181N90O2353K07357n1882j58469J11843K16055N597l06356j94542j17765
$$ 2684181 2684771 2747124 2954481 2902599 2744130 2855973 3072028 3077625 2771269 2576727 2458962
15895B458962J36714l527m4488j47897q5271J55116P9764K14634J35478J3845
$$ 2458962 2595676 2592149 2547661 2399764 2314493 2469609 2549373 2764007 2899485 2913330
15885B913330k44798N2475K16275o6968k73558J30008J94860K2099j05561j52047
$$ 2913330 2668532 2721007 2937282 2870314 2596756 2726764 2921624 2943723 2838162 2686115
15875B686115k46631J5434L56367M46704N4887j40939L28500l88694q7469p0782
$$ 2686115 2439484 2454918 2811285 3257989 3312876 3171937 3500437 3111743 3024274 2953492
15865B953492j04046l2385Q439j30155j27931K64489L5277K423K6335k21192M8862
$$ 2953492 2849446 2817061 2825500 2695345 2567414 2831903 2867180 2869603 2895938 2674746 2723608
15854B723608J74070j34309j17808N7835P2944K89566j32520L6485j17228L4704
$$ 2723608 2897678 2763369 2645561 2703396 2776340 3065906 2933386 2969871 2852643 2887347
15844B887347K43975M2137l6794k32303q9998L1581o3641k11374n0559O9437P9841
$$ 2887347 3131322 3173459 3136665 2904362 2814364 2845945 2782304 2570930 2520371 2589808 2669649
15833B669649r6347J55477J41596J09083q7649N1366J016n34417J65054J40188
$$ 2669649 2573302 2728779 2870375 2979458 2891809 2943175 2944191 2409774 2574828 2715016
15823B715016k57115L02638K62264j1415L4847j20248k96726J14106J5579r2084
$$ 2715016 2457901 2760539 3022803 3011388 3046235 2925987 2629261 2743367 2758946 2666862
15813B666862K95956k58338k0301l780M0921P82j20438J1471p7720J06656J49417
$$ 2666862 2962818 2704480 2684179 2680399 2721320 2722102 2601664 2613135 2535415 2642071 2791488
15802B791488O9892Q4037K06537l60445j20908L0100K85867J22173M6300k23217
$$ 2791488 2861380 2945417 3151954 2791509 2670601 2700701 2986568 3108741 3155041 2931824
15792B931824k09023r6329j9698K64943O9456j35048Q4216J2307j64523Q6337
$$ 2931824 2722801 2626472 2606774 2871717 2941173 2806125 2890341 2902648 2738125 2824462
15782B824462l8064J14676L3654j67867l01709j63009M25658J59132l51752J70970
$$ 2824462 2786398 2901074 2934728 2766861 2465152 2302143 2727801 2886933 2535181 2706151
15772B706151Q9105n0656K07256P6157l0471o7169J5826j78833R5391l6626J87430
$$ 2706151 2795256 2744600 2951856 3028013 2997542 2930373 2946199 2767366 2862757 2826131 3013561
15761C013561N9505k71352m5035j08677J26478J91659J40442l11469k41128r8891
$$ 3013561 3073066 2801714 2756679 2648002 2774480 2966139 3106581 2795112 2553984 2455093
15751B455093K48085o9142r613J32437o1151r6626K24225J07133k63871k1086
$$ 2455093 2703178 2634036 2624423 2756860 2695709 2599083 2823308 2930441 2666570 2645484
15741B645484N2996r7297j9248m5625k8649L68302K35853j86869l1307O7938J9723
$$ 2645484 2698480 2601183 2581935 2536310 2507661 2875963 3111816 2924947 2893640 2961578 2981301
15730B981301L4243J32846l34915m5103N0045l04331q570P7963J40125n2096O9875
$$ 2981301 3015544 3148390 2813475 2768372 2818417 2514086 2505516 2583479 2723604 2671508 2741383
15719B741383R4560l25601r7052J28115L88185j85457l8810K46088j43511N2615
$$ 2741383 2835943 2510342 2413290 2541405 2929590 2744133 2705323 2951411 2807900 2860515
15709B860515Q8048k33768l0053k4807l4144k17983N7906M88426k3985J15078
$$ 2860515 2948563 2714795 2684742 2659935 2625791 2407808 2465714 2954140 2930155 3045233
15699C045233j21234j32011j34261R5880O3732K431M1297k1663j05177J49719
$$ 3045233 2923999 2791988 2657727 2753607 2817339 2819770 2861067 2839404 2734227 2883946
15689B883946l8907J34649k17101k3751p1187o9774K10746j38303J89653K71774
$$ 2883946 2845039 2979688 2762587 2738836 2667649 2597875 2808621 2670318 2859971 3131745
15679C131745k95628q5163O0182K28549J99786l10650q527m2795J70967j88616
$$ 3131745 2836117 2750954 2811136 3039685 3239471 2928821 2920294 2877499 3048466 2859850
15669B859850k19077q310J20123P5738Q4117L5265l17274M5268J93381J70333
$$ 2859850 2640773 2632463 2752586 2828324 2912441 2947706 2630432 2675700 2869081 3039414
15659C039414k3689l0685r4806O243Q7362J24478r1034l424k46656Q1191m2537
$$ 3039414 3015725 2985040 2890234 2896477 2983839 3108317 3017283 3013859 2767203 2848394 2805857
$$ [...]
##END NTUPLES=NMR SPECTRUM
##END=
