##TITLE=1H_DE-80H_X3
 200.13MHz, d2o
 8 sc
 
 19ns.26.2.2025
##JCAMPDX= 6.0         $$ Bruker NMR JCAMP-DX V2.0
##DATA TYPE= NMR SPECTRUM
##DATA CLASS= NTUPLES
##ORIGIN= UXNMR, Bruker Analytische Messtechnik GmbH
##OWNER= pz
$$ XWIN-NMR		Version 3.5
$$ Fri Mar 20 11:24:24 2026 Russian Standard Time (UT+4h)  Yarkov@DPX200
##.OBSERVE FREQUENCY= 200.1313
##.OBSERVE NUCLEUS= ^1H
##.ACQUISITION MODE= SIMULTANEOUS
##.ACQUISITION SCHEME= undefined
##.AVERAGES= 8
##.DIGITISER RES= 18
##SPECTROMETER/DATA SYSTEM= spect
##.PULSE SEQUENCE= zg30
##.SOLVENT NAME= DMSO
##.SHIFT REFERENCE= (INTERNAL, DMSO, 0, 15.4891)
##AUDIT TRAIL= $$ (NUMBER, WHEN, WHO, WHERE, WHAT)
$$ ##TITLE= Audit trail, XWIN-NMR		Version 3.5
$$ ##JCAMPDX= 5.01
$$ ##ORIGIN= Bruker BioSpin GmbH
$$ ##OWNER= Yarkov
$$ C:/Bruker/XWIN-NMR/data/yarkov2/nmr/H-C/1/pdata/1/auditp.txt
$$ ##AUDIT TRAIL=  $$ (NUMBER, WHEN, WHO, WHERE, WHAT)
(   1,<2026-03-20 11:23:29.64 +0400>,<Yarkov>,<DPX200>,
      <created by zg, POWCHK disabled, PULCHK disabled
       configuration hash MD5:
       00 E9 B6 7A A2 85 ED C7 34 08 36 98 17 FE 4E 26
       data hash MD5: 16K
       9D EF 04 E1 C7 5A AC 9F 09 06 C7 66 85 0F E8 37>)
(   2,<2026-03-20 11:23:55.85 +0400>,<Yarkov>,<DPX200>,
      <Start of raw data processing
       efp BC_mod = 2 LB = 0.25 FT_mod = 6 PKNL = 1 PHC0 = -5299.148 PHC1 = 6.821927 SI = 16K 
       data hash MD5: 16K
       9A 22 C5 9C C4 F8 93 D1 00 D0 08 55 D7 9F 2C BE>)
$$ ##END=
$$ 
$$ hash MD5
$$ EA A3 5A 56 72 9C A7 C9 14 7F 2B 29 07 C9 58 06
##$RELAX= 
##$RELAX= 
##$RELAX= 
##$RELAX= 
##$RELAX= 
##$RELAX= 
$$ Bruker specific parameters
$$ --------------------------
##$DU= <C:/Bruker/XWIN-NMR>
##$EXPNO= 1
##$NAME= <H-C>
##$PROCNO= 1
##$TYPE= <nmr>
##$USER= <yarkov2>
##$AMP= (0..31)
100 100 100 100 100 100 100 100 100 100 100 100 100 100 100 100 100 100 
100 100 100 100 100 100 100 100 100 100 100 100 100 100 
##$AQSEQ= 0
##$AQ_mod= 1
##$AUNM= <au_zg>
##$AUTOPOS= <>
##$BF1= 200.13
##$BF2= 200.13
##$BF3= 200.13
##$BF4= 200.13
##$BF5= 200.13
##$BF6= 200.13
##$BF7= 200.13
##$BF8= 200.13
##$BYTORDA= 1
##$CFDGTYP= 0
##$CFRGTYP= 5
##$CHEMSTR= <none>
##$CNST= (0..31)
1 1 145 1 1 1 1 1 1 1 1 1 1 1 1 1 1 1 1 1 1 1 1 1 1 1 1 1 1 1 1 1 
##$CPDPRG= <>
##$CPDPRG1= <>
##$CPDPRG2= <>
##$CPDPRG3= <>
##$CPDPRG4= <mlev>
##$CPDPRG5= <mlev>
##$CPDPRG6= <mlev>
##$CPDPRG7= <mlev>
##$CPDPRG8= <mlev>
##$CPDPRGB= <>
##$CPDPRGT= <>
##$D= (0..31)
0 0.7 0 0 0 0 0 0 0 0 0 0.03 0 0 0 0 0 0 0 0 0 0 0 0 0 0 0 0 0 0 0 0 
##$DATE= 1773991409
##$DBL= (0..7)
120 120 120 120 120 120 120 120 
##$DBP= (0..7)
150 150 150 150 150 150 150 150 
##$DBP07= 0
##$DBPNAM0= <>
##$DBPNAM1= <>
##$DBPNAM2= <>
##$DBPNAM3= <>
##$DBPNAM4= <>
##$DBPNAM5= <>
##$DBPNAM6= <>
##$DBPNAM7= <>
##$DBPOAL= (0..7)
0.5 0.5 0.5 0.5 0.5 0.5 0.5 0.5 
##$DBPOFFS= (0..7)
0 0 0 0 0 0 0 0 
##$DE= 6
##$DECBNUC= <off>
##$DECIM= 32
##$DECNUC= <off>
##$DECSTAT= 4
##$DIGMOD= 1
##$DIGTYP= 9
##$DL= (0..7)
0 120 120 120 120 120 120 120 
##$DP= (0..7)
$$ [...]
##$SUBNAM2= <"">
##$SUBNAM3= <"">
##$SUBNAM4= <"">
##$SUBNAM5= <"">
##$SUBNAM6= <"">
##$SUBNAM7= <"">
##$SUBNAM8= <"">
##$SUBNAM9= <"">
##$SW= 18.0517328524113
##$SWIBOX= (0..15)
0 0 2 0 0 0 0 0 0 0 0 0 0 0 0 0 
##$SW_h= 3612.71676300578
##$TD= 16384
##$TD0= 1
##$TE= 0
##$TE2= 300
##$TE3= 300
##$TEG= 300
##$TL= (0..7)
0 120 120 120 120 120 120 120 
##$TP= (0..7)
150 150 150 150 150 150 150 150 
##$TP07= 0
##$TPNAME0= <>
##$TPNAME1= <>
##$TPNAME2= <>
##$TPNAME3= <>
##$TPNAME4= <>
##$TPNAME5= <>
##$TPNAME6= <>
##$TPNAME7= <>
##$TPOAL= (0..7)
0.5 0.5 0.5 0.5 0.5 0.5 0.5 0.5 
##$TPOFFS= (0..7)
0 0 0 0 0 0 0 0 
##$TUNHIN= 0
##$TUNHOUT= 0
##$TUNXOUT= 0
##$USERA1= <user>
##$USERA2= <user>
##$USERA3= <user>
##$USERA4= <user>
##$USERA5= <user>
##$V9= 5
##$VALIST= <valist>
##$VCLIST= <CCCCCCCCCCCCCCC>
##$VD= 0
##$VDLIST= <DDDDDDDDDDDDDDD>
##$VPLIST= <PPPPPPPPPPPPPPP>
##$VTLIST= <TTTTTTTTTTTTTTT>
##$WBST= 1024
##$WBSW= 4
##$XGAIN= (0..3)
0 0 0 0 
##$XL= 0
##$YL= 0
##$YMAX_a= 134250
##$YMIN_a= -128839
##$ZGOPTNS= <>
##$ZL1= 120
##$ZL2= 120
##$ZL3= 120
##$ZL4= 120
##$ABSF1= 0
##$ABSF2= 0
##$ABSG= 0
##$ABSL= 0
##$ALPHA= 0
##$AQORDER= 0
##$ASSFAC= 0
##$ASSFACI= 0
##$ASSFACX= 0
##$ASSWID= 0
##$AUNMP= <proc_1d>
##$AZFE= 0.1
##$AZFW= 0.1
##$BCFW= 0
##$BC_mod= 2
##$BYTORDP= 0
##$COROFFS= 0
##$CY= -3
##$DATMOD= 1
##$DC= 0
##$DFILT= <>
##$DTYPP= 0
##$F1P= 0
##$F2P= 0
##$FCOR= 1
##$FTSIZE= 16384
##$FT_mod= 6
##$GAMMA= 0
##$GB= 0
##$INTBC= 1
##$INTSCL= 3.241238e-09
##$ISEN= 128
##$LB= 0.25
##$LEV0= 0
##$LPBIN= 0
##$MAXI= 10000
##$MC2= 0
##$MEAN= 0
##$ME_mod= 0
##$MI= 1.114404
##$NCOEF= 0
##$NC_proc= -10
##$NLEV= 6
##$NOISF1= 3.799351
##$NOISF2= 2.8
##$NSP= 0
##$NTH_PI= 0
##$NZP= 0
##$OFFSET= 15.48907
##$PC= 1
##$PHC0= -5299.148
##$PHC1= 6.821927
##$PH_mod= 1
##$PKNL= yes
##$PPARMOD= 0
##$PSCAL= 0
##$PSIGN= 0
##$REVERSE= no
##$SF= 200.130006531173
##$SI= 16384
##$SIGF1= 3
##$SIGF2= 2
##$SINO= 0.751879
##$SIOLD= 32768
##$SREGLST= <19F.Aceton>
##$SSB= 0
##$STSI= 16384
##$STSR= 0
##$SW_p= 3612.71676300578
##$SYMM= 0
##$S_DEV= 0
##$TDeff= 16384
##$TDoff= 0
##$TI= <>
##$TILT= no
##$TM1= 0
##$TM2= 0
##$TOPLEV= 0
##$USERP1= <user>
##$USERP2= <user>
##$USERP3= <user>
##$USERP4= <user>
##$USERP5= <user>
##$WDW= 1
##$XDIM= 16384
##$YMAX_p= 366470760
##$YMIN_p= -5089299
$$ End of Bruker specific parameters
$$ ---------------------------------
##NTUPLES= NMR SPECTRUM
##VAR_NAME=  FREQUENCY,     SPECTRUM/REAL,   SPECTRUM/IMAG
##SYMBOL=    X,             R,               I
##VAR_TYPE=  INDEPENDENT,   DEPENDENT,       DEPENDENT
##VAR_FORM=  AFFN,          ASDF,            ASDF
##VAR_DIM=   16384,         16384,           16384
##UNITS=     HZ,            ARBITRARY UNITS, ARBITRARY UNITS
##FACTOR=    0.220516191357247, 1,           1
##FIRST=     3099.82766798575, 0,            0
##LAST=      -512.889095020026, 0,           0
##MIN=       -512.889095020026, -5089299,    0
##MAX=       3099.82766798575, 366470760,    0
$$ Real data points
##PAGE= N=1
##DATA TABLE= (X++(R..R)), XYDATA
$$ [...]
6047H3632702O12255J415886J623417J330756J277266N86895J607381J034236
6039I3120794J665804L29348K45663J073532J428669M55836J278292O60412J030381
6030A01288731O1546J600439K147925K88048K68017J76616Q22801N40638O89580
6021A07884341J287098P33221k86517P84444J565851J493644O21605n35694j74440
6012A13373553O16533M34161R44570n84750N84243O71548j22521p6201q09548
6003A15031588N95012J7137L81214P20676j046704N36059n08584j729817m26058
5994A13570523j76572K2773L82487J97207K75557p08649j536171o59413m44681
5985A10923061M52951p76184j25860j079494j777545r80956q23097L63851r79795
$$ plain form
6047 83632702 84244957 85660843 87284260 88615016 89892282 90479177 92086558 93120794
6039 93120794 94786598 95115946 95361609 96435141 97863810 98319646 99597938 100258350 101288731
6030 101288731 101350277 102950716 105098641 105386689 105654706 105831322 106654123 107194761 107884341
6021 107884341 109171439 109904660 109618143 110402587 111968438 113462082 114083687 113547993 113373553
6012 113373553 113990086 114424247 115368817 114784067 115368310 116039858 115917337 115841136 115031588
6003 115031588 115626600 115643737 116024951 116745627 115698923 116234982 115726398 113996581 113570523
5994 113570523 113393951 113416724 113799211 113996418 114271975 113563326 112027155 111367742 110923061
5985 110923061 111376012 110599828 110473968 109394474 107616929 106635973 105812876 106176727 105196932
5976A05196932j828447o53200K27952j561024j173487k77461j374684j644168
5968I6912413n03295r29010j216349r55487j770320j270222N6308J46418j227178
5959H9243278j427717q84217o77578j367865j921021r62393l90238p62956k051107
5950G8798186n20760k02180r63349j651148j415575o75885p04781l57690o44709
5941G1662109n90820p90913l90702j293392j407048j909380j007843k58316m59066
5932F3554629p41258r63346j243800p35824J52663j085643j487347j049955j33123
5923E6266996l91274l56662r44655q99973p04061j548736k78871p89238o97948
5914D9655578J50037P37711j133071q77702m55702o0812l86158j811440o55071
$$ plain form
5976 105196932 103368485 102715285 102943237 101382213 100208726 99931265 98556581 96912413
5968 96912413 96409118 95480108 94263759 93308272 91537952 90267730 90324038 90470456 89243278
5959 89243278 87815561 86931344 86253766 84885901 82964880 82002487 81612249 80849293 78798186
5950 78798186 78277426 78075246 77111897 75460749 74045174 73369289 72664508 72306818 71662109
5941 71662109 71071289 70280376 69889674 68596282 67189234 65279854 64272011 64013695 63554629
5932 63554629 62813371 61850025 60606225 59870401 60023064 58937421 57450074 56400119 56266996
5923 56266996 55875722 55519060 54574405 53674432 52970371 51421635 51142764 50353526 49655578
5914 49655578 49805615 50543326 49410255 48532553 48076851 48016039 47629881 45818441 45163370
5905D5163370p05680p98812M8240J137811J91582j587638n50008r18983k60712
5896D1719170l98109k36079l08406j082425L83192j948306p47308J222490O720
5887C8610939j194473L63231l01369j025870m51334P9920n9652j44835j173440
5878C4703117L71169L94807q11542n86062R7919j151453q90293J45538l05510
5869C1967690r55271m87387L82027O01525j8428r68290j00278k26503N70073P01379
5859C1466537k30275j158116M39868k61666j27997j330634J85049N82346P7267
5850B9642379L90098l63757J78901l17395J070368j05060j052086L03147p5506
5841B9671089J193749j429397j125447L17781o98663P99742J02702Q92653J194708
$$ plain form
5905 45163370 44457690 43658878 43707118 44844929 45036511 43448873 42898865 41979882 41719170
5896 41719170 41321061 41084982 40776576 39694151 40077343 38129037 37381729 38604219 38610939
5887 38610939 37416466 37779697 37478328 36452458 36001124 36081044 36021392 35876557 34703117
5878 34703117 35074286 35469093 34657551 34071489 34169408 33017955 32127662 32273200 31967690
5869 31967690 31012419 30525032 30907059 31508584 31490156 30521866 30421588 30195085 30765158 31466537
5859 31466537 31236262 30078146 30518014 30256348 30128351 28797717 28982766 29565112 29642379
5850 29642379 30032477 29668720 29847621 29530226 30600594 30495534 29443448 29746595 29671089
5841 29671089 30864838 29435441 28309994 28627775 27929112 28728854 28831556 29724209 30918917
5832C0918917p66366m29920j46476o85255J67812R54293k00375j110096J119769
5823B9822303J058732O47415m74167P12717M63422o96K39737j81904r3284O29596
5813C2823871J66493k26676K92336K21689j34911J076346J524315m380r90440
5804C4748643j00005n26962J408049J306662M10378J888010M074p53831P51500
5795C9136518R71975L94888J294195k4216l67667J38221m51205P46072K187965
5786D4026746J78487J075750l8200m46978J345580P68407r24900O92003K39951
5777D6916846n36234O12850o94765q80619P58690M8914m07442J155059K34976
5768D7208275k98184j417662r82491n8298P14050o13695j511895M73762r13715
$$ plain form
5832 30918917 30152551 29722631 29576155 28890900 29058712 30013005 29812630 28702534 29822303
5823 29822303 30881035 31528450 31054283 31767000 32230422 32229726 32469463 32287559 32194275 32823871
5813 32823871 32990364 32763688 33056024 33277713 33142802 34219148 35743463 35739083 34748643
5804 34748643 34648638 34121676 35529725 36836387 37246765 39134775 39138849 38385018 39136518
5795 39136518 40108493 40503381 41797576 41773360 41405693 41543914 41092709 41838781 44026746
5786 44026746 44205233 45280983 45242783 44795805 46141385 46909792 45984892 46676895 46916846
5777 46916846 46380612 46993462 46298697 45418078 46176768 46225682 45818240 46973299 47208275
5768 47208275 46910091 45492429 44509938 44451640 45165690 44551995 43040100 43513862 42600147
5759D2600147N67289m92862n33504N12175m10472j177662p64284q98748J59610
5750C9561689l83934o15081k91083j594036o77291q14839j016994j96285m11072
5741C3561074j207386r15001N8650N41331l56036l94736j070238q86028p8482
5732B9253148P2894n46379o46226n67314j13866o28324r95395l57529K50181l91454
5722B5329736o56283p88377o31982L93934j0864Q55696p78336j386279K38026
5713B2565271j199038m69936m51963K67862Q33243o25550o88854p40679L4750
5704A9525106j0670k88943o9563m11456l08429j197855R80031j76863m19503n0539
5694A7571316r97356K50049n29633M64856p10435Q82823m04227j659646K00391
$$ plain form
5759 42600147 43167436 42674574 42141070 42653245 42242773 41065111 40300827 39402079 39561689
5750 39561689 39177755 38562674 38271591 36677555 36000264 35185425 34168431 33972146 33561074
5741 33561074 32353688 31438687 31497337 32038668 31682632 31287896 30217658 29331630 29253148
5732 29253148 29326042 28779663 28133437 27566123 27452257 26823933 25828538 25471009 25721190 25329736
5722 25329736 24673453 23885076 23253094 23647028 23636164 24491860 23713524 22327245 22565271
5713 22565271 21366233 20896297 20444334 20712196 21545439 20919889 20231035 19490356 19525106
5704 19525106 19514436 19225493 19155930 18744474 18436045 17238190 18218221 18041358 17621855 17571316
5694 17571316 16573960 16824009 16294376 16759232 16048797 16931620 16527393 14867747 15068138
5685A5068138J9822n10362M09760K73515n73738N83911J299939q05317l27744
5676A5437924l60356p59889J98610o12687k9580j518105K3590M58825R80235n25056
5666A3293511N96561l25677p02886m24809l76619K32586J5611j32907j50471j549486
5656A0475414P32044K55334M3377J289713p6605q42015o2313Q17787m20294q44212
5646A1368230K58339l22817j22984N80078j208025k19899J53399Q10768K62960
5637A1560049J21307o88231p40715L85351K13133J5758p11736K85576Q61821q5260
5627A1217053k60938J04564o63712J31256q19077p07205J05290k13864J027917
5618I921284o92620J122955k26337M32839n79256K39195O42724j64098j523877
$$ plain form
5685 15068138 15087960 14577598 14987358 15260873 14687135 15271046 16570985 15765668 15437924
5676 15437924 15077568 14317679 14516289 13903602 13874022 12355917 12379507 12838332 13818567 13293511
5666 13293511 13890072 13564395 12861509 12436700 12060081 12292667 12308278 12175371 12024900 10475414
5656 10475414 11207458 11462792 11506169 12795882 12719277 11877262 11814949 12632736 12212442 11368230
5646 11368230 11626569 11303752 11180768 11760846 10552821 10332922 10486321 11297089 11560049
5637 11560049 11681356 10993125 10252410 10637761 10850894 10866652 10154916 10440492 11302313 11217053
5627 11217053 10956115 11060679 10396967 10528223 9709146 9001941 9107231 8893367 9921284
5618 9921284 9228664 10351619 10125282 10558121 9978865 10218060 10860784 10696686 9172809
5609I172809K52328J030677j72897J1465p36529q99789K55638L08301q14058Q6881
5599H494826J116228j36087J55853n47107q28440L97909p33880J526528K6208
5590I472038L42137m73314o30140P67655n56923p13538j78794o02517L86153Q94677
5580H707434M95091o2486j93607l7237j425478K44238n17827J312163j04243m2053
5570H375995M05581m62599K76488n67335J096535k68908k31845K55500m28164
5561H451248K84954j68930O4163Q3326o7821p55802M30820O27953j253181O13322
5551H310052O70596j103107P41748l28999j284907R4331P10206M3562j85768k40434
5541G427280J03984K152073L13675j374062n60204J64397J350459m40081r42634
$$ plain form
5609 9172809 9425137 10455814 10282917 10294382 9557853 8658064 8913702 9222003 8407945 8494826
5599 8494826 9611054 9474967 9630820 9083713 8255273 8653182 7919302 9445830 9472038
5590 9472038 9814175 9340861 8710721 9478376 8921453 8207915 8029121 7426604 7812757 8707434
5580 8707434 9202525 9140039 8946432 8909195 7483717 7727955 7210128 8522291 8418048 8375995
5570 8375995 8781576 8318977 8595465 8028130 9124665 8855757 8623912 8879412 8451248
5561 8451248 8736202 8567272 8631435 8714761 8646940 7891138 8321958 8949911 7696730 8310052
5551 8310052 8980648 7877541 8619289 8290290 7005383 7099714 7809920 7853482 7667714 7427280
5541 7427280 7531264 9683337 9997012 8622950 8062746 8227143 9577602 9137521 8194887
5532H194887k86422L85187k21879n41025J538871p82198k11381J39554Q54832
5523I070426M0968j027776K36147o82123k42427P75327k20186k49462p48960J287153
5513H239087K73333L46573r34504l687q0416k90157N08168p39844j030889K61494
5503F549158M13341J235445L66463j174861L89418L64956l66809m5134n21042
5494G210935o7622K80476o71016J78162K50155R56206J02961N24084j028584m60516
5484G275241L33521q4040Q06988n50327j37565J236851l98399p91615K77579k15131
5474G753103j37327J068278M34682N07378O11608j396531l68781p54422k36614
5465G481374J047967k26644m65357P22236L89855J63116N48150m31882N79687
$$ plain form
5532 8194887 7908465 8293652 8071773 7530748 9069619 8287421 8076040 8215594 9070426
5523 9070426 9111394 8083618 8319765 7637642 7395215 8170542 7950356 7700894 6951934 8239087
5513 8239087 8512420 8858993 7924489 7920802 7840386 7550229 8058397 7318553 6287664 6549158
5503 6549158 6962499 8197944 8564407 7389546 7778964 8143920 7777111 7731977 7210935
5494 7210935 7143313 7423789 6752773 6930935 7181090 8137296 8240257 8764341 7735757 7275241
5484 7275241 7608762 7524722 8331710 7781383 7643818 8880669 8482270 7690655 7968234 7753103
5474 7753103 7615776 8684054 9118736 9626114 10237722 8841191 8472410 7717988 7481374
5465 7481374 8529341 8302697 7837340 8559576 8949431 9112547 9660697 9228815 9808502
5456I808502k77161q96434K58420p15436K42808Q49759M90568L96203o80164o30385
5446H846680P95133L72017j207378q44798J0630R02508R11928p85804Q4119M34334
5436I519369j156317O49877J48120J13814N81932m30179M82148m37307m77563
5427H993894M98632J078067L77240k195024m56985J261498K18732M965M43279
5418A0224298J71783j402233L49952J593453m64117n19156P2246j1140M02341
5409A0417427J47980m84018J37518L14852k67862l49841J005366m46926p67520
5400I706976L22275R91893j058623q04054O88994J375785l93822j088978n84790
5391I155656J060756K02387J025532N49314r38952o36125N20532O19388J77905
$$ plain form
5456 9808502 9531341 8634907 8893327 8177891 8420699 9270458 9761026 10157229 9477065 8846680
5446 8846680 9641813 10013830 8806452 7961654 7972284 8874792 9786720 9000916 9085035 9519369
5436 9519369 8363052 9012929 9161049 9274863 9856795 9426616 9908764 9471457 8993894
5427 8993894 9492526 10570593 10947833 8752809 8295824 9557322 9776054 9781019 10224298
5418 10224298 10396081 8993848 9343800 10937253 10473136 9953980 10026226 10015086 10417427
5409 10417427 10565407 10081389 10218907 10533759 10265897 9916056 10921422 10474496 9706976
5400 9706976 10029251 11021144 9962521 9158467 9847461 11223246 10829424 9740446 9155656
5391 9155656 10216412 10418799 11444331 11993645 11054693 10418568 10939100 11558488 11736393
5382A1736393J043060q06687K8425O31147L28857o28858j201248O4162L97281
5373A1592532k88614O93742Q09319k94615j490798Q47013K79452j205280J276817
5364A2219568O41942R71113j807298o47944l34898L93844J350016k21948M80953
5355A3045348J485393j16100j282562M94615K24299l03224M37337J52933J37199
5346A4275238p5348p90984K59205q22691L66498P23381K30224Q57944K48751p2054
5336A5200164J25856m41198L53109M8627N43249q94665K80450O84073m23870j71743
5326A5304052N77792J65752j014842l57041J452865q4797k9396R8470K82982L12298
5316A6708135o44348k8028R64316N85853Q64395J7359p55736O12276J299920j761680
$$ plain form
5382 11736393 12779453 11972766 12001191 12632338 12961195 12332337 11131089 11195251 11592532
5373 11592532 11303918 11997660 12806979 12512364 11021566 11868579 12148031 10942751 12219568
5364 12219568 12861510 13832623 12025325 11377381 11042483 11436327 12786343 12564395 13045348
5355 13045348 14530741 14414641 13132079 13626694 13850993 13547769 13985106 14138039 14275238
5346 14275238 14199890 13408906 13668111 12845420 13211918 13935299 14165523 15023467 15272218 15200164
5336 15200164 15326020 14884822 15237931 15286558 15829807 14935142 15215592 15899665 15475795 15304052
5326 15304052 15881844 16047596 15032754 14675713 16128578 16043781 16014385 16112855 16395837 16708135
5316 16708135 16063787 16035759 17000075 17585928 18450323 18467682 17711946 18324222 19624142 17862462
5306A7862462J064587o79674q30069O94301N58903M56762P0878L22090K46167
5297A9766407P56790j60427N24885L24175K594O37462M5719n74333n12519N47055
5287B1357808O77209n70814k01709J216833M3509n6540L90974q8972J112521n89351
5277B3291468Q5751P55704L30680P92941M75794r22183j29845M32465N05780M26395
5267B6044950J180372R06961j70017p02032Q80613J13056N78122O82428j40858
5258B9373595k45976M44459n06420J474270J230568o91088K86346R17964O5737
5249C2349455k84889r3974k10036J242556N75578l46453j88259n8455P60446J337891
5239C5083860J261520j23992N4952J84913J42496m63940N07380J524837K1061
$$ plain form
5306 17862462 18927049 18247375 17417306 18111607 18670510 19127272 19198150 19520240 19766407
5297 19766407 20523197 20362770 20887655 21211830 21214424 21851886 21897605 21323272 20810753 21357808
5287 21357808 22035017 21464203 21262494 22479327 22522836 22466296 22857270 22768298 23880819 23291468
5277 23291468 23377219 24132923 24463603 25256544 25732338 24810155 24680310 25112775 25618555 26044950
5267 26044950 27225322 28132283 27962266 27260234 28140847 28253903 28832025 29514453 29373595
5258 29373595 29127619 29572078 29065658 30539928 31770496 31079408 31365754 32283718 32349455
5249 32349455 32064566 31970592 31760556 33003112 33578690 33232237 33043978 32985523 33745969 35083860
5239 35083860 36345380 36221388 36276340 36461253 36603749 36139809 36647189 38172026 38193087
5230C8193087N86219J422990j071297J103194k57045n19347Q43250P77085Q4443
5221D1162579N1262J179627k02135n9137m22885k8636P37371Q54545P26142J14158
5211D4112891l9827P37190O11881k81701N43619J79705K80865J008262K78691
5202D7431576J1148L67818O21178j067603N42327Q22583N29496p87468M43038
5193D8914093J124836p20431K08475J052503l73648M7953O71871J151363K41500
5184E2318515N94517n57j215721J213340J53952L66179M78488O38795m5042O76182
5174E5178648N84708o42826R83057M85428o027q6794J088167p12892P46120j31797
5164E7485792J89372M32435m29543J455051P48704N3975o05176M24868J60140
$$ plain form
5230 38193087 38779306 40202296 39130999 40234193 39977148 39457801 40301051 41078136 41162579
5221 41162579 41213841 42393468 42191333 42132196 41709311 41680675 42418046 43272591 43998733 44112891
5211 44112891 44073064 44810254 45422135 45140434 45684053 45863758 46144623 47152885 47431576
5202 47431576 47442724 47810542 48431720 47364117 47906444 48729027 49258523 48471055 48914093
5193 48914093 50038929 49318498 49526973 50579476 50205828 50253781 50925652 52077015 52318515
5184 52318515 52913032 52912475 51696754 52910094 53064046 53430225 53908713 54547508 54502466 55178648
5174 55178648 55763356 55120530 56103587 56589015 56582988 56496194 57584361 56871469 57617589 57485792
5164 57485792 57675164 58107599 57678056 59133107 59881811 59935786 59330610 59755478 59915618
5155E9915618k3228P0813P50391R81428r44615L45557J327528j029j46164p70723
5145F1505576o04132J101512J258687q2077M95862O18122P99084K08795J93137
5136F5494566N58699M79441r16334N32429L7508J13367O67557K38925O84895M3469
5126F7934522J25222L42713L54636O47166J032042J35671J28337j133818J19495
5117F9685986N88301N77928q62806Q63167j191N13567R34801Q73502K37536j204076
5107G2206715J094347J045164j037506M05254J132865J931388O15722m70624n00178
5098G6423147J182604k1085j191242N27093M84758J692315m06562j66089O65176
5089G9190115R44075j4327K13177k93935M88357N05923R02794N87616k90397l45023
$$ plain form
5155 59915618 59892390 59963203 60713594 61695022 60750407 61095964 62423492 62422463 62276299 61505576
5145 61505576 60901444 62002956 63261643 63179566 63675428 64293550 65092634 65301429 65494566
5136 65494566 66053265 66532706 65616372 66148801 66186309 66299676 66967233 67206158 67891053 67934522
5126 67934522 68059744 68402457 68757093 69404259 70436301 70571972 70700309 69566491 69685986
5117 69685986 70274287 70852215 69989409 70852576 70851385 71364952 72299753 73173255 73410791 72206715
5107 72206715 73301062 74346226 73308720 73713974 74846839 76778227 77393949 76923325 76423147
5098 76423147 77605751 77584666 76393424 76920517 77405275 79097590 78691028 78524939 79190115
5089 79190115 80134190 80119863 80333040 80039105 80527462 81033385 81936179 82523795 82233398 81888375
5079H1888375n59606J413632j67974N27001J674390J29429N16692n74983L60838
5070H5207794N64485R58141M92733J37192m93609j08602J259330l0570m55850
5061H7531044R20974J392511l4825L74220l03872M75617J562855p74357K98791
5052I1442958P12772R12759Q13545P61686P62125j009471J15053J080758P35108
5043I6327293M16651m36294N71706N80675J008849N98874N71502M06876M37444
5034A00483576q15716m7967J90791K39239J154604Q24568o78997J478542Q22960
5025A03651600k91317J015771K17638P31750K92454J19990p9442P77986j10634
5016A06325796N39899Q67171J65481Q67042M42550m3880j56176K3494o0337R21836
$$ plain form
5079 81888375 81328769 82742401 82574427 83101428 84775818 84905247 85421939 84846956 85207794
5070 85207794 85772279 86730420 87223153 87360345 86866736 86758134 88017464 87986894 87531044
5061 87531044 88452018 89844529 89809704 90183924 89880052 90355669 91918524 91144167 91442958
5052 91442958 92155730 93068489 93882034 94643720 95405845 94396374 94511427 95592185 96327293
5043 96327293 96743944 96307650 96879356 97460031 98468880 99067754 99639256 100046132 100483576
5034 100483576 99667860 99619893 99810684 100049923 101204527 102029095 101350098 102828640 103651600
5025 103651600 103360283 104376054 104593692 105325442 105617896 105737886 105658444 106436430 106325796
5016 106325796 106865695 107732866 107898347 108765389 109207939 109164059 109007883 109031377 108971040 109892876
5006A09892876P97509m2863J204350J97868n60947J318717J475669q62422P23157
4997A14143914j16506n20163J109179P86224l45717P14760L45099N0758J158799
4988A17326347O07251O16307K86764r37163M24014Q29649R4434L72739J429226
4979A21049568L29583L9355r982L73288k1852J578836J018171P01200j16431Q24974
4969A25766710M53595m15053o14910L55301J571971N43768L54165N05394J169010
4960A29689951k26774K61581K107696Q32456l92470J347718J37644M24697M82243
4951A34664742Q32892K21365Q20834Q18086o6885J7160J240667R45745P82349
4942A40276955L92709J122757M53554J250817J114685O35618k84245k98108J129737
$$ plain form
5006 109892876 110690385 110647522 111851872 112049740 111488793 112807510 114283179 113420757 114143914
4997 114143914 114027408 113507245 114616424 115402648 115056931 115771691 116116790 116167548 117326347
4988 117326347 117933598 118549905 118836669 117899506 118323520 119153169 119247603 119620342 121049568
4979 121049568 121379151 121418506 121408524 121781812 121759960 123338796 124356967 125058167 124941736 125766710
4969 125766710 126220305 125805252 125190342 125545643 127117614 127661382 128015547 128520941 129689951
4960 129689951 129463177 129724758 131832454 132664910 132272440 133620158 133757802 134182499 134664742
4951 134664742 135497634 135718999 136539833 137357919 137291034 137308194 138548861 139494606 140276955
4942 140276955 140669664 141792421 142245975 143496792 144611477 145247095 144962850 144664742 145794479
4933A45794479J228262J015269J129547Q41509J041525L67078m32883L56497R39525
4924A52280808M32149P60572J088897K26417R65083K33667Q5563Q33628J094200
4915A58000984j85332J0370K010611L87121J108728J379730p43421m42265O79674
4906A62206200J254617n74165J008193K21113J51515Q69126N19921M60090Q2774
4897A66199384P65824j012302L51246Q09078P27111J041529k15750J93456K55136
4888A69114712o00702o34300R52022N14550j6897n3153j38568M65351Q84857J36392
4878A70624264J078898n95636j785618L23080J138165j60187j41261N37472M90854
4869A71510031J177845j052298m42694L27535P07509l16251k43377Q77971m53865
$$ plain form
4933 145794479 147022741 148038010 149167557 150009066 151050591 151417669 150984786 151341283 152280808
4924 152280808 152712957 153473529 154562426 154788843 155753926 155987593 156073156 156906784 158000984
4915 158000984 157815652 157826022 159836633 160223754 161332482 162712212 161968791 161526526 162206200
4906 162206200 163460817 162886652 163894845 164115958 164267473 165136599 165656520 166116610 166199384
4897 166199384 166965208 165952906 166304152 167113230 167840341 168881870 168666120 168859576 169114712
4888 169114712 168514010 167879710 168831732 169346282 169329385 169276232 169137664 169603015 170487872 170624264
4878 170624264 171703162 171107526 169321908 169644988 170783153 170622966 170481705 171019177 171510031
4869 171510031 172687876 171635578 171192884 171520419 172227928 171911677 171668300 172546271 172092406
4860A72092406O95832p28386j05319N35986o49597n68155M5548k96136L74210
4851A71396389J429421j333090m37543k67493r28634K04126Q5230l30967j131937
4842A68685502j310196J38086J009977n14584m98286j116869r57981k14586q34471
4833A64386592m09794k60812j23380r22706j160576R05092l54756k09432k164579
4824A59685649n35910K76716j043003j111023j226930k491850j311885O29499
4816A52871263q560L95741O40083K94277j252455l34921j029349K4870j117141
4807A50483808j32047j391669M7785J16983r90030R49362k11468k47343l21393
4798A48303988J048682l09221j72286O60637j537293j45878P325P7928J183294
$$ plain form
4860 172092406 172788238 172059852 171954533 172490519 171840922 171272767 171318315 171022179 171396389
4851 171396389 172825810 171492720 171055177 170787684 169859050 170063176 170148406 169817439 168685502
4842 168685502 167375306 167513392 168523369 168008785 167510499 166393630 165435649 165221063 164386592
4833 164386592 163976798 163715986 163592606 162669900 161509324 162414416 162059660 161850228 159685649
4824 159685649 159149739 159426455 158383452 157272429 156045499 153553649 152241764 152871263
4816 152871263 152862703 153258444 153898527 154192804 152940349 152605428 151576079 151600949 150483808
4807 150483808 150351761 148960092 149007877 149124860 148134830 149084192 148872724 148625381 148303988
4798 148303988 149352670 149043449 148871163 149531800 147994507 147848629 147855954 147933882 149117176
4789A49117176K39311O62004P99662j56246k79052O977O89389J215505J638389
4780A53933115j68797q4649l52328J04561J102481J183156P02404N65937M97711
4771A57483591J74691P30400M52096J213772K33445O04161J913241J571206J388357
4762A65764960J244161K89942o52946J479362K129788R86924N6733P6603J087626
4753A72463153J202501K476416r9112l87052K492881K328049R11346R27723J276370
4744A83592275j58137n42031M00556O66261J995727L45423J357906J393616K75738
4735A89327334P76966j07301O4205O5812J027281J431039L07504q10298P30606
4726A92813148J079092m08284J018524P04372J061786m30811n6227l12584r96190
$$ plain form
4789 149117176 149356487 150018491 150818153 150661907 150382855 150389832 151079221 152294726 153933115
4780 153933115 153764318 153679669 153327341 153431902 154534383 155717539 156419943 156985880 157483591
4771 157483591 157658282 158388682 158840778 160054550 160287995 160892156 162805397 164376603 165764960
4762 165764960 167009121 167299063 166646117 168125479 170255267 171242191 171298924 171375527 172463153
4753 172463153 173665654 176142070 176042958 175655906 178148787 180476836 181388182 182315905 183592275
4744 183592275 183434138 182892107 183292663 183958924 185954651 186300074 187657980 189051596 189327334
4735 189327334 190104300 189996999 190061204 190127016 191154297 192585336 192892840 192082542 192813148
4726 192813148 193892240 193483956 194502480 195206852 196268638 195837827 195781600 195469016 194472826
4717A94472826O44252j716511o12799J219284q58829n80136j247450m52445k60123
4708A90608069p87371K9405K2115k32996k890323K4805j256803j706451q3385
4699A83727065j418189k199643n60969q83394j458297j515617j614369j089303
4691A72987284q76065n74291k240672k722784m33783o02806p00714r09434j042509
4682A62884226j144340j724284k556951k388774j772384j149149o67508j027560
4674A50453276k873573j533070q32737j402375q87223j536567p94444j669106
4666A38924181j017613j982540j357179j564688q70022n33784j261914j444893
4658A28891548o54275K77158j580709j104503r5288q21733o99603j028457k028229
$$ plain form
4717 194472826 195117078 193400567 192787768 194007052 193148223 192568087 191320637 190868192 190608069
4708 190608069 189820698 189850103 189872218 189639222 186748899 186773704 185516901 183810450 183727065
4699 183727065 182308876 180109233 179548264 178664870 177206573 175690956 174076587 172987284
4691 172987284 172111219 171536928 169296256 166573472 166139689 165536883 164836169 163926735 162884226
4682 162884226 161739886 160015602 157458651 155069877 153297493 152148344 151480836 150453276
4674 150453276 147579703 146046633 145213896 143811521 142924298 141387731 140593287 138924181
4666 138924181 137906568 135924028 134566849 133002161 132132139 131598355 130336441 128891548
4658 128891548 128237273 128514431 126933722 125829219 125733931 124912198 124212595 123184138 121155909
4649A21155909j130119j46073q18020j049623j56853m51324q29709q43305l77147
4640A15353736k06243j864972K78893k16325J27469j53996o14297j087053j064246
4631A10552966M67694j04712j375967m44313J05408r22232J93057j111164j421863
4622A05938874j84822P5965l58400N28425n77459j642431j968424m12994J079989
4613A02478723j001374k44574l79382j040176k59403j386552l68994j56470q56942
4604I6784856j457619p13287M88235j052037k350144r09803R26094j192281j661529
4595H8862485o42537n3948L21174k034903k177968r1723j529397j104161j116592
4586H0432430m92368k80501j088351n11000r00993o02488j879883k95587J13676
$$ plain form
4649 121155909 120025790 119879717 119061697 118012074 117855221 117403897 116574188 115730883 115353736
4640 115353736 115147493 113282521 113561414 113345089 113472558 113318562 112704265 111617212 110552966
4631 110552966 111020660 110915948 109539981 109095668 109201076 108278844 108471901 107360737 105938874
4622 105938874 105754052 105830017 105471617 106000042 105422583 103780152 101811728 101398734 102478723
4613 102478723 101477349 101232775 100853393 99813217 99553814 98167262 97798268 97641798 96784856
4604 96784856 95327237 94613950 95102185 94050148 91700004 90790201 91716295 90524014 88862485
4595 88862485 88219948 88166000 88487174 86452271 84274303 84182580 82653183 81549022 80432430
4586 80432430 79940062 79659561 78571210 78060210 77159217 76556729 74676846 74381259 74494935
4577G4494935p06790k460562r27040j387031j99015P03441k083673o99457k35035
4568F6499773M91392l06929j506890j113284j50604j036751l88643p98325j486007
4559F0203732p91203j39395m32454M55228j404407j91948o21829n13218k84672
4550E6279834j110856Q5356j140117j429684p85227J791854j256500m23346l29610
4541E1681704j291552M88052J63869p28656r42447m38255m0890j113751m06321
4532D7371753O90751j88904n36101o59817o9116J25448j153494r42518J41940
4523D4779942N07565q01586l09688r16212q23189N61252k65653L88032p99160
4514D2321303r289J038984l15243j05101p59209o10588m04531n51480m78430j141384
$$ plain form
4577 74494935 73788145 71327583 70400543 69013512 68814497 69517938 67434265 66734808 66499773
4568 66499773 66991165 66684236 65177346 64064062 63913458 62876707 62488064 61689739 60203732
4559 60203732 59412529 59273134 58840680 59295908 57891501 57699553 57077724 56564506 56279834
4550 56279834 55168978 55254334 54114217 52684533 51899306 53691160 52434660 52011314 51681704
4541 51681704 50390152 50878204 51042073 50313417 49370970 48932715 48891825 47778074 47371753
4532 47371753 48062504 47873600 47337499 46677682 46608566 46734014 45580520 44638002 44779942
4523 44779942 45287507 44485921 44176233 43260021 42436832 42998084 42732431 43120463 42321303
4514 42321303 42312014 43350998 43035755 42930654 42171445 41560857 41156326 40604846 40126416 38985032
4504C8985032j098411J486034p58984j264295O06250L89312k70586n35784m71358
4495C7067210m96554r3378M54266M52786j264518o4373l09858K90495q64144q99442
4485C4272490M84415j91129P6620j04564L63934j248628r66491K60383n60584
4476C2386446N66690q70150n33638J83578J18642l74272k74303m62714r7193N96050
4466C1239136J91186j009348O45098l20110j233607J13586j17492l41576O3144
4457B9230017L92893q38795J213767K34721j186400j40363J24065M02623m11320
4448B9021208l08361p09045J136996N18791o12749l61515l36225K55859q81435
4439B7723524J83089M91958k66200l70345J382198o40644m61620j7047O52931
$$ plain form
4504 38985032 37886621 39372655 38613671 37349376 37955626 38344938 38074352 37538568 37067210
4495 37067210 36570656 36477278 36931544 37384330 36119812 36055439 35745581 36036076 35171932 34272490
4485 34272490 34756905 34565776 34642396 34537832 34901766 33653138 32686647 32947030 32386446
4476 32386446 32953136 32082986 31549348 31732926 31851568 31477296 31202993 30740279 30643086 31239136
4466 31239136 31430322 30420974 31066072 30745962 29512355 29625941 29508449 29166873 29230017
4457 29230017 29622910 28784115 29997882 30232603 29046203 28905840 29029905 29432528 29021208
4448 29021208 28712847 28003802 29140798 29659589 29046840 28685325 28349100 28604959 27723524
4439 27723524 27906613 28398571 28132371 27762026 29144224 28503580 28041960 28024913 28677844
4430B8677844M20950q08613J26502o10019l66485N25589q19116l05735L71822
4421B7212739J132941k52394p37333J43458P74681M54905k262K74972l08352j57314
4411B8536041J05176k78762q42589m83820J63957P88154K72527K71815L5963p36554
4401B7831908j030814N12643o6055O33709p66104R95639J103571O98618o61032
4392B9252083M7093k54794n51145J438817k22616Q06440K14851m14263n53359
4383B9763107L68101j141896R2299k74130K1457J150088N55122J089880m70318
4374C1153710J28525K0923k33494k89896L9894j42835J156377J34748P78159J110805
4364C3856916r57227j314841M11003Q66934L64968r0508P91082k01109l14548
$$ plain form
4430 28677844 29098794 28290181 28416683 27806664 27440179 27965768 27146652 26840917 27212739
4421 27212739 28345680 28093286 27355953 27499411 28274092 28728997 28726735 29001707 28693355 28536041
4411 28536041 28641217 28362455 27519866 27036046 27200003 27988157 28260684 28532499 28568462 27831908
4401 27831908 26801094 27313737 27247682 27881391 27115287 28110926 29214497 29913115 29252083
4392 29252083 29299176 29044382 28493237 29932054 29709438 30515878 30730729 30316466 29763107
4383 29763107 30131208 28989312 29081611 28807481 28828938 29979026 30534148 31624028 31153710
4374 31153710 31282235 31303158 31069664 30779768 30819662 30676827 31833204 31967952 32746111 33856916
4364 33856916 32899689 31584848 31995851 32862785 33227753 33137245 33928327 33727218 33412670
4355C3412670Q9684m59971P72037J26527J30712l30077J348471j82480Q73029
4346C5780602N38857P14621n63877m42221K99307j059749j07458M31246J043042
4337C6634370k11228l74769J37624m10478k64540L46292r3020j707Q94426R62413
4327C7619383k15826R5266q4656Q78329J1739q21940O61273R3829p16721O77062
4317C8197738O93324J159756K29771j465272K43008O0104q09879L43346K71362
4308C8923258m93865j155236N26712N66800p64631Q73352N90692j01061j98745
4299C8767276l74603L17875J785666l98527k11258P9306J062407k31867n30123
4290D0266152N62711p97759j436070J43491P26002o5381j011505l31866J65051
$$ plain form
4355 33412670 33502354 33042383 33814420 33940947 34071659 33741582 35090053 34907573 35780602
4346 35780602 36319459 37034080 36470203 36027982 36327289 35267540 35160082 35591328 36634370
4337 36634370 36423142 36048373 36185997 35775519 35510979 35857271 35764251 35762544 36656970 37619383
4327 37619383 37403557 37498823 37414167 38292496 38304235 37482295 38143568 38237397 37520676 38197738
4317 38197738 38891062 40050818 40280589 38815317 39058325 39118429 38308550 38651896 38923258
4308 38923258 38429393 37274157 37800869 38367669 37603038 38476390 39067082 38966021 38767276
4299 38767276 38392673 38710548 40496214 40097687 39886429 39965735 41028142 40796275 40266152
4290 40266152 40828863 40031104 38595034 38738525 39464527 39399146 38387641 38055775 38220826
4281C8220826L31773N47069N43521J57204N48869M39897R2303n63544P2718P76429
4271D1167065N1743P2074p94539N81820J21707l7017k05022J0623q57604o65429
4261C9445421M20061Q45699Q41895o50647J91046m85574j286382J148038L44260
4252D0813817K52359K86896J9067J319505q44220O95741q3742p33639Q22637o86773
4242D1861648l25026K5103n98925K99720J18615Q22986Q91052m657N77167k46900
4232D3420783J17654j99979k72907M60782O94268O48308r11906k7480N44749M811
4222D4479083O19097r8067R64035Q42509K06720L94968m16775m28890J097804
4213D7660484n39450Q23483k977J187704P89835k9826J064070J16380j104649
$$ plain form
4281 38220826 38552599 39099668 39643189 39800393 40349262 40789159 40881462 40317918 40390636 41167065
4271 41167065 41218808 41290882 40496343 41078163 41199870 41162853 40957831 40968454 40110850 39445421
4261 39445421 39865482 40711181 41553076 40902429 41093475 40607901 39321519 40469557 40813817
4252 40813817 41066176 41353072 41372139 42691644 41847424 42543165 42459423 41725784 42548421 41861648
4242 41861648 41536622 41561725 40962800 41262520 41381135 42204121 43095173 43090516 43667683 43420783
4232 43420783 43538437 43338458 43065551 43526333 44220601 44868909 43957003 43929523 44474272 44479083
4222 44479083 45098180 45000113 45964148 46806657 47013377 47408345 46991570 46562680 47660484
4213 47660484 47121034 47944517 47941540 49129244 49919079 49889253 50953323 51069703 49965054
4204D9965054O44287Q29886J152916K49692Q94995L91082M84947k25141Q46965
4195E5234683J03999Q78092J371086J47174r3504k02989R03943J256936R39708
4186F0539128R4954J566193N97675k6977O75213J668195N47847n24946j56923
4177F4980359K851711J956888M85133n95770J694920J474304J159738R70304p7250
4168G4900337L76117M95030Q21454J394319J019749J464248J626747J262993J917376
4159H5278370R87419l62691P35735J081986J044361K239444J433040R11457K006786
4150I5355907J272924K374462K76797Q38973J367475K024526M93064J112050J533482
4141A06649660N19723K276847J516718O83476K761585J703320R16928K090684
$$ plain form
4204 49965054 50609341 51439227 52592143 52841835 53736830 54127912 54612859 54387718 55234683
4195 55234683 55338682 56216774 57587860 57735034 57641530 57438541 58342484 59599420 60539128
4186 60539128 60634082 62200275 62797950 62770973 63446186 65114381 65662228 65137282 64980359
4177 64980359 67832070 69788958 70274091 69678321 71373241 72847545 74007283 74977587 74900337
4168 74900337 75276454 75771484 76592938 77987257 79007006 80471254 82098001 83360994 85278370
4159 85278370 86265789 85903098 86638833 87720819 88765180 91004624 92437664 93349121 95355907
4150 95355907 96628831 99003293 99280090 100119063 101486538 103511064 104004128 105116178 106649660
4141 106649660 107169383 109446230 110962948 111646424 114408009 116111329 117028257 119118941
4133A19118941J985565K205537J144616J336336K177580K695455K141482J329292
4125A34134804O57406R80903K462665K436182J358666J574610J115477K578310
4117A47299023K245451K140690K172099J207753J515624K151972K722298J488432
4109A62943342J509983K714060J386919J513892K035653J602238N51383K375749
4101A76633219K255458O31576L093028J810020K994300K254046R45350K707821
4093A93324818J729016J479286J741470O37301K082433K574096K541622J631282
4085B07741324J261311J954263J571160J448209K521589J472075J475294J150793
4077B20596018J149331K969071J470177J682986K121583J304825J168413J319340
$$ plain form
4133 119118941 121104506 123310043 124454659 125790995 127968575 130664030 132805512 134134804
4125 134134804 134792210 135773113 138235778 140671960 142030626 143605236 144720713 147299023
4117 147299023 149544474 151685164 153857263 155065016 156580640 158732612 161454910 162943342
4109 162943342 164453325 167167385 168554304 170068196 172103849 173706087 174257470 176633219
4101 176633219 178888677 179520253 182613281 184423301 187417601 189671647 190616997 193324818
4093 193324818 195053834 196533120 198274590 198911891 200994324 203568420 206110042 207741324
4085 207741324 209002635 210956898 212528058 213976267 216497856 217969931 219445225 220596018
4077 220596018 221745349 224714420 226184597 227867583 229989166 231293991 232462404 233781744
4069B33781744R68424K089734K587946Q33752N36074J92116N8647K225428J665760
4060B44939625P84588J337421J468405J120496J210648N07075J019317N28904
4052B52916479K27325N42166J555519l35155J204429J643565J274353o7035P49373
4043B59711019P21633j53426O69997J96184o64879J192985J193604M26831O03157
4034B63897105J142278m95322n0731l72962l29742N03311o40950N53449J084143
4025B65290579q39805j696241p10318L61366m10951j01313l98226j56038o85114
4016B60653939j779240O7239K73633j631030j422110N23256j111373l01094r57116
4007B54316104m0963o07192l78514j016820j438822j188685o49216J24661Q0199
$$ plain form
4069 233781744 234750168 236839902 239427848 240261600 240797674 240989790 241048437 243273865 244939625
4060 244939625 245724213 247061634 248530039 249650535 250861183 251368258 252387575 252916479
4052 252916479 253143804 253685970 255241489 254906334 256110763 257754328 259028681 258961646 259711019
4043 259711019 260432652 260279226 260949223 261145407 260480528 261673513 262867117 263293948 263897105
4034 263897105 265039383 264544061 264493330 264120368 263790626 264293937 263652987 264206436 265290579
4025 265290579 264450774 262754533 262044215 262405581 261994630 261893317 261495091 261339053 260653939
4016 260653939 258874699 258941938 259215571 257584541 256162431 256685687 255574314 255273220 254316104
4007 254316104 254275141 253667949 253289435 252272615 250833793 249645108 248995892 249120553 249200752
3998B49200752j587517j668366j645291m60095p71026j124618j532839q49819
3990B39561181n42966j835556J6260r38316q41436j830626j764080j135113q4785
3981B30604563J21787j453956q74362j714929n52299r67176p55434j392828j860514
3972B21154852m27965j564388q62650p60259j437834q17292j384332o70977k29595
3963B12999560j966612j937894m46357k116513j041230p76055j181171k101768
3955B01431960j829728j689978n10363N95217j524521n61669j861313j246760
3947A92802845j169916j789475q86091r64462j446732j228061R2687j883042j204849
3938A82322904j520570j128543n24392q53387K1604j421208j235773o95084k135212
$$ plain form
3998 249200752 247613235 245944869 244299578 243839483 243068457 241943839 240411000 239561181
3990 239561181 239018215 237182659 237198919 236260603 235419167 233588541 231824461 230689348 230604563
3981 230604563 230726350 229272394 228398032 226683103 226130804 225163628 224408194 223015366 221154852
3972 221154852 220726887 219162499 218299849 217539590 216101756 215284464 213900132 213229155 212999560
3963 212999560 211032948 209095054 208648697 206532184 205490954 204714899 203533728 201431960
3955 201431960 199602232 197912254 197401891 197997108 196472587 195910918 194049605 192802845
3947 192802845 191632929 189843454 188957363 187992901 186546169 185318108 185410795 183527753 182322904
3938 182322904 180802334 179673791 179149399 178296012 178317616 176896408 175660635 174965551 172830339
3929A72830339k96065j540796p13312l37139p57207J18586j056229k66964q92722
3920A67088491j266044j004271l68646r09613j232739r487J94416m64055J08703
3911A62136755l36126l76773K04310j99881j62191p571m73787m80458l47303k59540
3901A59697435k63784M64618l07049R06571N55331n86182l76534M40381P67886
3892A61298673P41508p60661K52320j18708K14193J812566M11117m94117l27886
3883A63029005J168807J034784P56806L5996K77982R31066N27182m42935Q9595
3874A67408288J106980M30739J453660M83814j95316J197062Q56551l38146M47873
3865A72851505J149176K027175N10200M83725p78739j0595O80894K08775O69613
$$ plain form
3929 172830339 172534274 170993478 170280166 169943027 169185820 169304406 168248177 167981213 167088491
3920 167088491 165822447 164818176 164449530 163539917 162307178 162297691 162492107 162028052 162136755
3911 162136755 161800629 161423856 161628166 161428285 161266094 161258523 160784736 160304278 159956975 159697435
3901 159697435 159433651 159898269 159591220 160497791 161053122 160466940 160090406 160530787 161298673
3892 161298673 162040181 161279520 161531840 161413132 161627325 163439891 163851008 163356891 163029005
3883 163029005 164197812 165232596 165989402 166025398 166303380 167234446 167761628 167318693 167408288
3874 167408288 168515268 168946007 170399667 170883481 170688165 171885227 172741778 172403632 172851505
3865 172851505 174000681 176027856 176538056 177021781 176243042 176232447 176913341 177122116 177791729
3856A77791729l83613P79005J470912J141487j083916J085337N75073K90294q57446
3847A80808862n82921L96711k85765R22031P9046Q00134J13310n7799J85120j038047
3837A81340682M9311J437207k45339j06898k26190r17927k38897j05278l17435
3828A80669236M19526K69594k81316n84330R78022n33883Q48937N41068j096197
3819A81230657o4201l44424j533000j482328k22027j177739r18028Q18995N18832
3810A76826737r49137j638910m24436j43913r47820o48401J010925j257581j667276
3801A70160188M53091j838562j561466n1346q65521p29280n81047j956069l20702
3792A62709286K30200j185361k055842m33511n99518j446062j886232k497037
$$ plain form
3856 177791729 177408116 178187121 179658033 180799520 179715604 180800941 181376014 181666308 180808862
3847 180808862 180225941 180622652 180336887 181258918 181337964 182138098 182251408 182193609 182378729 181340682
3837 181340682 181389993 182827200 182581861 182474963 182248773 181330846 181091949 180986671 180669236
3828 180669236 181088762 181358356 181077040 180492710 181470732 180936849 181785786 182326854 181230657
3819 181230657 181166456 180822032 179289032 177806704 177584677 176406938 175488910 176307905 176826737
3810 176826737 175877600 174238690 173814254 173670341 172722521 172074120 173085045 171827464 170160188
3801 170160188 170613279 168774717 167213251 167161905 166296384 165567104 164986057 163029988 162709286
3792 162709286 162939486 161754125 159698283 159264772 158665254 157219192 155332960 152835923
3784A52835923j630626L89292q50398j695690j374571p96175p70832o74866k174945
3775A43257112j346136l34135j154229r14067l93821j902828R7543o14888j777622
3766A34916929j377989P2105j034152j122054o13464k10741l47920n66139j425033
3757A28291542j565477j352351m93925k98870j120649o90617m98302j53634o48283
3748A21469434j456743n25384P86226p87342q98663L18874k94849p24552l95812
3739A17491189j1076j312515j436645O03396n15612j422784J08568M63379n46855
3730A13421045m89801K62999K22534K5642M56078r94514Q0943M83049k37184n38167
3720A12692624M55169l81412j35934j24840k66704n74054M91M29284k5691j72249
$$ plain form
3784 152835923 151205297 151594589 150744191 149048501 147673930 146877755 146106923 145432057 143257112
3775 143257112 141910976 141576841 140422612 139508545 139114724 137211896 137309439 136694551 134916929
3766 134916929 133538940 133611045 132576893 131454839 130841375 130630634 130282714 129716575 128291542
3757 128291542 126726065 125373714 124879789 124580919 123460270 122769653 122271351 122117717 121469434
3748 121469434 120012691 119487307 120273533 119486191 118587528 118906402 118611553 117887001 117491189
3739 117491189 117480113 116167598 114730953 115334349 114818737 113395953 113504521 113967900 113421045
3730 113421045 112931244 113194243 113416777 113442419 113898497 112903983 112984926 113467975 113230791 112692624
3720 112692624 113147793 112766381 112630447 112505607 112238903 111664849 111665340 112094624 112068933 111896684
3710A11896684j03784n70880O66808n63891K68055P49504N50395J81747m92585
3701A12582053M32928r05879r99134N51562R05007P10516p07737j11425M63417
3692A12921308n6284j166259N42278K40052m1641M22J636156K80347q94972j68628
3682A13292779J34226N17622m84842j91110m75152M0247N72899M12451n15317
3673A13303803l96819Q08254q0619L53065L68202o7168Q45584M08324K53573L62011
3663A16158210Q3703j014663m08534O95509P15203J80471O24398r87942j027454
3654A15018901o19086M41328Q87437O04013k26387Q74878M90987l92035j97609
3645A16882427R14771N6112r44733L27765K8602J394147J27742l96676P58915
$$ plain form
3710 111896684 111792900 111222020 111888828 111324937 111592992 112342496 112892891 113074638 112582053
3701 112582053 113014981 112109102 111109968 111661530 112566537 113277053 112569316 112457891 112921308
3692 112921308 112865024 111698765 112241043 112481095 112439454 112439876 114076032 114356379 113461407 113292779
3682 113292779 113427005 113944627 113459785 113268675 112793523 112833770 113406669 113819120 113303803
3673 113303803 112906984 113715238 113634619 113987684 114355886 114288718 115134302 115542626 115796199 116158210
3663 116158210 116241913 115227250 114818716 115514225 116229428 116409899 117034297 116046355 115018901
3654 115018901 114399815 114841143 115728580 116332593 116106206 116981084 117472071 117080036 116882427
3645 116882427 117797198 117853310 116908577 117236342 117264944 118659091 118786833 118390157 119149072
3636A19149072j056309P94812j01041N65299M07868J53593N19968k00722m72644
3627A19759896p0387J584822J100213j028406N75995O22725J246715J05891j105701
3618A22791763Q16520K62250k38680j014652R74980P29983L1778Q9848Q66945
3609A25310735N12553N39558J88954J178115j20504N57968P70670k33512J473994
3600A30178531J218006q94813J638866J430743j7941j028997O65921J342360M74716
3591A35007392n78415K28661K512340k3256J486365R77991O78296R9418l6181
3582A40352611J09583K406499M63958N19153K261953K098747J199432L03021O47246
3573A50362203J174674J524849J023780R81449J762264K378102J312729J825098
$$ plain form
3636 119149072 118092763 118887575 118786534 119351833 119759701 119913294 120433262 120232540 119759896
3627 119759896 119689509 121274331 122374544 121346138 121922133 122544858 123791573 123897464 122791763
3618 122791763 123608283 123870533 123631853 122617201 123592181 124322164 124353942 124443790 125310735
3609 125310735 125823288 126362846 126551800 127729915 127609411 128167379 128938049 128704537 130178531
3600 130178531 131396537 130501724 132140590 133571333 133553392 132524395 133190316 134532676 135007392
3591 135007392 134428977 134657638 137169978 137146722 138633087 139611078 140289374 140388792 140352611
3582 140352611 140462194 142868693 143332651 143851804 146113757 148212504 149411936 149714957 150362203
3573 150362203 151536877 153061726 154085506 155066955 156829219 159207321 160520050 162345148
3565A62345148K455282M26510J965373O11566K211907J695232J007448J648833
3557A74367299J271067L038386J980331J975465K802061L319938K045772J466209
3549A92266528L116763K352434K476765J844310K205425L509554M532670K944309
3541B15248758K220423K262372L320856L734729J795580L373474L860501L783223
3533B39599916L753419L729741L551721M221617L316401L287641L651797M989268
3525B70101521L643403L487096K630194M509104M128416M657668K055361L966750
3517B99179513L655608M901707L414878K811619L711184L964785K693718L007809
3509C27340821M120534K621271L515093L864653K240760J622484K518296J465828
$$ plain form
3565 162345148 164800430 165226940 167192313 167803879 170015786 171711018 172718466 174367299
3557 174367299 175638366 178676752 180657083 182632548 185434609 188754547 190800319 192266528
3549 192266528 195383291 197735725 200212490 202056800 204262225 207771779 212304449 215248758
3541 215248758 217469181 219731553 223052409 226787138 228582718 231956192 235816693 239599916
3533 239599916 243353335 247083076 250634797 254856414 258172815 261460456 265112253 270101521
3525 270101521 273744924 277232020 279862214 284371318 288499734 293157402 295212763 299179513
3517 299179513 302835121 307736828 311151706 313963325 317674509 321639294 324333012 327340821
3509 327340821 331461355 334082626 337597719 341462372 343703132 345325616 347843912 349309740
3501C49309740K394921K318163L191466L93395P02209M57839P55234K297166P42948
3492C62563081J98728J374054L67397j23707J017908p96445L79448J490296l20954
3483C66149806m53130n97580j038692N1761l51126m82862n69133r01414m25822
3474C61381808j580420q02208J51323p34944l92367j074278n02567l91904o18216
3465C55436227q79583j808676J31791k01695j321385j096964n32939n67329k98584
3456C48860863j735525P7971j057867K22866j272330q25191r17279j44648o96523
3447C42512337o89363j465747K2330q74293j267121r69325q04336l13617o20847
3438C35530018j213560j546929o35442k083710r71182q43446l61133q93802j228673
$$ plain form
3501 349309740 351704661 354022824 357214290 357607685 358309894 358767733 359522967 361820133 362563081
3492 362563081 362761809 364135863 364503260 364379553 365397461 364601016 364980464 366470760 366149806
3483 366149806 365696676 365099096 364060404 364112165 363761039 363278177 362709044 361807630 361381808
3474 361381808 359801388 358999180 359150503 358415559 358023192 356948914 356446347 356054443 355436227
3465 355436227 354556644 352747968 352879759 352678064 351356679 350259715 349726776 349159447 348860863
3456 348860863 347125338 347203309 346145442 346368308 345095978 344270787 343353508 343208860 342512337
3447 342512337 341822974 340357227 340379557 339505264 338238143 337268818 336464482 336150865 335530018
3438 335530018 334316458 332769529 332134087 330050377 329079195 328235749 327874616 326980814 325752141
3429C25752141n00796j767022j149714m65064p57502P47301j95145j082385r40540
3420C19641274j016726j239962J12872j588543j774027o31165r585o0781Q9394
3411C13522751j814415q80351j053205o48112q18457j401991j427019l3568q94194
3402C04551439l0343N22594r65973j159180Q30648m06933n26936j50143j009658
3393C01655515P10060q32701L50036p9424O85191j74024j039245J193869l51147
3384C02118130r45490p74498K35478J376911k782k38223l71150J657291R24858
3375C03980525O2903J81501M65866r0067j79955J355741l46266J209617R58130
3366C07597995j4139J006244J209394J178862k11222Q66585k22217N52861K67328
$$ plain form
3429 325752141 325251345 323484323 322334609 321869545 321112043 321859344 321664199 320581814 319641274
3420 319641274 318624548 317384586 317497458 315908915 314134888 313503723 313494138 313433357 313522751
3411 313522751 311708336 310827985 309774780 309126668 308308211 306906220 305479201 305445633 304551439
3402 304551439 304521096 305043690 304077717 302918537 303749185 303342252 302815316 302665173 301655515
3393 301655515 302365575 301532874 301882910 301803486 302488677 302314653 301275408 302469277 302118130
3384 302118130 301172640 300398142 300633620 302010531 302007749 301769526 301398376 303055667 303980525
3375 303980525 304043428 304224929 304690795 304600728 304420773 305776514 305430248 306639865 307597995
3366 307597995 307583856 308590100 309799494 310978356 310767134 311633719 311411502 311964363 312231691
3357C12231691J009559J437708M47959L68168l57323M20982M26790M6066n36261
3348C15495339M17923N03985K28521K32748l40098m15021j319603r75294J375125
3339C15203625J96588j270851m85886l4119L37777P86403r37148N4808p8844N38490
3329C14310843n89875j82073j008961j104990K64489K75436K56750J14923J5051
3320C12351593L90753M59409J39901q1905o6638M873m08571J097547K331188J88518
3310C16406668J98668O59976R13786J09098L03864M65010R23274R29274M67455
3301C21377073M19262N35904J027521K42743M44085J54544J322436l18514L55996
3292C25561050M50802J235173j50331o87041N55847J357049j433553j665645R38810
$$ plain form
3357 312231691 313241250 314678958 315126917 315495085 315137762 315558744 315985534 316031600 315495339
3348 315495339 315913262 316417247 316645768 316878516 316538418 316123397 314803794 313828500 315203625
3339 315203625 315400213 314129362 313643476 313609357 313947134 314733537 313796389 313851197 313772353 314310843
3329 314310843 313720968 313538895 312529934 311424944 311689433 311964869 312221619 312336542 312351593
3320 312351593 312742346 313201755 313341656 313259751 313193113 313197986 312789415 313886962 316218150 316406668
3310 316406668 316605336 317265312 318179098 318288196 318592060 319057070 319980344 320909618 321377073
3301 321377073 321796335 322332239 323359760 323602503 324046588 324201132 325523568 325205054 325561050
3292 325561050 326011852 327247025 327096694 326409653 326965500 328322549 326888996 325223351 326162161
3283C26162161P64828j741291l55179k62935j176793j351262o10685q39418j227270
3274C19362156j182501j956738r40023j419961j911499j328700k498584l884722
3266C04239428j587520o55176l689680k272572k614748l432875k821679k038630
3258B85126548k927456k807507k371255m417495k924284l444100l517714l305039
3250B59411698k614637l505855l298394k945267m377149l412130l244052l076272
3242B32937942l334378l414364k745531l663658l526066l273110l686385k783807
3234B06510643k554702m089059l840985k202803k857512k435784k391860k875754
3226A83262184k404443l325922k508857k256144l080442l981627j724758k578992
$$ plain form
3283 326162161 326926989 325185698 324830519 324567584 323390791 322039529 321428844 320589426 319362156
3274 319362156 318179655 316222917 315282894 313862933 311951434 310622734 308124150 304239428
3266 304239428 302651908 301996732 298307052 296034480 293419732 289986857 287165178 285126548
3258 285126548 282199092 279391585 277020330 272602835 269678551 266234451 262716737 259411698
3250 259411698 256797061 253291206 249992812 247047545 242670396 239258266 236014214 232937942
3242 232937942 229603564 226189200 223443669 219780011 216253945 212980835 209294450 206510643
3234 206510643 203955941 199866882 196025897 193823094 190965582 188529798 186137938 183262184
3226 183262184 180857741 177531819 175022962 172766818 169686376 165704749 163979991 161400999
3218A61400999j204054k433747k478165j332678k499794l105255j776222j992796
3210A44578288k382186k159022j988104k432609k902099j719499m24325j219313
3202A29351131k720686j290321k213255j756215r47024j430398j713332j231861
3194A16048039k775991n85642j296175j523393j341268r52312j535161j040682
3186A04997415k322643j442024m21214j580353j596499o57470j240902m38716
3178I5297594j463909k109940j92291j853474p33004p24002j608576j038880k32145
3169H5341373j390850j334791r01042K14370j252109o52628P0355l04179j012212
3160G8778287q95205j680302q82176j291975k29394o63530j808654j329033n87250
$$ plain form
3218 161400999 160196945 157763198 155285033 153952355 151452561 148347306 146571084 144578288
3210 144578288 142196102 140037080 138048976 135616367 132714268 130994769 130570444 129351131
3202 129351131 126630445 125340124 123126869 121370654 120423630 118993232 117279900 116048039
3194 116048039 113272048 112686406 111390231 109866838 108525570 107573258 106038097 104997415
3186 104997415 102674772 101232748 100811534 99231181 97634682 96977212 95736310 95297594
3178 95297594 93833685 91723745 91531454 89677980 88944976 88220974 86612398 85573518 85341373
3169 85341373 83950523 82615732 81714690 81929060 80676951 80024323 80094678 79790499 78778287
3160 78778287 77883082 76202780 75320604 74028629 73799235 73135705 71327051 69998018 69410768
3151F9410768q5114j563191j528458P62954m91123q63761j15326o49477j352674
3142F3524598L6279M8243r8668q76194j187510j077460o90387k62056o87211k81449
3132E8448185j512052J06583k52619o34901k06079J73416k047480r46402O06253
3123E3734904r48541o48401j505052j06798L41178q08937N58926K65138k43627
3114E0638790p65706j332552L40197J4674n67649o12018j069273L71154j338952
3105D5678665j334114N32515k58450n87846m09292j722990O5286p7951L74638
3096D2260461k61451j02691n72578j89860l55144j633740l8965J393914m50249
3087D0049697j155316k03889K11907l58954r12809p07335n21391M49401l44655
$$ plain form
3151 69410768 69325654 67762463 66234005 66996959 66505836 65642075 65526749 64877272 63524598
3142 63524598 63560877 63609120 63510452 62634258 61446748 60369288 59678901 59416845 58729634 58448185
3132 58448185 56936133 57042716 56790097 56155196 55949117 56122533 54075053 53128651 53734904
3123 53734904 52786363 52137962 50632910 50526112 50867290 50058353 50617279 50882417 50638790
3114 50638790 49873084 48540532 48880729 48895403 48327754 47715736 46646463 47017617 45678665
3105 45678665 44344551 44877066 44618616 44030770 43621478 41898488 41963774 41885823 42260461
3096 42260461 41999010 41896319 41323741 41133881 40778737 39144997 39106032 40499946 40049697
3087 40049697 38894381 38690492 38902399 38543445 37630636 36923301 36401910 36851311 36506656
3078C6506656n12501L28325M07771k42376q66991q28619P30994p21560o07348
3069C4194351k20467p88284J43664j088746O6852M81957l33668p89119l17602
3060C1348938M61519o1309o09842j760718l27828N12558N26220n26802p69217
3051B8793519l09098J57475l45691n17172K33303j24015K49469l67813P31209
3042B8501186j186262L02952k00485j287701J67738j086349J146132J62335M45606
3033B6965152j749824J12822J030140p95169o80142n08834n67550J450508k41030
3024B5016073o12928M61239l61528p66308k52469r053J54517n28851p62697J634757
3014B3972752p32804L6546j92818q40096J083954k73262q05281L3063m20335J82291
$$ plain form
3078 36506656 35994155 36322480 36730251 36487875 35620884 34792265 35523259 34801699 34194351
3069 34194351 33973884 33185600 33329264 32240518 32307370 32789327 32455659 31666540 31348938
3060 31348938 31810457 31749148 31139306 29378588 29050760 29563318 30089538 29562736 28793519
3051 28793519 28484421 28641896 28296205 27779033 28012336 27888321 28137790 27769977 28501186
3042 28501186 27314924 27617876 27417391 26129690 26297428 25211079 26357211 26519546 26965152
3033 26965152 25215328 25328150 26358290 25563121 24882979 24374145 23806595 25257103 25016073
3024 25016073 24403145 24864384 24502856 23736548 23484079 23475026 23629543 23100692 22337995 23972752
3014 23972752 23239948 23276494 23083676 22243580 23327534 23054272 22248991 22282054 21861719 22044010
3004B2044010o93257N2952q95314K17716L88732k23064j75071q76871J11695q7002
2994A9864526R92731J177554l28298l3748k87511j089395j027284J31774l85539
2985A9014810j88067K30079M43272M72766j74752p67537k07718k65739k57581
2976A8299533Q05681r52182o72468L37840N02494L28456N9257K37277p42669j84385
2966A8018834L72784l10889l43745m79021K01061M30281r429j392156k74941K93149
2956A6505928K61205l78637m85916P81663k68577N64283j44057p10133M67531
2947A6593290j35711j102653l42269M41430N96376q42489P346O24091l41772P22241
2937A6219880l67286o22101K64613J57961p04125n14804p621r3773o01319L69511
$$ plain form
3004 22044010 21350753 21403705 20508391 20726107 21114839 20891775 20716704 19839833 19951528 19864526
2994 19864526 20857257 22034811 21706513 21672765 21385254 20295859 19268575 19400349 19014810
2985 19014810 18826743 19056822 19500094 19972860 19798108 19030571 18822853 18557114 18299533
2976 18299533 19105214 18153032 17480564 17818404 18320898 18649354 18708611 18945888 18203219 18018834
2966 18018834 18391618 18080729 17736984 17257963 17459024 17889305 17879876 16487720 16212779 16505928
2956 16505928 16767133 16388496 15902580 16684243 16415666 16979949 16835892 16125759 16593290
2947 16593290 16457579 15354926 15012657 15454087 16050463 15207974 15215320 15839411 15497639 16219880
2937 16219880 15852594 15230493 15495106 15653067 14948942 14434138 14426517 14332744 13731425 14100936
2927A4100936Q19367J11000J220666K06820n39895l0434k113493N52791Q65810
2918A5193568Q46043j344848r59125Q77335q81392m18893P9990l59581Q36434
2909A3869531K21734r70311R81120P75242p70305k03721L01788j117563j583k44948
2899A2840984L6485K34178j07837R02109J53469K72900o41386k44231M24321L26426
2889A4197418j338381k45214L01651q15878P18381N36108p4932q84234N92276
2880A2987195O1109l87946J85400N8808q76092n24546K26623L79414J5229L13806
2870A2439000q6036p97489k80642O70635J495360n74328j133478M55489K99823
2861A2488334j293649o87829P82898K06656n38426J004109J262993l61544o93781
$$ plain form
2927 14100936 14920303 15031303 16251969 16458789 15918894 15888460 13774967 14327758 15193568
2918 15193568 16039611 14694763 13735638 14612973 13731581 13312688 13392678 13033097 13869531
2909 13869531 14091265 13120954 14102074 14877316 14107011 13903290 14205078 13087515 13085932 12840984
2899 12840984 12877469 13111647 13003810 13905919 14059388 14332288 13690902 13446671 13870992 14197418
2889 14197418 12859037 12613823 12915474 12099596 12817977 13354085 13279153 12394919 12987195
2880 12987195 13048304 12660358 12845758 12904566 12028474 11503928 11730551 12109965 12125194 12439000
2870 12439000 12352964 11555475 11274833 11945468 13440828 12866500 11733022 12188511 12488334
2861 12488334 11194685 10506856 11289754 11496410 10957984 11962093 13225086 12863542 12169761
2852A2169761r97998j99111k29398M98996L60322K76082k45612L38943j810131
2843A0161854k04279J453653L58431o92017L06004N63185o7475p95879j292349
2834I791128P94563J20614J2476N4840q4437j033393J316840J097939j447299
2825A0623271j1965J059099l53687k91039j288571J29291O96251k29408k61360
2816A0071882l14838L13475k91302n01468M74418R24755p75757l66958N92294
2807A0126501N39670l0249q25666R20850J521616j310014p64779J47919J71104
2798A0496952J20486N5974q05981L45328Q29113k08813n43057k87713K02574n17618
2788I687245j64323J090147M07575l26352M96504n91153l16743Q88555K65524
$$ plain form
2852 12169761 11171763 10972652 10743254 11242250 11602572 11878654 11633042 11971985 10161854
2843 10161854 9957575 11411228 11769659 11077642 11383646 11946831 11879356 11083477 9791128
2834 9791128 10585691 10706305 10718781 10773621 10689184 9655791 10972631 12070570 10623271
2825 10623271 10611306 11670405 11316718 11025679 9737108 9866399 10562650 10333242 10071882
2816 10071882 9757044 10070519 9779217 9277749 9752167 10676922 9901165 9534207 10126501
2807 10126501 10666171 10635922 9810256 10731106 12252722 10942708 10177929 10325848 10496952
2798 10496952 10617438 10673412 9867431 10212759 11041872 10833059 10290002 10002289 10204863 9687245
2788 9687245 9522922 10613069 11020644 10694292 11190796 10599643 10282900 11171455 11436979
2779A1436979n25994p86618K92153M93668l62870m71003r33934P89710J91707
2770A0123798P31494n36079n56787R43515j66908J067908q21100L17204l10514
2761A0792531o99913P42376p65689M37880l51826n05349j2095Q65855O66526n56463
2751A0613833l11242K86343j922125p31316N4029O15245M25029L53326J68494
2742I551616k30577O8366n94722O17652p30359R26717J412058j893225j314262
2733G813264J161443O62706l59469m28317P22001o6136n93133o12916j56146j13597
2723H029700J158707L32017p38529M39328P73000L88869j817069P52477M25994
2714I744494j45845R2521L81507n55338o01889M49589o5168J118046n47851J68601
$$ plain form
2779 11436979 10910985 10124367 10416520 10910188 10547318 10076315 9142381 9932091 10123798
2770 10123798 10855292 10319213 9762426 10705941 10539033 11606941 10785841 11103045 10792531
2761 10792531 10092618 10834994 10069305 10507185 10155359 9650010 9637915 10503770 11170296 10613833
2751 10613833 10302591 10588934 8666809 7935493 7989522 8604767 9029796 9383122 9551616
2742 9551616 9321039 9389405 8794683 9412335 8681976 9608693 11020751 9127526 7813264
2733 7813264 8974707 9637413 9277944 8849627 9571628 9505492 8912359 8299443 8143297 8029700
2723 8029700 9188407 9520424 8781895 9221223 9994223 10383092 8566023 9318500 9744494
2714 9744494 9598649 9691170 10072677 9517339 8915450 9365039 9299871 10417917 9870066 10038667
2704A0038667K92091O27603j96130n50918O0215p5469j41061K70604L49442K37171
2694A0912215j400216L34395o30632r50530P86685M16691N58379J11336M94322
2685A0632645r84395m3920n3169m95868n2882r8482K39645J98414O96437P2741
2675A0111166j736561O6770L41575J698216P5367p06880q42920P86157P3229R7046
2665I963165L83925m70022K36709K8032j189171K54377J32136p74708K32816J175419
2655I972678j26405O3306n76346K21378P34623N73635m12490N5959l54746M40409
2645A0592001m46811j61169j5858m93255N35487m91684R93414r28902Q3002n00900
2635I165325J483462L22877j000693j57243J248762j392899k28410n51500K32022
$$ plain form
2704 10038667 10330758 10958361 10762231 10211313 10271528 10196059 10054998 10325602 10675044 10912215
2694 10912215 9511999 9846394 9215762 8265232 9051917 9468608 10026987 10138323 10632645
2685 10632645 9648250 9604330 9551161 9055293 9002411 8903929 9143574 9341988 10038425 10111166
2675 10111166 8374605 8441375 8782950 10481166 10556533 9849653 9006733 9792890 9866119 9963165
2665 9963165 10347090 9877068 10113777 10141809 8952638 9207015 9339151 8564443 8797259 9972678
2655 9972678 9846273 9909579 9333233 9554611 10289234 10862869 10450379 10506338 10151592 10592001
2645 10592001 10145190 9984021 9968163 9474908 10010395 9518711 10512125 9583223 9666225 9165325
2635 9165325 10648787 10971664 9970971 9813728 11062490 9669591 9441181 8889681 9121703
2626I121703J162621K04300M33479J39253o31755q67068j13908O41336O87891
2617A0777852Q90546j196945q56958N40154Q09587L72032n86563r799m37399p31132
2607I571375J254374J021700l88877m78352M43162j95234o36150l33341L31369
2598A0590026m02421o6290N28526R17835j294208M55997p260n30718L75638P49632
2588A1316757k92602n00949L05075M93068L97954k15547M02451n93254J33313
2579A1446266l22901p19380N40834R8468M13330k33788j75623K87866M90457R81124
2569A2806653j209164j16984J11987L80574o5204J22103j419399o09791P18608
2560A0719383j73797j9721J120116J13968P76773k70294j326097K2491N83005
$$ plain form
2626 9121703 10284324 10488624 10922103 11061356 10429601 9562533 9448625 10089961 10777852
2617 10777852 11668398 10471453 9614495 10154649 10964236 11336268 10749705 10739906 10302507 9571375
2607 9571375 10825749 11847449 11458572 10980220 11423382 11228148 10591998 10258657 10590026
2598 10590026 10187605 10121315 10649841 11567676 10273468 10729465 10722205 10191487 10567125 11316757
2588 11316757 11024155 10523206 10828281 11321349 11719303 11503756 11906207 11312953 11446266
2579 11446266 11123365 10403985 10944819 11043287 11456617 11222829 11047206 11335072 11825529 12806653
2569 12806653 11597489 11480505 11592492 11973066 11907862 12029965 10610566 10000775 10719383
2560 10719383 10545586 10525865 11645981 11759949 12536722 12266428 10940331 10962822 11545827
2551A1545827P709K76272J7156P4149m44976O34502L85749O96226j31454M05560
2541A3466720j614607o49143J019486R32470j237522J84283O20333M9781k44604
2532A2527197p66113j35444J491092n32164j718266R60537J242802m56590n7548
2523A2555503K68987M7549p04854j32186Q43276L30658n79274P46379Q13431q27591
2513A3361878m21159K96377O94411l90315L32620M20718l83245N46486K61668
2504A4719439n4167Q27165j184134N0214O77303k40933M32633N28109q61157L29274
2494A5223746q2264j41436q58732Q38507J570990K82316J21374O05686l70806
2485A7189381k58276M77441J260138l51438M58592J51549P28075n55642j703926
$$ plain form
2551 11545827 11553536 11829808 11846964 11921113 11476137 12110639 12496388 13192614 13061160 13466720
2541 13466720 11852113 11202970 12222456 13154926 11917404 12101687 12722020 12771801 12527197
2532 12527197 11761084 11625640 13116732 12584568 10866302 11826839 13069641 12613051 12555503
2523 12555503 12824490 12872039 12167185 12034999 12878275 13208933 12629659 13376038 14189469 13361878
2513 13361878 12940719 13237096 13931507 13541192 13873812 14294530 13911285 14457771 14719439
2504 14719439 14665272 15492437 14308303 14358517 15035820 14794887 15227520 15755629 14894472 15223746
2494 15223746 15141482 15000046 14141314 14979821 16550811 16833127 16954501 17560187 17189381
2485 17189381 16931105 17408546 18668684 18317246 18775838 18927387 19655462 19099820 17395894
2476A7395894J530224J595584m32336j27934J75843J99168J595116m67297l28749
2467B1135513J391993j101323n12235R92089J78809r9945N56624N63516L49411
2458B3454452J88066J255289Q13816N42625O2640M42313m10610O29175P63858
2449B7741624R93679m72588q1884L15362M54789m38807m6563J832385L95023K76867
2439C0969887L57297L16194R12126O44867L64486R48122N7277J245193J88897
2430C6004346J226694k33859J01524Q13409P75174L98458J691635k25611J472602
2421D2024372J297567N90114J23141J590744J442632r79951J98196J297977K064306
2412D9649098J549488J099325N73432J945244Q80077J106251J735329J153679
$$ plain form
2476 17395894 18926118 20521702 20089366 19961432 20137275 20336443 21931559 21464262 21135513
2467 21135513 22527506 21426183 20913948 21906037 22084846 21984901 22541525 23105041 23454452
2458 23454452 23642518 24897807 25711623 26254248 26316888 26759201 26348591 26977766 27741624
2449 27741624 28735303 28262715 28180831 28496193 28950982 28512175 28465612 30297997 30693020 30969887
2439 30969887 31327184 31643378 32555504 33200371 33564857 34512979 34570256 35815449 36004346
2430 36004346 37231040 36997181 37098705 37912114 38687288 39085746 40777381 40551770 42024372
2421 42024372 43321939 43912053 44035194 45625938 47068570 46088619 46286815 47584792 49649098
2412 49649098 51198586 52297911 52871343 54816587 55696664 56802915 58538244 59691923
2404E9691923r3212J875414J637126R85051J299695J372913K037923K457977J771932
2395G3036742J033638J678259J749471K010712K739093L58170R35630J823178
2387H5364893K740914K338355J862326J997793K864394K121921K000312J814788
2379A03105696J889923L185519K239199L248173L197993K051616J089803L340382
2371A23348304L036286K736256K265414L187981L299084K732693J540392J895370
2363A44041780K455877K600685K975265K368270K134847K214011P98425K855903
2355A62445063J810047J369205K595975J452818N12788J422085J67442K15523
2347A71990946J139879P24227l74225L35686M22042j105602k16205m16847q32346
$$ plain form
2404 59691923 59598711 61474125 63111251 64096302 65395997 66768910 68806833 71264810 73036742
2395 73036742 74070380 75748639 77498110 79508822 82247915 82606085 83541715 85364893
2387 85364893 88105807 90444162 92306488 94304281 97168675 99290596 101290908 103105696
2379 103105696 104995619 108181138 110420337 113668510 116866503 118918119 120007922 123348304
2371 123348304 126384590 129120846 131386260 134574241 137873325 140606018 142146410 144041780
2363 144041780 146497657 149098342 152073607 154441877 156576724 158790735 159589160 162445063
2355 162445063 164255110 165624315 168220290 169673108 170185896 171607981 171775423 171990946
2347 171990946 173130825 173855052 173480827 173816513 174238555 173132953 172916748 172499901 171667555
2338A71667555r74824p25826k647999n40264j750202k251954k319738p27857q76538
2329A58852353l713777k221043j293322j332845k990357m030692k742895k425281
2321A38102141k555604k775349k597224k675032m93958k371410l574661k009471
2313A19049432k322731k425514l058567l617264j841027k038282j801412j995711
2305I9948924k154007j907676j631630k106654j391928j953105k376708p22845
2297H5704371j958604j507266j511442k161530k468330j933129j467982J48969
2289G2845057j950695k102751k089151p49149n77097j230433j199834r71185j106962
2280F0867800m93244o63340j015891r90975j188307j84751j961471m30240j161980
$$ plain form
2338 171667555 170692731 169966905 167318906 166778642 165028440 162776486 160456748 159728891 158852353
2329 158852353 155138576 152917533 151624211 150291366 147301009 143270317 140527422 138102141
2321 138102141 135546537 132771188 130173964 127498932 127004974 124633564 121058903 119049432
2313 119049432 116726701 114301187 111242620 107625356 105784329 103746047 101944635 99948924
2305 99948924 97794917 95887241 94255611 92148957 90757029 88803924 86427216 85704371
2297 85704371 83745767 82238501 80727059 78565529 76097199 74164070 72696088 72845057
2289 72845057 70894362 68791611 66702460 65953311 65376214 64145781 62945947 61974762 60867800
2280 60867800 60374556 59711216 58695325 57704350 56516043 56331292 54369821 53939581 52777601
2271E2777601r73472O105m69503j182335k884010m72709N31107l33037k053536
2262D4946211j334185q5292p35410k02715k65608n21995j044099q11964j15697
2253C9829246k22071p61570j167445p94097J73747k88180p37583L66432q37812
2244C5560667j402542L49037m71530p04634p59400k45165j158510L2908P91289
2235C1992120j609827k012013m30539J167459K84427n9362k59433q65936N7554
2226B8264450l71847j659497j08615q97901q2152Q693k30813M57161l74030n88147
2216B4417302j79313r283l4123k249018K43646L93221n28839M60322J35805M96512
2206B3146232j241622j231553N57307J08275M8407O33972j066351o11530P74671
$$ plain form
2271 52777601 51804129 51810234 51340731 50158396 47274386 46801677 47332784 46999747 44946211
2262 44946211 43612026 43526734 42791324 42588609 42323001 41801006 40756907 39944943 39829246
2253 39829246 39607175 38845605 37678160 36884063 37057810 36769630 36032047 36398479 35560667
2244 35560667 34158125 34507162 34035632 33330998 32571598 32326433 31167923 31200831 31992120
2235 31992120 30382293 28370280 27939741 29107200 29391627 29332265 29072832 28206896 28264450
2226 28264450 27892603 26233106 26124491 25226590 25144438 25153131 24922318 25379479 25005449 24417302
2216 24417302 24237989 24228706 24194583 21945565 22189211 22582432 22053593 22513915 22649720 23146232
2206 23146232 21904610 20673057 21230364 21338639 21387046 22021018 20954667 20343137 21117808
2197B1117808l10198j241136p24106L80890p16886o46232N37854r04467O65370
2188A8158897K18562m68049j427285Q36309P73251j82754j48148J03659K69609
2179A8134051o59867j376874q77988o44370J457745K8676q19264O3342l97498
2170A4907953O94393o16331k37754J073634j709525M79955M51948K34377j010749
2161A4267901K54295J39242l67750M21660l71944j366637l8503K87019p15738
2152A2509545O60953k036K50474J24072j200059l71428R18667j87464j43626J30360
2142A2689458N69137p97239p36587j363565N10526j57299k34593Q4906k32284
2133A0332460J49216O98606p10497q9245N11968n57524j9402Q70084r36887Q53333
$$ plain form
2197 21117808 20807610 19566474 18842368 19223258 18506372 17860140 18397994 17493527 18158897
2188 18158897 18377459 17909410 16482125 17318434 18091685 17908931 17760783 17864442 18134051
2179 18134051 17474184 16097310 15219322 14574952 16032697 16061373 15242109 15305451 14907953
2170 14907953 15602346 14986015 14748261 15821895 14112370 14592325 15044273 15278650 14267901
2161 14267901 14522196 14661438 14293688 14715348 14343404 12976767 12938264 13225283 12509545
2152 12509545 13170498 13168462 13418936 13543008 12342949 11971521 12890188 12702724 12559098 12689458
2142 12689458 13258595 12461356 11724769 10361204 10871730 10714431 10479838 10564744 10332460
2133 10332460 10481676 11180282 10469785 10380540 10892508 10334984 10315582 11185666 10248779 11102112
2123A1102112l91620K61573n15403j88731j39539k07404O15314n3824n96583p1230
2113I814665k24591K81720k65921j061394M7143k25909N06373k2924n43097o93756
2103G612309P08053P90565L12241k86900j97772N06784j523276M90189Q53173
2094I265366p11728l8692m76058O34766K38751r57710r1037M02994j09557p65487
2084G391608K86846l07639Q6084N08636l81561l59144p74024K10043J054715J163854
2074H879418q76366Q88004k04387n70679l49698N16723j123585r6506j89278j49742
2064F723904J88256n56886K01236M79206J98211j62550P46653l67874j174337
2055F275819q42755R21113j72402R91810J184134p15186j349371Q46121M23570
$$ plain form
2123 11102112 10710492 10972065 10456662 10267931 10128392 9920988 10536302 10482478 9885895 9814665
2113 9814665 9590074 9871794 9605873 8544479 8591622 8365713 8872086 8849162 8306065 7612309
2103 7612309 8320362 9110927 9423168 9136268 8938496 9445280 7922004 8412193 9265366
2094 9265366 8553638 8514946 8038888 8673654 8912405 7954695 7863658 8266652 8157095 7391608
2084 7391608 7678454 7370815 7456899 7965535 7583974 7224830 6450806 6660849 7715564 8879418
2074 8879418 8003052 8891056 8686669 8115990 7766292 8283015 7159430 7062924 6873646 6723904
2064 6723904 6912160 6355274 6556510 7035716 7233927 7071377 7818030 7450156 6275819
2055 6275819 5433064 6354177 6181775 7173585 8357719 7642533 6293162 7139283 7562853
2046G562853j779535k67652k53939r2401J014727N12982l50221n58651M81169
2037F269332O48816l19452J00892q58954P2136k54995n06342M86469M4671r08236
2027D774337k69302N91296J02114k76970j142987o07317J39377P57513M34782
2018D502843L58029R28189L29358k69326n3534k69035J89616o65797k69574n61532
2008D219237J08336J188137n72880r2626J01084q37004o41766O77602l26097O56860
1998D480883m22611Q8926O6004R9076J021026l17511q03495Q78838p2128q75848
1988D143160L10130N22958j023781R73994k07012j040771P6640M051l53692P05812
1978D111489Q95313J10883r95396J7090O55314N64667j449L09021r8507r89038
$$ plain form
2046 7562853 5783318 5515666 5261727 5169326 6184053 6697035 6346814 5788163 6269332
2037 6269332 6918148 6598696 6699588 5840634 5912770 5657775 5151433 5637902 5682573 4774337
2027 4774337 4505035 5096331 5198445 4921475 3778488 3171171 3310548 4068061 4502843
2018 4502843 4860872 5789061 6118419 5849093 5795559 5526524 5716140 5050343 4780769 4219237
2008 4219237 4327573 5515710 4942830 4850204 4951288 4114284 3472518 4150120 3824023 4480883
1998 4480883 4058272 4147198 4213202 4312278 5333304 5015793 4212298 5091136 5019008 4143160
1988 4143160 4453290 4976248 3952467 4926461 4719449 3678678 3755318 3759369 3405677 4111489
1978 4111489 5006802 5117685 4122289 4139379 4794693 5359360 5357911 5666932 5568425 4579387
1968D579387O29919Q04611l494r09744o15288j23887K31814k63470J236881j393570
1958D173159n84032J63560M27646M30351J06598k83308L02145l4274J92200r9051
1948D794994m45132l37340k6370K71760K6951r40055P97053K42143R91312p23334
1938D651982j61978l44287m03716Q50923o4536p38079r1187K38526j41133L2225
1928C828740k62343l17006q00523J241263K059184l89908j202655N25491o26455
1919D055788n14404J861014O79427L6284r99556p09653M30505q13051n28644O77998
1909D175708n50552j53707J9088l7700j44206k70811R98095j66133j00576j81927
1899C587279J37631L65727j43688p02944L02499l40977L42311J227861l51468
$$ plain form
1968 4579387 5209306 6013917 6010423 5100679 4485391 4361504 4593318 4329848 5566729 4173159
1958 4173159 3589127 3752687 4180333 4610684 4717282 4433974 4736119 4701845 4894045 4794994
1948 4794994 4349862 4012522 3986152 4257912 4284863 3344808 4141861 4384004 5375316 4651982
1938 4651982 4490004 4145717 3742001 4592924 4528388 3790309 3699122 3937648 3796515 3828740
1928 3828740 3566397 3249391 2448868 3690131 5749315 5359407 4156752 4682243 4055788
1919 4055788 3541384 5402398 6081825 6118109 5118553 4408900 4839405 4026354 3497710 4175708
1909 4175708 3625156 3471449 3490537 3452837 3308631 3037820 4035915 3869782 3769206 3587279
1899 3587279 3724910 4090637 3946949 3244005 3546504 3205527 3547838 4775699 4424231
1890D424231m30772P87244k82367k97431L51684N50368j115519P58778l1622j133455
1880C581139M84576o0503K24058j45922J204634L192j751624m77690m60272l08616
1870B292972J348288P10240J91713q77124m11333k8625N56086L4454o46459P5143
1860C245355O19697m58726r01756L79240J369303m74040j0229J04450j101004
1851B772290L75023q70421J282508J839218q34665k080989O04612N23444k37726
1842C373294k06063j62023j254568O42937L60573l88230L10658N46632j90533
1833C032677o26980Q20598j42604J295788K98634q66454m26061o96761J333877
1824D022714p46610k70308O31735K38135K69202J0648j500648j88850L79490P0363
$$ plain form
1890 4424231 3993459 4780703 4498336 4200905 4552589 5102957 3987438 4746216 4714594 3581139
1880 3581139 4065715 4005212 4229270 4083348 5287982 5291174 3539550 3061860 2601588 2292972
1870 2292972 3641260 4351500 4543213 3666089 3254756 3226131 3782217 3816671 3170212 3245355
1860 3245355 3865052 3406326 2504570 2883810 4253113 3779073 3768844 3873294 2772290
1851 2772290 3147313 2276892 3559400 5398618 4563953 2482964 3087576 3611020 3373294
1842 3373294 3167231 3005208 1750640 2393577 2754150 2365920 2676578 3223210 3032677
1833 3032677 2405697 3226295 3083691 4379479 4678113 3811659 3385598 2688837 4022714
1824 4022714 3276104 3005796 3637531 3875666 4144868 4155516 2654868 2466018 2845508 2915871
1814B915871k18041K89586m99901k31562k453Q54915P37943k08414p11756p31311
1804B194877n02661N95291J11707L87967J144649l9296L13592k62974j68592n33374
1794C241186Q01993M0372p60270j430331j20152N59752J192721j84134j130533
1785B210604m32944P97709r1520j88367L76540k08446O02597J267843m37367K0138
1775C916787l21566p62657j51599n27125m25257J336002K15879K09986q1587q75211
1765B533652l83523R09958P9392j097962M61409R76474n573l23368n24962o75177
1755A950320J237533M93498j29866K34882k18925K45718M87090p81924Q5110j36454
1745C466982m01241L98575k64371l0319k72330M28517O78079j190219j513997
$$ plain form
1814 2915871 2697830 2987416 2487515 2255953 2253500 3108415 3846358 3637944 2926188 2194877
1804 2194877 1692216 2287507 2399214 2787181 3931830 3892534 4206126 3943152 3774560 3241186
1794 3241186 4043179 4083551 3323281 1892950 1772798 2332550 3525271 3341137 2210604
1785 2210604 1777660 2575369 2483849 2295482 2672022 2463576 3066173 4334016 3896649 3916787
1775 3916787 3595221 2832564 2680965 2153840 1728583 3064585 3280464 3490450 3408863 2533652
1765 2533652 2150129 3060087 3139479 2041517 2502926 3479400 3473827 3150459 2625497 1950320
1755 1950320 3187853 3681351 3551485 3786367 3567442 3813160 4300250 3518326 3603436 3466982
1745 3466982 3065741 3464316 3199945 3169626 2897296 3325813 4003892 2813673 1299676
1736A299676N25894J6033j25233M00738P27637K98070p58830J41170J96638M97031
1726C218824m02976K63088J952281l25088q05000j274119L72416L42145P57381
1717D098952j181701j537938J328073L97508n03557L60063o03241N04629O85492
1708C548280k26270j89193n03210n92106J661876m47806n31729J7608K64060l54474
1698B647036q56434O16565k70319K22537K80309l94597O2020N8133J478805o83707
1688C160348m80966r878L6135J282516r70459N01418o87178P42030j831855q3729
1678A658382L75560K43955q64015q3335K93276O33372N19108K46630o35270m19404
1668A968259m70381Q08645J76392l82460m02023l09124O69251O06720k81646j11187
$$ plain form
1736 1299676 1825570 1841603 1716370 2117108 2844745 3142815 2383985 2525155 2721793 3218824
1726 3218824 2815848 3078936 5031217 4706129 3901129 2627010 2999426 3341571 4098952
1717 4098952 2917251 1379313 2707386 3104894 2601337 2961400 2358159 2862788 3548280
1708 3548280 3322010 3132817 2629607 2037501 3699377 3251571 2719842 2737450 3001510 2647036
1698 2647036 1790602 2407167 2136848 2359385 2639694 2245097 2307117 2365250 3844055 3160348
1688 3160348 2679382 2669504 2705639 3988155 3017696 3519114 2831936 3573966 1742111 1658382
1678 1658382 2033942 2277897 1413882 1330547 1623823 2257195 2776303 3022933 2387663 1968259
1668 1968259 1497878 2306523 2482915 2100455 1698432 1389308 2058559 2665279 2383633 2272446
1658B272446K4841j74719p8695R26900L15292j153740K70540P837j08751q82495
1648A419456O83883l80779k76005J23067L77935M44607K83779N25366j304866
1639A896443l80247M19506J055799m28158j82206R29941N70945j176246j94685
1630B511092K92841P05981K90760o15738l10952m56584k16154j67871K10127P36000
1620B979502L72560k88103o48007m69401m26224L75003j63622l55458J456807
1611B833057n02766j45277J05830r9072o54763P17099k49942j122331J76469M84886
1601A543190k45763o40564l9128J120360q451o42873L74833R74800J67972r83727
1591A620649J35784R81314j394431j486187Q58745M6415J179330J06006k2224
$$ plain form
1658 2272446 2297287 2122568 2043873 2970773 3286065 2132325 2402865 2410702 2301951 1419456
1648 1419456 2103339 1722560 1446555 1569622 1947557 2392164 2675943 3201309 1896443
1639 1896443 1516196 1935702 2991501 2563343 2381137 3311078 3882023 2705777 2511092
1630 2511092 2803933 3509914 3800674 3184936 2873984 2417400 2201246 2033375 2243502 2979502
1620 2979502 3352062 3063959 2415952 1946551 1520327 1895330 1731708 1376250 2833057
1611 2833057 2330291 2185014 2290844 2191772 1537009 2254108 2004166 881835 1058304 1543190
1601 1543190 1297427 656863 617735 1738095 1729644 1086771 1461604 2436404 2604376 1620649
1591 1620649 1756433 2737747 1343316 -142871 715874 762289 1941619 2047625 2025401
1582B025401M52743L8304J18845j331057J280694j22000p28943R367Q83979L76018
1572C003351r64271p05991j89492J263321k42250j126420P84847L01160j48064
1563A976191P94983j98535K55692j59083n40262J013062o69882p78142J37020
1554A831044J80810L27672N93200o68817l24921j30890k44536m8341q22119N68092
1544A261194J156287j31311r0672K03633J29778o52960L97297J17185q0019l3657
1534B276755K58080m91349J30785N65047j446235q00247J719904K19725q18995
1525A613470n94032M81345P02620J85344K65437K44031L94782j08685l05261o04699
1515B274352M82467m06543k18502k35133k66r076j012851R26099m48308L33087
$$ plain form
1582 2025401 2478144 2516448 2635293 1304236 2584930 2462930 1733987 1743354 2627333 3003351
1572 3003351 2039080 1333089 1143597 2406918 2164668 1038248 1823095 2124255 1976191
1563 1976191 2771174 2572639 2828331 2669248 2128986 3142048 2472166 1694024 1831044
1554 1831044 2011854 2339526 2932726 2263909 1938988 1808098 1563562 1515221 693102 1261194
1544 1261194 2417481 2286170 2195498 2399131 2528909 1875949 2273246 2390431 2310412 2276755
1534 2276755 2534835 2043486 2174271 2739318 1293083 492836 2212740 2432465 1613470
1525 1613470 1019438 1500783 2203403 2388747 2654184 2898215 3292997 3184312 2879051 2274352
1515 2274352 2756819 2350276 2131774 1896641 1896375 1887299 874448 1800547 1352239 1685326
1505A685326M215m50058L86241q10195M12251M85746O87485l78005r0364J49765
1495B082407P60937j37472j87660j89837p60116r09233P81806K61864j13018n02718
1485A086960l88918O64552M61848M1006l39399M12415K82716K50805o0888m56238
1475A954859R3072J49751n71895k17429N27343j3706R04104j050577k29126o47250
1465H99146N61269m6068k30253M7344j70197o15764K35065J08101L76134J446757
1455B611534m91290Q47587n2030K61235l32288r33698p67135J359040M20924k94485
1445B629394Q7869q78380o87588Q32956L10358o69188P71745q32072P8445M43424
1435B086963M20964q20577k57662j525151K584R18948k50666r4334K3374R04312
$$ plain form
1505 1685326 1689541 1239483 1625724 815529 1227780 1713526 2401011 2023006 1932642 2082407
1495 2082407 2843344 2705872 2518212 2328375 1568259 659026 1440832 1702696 1589678 1086960
1485 1086960 698042 1362594 1824442 1865448 1526049 1938464 2221180 2471985 2411097 1954859
1475 1954859 2047931 2197682 1625787 1408358 1935701 1921995 2826099 1775522 1546396 899146
1465 899146 1460415 1414347 1184094 1231438 1061241 445477 680542 788643 1164777 2611534
1455 2611534 2120244 2967831 2915801 3177036 2844748 1911050 1143915 2502955 2923879 2629394
1445 2629394 2717263 1838883 1151295 1984251 2294609 1625421 2397166 1565094 1643539 2086963
1435 2086963 2507927 1687350 1429688 -95463 -92879 826069 575403 481069 504443 1408755
1425A408755K19332P81985n8219k65515m80518n965k28251J77833q88203o99204
1415c7970R56715P97649M97966l2379p43607l42566N53453o939j15452m947L41363
1404A863286M26190K16204m00091m7372n13563p62117M74248N00387K00937l97286
1394A560823P01467L10869q16838l52928O14830J43884m6468m03068Q00513l58452
1384B154632l02987R2951P25244k40625k53072N07824K26981k24727j040982m91349
1374A153890m05806O08233O14565q62000L41013O96330q05796n24650L21896m9270
1364A088405N64238p15676l27157J92492o6440J44259P43752O73810k63421N32501
1354B566763P0065K42496j114642j206579J298272M3772p27360k01553P19954
$$ plain form
1425 1408755 1628087 2410072 2351853 2086338 1605820 1599855 1371604 1549437 661234 -37970
1415 -37970 918745 1716394 2214360 2181981 1438374 1095808 1649261 1642322 1526870 1521923 1863286
1404 1863286 2289476 2505680 2105589 2058217 1544654 782537 1256785 1757172 1958109 1560823
1394 1560823 2262290 2573159 1756321 1403393 2018223 2162107 2115639 1712571 2513084 2154632
1384 2154632 1851645 1944596 2669840 2429215 2176143 2683967 2910948 2686221 1645239 1153890
1374 1153890 748084 1356317 1970882 1108882 1449895 2146225 1340429 815779 1137675 1088405
1364 1088405 1652643 936967 609810 802302 735862 880121 1623873 2297683 2034262 2566763
1354 2566763 2636828 2879324 1764682 558103 1856375 1900147 1172787 971234 1691188
1345A691188M63370j103665n32855M76938j95968N92827M62381q14679L18362
1336A357899K13741p49670k11742l04890R16750p2193j292505J302165K72597
1327A432152J80283k0366N00915q31937j94742n54255j77687P78995J3367l76227
1317G50498p3392Q02102J28494N18642N42909K37070p91916r99504J359336p48216
1307A726023k26345L67740j012679j2159L49737K03254J285347l91593m28158
1298A861167L9987L7927k34369K62584P94063o12881k11466j42725m08636m12538
1288I73113m16549o85373J091323j39886j57372k84844J121374K0929O31033R76101
1278C129849l75411j033272N0212O38267j235839k4742O4153o29563Q92206L56626
$$ plain form
1345 1691188 2154558 1050893 518038 994976 799008 1391835 1854216 1039537 1357899
1336 1357899 1571640 821970 610228 305338 1222088 1149895 -142610 1159555 1432152
1327 1432152 1612435 1592069 2092984 1261047 1066305 512050 334363 1113358 1126725 750498
1317 750498 677106 1479208 1607702 2126344 2669253 2906323 2114407 1114903 2474239 1726023
1307 1726023 1499678 1867418 854739 842580 1192317 1395571 2680918 2289325 1861167
1298 1861167 1901154 1939081 1704712 1967296 2761359 2148478 1937012 1794287 1385651 973113
1288 973113 556564 -128809 962514 822628 665256 380412 1501786 1522715 2153748 3129849
1278 3129849 2754438 1721166 1771378 2409645 1173806 1149064 1213217 583654 1475860 1832486
1268A832486o9267r33972L04923J047208k48055l68322o7209J050439o85285L43585
1258B206531R3109L30905P06142j121270j54141r9455J30972l03154m80982K54345
1248A563002m26857n47954J012826L21838r19800J46444O32342K59548n67921
1239A473468J016547q81780l95996j25235L45078p6331O1999J16278L54090P27985
1229B616103L48374j193397k202266M95032Q18657K15870P26864M0178j069768
1220G95647j06801R83307o97722p12795K20874J087506L33591n5960l4384k25382
1210A587881j91489l70415K33608l8152k44850n33445R41513R8512l63746l48581
1200G70836L22841l62805N69380J15383K53858o3813o2449M01283J017526r15538
$$ plain form
1268 1832486 1763219 829247 1134170 2181378 1933323 1565001 1497792 2548231 1862946 2206531
1258 2206531 2299640 2630545 3336687 2215417 2061276 1961821 2092793 1789639 1308657 1563002
1248 1563002 1136145 588191 1601017 1922855 1003055 1149499 1781841 2041389 1473468
1239 1473468 2490015 1608235 1212239 1087004 1432082 1355751 1417750 1534028 1888118 2616103
1229 2616103 2964477 1771080 -431186 63846 882503 1098373 1825237 1865415 795647
1220 795647 688846 1672153 974431 261636 482510 1570016 1903607 1847647 1813263 1587881
1210 1587881 1396392 1025977 1259585 1221433 976583 443138 1384651 1483163 1119417 770836
1200 770836 1093677 730872 1300252 1415635 1669493 1605680 1543231 1944514 2962040 2046502
1190B046502k31353j2912j97790q12039l2112L54284K7418J72519n07775p30853
1180G5889j29114K55165L25426J336630R71292n48945j094077K58791J36339k08750
1170A378646j194220P86066R2860K08556p11854n58355J20782l29036J05735K69894
1160A69074k08710O48548P13796O94863j149203l58621L82367O62619j24791Q83458
1150B313400K4233r95248n75944L89421K5891M31153L9599L2041J95880K21460
1140B101886k58996Q5976j84391m52938l48707j67710P69987o75984k62697P99723
1130A406149M87008M59688O28218r53641N15353q26853l44406o38750P92059r22385
1120F02440M1785J206263o0358k071908J084662J76414O64468p8785j132657L14791
$$ plain form
1190 2046502 1815149 1802237 1604447 792408 760296 1114580 1141998 1314517 806742 75889
1180 75889 -53225 201940 527366 1863996 2835288 2286343 1192266 1451057 1587396 1378646
1170 1378646 184426 970492 1063352 1271908 560054 1699 122481 -206555 -100820 169074
1160 169074 -39636 608912 1322708 2017571 868368 509747 892114 1554733 1429942 2313400
1150 2313400 2337633 1342385 766441 1155862 1181753 1612906 1652505 1684546 1880426 2101886
1140 2101886 1842890 1928866 1744475 1291537 942830 775120 1545107 869123 606426 1406149
1130 1406149 1893157 2352845 2981063 2027422 2542775 1715922 1371516 732766 1524825 602440
1120 602440 644225 1850488 1790130 -281778 802884 979298 1643766 1564981 432324 747115
1110G47115l10263P76543Q97536J81419l68995J60127M84665j35964j192853L60374
1100A599704j036181k88176L71135M2177k72680P75050m01734n8887R38438j12626
1090A556220J7923j33521J13040M64178J64158n98621q39757J130274M8098n391
1080A916601q3157O6734K75250p73356K28181K37220r81703J84346N20381m17155
1070A173342R5613K66499L59679K53344n38337l90261K6249k56862Q16653l27479
1060A478440j216646l96401J077794o25372j7071J625140L68952n90460m99861
1051A204515r51448k18525O07626O20756j8990K20193j78929k18147j044249M42281
1041D65083K63445J24148j94719o53797J94971P33286M56176q68588p4299Q12564
$$ plain form
1110 747115 436852 1213395 2110931 2292350 1923355 2083482 2568147 2432183 1239330 1599704
1100 1599704 563523 275347 646482 688659 415979 1191029 789295 730408 1668846 1556220
1090 1556220 1574143 1440622 1553662 2017840 2181998 1583377 743620 1873894 1921992 1916601
1080 1916601 1833444 1900178 2175428 1402072 1630253 1867473 885770 1070116 1590497 1173342
1070 1173342 1268955 1535454 1895133 2148477 1610140 1219879 1246128 989266 1805919 1478440
1060 1478440 261794 -134607 943187 317815 300744 1925884 2294836 1704376 1204515
1051 1204515 253067 34542 642168 1262924 1243934 1464127 1285198 1067051 22802 465083
1041 465083 728528 852676 657957 4160 199131 932417 1388593 520005 445706 1258270
1031A258270N01146m99690j52261K41970r86553n12564Q93078l5599J013068l61111
1021A359754J39031l20426M58067J664779K20289j310333r45048M35887M46124
1012B148124r06038k58056L43057M41583l73679n06805p185p73383Q13J408649
1002A517080M21591l23245j56250r4159o23800k69841N04601j88646l38934Q14260
992A262657m35605o97419J727555j55105p67405p51823J85151j69319m01507R13101
982G10281K2980O32983p60140J17300n69871N43745J506527m91677j191705k73400
972B47023Q14231J957805o55716j608876J408542q84340p7598j002657k83609
963h5195N90198O82401Q62371j17610l76883O56458J20883j498071P73648j65682
$$ plain form
1031 1258270 1759416 1259726 1107465 1349435 362882 -149682 743396 707797 1720865 1359754
1021 1359754 1498785 1178359 1636426 3301205 3521494 2211161 1266113 1702000 2148124
1012 2148124 1242086 984030 1327087 1768670 1394991 888186 881001 107618 108431 1517080
1002 1517080 1938671 1615426 1459176 1365017 741217 471376 975977 787331 448397 1262657
992 1262657 827052 129633 1857188 1702083 934678 182855 368006 198687 -202820 710281
982 710281 733261 1366244 606104 723404 153533 697278 2203805 1712128 520423 247023
972 247023 1061254 3019059 2363343 754467 2163009 1278669 1201071 198414 -85195
963 -85195 505003 1187404 2049775 1932165 1555282 2211740 2332623 834552 1608200 1442518
953A442518m3248K49297j399718n49345J219863M7440k57323O73170n44645j30685
943G07324M09724M52930l86369o35831m86634M40416N80938m49255j6838l63467
933B52938J029730K91090n77720N10671j020821q40417J299322L24099k84200
924I84692O44171N93131r36546R11096j31744r50056O41825L2529j83904o44437
914I60757l16030L92519j0418p662L61616N10954j38291l60011J27815K75251
904A796500J19140j57252N30402k9115l59790p66132r28893P2891l43928J011894
894I45717J715228l72025k001308l80602J085792N13230J09034r43465J105293
885A776894o36807l64108j89559K56253O52005l25091L4229k72172r67750J326095
$$ plain form
953 1442518 1399270 1648567 248849 -300496 919367 966807 709484 1382654 838009 707324
943 707324 1117048 1569978 1183609 547778 61144 501560 1082498 633243 616405 252938
933 252938 1282668 1573758 996038 1506709 485888 -354529 944793 1268892 984692
924 984692 1628863 2221994 1285448 2196544 2064800 1114744 1756569 1789098 1605194 960757
914 960757 644727 1037246 1026828 1019166 1380782 1891736 1753445 1393434 1521249 1796500
904 1796500 1915640 1758388 2288790 2259675 1899885 1133753 204860 277751 -66177 945717
894 945717 2660945 2288920 287612 -92990 992802 1506032 1615066 671601 1776894
885 1776894 1140087 775979 586420 842673 1494678 1169587 1203816 931644 -36106 1289989
875A289989J828585n44910j654233p89399J24791J399720M22500K91092L2721
866B400856r57622q27017l9761J064256o05371j55165L05728j137470j90904J342196
856A199726O06139j297235o5915J077765n86787n82849N01015L81175L03011K72891
846A808936R9851m94669j043759l538K26771N63563P94885p5996n49502j605880
836b79338N2817K64093K9668Q8655P41641m44592J31041K39774p33486J546585
826A636858k715q56786Q93741M92181j35030j057826J36596Q58756k39459o62044
$$ plain form
875 1289989 3118574 2573664 919431 130032 254823 1654543 2077043 2368135 2400856
866 2400856 1443234 616217 576456 1640712 1035341 880176 1185904 48434 -142470 1199726
856 1199726 1805865 508630 442715 1520480 933693 350844 851859 1233034 1536045 1808936
846 1808936 1908787 1414118 370359 366821 593592 1157155 1952040 1876044 1326542 -279338
836 -279338 -226521 37572 67240 155895 897536 452944 583985 823759 90273 1636858
826 1636858 1634143 777357 1671098 2163279 2028249 970423 1107019 1965775 1726316 1064272
$$ [...]
##END NTUPLES=NMR SPECTRUM
##END=
