##TITLE=1H_DE-80H_X3
 200.13MHz, d2o
 8 sc
 
 19ns.26.2.2025
##JCAMPDX= 6.0         $$ Bruker NMR JCAMP-DX V2.0
##DATA TYPE= NMR SPECTRUM
##DATA CLASS= NTUPLES
##ORIGIN= UXNMR, Bruker Analytische Messtechnik GmbH
##OWNER= pz
$$ XWIN-NMR		Version 3.5
$$ Wed Mar 18 10:46:25 2026 Russian Standard Time (UT+4h)  Yarkov@DPX200
##.OBSERVE FREQUENCY= 200.1313
##.OBSERVE NUCLEUS= ^1H
##.ACQUISITION MODE= SIMULTANEOUS
##.ACQUISITION SCHEME= undefined
##.AVERAGES= 8
##.DIGITISER RES= 18
##SPECTROMETER/DATA SYSTEM= spect
##.PULSE SEQUENCE= zg30
##.SOLVENT NAME= CDCl3
##.SHIFT REFERENCE= (INTERNAL, CDCl3, 0, 15.4285)
##AUDIT TRAIL= $$ (NUMBER, WHEN, WHO, WHERE, WHAT)
$$ ##TITLE= Audit trail, XWIN-NMR		Version 3.5
$$ ##JCAMPDX= 5.01
$$ ##ORIGIN= Bruker BioSpin GmbH
$$ ##OWNER= Yarkov
$$ C:/Bruker/XWIN-NMR/data/yarkov2/nmr/H-C/1/pdata/1/auditp.txt
$$ ##AUDIT TRAIL=  $$ (NUMBER, WHEN, WHO, WHERE, WHAT)
(   1,<2026-03-18 10:45:31.65 +0400>,<Yarkov>,<DPX200>,
      <created by zg, POWCHK disabled, PULCHK disabled
       configuration hash MD5:
       00 E9 B6 7A A2 85 ED C7 34 08 36 98 17 FE 4E 26
       data hash MD5: 16K
       68 AF 0B 69 69 FF 56 18 70 B2 FC C2 A3 C1 D3 09>)
(   2,<2026-03-18 10:45:38.96 +0400>,<Yarkov>,<DPX200>,
      <Start of raw data processing
       efp BC_mod = 2 LB = 0.25 FT_mod = 6 PKNL = 1 PHC0 = -5299.148 PHC1 = 6.821927 SI = 16K 
       data hash MD5: 16K
       81 E9 AA 75 42 59 0B E7 30 E1 45 FC B2 B9 DA EC>)
(   3,<2026-03-18 10:45:46.09 +0400>,<Yarkov>,<DPX200>,
      <abs ABSG = 5 
       data hash MD5: 16K
       1A D8 B6 32 02 EE 0D 07 81 11 51 F5 69 6F 39 8E>)
$$ ##END=
$$ 
$$ hash MD5
$$ 14 75 E3 01 BA 61 A1 8B AB 28 E9 24 9D A2 CB D4
##$RELAX= 
##$RELAX= 
##$RELAX= 
##$RELAX= 
##$RELAX= 
##$RELAX= 
$$ Bruker specific parameters
$$ --------------------------
##$DU= <C:/Bruker/XWIN-NMR>
##$EXPNO= 1
##$NAME= <H-C>
##$PROCNO= 1
##$TYPE= <nmr>
##$USER= <yarkov2>
##$AMP= (0..31)
100 100 100 100 100 100 100 100 100 100 100 100 100 100 100 100 100 100 
100 100 100 100 100 100 100 100 100 100 100 100 100 100 
##$AQSEQ= 0
##$AQ_mod= 1
##$AUNM= <au_zg>
##$AUTOPOS= <>
##$BF1= 200.13
##$BF2= 200.13
##$BF3= 200.13
##$BF4= 200.13
##$BF5= 200.13
##$BF6= 200.13
##$BF7= 200.13
##$BF8= 200.13
##$BYTORDA= 1
##$CFDGTYP= 0
##$CFRGTYP= 5
##$CHEMSTR= <none>
##$CNST= (0..31)
1 1 145 1 1 1 1 1 1 1 1 1 1 1 1 1 1 1 1 1 1 1 1 1 1 1 1 1 1 1 1 1 
##$CPDPRG= <>
##$CPDPRG1= <>
##$CPDPRG2= <>
##$CPDPRG3= <>
##$CPDPRG4= <mlev>
##$CPDPRG5= <mlev>
##$CPDPRG6= <mlev>
##$CPDPRG7= <mlev>
##$CPDPRG8= <mlev>
##$CPDPRGB= <>
##$CPDPRGT= <>
##$D= (0..31)
0 0.7 0 0 0 0 0 0 0 0 0 0.03 0 0 0 0 0 0 0 0 0 0 0 0 0 0 0 0 0 0 0 0 
##$DATE= 1773816331
##$DBL= (0..7)
120 120 120 120 120 120 120 120 
##$DBP= (0..7)
150 150 150 150 150 150 150 150 
##$DBP07= 0
##$DBPNAM0= <>
##$DBPNAM1= <>
##$DBPNAM2= <>
##$DBPNAM3= <>
##$DBPNAM4= <>
##$DBPNAM5= <>
##$DBPNAM6= <>
##$DBPNAM7= <>
##$DBPOAL= (0..7)
0.5 0.5 0.5 0.5 0.5 0.5 0.5 0.5 
##$DBPOFFS= (0..7)
0 0 0 0 0 0 0 0 
##$DE= 6
$$ [...]
##$SUBNAM3= <"">
##$SUBNAM4= <"">
##$SUBNAM5= <"">
##$SUBNAM6= <"">
##$SUBNAM7= <"">
##$SUBNAM8= <"">
##$SUBNAM9= <"">
##$SW= 18.0517328524113
##$SWIBOX= (0..15)
0 0 2 0 0 0 0 0 0 0 0 0 0 0 0 0 
##$SW_h= 3612.71676300578
##$TD= 16384
##$TD0= 1
##$TE= 0
##$TE2= 300
##$TE3= 300
##$TEG= 300
##$TL= (0..7)
0 120 120 120 120 120 120 120 
##$TP= (0..7)
150 150 150 150 150 150 150 150 
##$TP07= 0
##$TPNAME0= <>
##$TPNAME1= <>
##$TPNAME2= <>
##$TPNAME3= <>
##$TPNAME4= <>
##$TPNAME5= <>
##$TPNAME6= <>
##$TPNAME7= <>
##$TPOAL= (0..7)
0.5 0.5 0.5 0.5 0.5 0.5 0.5 0.5 
##$TPOFFS= (0..7)
0 0 0 0 0 0 0 0 
##$TUNHIN= 0
##$TUNHOUT= 0
##$TUNXOUT= 0
##$USERA1= <user>
##$USERA2= <user>
##$USERA3= <user>
##$USERA4= <user>
##$USERA5= <user>
##$V9= 5
##$VALIST= <valist>
##$VCLIST= <CCCCCCCCCCCCCCC>
##$VD= 0
##$VDLIST= <DDDDDDDDDDDDDDD>
##$VPLIST= <PPPPPPPPPPPPPPP>
##$VTLIST= <TTTTTTTTTTTTTTT>
##$WBST= 1024
##$WBSW= 4
##$XGAIN= (0..3)
0 0 0 0 
##$XL= 0
##$YL= 0
##$YMAX_a= 838205
##$YMIN_a= -806648
##$ZGOPTNS= <>
##$ZL1= 120
##$ZL2= 120
##$ZL3= 120
##$ZL4= 120
##$ABSF1= 15.4957
##$ABSF2= -2.556149
##$ABSG= 5
##$ABSL= 3
##$ALPHA= 0
##$AQORDER= 0
##$ASSFAC= 0
##$ASSFACI= 0
##$ASSFACX= 0
##$ASSWID= 0
##$AUNMP= <proc_1d>
##$AZFE= 0.1
##$AZFW= 0.1
##$BCFW= 0
##$BC_mod= 2
##$BYTORDP= 0
##$COROFFS= 0
##$CY= -3
##$DATMOD= 1
##$DC= 0
##$DFILT= <>
##$DTYPP= 0
##$F1P= 0
##$F2P= 0
##$FCOR= 1
##$FTSIZE= 16384
##$FT_mod= 6
##$GAMMA= 0
##$GB= 0
##$INTBC= 1
##$INTSCL= 3.241238e-09
##$ISEN= 128
##$LB= 0.25
##$LEV0= 0
##$LPBIN= 0
##$MAXI= 10000
##$MC2= 0
##$MEAN= 0
##$ME_mod= 0
##$MI= 1.114404
##$NCOEF= 0
##$NC_proc= -6
##$NLEV= 6
##$NOISF1= 3.799351
##$NOISF2= 2.8
##$NSP= 0
##$NTH_PI= 0
##$NZP= 0
##$OFFSET= 15.42847
##$PC= 1
##$PHC0= -5299.148
##$PHC1= 6.821927
##$PH_mod= 1
##$PKNL= yes
##$PPARMOD= 0
##$PSCAL= 0
##$PSIGN= 0
##$REVERSE= no
##$SF= 200.130018658049
##$SI= 16384
##$SIGF1= 3
##$SIGF2= 2
##$SINO= 0.751879
##$SIOLD= 32768
##$SREGLST= <19F.Aceton>
##$SSB= 0
##$STSI= 16384
##$STSR= 0
##$SW_p= 3612.71676300578
##$SYMM= 0
##$S_DEV= 0
##$TDeff= 16384
##$TDoff= 0
##$TI= <>
##$TILT= no
##$TM1= 0
##$TM2= 0
##$TOPLEV= 0
##$USERP1= <user>
##$USERP2= <user>
##$USERP3= <user>
##$USERP4= <user>
##$USERP5= <user>
##$WDW= 1
##$XDIM= 16384
##$YMAX_p= 444959715
##$YMIN_p= -526090
$$ End of Bruker specific parameters
$$ ---------------------------------
##NTUPLES= NMR SPECTRUM
##VAR_NAME=  FREQUENCY,     SPECTRUM/REAL,   SPECTRUM/IMAG
##SYMBOL=    X,             R,               I
##VAR_TYPE=  INDEPENDENT,   DEPENDENT,       DEPENDENT
##VAR_FORM=  AFFN,          ASDF,            ASDF
##VAR_DIM=   16384,         16384,           16384
##UNITS=     HZ,            ARBITRARY UNITS, ARBITRARY UNITS
##FACTOR=    0.220516191357247, 1,           1
##FIRST=     3087.69992050026, 0,            0
##LAST=      -525.016842505521, 0,           0
##MIN=       -525.016842505521, -526090,     0
##MAX=       3087.69992050026, 444959715,    0
$$ Real data points
##PAGE= N=1
##DATA TABLE= (X++(R..R)), XYDATA
$$ [...]
8179 51724 19225 -40930 31149 91872 102668 39359 26736 -9420 16286 -4152 63416 12685
8167 12685 -39734 73115 45602 13661 -99572 -73213 -134954 -150128 -62782 -111249 -143799
8156 -143799 -121774 -98585 -72269 -33486 -27169 -29584 -76312 -147237 -144270 -134475 -106546 -116373 -176926
8143 -176926 -201331 -218525 -183155 -183913 -146833 -144162 -177522 -163975 -274458 -281938 -216132 -201349
8131 -201349 -165024 -175600 -198738 -227154 -230592 -180267 -255666 -257081 -219969 -180326 -176048 -234717
8119 -234717 -202178 -198109 -186522 -217408 -232888 -180910 -214112 -228741 -270165 -282802 -254288 -233339
8107 -233339 -255926 -239448 -209735 -197713 -185421 -218600 -234479 -232151 -236477 -188205 -82876 -130859
8095 -130859 -188444 -177233 -194828 -267572 -269638 -132331 -148663 -189167 -240417 -245383 -257449 -265583
8083 -265583 -286268 -198968 -214290 -177274 -96721 -127434 -98488 -112438 -121200 -184283 -178600 -170980
8071 -170980 -194802 -186515 -255067 -239344 -192939 -150609 -216825 -241483 -213774 -192944 -192528 -231897
8059 -231897 -124845 -99707 -138823 -174181 -190978 -183927 -111548 -193574 -165781 -172047 -255172 -208782
8047 -208782 -171957 -120580 -158183 -226127 -206327 -183683 -259112 -276503 -198167 -227805 -229663 -229215
8035 -229215 -211338 -241318 -298537 -321832 -253614 -219362 -253810 -272009 -264361 -232298 -213241 -168688
8023 -168688 -122730 -166971 -140422 -37961 -58478 -168897 -226931 -183661 -148332 -182544 -165827
8012 -165827 -240211 -260195 -251232 -222758 -157551 -158340 -216009 -252620 -211656 -187217 -172970 -151230
8000 -151230 -201924 -207687 -168897 -260872 -246750 -152147 -194157 -239497 -235135 -241290 -220946 -210949
7988 -210949 -260865 -275951 -277742 -214929 -212011 -194096 -186945 -233301 -248351 -219979 -156323 -166839
7976 -166839 -256017 -264540 -219218 -222280 -210408 -228449 -191966 -216609 -182938 -230916 -220347 -255716
7964 -255716 -233816 -239112 -240702 -167845 -264083 -308626 -253775 -256691 -310852 -281746 -214794 -221846
7952 -221846 -207803 -179652 -213760 -215519 -221373 -276216 -258133 -221736 -248260 -220148 -192606 -191470
7940 -191470 -171540 -213066 -186996 -143633 -221304 -193116 -212685 -298805 -205907 -194449 -112660 -131307
7928 -131307 -226210 -215396 -232312 -272291 -226677 -84394 -95424 -204406 -328025 -311633 -268162
7917 -268162 -205419 -201733 -209174 -161867 -173465 -251205 -285565 -319870 -282750 -208384 -252132 -225460
7905 -225460 -232137 -175317 -144195 -119741 -86949 -118849 -184675 -120080 -159216 -206438 -238833 -228033
7893 -228033 -171914 -196417 -138788 -147957 -211469 -192001 -196719 -262271 -265816 -193485 -188342 -242407
7881 -242407 -221452 -214519 -226963 -245244 -212364 -186580 -188040 -184317 -228647 -246206 -221191 -231542
7869 -231542 -165578 -169387 -198356 -228069 -202453 -240711 -180529 -188615 -167526 -138868 -177402 -139518
7857 -139518 -210546 -237073 -223194 -259440 -284403 -165910 -207080 -272956 -222578 -264214 -264999 -236991
7845 -236991 -213724 -230309 -208281 -192473 -182572 -182297 -192358 -190979 -122654 -201035 -253747 -218621
7833 -218621 -219548 -266433 -294876 -260767 -276750 -210208 -173971 -258850 -213444 -135113 -98799 -199132
7821 -199132 -208853 -142072 -138204 -211329 -222097 -196051 -180731 -187249 -188685 -183477 -224717 -314118 -526090
7808 -526090 -197119 -89392 -162921 -152620 -135884 -148630 -190449 -244614 -231701 -259886 -264925
7797 -264925 -192623 -150915 -177794 -168449 -213872 -270792 -192934 -179991 -223729 -134366 -137585 -149257
7785 -149257 -173338 -237582 -242250 -198426 -208463 -223389 -227265 -232556 -226274 -246664 -236092 -189007
7773 -189007 -214932 -231329 -232456 -228038 -223706 -206191 -167073 -177571 -130574 -237006 -197536 -247000
7761 -247000 -231324 -197571 -161186 -220951 -217944 -228059 -233020 -240237 -253398 -210526 -204120 -230678
7749 -230678 -198991 -196617 -143718 -143771 -156979 -148353 -187234 -177247 -268552 -285647 -200292 -221238 -203884
7736 -203884 -168937 -221617 -190514 -260740 -215118 -144380 -181252 -144043 -122042 -242255 -252071 -210322
7724 -210322 -257386 -227558 -222413 -204309 -239943 -190756 -168826 -168305 -143416 -151963 -144786 -105173 -87096
7711 -87096 -118102 -140493 -119651 -110511 -100182 -123358 -72601 -74868 -138342 -136304 -137560 -179031 -146981
7698 -146981 -88449 -192192 -203746 -134697 -136815 -197708 -170589 -157777 -153361 -158933 -118381 -191236
7686 -191236 -203893 -239454 -271654 -164264 -189588 -226116 -235717 -185550 -132596 -140047 -128902 -215215
7674 -215215 -173062 -193268 -173105 -151096 -155348 -108844 -181365 -198501 -183801 -236121 -148566 -92398
7662 -92398 -151119 -161479 -160720 -122720 -139455 -217401 -221873 -161532 -108707 -116392 -93599 -115104 -135868
7649 -135868 -153455 -114257 -90812 -67456 -57408 -120663 -113279 -125831 -215337 -224639 -142804 -150831
7637 -150831 -213400 -161093 -77338 -65380 -29096 -77453 -125325 -159084 -172282 -109905 -109165 -129069
7625 -129069 -166643 -151331 -127388 -184413 -150497 -95816 -168240 -125530 -163959 -240294 -173394 -94558
7613 -94558 -102901 -215066 -219067 -160745 -165043 -245632 -141358 -123671 -140116 -160336 -193522 -180723
7601 -180723 -250633 -183469 -125067 -162637 -166175 -169432 -145114 -214924 -209730 -200765 -137070 -206327
7589 -206327 -265671 -193657 -176511 -165875 -130038 -123133 -133271 -129532 -160208 -172257 -179850 -219420
7577 -219420 -207883 -153320 -130075 -88159 -133594 -173624 -198281 -248612 -258331 -177772 -180298 -147519
7565 -147519 -202721 -261889 -196472 -200894 -174131 -157913 -170377 -132521 -92238 -121529 -169474 -169186
7553 -169186 -233310 -227290 -158021 -166228 -163312 -213911 -175366 -139265 -113605 -114548 -112813 -200238 -204775
7540 -204775 -182640 -119407 -148680 -261129 -247862 -193712 -234627 -185070 -182457 -185622 -174377 -185436
7528 -185436 -151135 -147658 -126378 -185507 -127891 -144088 -166172 -124273 -113859 -140828 -156861 -205548
7516 -205548 -172033 -146407 -139259 -160716 -144960 -189818 -172102 -21391 -44992 -61750 -48733 -77077
7504 -77077 -57555 -92600 -100476 -119300 -109534 -92580 -72878 -30957 -58624 -62524 -81887 -140014
7492 -140014 -79877 -27570 6552 -15050 -52544 -42231 -93288 -123404 -140780 -139202 -78292 -58474
7480 -58474 -63491 -74039 -76017 -88992 -208002 -140661 -49580 9601 45423 48995 -6100 -46842
7468 -46842 -99181 -108318 -91738 -131281 -103167 -88166 -81396 -48252 -5056 -66585 -135667 -94877
7456 -94877 -77001 -34438 -6633 -21880 133 -11174 1236 -31146 -33450 4621 -33768 -121632
7444 -121632 -101124 -63837 -33742 -23446 35178 36331 67379 3325 -1887 -8832 -62144 -71608
7432 -71608 4410 38078 -34736 -65585 -104502 -36501 -21329 -171882 -159949 -113683 -56204 -29036
7420 -29036 -99528 -73359 -117642 -101325 -94320 -135164 -63312 -8202 -108142 -117112 -109247 -177443
7408 -177443 -142507 -116996 -53100 -46494 -44594 -22876 -39322 -70824 -135849 -97399 -51840 -33474
7396 -33474 -46040 -25282 -16798 -31074 -35897 -44674 -91088 -58887 -55927 -57807 -43838 -97805 -76180
7383 -76180 -13357 1462 -1642 -6473 -13220 23864 55562 3965 52023 28830 -9175 -42924
7371 -42924 -41061 -45563 -35302 -21564 -7729 6205 1571 16460 -48005 -74784 -20632 -29703 -21634
7358 -21634 -41096 -55558 -141793 -112127 -89905 -67402 -31490 -35199 -25245 -11941 2048 -7253
7346 -7253 -12522 -67969 52341 118407 48433 90966 26382 4894 43715 -47921 -4567 140570
7334 140570 73551 -42180 -8377 -3716 -19668 -51121 -45628 -102091 -31276 -48728 -26093 -21178
7322 -21178 -72363 -68319 -48955 -32363 -76687 -103890 -93567 10680 18532 -139 -29704 -7521
7310 -7521 -97308 -152648 -73401 -93359 -65070 -32542 -53312 -103339 -137484 -87468 -112174 -143776
7298 -143776 -177384 -112371 -23712 -62417 -115617 -84986 -107362 -131856 -78539 -67033 -21506 -53822
7286 -53822 -50709 -32580 -54114 -31049 -35841 -56857 -38846 -58421 -9899 -6585 -2190 -55896 -10208
7273 -10208 -20888 -20094 -40822 -715 22723 -18104 -75554 -37246 -51208 -4973 -3621 -17418
7261 -17418 -80797 -76916 -18802 13418 -23362 -117223 -82756 -79184 -35134 -75658 -20467 -16485
7249 -16485 -62120 -90307 -70567 -50176 -97883 -119153 -43611 -32790 -16250 -74187 -57205 -22163
7237 -22163 -20062 -93449 -147534 -78440 -63174 -55642 -10482 39767 30876 56364 -10912 -89727
7225 -89727 -54909 -24775 21768 -43455 5695 -430 15685 79501 75402 -56131 -67907 862
7213 862 -48758 -48196 -3810 -45010 -33780 -1564 -16357 -41527 -91541 -49947 -45138 -9537 -65651
7200 -65651 -73568 -52060 -57254 -13054 9394 33605 -41226 -43112 5576 59929 50297 -13611 -6456
7187 -6456 10032 57533 81606 6697 -25915 -35807 -95522 -80963 -76528 -50236 31478 45126
7175 45126 50726 72402 -6973 -55168 -31234 7870 71857 83254 83371 100545 78072 62061
7163 62061 119382 159858 131157 88262 160304 223126 221595 181234 199269 214594 133184 129974
7151 129974 138355 109319 141837 112778 73766 99943 125955 145282 68133 92594 125861 140709
7139 140709 191984 276043 255394 234711 247867 244347 169055 56308 88702 101624 108624 155932
7127 155932 147693 170955 147291 167388 168474 136659 191137 123841 159267 229252 193959 146132
7115 146132 145629 121041 127543 129302 108868 79696 76728 46219 50554 84933 90031 120905 71381
7102 71381 97969 85443 51119 85513 94427 102079 69788 81017 133710 123331 136959 85855
7090 85855 57717 104426 135655 71589 102286 112814 9110 -52427 14135 73793 98692 112569
7078 112569 64135 34309 19037 3762 -10041 -2038 14312 74478 37009 34431 74058 91990
7066 91990 77135 13401 21746 -8017 -23302 5534 35585 119974 103184 -5843 14913 59513
7054 59513 74504 108298 103559 78769 52654 51167 62814 87623 138300 74350 64447 41030
7042 41030 9604 -12948 87575 109459 85068 26950 -24990 -9101 25677 -7309 -28188 35516
7030 35516 104147 92945 25490 36455 -5270 -3013 -15022 61441 61156 106296 97194 101701 10251
7017 10251 -16442 -27533 -49438 -16703 18799 29387 50720 42453 -24158 -22637 6748 -9594
7005 -9594 -32905 10155 22939 70897 109465 75734 36035 104477 165296 97068 20612 11750
6993 11750 59130 45078 55735 103167 74961 27309 51465 80948 116966 124957 95644 73626
6981 73626 99967 82390 125694 149088 155347 71901 81238 113004 65536 26756 47185 115171
6969 115171 107681 105754 58000 50046 110977 117691 67418 70599 45759 97427 124649 121103 62784
6956 62784 35601 70601 82618 39723 55349 73505 125161 187753 191957 106041 147731 227046
6944 227046 154816 92938 121575 21775 82679 108947 113237 155104 111550 122391 143823 127796
6932 127796 128612 157907 113188 152284 140677 153270 146762 193852 191825 112679 18556 -39063
6920 -39063 -48691 -24737 35098 71755 31465 27270 76797 106950 91803 90515 148701 126656
6908 126656 113698 94449 114195 113629 114332 127262 104184 33694 36010 63801 128353 85629 29471
6895 29471 -39451 15642 144996 191651 181482 115885 -8622 -10014 40507 68668 61854 28009
6883 28009 13519 8495 723 10115 41167 16350 11877 -9961 -2832 85998 65544 68564 110531
6870 110531 72412 47538 17807 7423 -18016 49686 114379 112262 60373 72157 80851 69235
6858 69235 103738 122247 61978 95670 127245 94485 70029 114994 105574 117153 103274 171291
6846 171291 164846 175453 53148 59152 133133 120760 63794 61371 128214 42638 101956 180393
6834 180393 183842 135812 169549 113188 82245 127692 128550 153525 85685 106022 109828 158027
6822 158027 95389 132335 150428 75576 97014 143649 156315 112714 137404 152484 165762 197793
6810 197793 265434 214688 154073 192723 212782 154037 187832 297529 345786 357564 405026
6799 405026 383314 351331 435981 445445 427316 469985 429992 460581 485103 465260 494952 532809
6787 532809 518130 439481 479902 603568 603406 619770 598411 605437 654910 639081 558471 612550
6775 612550 615310 560336 573711 666076 632894 620656 676904 612527 554659 541158 543260 536867
6763 536867 510969 496604 505265 544886 545544 494513 478878 470734 495844 454383 502443 516318
6751 516318 429967 434198 393191 417427 446825 466603 384752 341432 332889 327506 348543 358654
6739 358654 380834 344989 320403 247461 239900 336669 325449 370513 335422 367654 331829 320222
6727 320222 399712 358778 425454 390329 418722 451686 449716 444258 462870 361389 318933 357240
6715 357240 306833 335797 357155 374746 372162 326797 315396 427323 429257 354889 364814 421585
6703 421585 464430 461912 429630 375116 370399 421232 512883 510339 502749 516406 504820 464213
6691 464213 441201 448300 471523 433179 495514 542903 511786 525209 498422 468037 484968 482504
6679 482504 549835 571361 533846 629713 600369 581804 622181 639103 708183 715834 753446 777135
6667 777135 768137 832807 807171 754270 684445 673015 709493 675623 694000 682655 639624 631468
6655 631468 647644 616094 687370 601185 585392 573683 555739 574398 599433 511225 506956 575307
6643 575307 535550 540300 540236 514892 533525 545875 485567 468175 548736 589660 607950 618249
6631 618249 572796 552726 550975 545563 535412 498453 461954 550094 610457 574570 479276 501710
6619 501710 545085 564137 603970 628737 604026 592814 564446 597494 642930 615888 657119 687349
6607 687349 636529 591339 556686 610989 631159 582527 578363 572362 587342 614911 628788 645718
6595 645718 539533 516822 516300 509713 489066 508379 478967 485936 488595 542124 518963 506345
6583 506345 529885 585603 558252 503527 526201 482911 445661 433655 495148 446303 457293 456786
6571 456786 506056 541775 548928 555307 551278 620871 602686 550787 497580 570360 653912 613953
6559 613953 528799 409497 453167 542930 562973 545146 584453 604294 640379 620601 582366
6548 582366 680090 647827 636780 608296 536196 559572 537620 515170 572606 563372 560165 530002
6536 530002 457789 472871 506476 568311 545271 549291 493437 555648 582997 562934 518432 547920
6524 547920 550648 578299 540308 476380 570764 575343 687907 634103 570116 560931 616599 678587
6512 678587 729137 726314 743977 758721 741088 714510 679176 628195 665116 688160 685145 687172
6500 687172 741573 726207 692094 713704 658048 706923 732234 794951 761995 726189 729010 698943
6488 698943 680166 648095 634441 598611 677177 740529 762438 827415 852514 884143 899271 901113
6476 901113 845764 753408 737766 703725 626241 639644 653487 680100 644609 715499 780480 735788
6464 735788 680930 698291 706581 689514 656604 741622 788394 840042 834345 806072 793827 823620
6452 823620 797546 789290 790480 848694 875267 881593 861369 855609 856242 818423 841766 839255 931452
6439 931452 892488 849235 877604 866637 787221 815322 795044 768940 784846 872620 871977 836111
6427 836111 803640 750261 813813 821627 830246 823527 855580 801790 756101 720550 712066 749154
6415 749154 784350 803538 776418 843470 795999 767495 769636 781252 793494 885861 859357 846976
6403 846976 794539 793031 824603 871179 855870 851266 856244 850337 904583 919617 922452 945867 1012729
6390 1012729 966392 983671 1018835 1047524 1028739 1006226 1016361 980187 1042497 1020738 1034834
6379 1034834 1113508 1117794 1116846 1131342 1131449 1119299 1147269 1123352 1103254 1159455 1186375 1185792 1216600
6366 1216600 1225549 1153601 1223611 1279365 1297309 1309878 1348070 1361843 1349913 1387187 1430625 1509396
6354 1509396 1548535 1559810 1578725 1679988 1647460 1613371 1594942 1557097 1647729 1671109 1600907
6343 1600907 1639787 1631304 1687250 1674886 1668060 1689095 1715651 1809239 1876820 1832324 1845449 1910818
6331 1910818 1935671 2079083 2139380 2149533 2199593 2327869 2450797 2506639 2519352 2513798 2507847
6320 2507847 2564543 2641841 2684369 2699822 2675331 2702799 2694349 2699733 2785094 2874636 2919384 2957659
6308 2957659 3048475 3066072 3046771 3168791 3229355 3401067 3524873 3697954 4000589 4183002
6298 4183002 4374613 4690082 5101416 5560377 6141507 6875903 7868677 8881780 9743147
6289 9743147 10240452 10242359 9889751 9313136 8731356 8254805 7929198 7762619 7884699 8174446
6279 8174446 8666737 9445347 10353939 11091126 11500527 11504667 10911032 10063360 9152729 8324061
6269 8324061 7540134 6914779 6403449 6064110 5806754 5562046 5436660 5318156 5339405 5233944
6259 5233944 5223713 5224200 5251994 5181145 5097548 5146483 5177707 5307033 5383593 5462848 5448576 5426893
6247 5426893 5482090 5346488 5241446 5209800 5151012 5130692 5025951 4989005 4976604 4930302 4916850
6236 4916850 4884596 4893934 4943815 4996072 5152243 5294083 5429372 5562384 5864526 6227646
6226 6227646 6623720 7246535 8002469 8916372 10096667 11733648 13524748 15154838 16228209
6217 16228209 16385437 15785850 14636916 13387964 12324311 11505815 11043994 10872532 11122055
6208 11122055 11720201 12771413 14120680 15448029 16272697 16333956 15557061 14161631 12656303
6199 12656303 11080298 9763474 8646293 7750457 7060751 6543178 6166133 5836231 5554937
6190 5554937 5313533 4963477 4808344 4682984 4608775 4560247 4471334 4474108 4445904 4406042 4372923
6179 4372923 4351136 4309090 4328716 4347288 4432143 4500613 4387939 4434638 4390662 4413607 4516678
6168 4516678 4579411 4576347 4542136 4576513 4551710 4598168 4584802 4631369 4630744 4518823 4451126 4377326
6156 4377326 4350193 4323800 4357353 4379260 4332716 4350562 4362809 4335603 4301911 4348348 4397222
6145 4397222 4411024 4441474 4481841 4493833 4531196 4564483 4632550 4693570 4791254 4854865 4917635
6134 4917635 5020514 5087063 5130189 5181257 5259637 5353839 5415739 5521390 5581531 5645438 5775617
6123 5775617 5918107 5943665 6009875 6141358 6236428 6312252 6348001 6444626 6559842 6614153 6691865
6112 6691865 6839825 6933413 7005867 7018595 7055132 7070358 7100704 7189460 7246601 7249757 7329487
6101 7329487 7405077 7458533 7570857 7646723 7761579 7816275 8011407 8113462 8211569 8451147
6091 8451147 8678712 8859264 8965504 9100252 9379815 9631594 9740978 9910683 10080282 10254236
6081 10254236 10410909 10485553 10606694 10772814 10972538 11122681 11340870 11565240 11822601 12122987
6071 12122987 12493046 12811834 13270291 13740783 14333822 15015324 15669313 16411072 17130469
6062 17130469 17832160 18625202 19646421 20908859 22555293 24433144 26162769 27313683
6054 27313683 27817766 27536076 26711939 25719674 24745867 23937791 23297834 23065733 23072477 23149134
6044 23149134 23497703 23925383 24543969 25289048 26229026 27450569 29019021 30920071 33325649
6035 33325649 36148427 39134254 41850524 43966902 45439912 46625723 47900638 49677228
6027 49677228 52349217 55903171 60482331 65945737 71774238 77299474 82420840 86931943
6019 86931943 90907993 94532644 97528472 99894507 101314716 101659525 100670985 98384182
6011 98384182 95251804 91807868 88633785 86174039 84575124 83990607 84370369 85780458
6003 85780458 88187490 91474158 95535088 100314385 105575021 110703618 115236158 119242554
5995 119242554 122893663 126495290 130120276 133421068 135733988 136372746 134242434 129101555
5987 129101555 121781695 113556192 105436188 97955667 91223917 85111825 79635676 74828423
5979 74828423 70685309 67095526 63933209 60950728 57991790 54752170 51204865 47464752
5971 47464752 43831755 40389200 37297945 34645813 32503464 30978687 29953432 29339563
5963 29339563 29070574 28786691 28257097 27262701 26022265 24555601 23084892 21668267 20473433
5954 20473433 19498093 18622507 17832976 17193908 16635242 16096551 15710939 15228646 14811491
5945 14811491 14598268 14309329 14019560 13686591 13448040 13286290 13194946 13068764 12991379 12973105
5935 12973105 12944673 13042319 13080075 13116829 13147233 13274257 13461431 13636359 13950357 14192793
5925 14192793 14265256 14230534 14147233 13949636 13751170 13568040 13398029 13292646 13321677 13478324
5915 13478324 13691370 13937450 14333700 14848884 15567667 16398199 17225035 17842779 18189290
5906 18189290 18419455 18263759 17966481 17608488 17234841 16964653 16770365 16699410 16817383 17024869
5896 17024869 17361202 17899866 18613072 19568356 20764364 22004067 23337953 24545821 25556883
5887 25556883 26317167 26776263 26996618 27067198 26845479 26600141 26437127 26305245 26315095 26456327
5877 26456327 26825060 27394631 28171579 29152170 29912510 30691432 31474494 32154744 32755931
5868 32755931 33412157 34155481 34866913 35508350 35942752 36033875 35859889 35678407 35444563 35280656
5858 35280656 35278224 35598637 36063768 36564589 37106734 37635666 37986670 38422509 38760174 38703655
5848 38703655 38608835 38446144 38206633 37752549 36992319 36036603 35116924 34355316 33789294 33466804
5838 33466804 33199780 33043835 33001416 33125159 33483832 34157430 34806268 35406241 35680312 35439500
5828 35439500 34715215 33518856 32225659 30775236 29280411 27964822 26625371 25527618
5820 25527618 24572790 23690504 22993983 22409063 22061544 21888410 21932357 22053840 22206216 22249906
5810 22249906 21988602 21592367 21042535 20425400 19648622 18879005 18048401 17087798 16132579
5801 16132579 15153773 14268079 13446361 12879976 12297162 11820638 11385216 11054937 10533009
5792 10533009 10148749 9939942 9682082 9477017 9352562 9250447 9097605 8803551 8362207
5783 8362207 7891700 7364963 6990334 6579464 6223972 5923681 5676830 5508063 5307260 5152574
5773 5152574 5049939 4954250 4776392 4610104 4482890 4335065 4131908 3944297 3851233 3719765
5763 3719765 3613741 3515473 3449459 3342925 3285861 3202395 3165700 3105788 3056050 3010157 2899492
5752 2899492 2864583 2808369 2743330 2740286 2760783 2796871 2754586 2675764 2600851 2644185 2679186 2621665
5740 2621665 2576640 2580298 2595751 2504688 2528274 2468436 2430614 2477640 2466251 2477042 2449317 2407689
5728 2407689 2385568 2354702 2300684 2271112 2263072 2299333 2225199 2190706 2213648 2241839 2244643 2214370
5716 2214370 2244343 2264891 2296494 2361864 2398413 2419058 2510241 2520901 2616324 2667109 2596922
5705 2596922 2592716 2597055 2597619 2601189 2596805 2614391 2650355 2618775 2592000 2614192 2635224 2591411 2603856
5692 2603856 2628172 2558110 2608371 2656603 2697250 2649705 2656821 2640713 2564332 2503424 2467322 2418648
5680 2418648 2454048 2451548 2375803 2434473 2437521 2445435 2491233 2432428 2360404 2314066 2267103 2252197
5668 2252197 2262511 2248721 2159522 2195236 2166933 2020987 2011913 2021015 2020787 2075041 2074960 2056619 2035076
5655 2035076 2101940 2092030 2047329 1999113 2009134 2031544 2051682 2072650 2017132 2009819 2050171 2031663
5643 2031663 2093420 2101688 2012821 1915834 1961443 1977722 1900624 1814519 1813648 1863754 1914292 1866456
5631 1866456 1912271 1922318 1832159 1881497 1926197 1939429 1967699 2021854 1922121 1881523 2000249
5620 2000249 2088633 2095797 2138941 2151987 2123404 2114918 2134507 2110655 2031567 2054509 2066062 2113003
5608 2113003 2162006 2163084 2101717 2084484 2050779 1973727 2022513 2047486 2017702 2043258 2092789 2072589
5596 2072589 2119737 2138380 2183749 2241692 2195112 2218988 2259514 2216285 2319068 2382175 2406465
5585 2406465 2367390 2319406 2267198 2318911 2299362 2281533 2327835 2331102 2277976 2255611 2227969 2317335
5573 2317335 2388416 2435320 2418675 2490463 2629535 2763152 2891261 2987535 3055279 3142319 3150062
5562 3150062 3108235 3073970 3013761 3031032 3032188 3009728 2990727 3007180 3035488 3105889 3189645 3340963
5550 3340963 3473407 3675225 3790260 3910972 4012625 3980005 3902938 3876875 3840983 3719790
5540 3719790 3504630 3369525 3213701 3085177 3075274 2952238 2914688 2935779 2967088 3070875
5530 3070875 3118532 3113113 3124974 3255389 3387749 3410340 3462487 3383175 3218602 3182220 3061769
5519 3061769 2908915 2898162 2835222 2777614 2763956 2714683 2769184 2739660 2687729 2730459 2597891
5508 2597891 2548755 2580721 2603078 2489604 2400038 2430328 2328354 2310774 2297699 2367352 2386361
5497 2386361 2263223 2230221 2266131 2277857 2268462 2179135 2141886 2085734 2065786 2040723 2042978 2076654
5485 2076654 2043402 2010254 1952799 1879011 1950163 1960740 1979583 1990304 2046674 2005373 1931195
5474 1931195 1940704 2017471 2021595 2004090 2026797 2014526 1977637 1940652 1935246 1910902 1899902 1943423
5462 1943423 1928760 1917505 1893361 1948462 1951687 1964901 1988254 2011830 2000074 2028086 1960854 1998547
5450 1998547 1991031 1910661 1895008 1888906 1947100 1919787 1983402 1923977 1894629 1896769 1873022 1857884
5438 1857884 1899736 1863161 1908133 1938326 2011486 2079109 2090328 2099432 2133914 2102489 2092845 2152544
5426 2152544 2209713 2178798 2202023 2213476 2185118 2194326 2209144 2175601 2169727 2174417 2117380 2034144
5414 2034144 2068275 2023000 1977976 1972950 1956583 1955327 1961257 1995380 2126545 2020381 2011843 2070221
5402 2070221 2075716 2054317 2128783 2080897 2042413 2017884 2000122 2048659 1960352 1962362 1986942 1936137
5390 1936137 1967628 2009098 2038666 2084055 2118431 2061099 2073335 2120283 2122934 2070008 1993040 2049573
5378 2049573 1969042 2104085 2143540 2234575 2269205 2249135 2283826 2289935 2287484 2338219 2392080 2362979
5366 2362979 2383356 2388317 2411391 2413200 2413161 2401546 2410676 2410086 2388495 2433270 2469617 2525358 2533191
5353 2533191 2497497 2512412 2629517 2573524 2611354 2747839 2778219 2809420 2777477 2818877 2807258
5342 2807258 2776095 2779537 2753990 2698829 2666665 2666040 2638159 2647350 2645164 2691740 2699376 2744968 2672245
5329 2672245 2660376 2682746 2683761 2642911 2671296 2764000 2820139 2815762 2841018 2895243 2911802 2879821
5317 2879821 2855027 2896907 2890228 2915610 2944648 2854227 2867669 2907757 2839289 2832214 2844958 2874074
5305 2874074 2894332 2954052 2997347 3009804 2989247 2989917 2995169 3067103 3068969 3080763 3192765 3223416
5293 3223416 3231938 3225786 3239707 3305296 3263003 3274085 3349261 3378510 3412786 3448023 3491801 3504127
5281 3504127 3525932 3571009 3611970 3622217 3669494 3750230 3818949 3840985 3790271 3744885 3863733
5270 3863733 3950504 4023807 4144901 4156750 4286736 4448598 4640885 4773062 4973225 5422949
5260 5422949 5832363 6333113 6717058 6947307 7061832 6963479 6861158 6753562 6753584 6852601 7057093
5249 7057093 7391797 7952426 8712693 9434792 10092550 10589821 10960802 11211986 11319044 11397389
5239 11397389 11475907 11438509 11514802 11665967 11745676 11893420 12080820 12322350 12573022 12807823
5229 12807823 13076207 13424405 13736425 14125427 14477370 14566236 14413132 14051775 13617139 13294816
5219 13294816 13014344 12874673 12712935 12407816 12201632 12010140 11760450 11486797 11253000
5210 11253000 11182576 11092547 11022333 11060435 11116314 11034223 10816470 10384905 9702615 8834828
5200 8834828 8126161 7488397 7024479 6694726 6489327 6496430 6593873 6742859 6918589 6919068 6669111
5189 6669111 6344407 5966399 5557814 5221647 5016962 4807851 4568975 4414385 4397046 4345977
5179 4345977 4280109 4221237 4167229 4080918 4078172 4089139 4094880 4142073 4067760 4040285 4085371 4045089
5167 4045089 4036584 3990515 3945026 3986466 3994982 3925173 3973724 3998683 3988253 4042482 4081513 4153747
5155 4153747 4217166 4241833 4263970 4337503 4351854 4334358 4309570 4318703 4314776 4353506 4481546 4500634
5143 4500634 4508402 4523772 4479542 4452139 4529180 4567225 4555666 4563331 4541873 4476438 4479174 4501492
5131 4501492 4576823 4533653 4493142 4461228 4517490 4513488 4554095 4528565 4537880 4533405 4567059 4684847
5119 4684847 4754048 4808327 4811930 4884678 4921295 5030621 5146544 5165566 5145023 5206701 5269992
5108 5269992 5372726 5497816 5602841 5695979 5803224 5921692 5935654 5991812 6005104 5970005
5098 5970005 5942497 5865264 5827222 5813865 5882257 5886030 5972082 6054868 6037064 6120049 6254160
5087 6254160 6285156 6375789 6431050 6493677 6531024 6580865 6618802 6584862 6599788 6637953 6690439
5076 6690439 6671601 6637877 6675128 6651842 6724316 6858522 6929420 7092237 7231525 7328589 7387180
5065 7387180 7492859 7549196 7671706 7771895 7748872 7766830 7794387 7830790 7839377 7914165 7987135
5054 7987135 8031016 8068217 8198505 8314609 8371731 8417242 8422242 8516841 8526524 8561517 8589924
5043 8589924 8587281 8579431 8515523 8455249 8397123 8371035 8387733 8416054 8500536 8602783 8583880 8603916
5031 8603916 8647947 8679594 8755510 8876907 8822837 8754978 8695441 8666187 8617663 8521432 8506809
5020 8506809 8540147 8554423 8613616 8700826 8763551 8811095 8918900 9002714 9170298 9368599 9516914
5009 9516914 9667478 9879257 10135222 10366190 10539054 10829785 11185168 11521181 12007167 12488447
4999 12488447 13009836 13723903 14523297 15338128 16516654 17899054 19555711 21317661 22894350
4990 22894350 23941894 24116331 23450322 22304223 21098999 19929111 18902837 18143189 17645965
4981 17645965 17382139 17300679 17522784 17998437 18752176 19751701 21026849 22624372 24268287
4972 24268287 25568983 26224478 25885543 24853459 23454049 22083388 20881266 19941098 19221455
4963 19221455 18675436 18484750 18349039 18256720 18391454 18687543 19060061 19524055 20022777 20602312
4953 20602312 21040000 21330550 21449614 21413182 21348226 21481160 21742568 22129307 22638362 23468882
4943 23468882 24380973 25516356 26955085 28697345 30969544 33635483 36591443 39443163
4935 39443163 41493036 42228924 41667899 40063553 38081801 36078768 34226495 32679683
4927 32679683 31576826 30861860 30509613 30442983 30773678 31455535 32542061 34084373 35880138
4918 35880138 37721710 39249109 39943609 39509509 38375940 36796253 35171910 33757082
4910 33757082 32611446 31716356 31136133 30841044 30753548 30916027 31360861 31837169 32590277
4901 32590277 33510873 34578079 35969417 37397001 38782208 39971350 41052910 42093317
4893 42093317 43178673 44397935 45711160 47280964 49152731 51093461 53046542 55000265
4885 55000265 56943196 58731473 60597896 62544606 64507484 66401705 68188274 69708738
4877 69708738 70910232 71782760 72580667 73526675 74703860 76198387 77941612 79854193 82067166
4868 82067166 84502670 87116814 89915776 93003029 96324324 99981632 104111698 108482955
4860 108482955 112619365 115585683 116819132 116587642 115551622 114203382 112870000 111731375
4852 111731375 110827771 110183544 109835477 109634830 109659392 109932292 110544132 111558729 113121879
4843 113121879 114989893 116938498 118536468 119498011 120014169 120171988 119684086 118400347 116805576
4834 116805576 115209759 113819488 112448433 111019997 109698785 108522232 107687234 107233281
4826 107233281 107183959 107626501 108516260 109872409 111561963 113305349 114603053 114983711 114487930
4817 114487930 113648826 113096956 113008273 113245868 113624773 114088819 114746177 115749065 117171983
4808 117171983 119026267 121233137 123896908 126714334 129339409 131303237 132435840 132732203
4800 132732203 132196082 130963755 129292576 127263827 125124363 122976371 120882651 119197310
4792 119197310 118027875 117691212 118169283 119520229 121979873 125378599 129608808 134599974
4784 134599974 140339746 146670330 153561881 160994710 169002275 177205554 184852290 190975513
4776 190975513 194631082 195660858 194125535 190681374 185836293 180196761 174204344 168049578
4768 168049578 161874331 155830961 150064736 144947347 140728143 137589216 135640568 134660751
4760 134660751 134388972 134321719 133616765 131960802 129372959 126248874 122968189 119829037 116861711
4751 116861711 113898095 110919360 107808572 104403110 100619173 96676834 92718644 88876688
4743 88876688 85176148 81598495 78189430 74994133 72031471 69445221 67522386 66264438
4735 66264438 65589428 65552310 65681921 65450794 64360305 62048029 58839620 55215702 51572848
4726 51572848 48273143 45399945 42974016 40936239 39203918 37761154 36678972 35877372
4718 35877372 35365089 35091749 34959847 34834388 34614182 34233039 33505768 32723172 32049850
4709 32049850 31447658 31048134 30865581 30871147 31098362 31553464 32248327 33360702 34914378
4700 34914378 36752788 38823412 40725283 41959254 42001569 40840693 38994801 36798095
4692 36798095 34648739 32667974 31140878 29998787 29205510 28740768 28614568 28870947 29405043
4683 29405043 30242531 31256095 32400630 33341917 34018519 34545989 34845813 34788180 34350770
4674 34350770 33556286 32608105 31721181 31173329 31023180 31360073 32214950 33572306 35232991
4665 35232991 36567201 37135506 36761520 35502810 33734642 31929238 30313250 28874126
4657 28874126 27524855 26372002 25363285 24511698 23878289 23451540 23232433 23311890 23592841
4648 23592841 24126804 24913616 25739383 26645732 27571271 28352995 28955851 29285438 29078591
4639 29078591 28511480 27849622 27329431 27081079 27339518 28059165 29276295 30892796 32618460
4630 32618460 33948428 34520119 34194248 33148955 31939568 30517679 29133319 27767993
4622 27767993 26276634 24819254 23531296 22428677 21595282 20992270 20696010 20751445 21213819
4613 21213819 21930451 22995380 24206954 25346361 25974808 25828492 24888992 23382749 21794466
4604 21794466 20287066 18940343 17864091 17000020 16329204 15797707 15364212 15107300 14944012
4595 14944012 14910155 14932433 15131998 15402500 15725715 15981853 16148824 16226351 16128710 15948578
4585 15948578 15791177 15622494 15735560 16017964 16397237 17016477 17911260 19055269 20409344
4576 20409344 21891184 23107379 23583167 23270422 22291080 20997461 19717875 18633812 17790271
4567 17790271 17136007 16854046 16793673 17048218 17783724 18946391 20541788 22275162 23399639
4558 23399639 23557027 22866337 21592291 20260352 19265064 18707561 18598300 18948441 19891385
4549 19891385 21207372 22645615 23476759 23294164 22308982 20963184 19704681 18788571 18600023
4540 18600023 19078060 20013749 20908159 21384288 21023192 19974665 18704254 17464229 16525089
4531 16525089 15941545 15791277 16150513 16902920 17989518 18879218 19184773 18530441 17233976
4522 17233976 15678569 14164240 12928182 11906116 11092146 10415688 9974371 9588097 9315359
4513 9315359 9134543 8950468 8778889 8622085 8500683 8403270 8278102 8215577 8053511 7924797
4503 7924797 7843934 7757047 7687953 7654706 7647019 7582138 7491409 7456871 7432841 7388777 7330177 7280973
4491 7280973 7272013 7291035 7277811 7260577 7248159 7234529 7191988 7207180 7192145 7121602 7081447 7090352
4479 7090352 7065246 7110083 7085238 7011619 7030783 7052213 7014091 7067994 6967745 6961078 6991316
4468 6991316 6884986 6911746 6855022 6850307 6852263 6854329 6798134 6833844 6846468 6874551 6862832 6863220
4456 6863220 6884592 6944459 6941920 6932703 6902982 6853717 6825288 6845674 6834784 6768680 6645285 6663253
4444 6663253 6656806 6618922 6649512 6714374 6783130 6738901 6739253 6749915 6783053 6787346 6869919 6910640
4432 6910640 6948519 6935366 7111945 7250726 7342870 7470242 7563860 7576609 7507805 7374443 7354240
4421 7354240 7335991 7305357 7330488 7349246 7366677 7438448 7501254 7571880 7595549 7595205 7597658 7628981
4409 7628981 7632954 7597663 7534961 7537455 7686795 7671938 7640363 7588154 7649573 7676560 7772354 7883103
4397 7883103 7884662 7979978 7991804 8034359 8244365 8263908 8238405 8236092 8310462 8375349 8366400 8418853
4385 8418853 8496638 8542871 8564250 8610713 8641382 8763047 8809580 8830715 8849171 8867505 8985466
4374 8985466 9021921 9074808 9147488 9140326 9141036 9136473 9105068 9166651 9148696 9192242 9268538 9288774
4362 9288774 9341362 9406227 9513410 9628299 9736788 9806929 9888757 10000909 10085365 10195963
4352 10195963 10307775 10415119 10501566 10586274 10566825 10633442 10632448 10582467 10613725 10747490 10849793
4341 10849793 10876476 10949795 11055023 11159020 11182264 11190981 11124429 11156961 11171717 11229626 11293310
4330 11293310 11312350 11391377 11419863 11481008 11527470 11589428 11599563 11673161 11833245 11922924 12019662
4319 12019662 12121316 12321678 12513339 12690850 12786172 12940678 13198757 13402176 13625166 13855396
4309 13855396 14020264 14275311 14569171 14878041 15163727 15450476 15729492 16017344 16198156
4300 16198156 16209774 16265019 16453041 16673164 16866012 17114630 17363314 17613433 17828443 18015782
4290 18015782 18184065 18399086 18668378 18891243 19160291 19619417 20122840 20768052 21550376
4281 21550376 22436368 23504875 24519685 25570073 26434638 27050021 27602031 28052761 28282522
4272 28282522 28656055 29217284 29800729 30234597 30487455 30599545 30528109 30445691 30360931 30565247
4262 30565247 31207868 32285840 33696518 35611902 38098782 41187638 45211488 50358155
4254 50358155 57000092 65149220 74710225 84920452 93973692 100126661 102921308 103139153
4246 103139153 102261226 101837209 102555394 103829442 103885010 101191034 95048678 86137915 76128293
4237 76128293 66349104 57728049 50495486 44533743 39766541 35958356 32904631 30342037
4229 30342037 28366855 26762903 25330879 24196136 23206615 22409596 21790801 21143327 20603330
4220 20603330 20175961 19766940 19513753 19227305 18991270 18769448 18547906 18429344 18333810 18195495
4210 18195495 18071810 17954081 17870371 17778679 17692266 17639845 17620738 17605354 17611159 17628732 17728625
4199 17728625 17925936 18008558 18086208 18246226 18278241 18338045 18430565 18510700 18686891 18869327
4189 18869327 19074431 19322151 19543772 19802842 20106594 20347456 20724211 21170611 21542705
4180 21542705 21974016 22457404 22944002 23496624 24103757 24851328 25739859 26602105 27455756
4171 27455756 28423991 29487123 30589669 31674172 32789010 33806014 34759116 35690640 36660553
4162 36660553 37480622 38302596 39094485 39872687 40817572 41775836 42876411 44138746 45404122
4153 45404122 46805506 48233564 49706663 51191981 52655998 54010068 55453577 56845028
4145 56845028 58210968 59588455 61188152 62779800 64287283 65824872 67390125 68932717
4137 68932717 70652879 72352261 74061908 75965686 78157169 80577058 83455976 86914705
4129 86914705 91106790 95878384 101684876 108792923 117947549 130116918 147867493 171164866
4121 171164866 194812485 207827272 204919808 191362058 173175144 156261512 142296515
4114 142296515 131888258 124388067 119048354 115274829 113158143 111860076 111133700 110632182
4106 110632182 110394866 110291273 110447830 110883760 111766393 113259575 115365191 118064906 121293743
4097 121293743 124866455 128577597 132234486 135609068 138718345 141629045 144210617 146508165
4089 146508165 148604829 150356121 151814074 152921001 153723112 154312429 154507471 154398049 153901665
4080 153901665 153232330 152677238 152375824 152276874 152409734 152598166 152754395 152833467 152712816 152345236
4070 152345236 151782213 151104344 150383229 149789816 149444969 149394368 149742254 150446509 151311088
4061 151311088 152218589 152976326 153283760 153092884 152567232 151627762 150228510 148325006 146215958
4052 146215958 143774469 141300053 138713044 135894893 132613546 128711354 124375830 120019410
4044 120019410 115967773 112557817 109853503 107906254 106463949 105375774 104843298 104532912
4036 104532912 104482392 104660845 104942836 105446270 105904083 106234159 106050416 105431003 104496358
4027 104496358 103530956 102760364 102275490 102072883 102009017 101663624 100731837 99097053 96614161
4018 96614161 93659329 90477592 87609222 85186970 83391381 82182501 81320502 80711126
4010 80711126 79955261 78976124 77634584 76152200 74535182 73089774 71673242 70370433
4002 70370433 69050075 67376727 65504361 63443318 61238949 59111202 57140103 55186412
3994 55186412 53152692 51196963 49265949 47367615 45503548 43792380 42172690 40728482
3986 40728482 39430962 38202404 37089890 36088983 35110448 34261488 33487895 32788414 32194842
3977 32194842 31601345 31061013 30517947 29948534 29324788 28656703 27933945 27260932 26575818
3968 26575818 25839335 25290819 24730416 24303773 23888681 23526857 23001809 22512629 22217212
3959 22217212 21936302 21766096 21590989 21521343 21349033 21169329 20914764 20661245 20345110 20139863
3949 20139863 19906655 19777520 19705611 19609606 19525396 19381776 19226179 19088511 18954932 18861316
3939 18861316 18718361 18520313 18329427 18178758 18076360 18032505 17978325 17841741 17636234 17486838
3929 17486838 17259126 17078191 16855223 16674003 16612813 16500563 16355640 16275235 16188204 16131598
3919 16131598 16082136 16112062 16036685 16057040 15996053 15886827 15759219 15765899 15814090 15813479 15820902 15954986
3907 15954986 16056721 16032302 15996919 15953923 15950574 15949263 15937050 15947135 15969283 16066240 16183567
3896 16183567 16384479 16624786 16717365 16920465 17089226 17339825 17548946 17730360 17903642 18066530
3886 18066530 18345798 18570709 18851381 19189340 19536027 19843076 20110664 20472470 20880007
3877 20880007 21376472 21720716 22116787 22542416 22874993 23299007 23688791 24041849 24364939
3868 24364939 24718255 25109960 25523888 25917826 26460694 27012671 27583872 28183735 28841462
3859 28841462 29659793 30524509 31425327 32424469 33670742 35104715 36707133 38478886 40457377
3850 40457377 42550699 44705202 47004470 49318482 51750542 54199168 56572124 59110610
3842 59110610 61506674 63973612 66362901 68656542 70820393 72950740 75075615 77268806
3834 77268806 79309062 81378718 83396645 85317457 87220188 89153027 90958142 92630882
3826 92630882 93769109 94297815 94233236 93753155 92834774 91553746 90041173 88242265 86188528
3817 86188528 84082107 82040360 80044618 78277980 76791388 75443298 73967302 72383608
3809 72383608 70636715 68703015 66659114 64639085 62508132 60474227 58579820 56894550
3801 56894550 55414628 54098868 53001333 52056693 51461859 51027993 50688263 50617591 50678396
3792 50678396 50735866 50845491 51092621 51477633 51946899 52525853 53330757 54251537 55395879
3783 55395879 56435409 57527549 58567334 59396756 60082982 60645904 60995185 61195114 61397686
3774 61397686 61584991 61726366 61919979 62020617 62132649 62124238 61951173 61665698 61298992 60871881
3764 60871881 60313244 59664449 58898910 57972978 57077184 56170790 55401857 54740852 54201927
3755 54201927 53632629 52903557 52149594 51277280 50401793 49560449 48988187 48482143 48053537
3746 48053537 47821633 47841114 47980325 48153165 48375653 48605912 48762934 48913347 49140976 49573246
3736 49573246 50096774 50731012 51532929 52407247 53246482 53950976 54608716 55249723 55902977
3727 55902977 56474309 56928894 57288379 57461540 57526180 57439705 57304075 57223752 57113896 57110605
3717 57110605 56983177 56689560 56210742 55600860 54855173 54077802 53343812 52632326 51910426
3708 51910426 51246694 50515924 49697033 48796558 47919417 47056849 46089482 45292285 44674783
3699 44674783 44085835 43544708 43048284 42728814 42468856 42278031 42182103 42212775 42490621 42885696
3689 42885696 43294857 43654274 44023046 44436327 45051417 45977392 47116245 48611467 50233852
3680 50233852 51913305 53685743 55372647 56894655 58362248 59842713 61367189 62931018
3672 62931018 64351273 65582401 66531451 67185916 67650104 67921145 67999382 67866624 67596396
3663 67596396 67266830 66903794 66456656 65811492 65053497 64198635 63469639 62633490 61922230
3654 61922230 61253978 60559551 59841847 59029512 58196411 57422566 56633777 56000208 55358296
3645 55358296 54744726 53999778 53141714 52265066 51322244 50314505 49229846 48225051 47336213
3636 47336213 46707570 46434227 46472123 46756834 47417259 48501552 49982892 51752114 53506865
3627 53506865 55210994 56833980 58239469 59564125 60716076 61769048 62823856 63908432
3619 63908432 64938529 65828002 66461000 66687028 66466746 65867000 65080593 64107642 63008894
3610 63008894 61821180 60681350 59659473 58556688 57423962 56222509 54986096 53825292
3602 53825292 52871433 52288959 52097246 52206037 52751920 53603915 54544859 55662262 56882959
3593 56882959 57892959 58674666 59277060 59581831 59619872 59548865 59208522 58521594 57455958
3584 57455958 56124798 54663775 53040931 51523326 50300801 49333098 48746210 48664623 48925908
3575 48925908 49478962 50176910 50829877 51170835 51037034 50464281 49489996 48232332 46651175
3566 46651175 44789031 42757852 40738863 38916339 37487287 36189585 35186476 34440893
3558 34440893 33742222 33182743 32596162 32028931 31473187 31066667 30796564 30721668 30781679 30864867
3548 30864867 31004852 31132870 31200015 31347990 31549450 31975259 32424870 33000458 33919701 34968582
3538 34968582 36161726 37524661 38899160 40183575 41468968 42742015 43932457 45028032
3530 45028032 45986119 46792779 47521654 48137567 48789341 49607819 50822433 52478531 54622785
3521 54622785 57138733 59696409 62057712 63679395 64126381 63365625 61459020 58800380
3513 58800380 55850406 52971397 50150170 47446678 44762344 42344362 40092802 38061085
3505 38061085 36438215 35075448 34033579 33275493 32698643 32353419 32289972 32356337 32520917
3496 32520917 32835950 33201694 33460571 33624706 33791286 33712720 33585271 33421612 33263471 33186645
3486 33186645 33056613 33050626 33125401 33235100 33310989 33401810 33549764 33665850 33854745 34207283
3476 34207283 34664672 35248550 36106812 37023403 37814046 38435120 38922956 39298278 39804946
3467 39804946 40501583 41287563 42190258 42949982 43613195 43879564 43810371 43639514 43426476 43123381
3457 43123381 42903882 42756719 42590706 42410421 42209067 41903134 41651423 41454805 41423367 41469914
3447 41469914 41619260 41879459 42209287 42538090 42996068 43581713 44186361 44783405 45455914
3438 45455914 45990851 46261557 46418848 46592955 46648154 46835869 47092946 47317606 47636663 47976204
3428 47976204 48336943 48640207 48960531 49288770 49390538 49185064 48774481 48134027 47408425
3419 47408425 46819818 46322182 46053215 45951312 45927568 45946574 45963345 46112571 46366839 46720280
3409 46720280 47137436 47799401 48645374 49788667 51336896 53513829 56200240 59231615 61556867
3400 61556867 62452740 61684756 59887477 57705013 55573390 53919927 52575918 51632301 51013911
3391 51013911 50680690 50487385 50549351 50765764 50990188 51386328 52024864 52887415 54012786
3382 54012786 55356315 57076648 59036481 61286400 63694438 65824208 67641828 68969325
3374 68969325 69782205 70468705 71329276 72522425 74130949 76176269 78608260 81172350 83958318
3365 83958318 86457032 88412467 89894112 91159244 92512252 94279781 96492685 98839881
3357 98839881 100773365 101730851 101490006 100344731 98717967 97355569 96570588 96377895 96488128
3348 96488128 96517800 96142294 95431452 94603596 93977716 93787495 94048418 95064367 97065866
3339 97065866 100248175 104656134 110400168 117355158 125889935 136410979 149629437 166691103
3331 166691103 188405113 214383963 241830995 264929447 277139632 275385966 261998766
3324 261998766 242519147 222064314 203711095 188469985 176158945 166449306 159024520
3317 159024520 153892701 150954181 149912138 150327527 151503566 153018476 154603516 156442789
3309 156442789 158891270 162490917 167660304 174529619 183172143 193923293 207650936 225590399
3301 225590399 248899569 276533123 304388975 326344597 336460328 331765525 314669622
3294 314669622 291099481 267219776 246891978 231884895 222394488 217111011 214338952
3287 214338952 212245844 209355646 205506703 201204954 197207921 193756262 190679697 187491007
3279 187491007 183885329 180071319 176717157 174737494 174319859 175359358 177043967 177892619
3271 177892619 177179764 174814372 171755952 169129392 167846752 168410581 170938492 175362595
3263 175362595 181910844 190936502 202567171 217063602 234411034 254569439 277655273
3256 277655273 304125436 334235138 366719999 398239884 424170989 440566237 444959715
3249 444959715 436269994 414869544 383398645 346548420 309113650 274574848 244300221
3242 244300221 218673014 197329046 179812637 165471823 153703126 143924038 135485940
3235 135485940 127935641 121017209 114723343 108919565 103563073 98792315 94772522 91408919
3227 91408919 88795597 86828786 85170354 83904181 83194866 82945199 83473559 85196675 88183151
3218 88183151 92743606 98526806 104160703 108289456 109541319 107544520 103289655 98069393
3210 98069393 93191665 89246726 86463184 84600740 83276983 82119523 80902831 79228831
3202 79228831 77358828 75592889 74029758 72720998 71784169 70972805 70226004 69393752 68651173
3193 68651173 67893026 67414240 67274697 67537736 68349968 69809769 72157174 75573642 80007559
3184 80007559 84958454 89214624 91353580 90599168 87007113 81679503 75648268 69808402
3176 69808402 64452925 60050636 56488458 53619345 51367499 49691394 48389317 47478257
3168 47478257 46753227 46262093 45976050 45879268 46139306 46690230 47459762 48555896 49968994
3159 49968994 51804791 54169558 56940830 59817766 62814410 65791678 68778847 72103140
3151 72103140 76263182 81567972 88195558 95677758 102982629 109139218 113383685 115826223
3143 115826223 116656374 115854060 113019011 107884229 100540312 91915577 82993423 74600632
3135 74600632 67204154 60989961 56009450 51932029 48596418 45992759 43988926 42533875
3127 42533875 41454997 40649621 40005775 39626223 39274302 38896071 38696454 38615156 38640611 38690417
3117 38690417 38827287 39140412 39632215 40175679 40845411 41606603 42333853 43014990 43801942
3108 43801942 44693838 45824053 46976209 48319421 49849240 51545217 53613821 56096556
3100 56096556 59072726 62669829 67002294 72222931 78411870 85601541 94219294 104458806
3092 104458806 116732167 131558534 149336121 169776568 191394053 211308327 226145802
3085 226145802 233007301 230968535 221794603 208654738 194739435 182592828 173945962 169806685
3077 169806685 170670064 176346918 186367334 198844240 210610093 218018092 218186754 210068239
3069 210068239 195153990 176068792 155789561 136410329 119109468 104428752 92265050
3062 92265050 82391774 74285383 67596034 62043841 57360498 53181746 49482689 46210166
3054 46210166 43528836 41320845 39475008 37999690 36639740 35427939 34332323 33306612
3046 33306612 32346223 31226563 30110492 28913468 27602724 26176172 24773782 23462491
3038 23462491 22288490 21238521 20271985 19368695 18466999 17766220 17210617 16677494 16229652
3029 16229652 15683172 15252431 14877827 14474666 14122363 13832650 13594416 13304939 13111366
3020 13111366 12913754 12713772 12645445 12571098 12520721 12553104 12597284 12528614 12328549 12247065 12116414
3009 12116414 12040163 11977844 11939556 11933648 11968276 12138544 12345638 12596475 12848087 13278757
2999 13278757 13812371 14498727 15321700 16349221 17618442 19364028 21663064 24480016 28125650
2990 28125650 32578066 37402651 42012452 45521717 47094211 46366014 43617303 39440442
2982 39440442 34657780 29890326 25490310 21845175 18887935 16492229 14659662 13208662
2974 13208662 11968461 11033064 10291504 9621057 9066054 8674505 8322143 7953444 7658847
2965 7658847 7335183 7004171 6636371 6246007 5916837 5534558 5246627 5007456 4760464 4511611
2955 4511611 4371592 4302397 4156048 3990689 3842349 3642662 3486456 3463188 3286001 3162251
2945 3162251 3086728 2954348 2829693 2773483 2762723 2634600 2581697 2560626 2532574 2481674 2442235
2934 2442235 2330099 2320289 2317230 2289378 2257490 2190593 2103425 2055410 1989578 1877518 1855805
2923 1855805 1788370 1723451 1722915 1647993 1600453 1575287 1522175 1529669 1525072 1435682 1458989 1442614
2911 1442614 1361621 1308846 1391376 1398377 1398969 1408952 1396777 1410164 1439127 1457310 1418928 1408391
2899 1408391 1379288 1375899 1418166 1444660 1412492 1303074 1231373 1273190 1229687 1234199 1172995 1114705
2887 1114705 1115112 1087569 1022528 894063 929663 953867 916074 955399 916443 941837 876527 847739
2875 847739 823163 842320 869053 883687 864789 865091 776349 759927 800934 784946 822447 819212
2863 819212 814095 842693 773126 739057 846697 882854 917136 902645 881121 821123 713419
2852 713419 621943 593110 510092 433495 434611 499019 537535 443279 491554 486721 394372 389089
2840 389089 406308 394003 395004 448356 383556 398168 309896 327654 324198 314798 360373 321964
2828 321964 252790 254496 314343 335187 351857 346483 385926 356796 395402 372352 369446 383154
2816 383154 438095 486037 476015 408251 438133 420864 506149 567688 621335 682212 768785 871958
2804 871958 962922 1032698 1106264 1088820 1078836 1089103 1002676 923242 898881 894635 897830 894840
2792 894840 810155 842692 860744 959503 918234 847523 806955 717362 668309 625439 516235
2781 516235 406165 252066 170754 184075 121391 65268 19037 39528 45371 63907 102169
2770 102169 28759 -47544 -71189 -13034 -27701 -83059 -174738 -156845 -186371 -175646 -168071 -141960
2758 -141960 -185261 -218646 -240757 -175039 -181999 -217059 -273220 -329089 -289793 -259830 -207385 -236121
2746 -236121 -189996 -280966 -261235 -241846 -300043 -249914 -210314 -255340 -283879 -389354 -463226
2735 -463226 -450630 -366899 -392239 -415579 -362138 -355829 -261695 -303504 -335851 -302949 -320609 -374096
2723 -374096 -351410 -374997 -407561 -321415 -311320 -340377 -301930 -308854 -276698 -288798 -270285 -258135
2711 -258135 -301603 -220454 -221588 -220305 -201581 -174369 -160743 -172014 -115939 -126513 -186988 -213416
2699 -213416 -212451 -259080 -351991 -275665 -181212 -193152 -255343 -263020 -241967 -259970 -263279 -264498 -320057
2686 -320057 -320664 -212226 -202079 -210091 -246223 -274290 -219497 -163648 -152182 -189355 -219884 -191125
2674 -191125 -114052 -102664 -93580 -80358 -94502 -132198 -114163 -79011 -145226 -126791 -105227 -161337
2662 -161337 -169379 -190259 -216575 -209292 -141331 -200518 -209363 -158878 -106942 -130878 -107335 -108022 -111289
2649 -111289 -54554 -5451 -26475 -37040 -16898 -54409 -95945 -91264 -150398 -175009 -219329 -162781
2637 -162781 -158819 -221649 -236019 -239354 -232006 -281832 -287800 -211907 -154482 -253077 -207710 -186673
2625 -186673 -217396 -254302 -254696 -287410 -306771 -316214 -266316 -246953 -278291 -267646 -230709 -266374
2613 -266374 -284184 -283635 -223667 -230043 -318275 -317687 -322625 -275638 -289934 -295506 -338286 -382127 -375729
2600 -375729 -321890 -350069 -339844 -278778 -271762 -369558 -288340 -252892 -309950 -292157 -328962 -361842
2588 -361842 -365729 -354248 -306921 -312056 -355739 -405980 -425868 -364764 -354258 -352060 -358119 -256212
2576 -256212 -302788 -327637 -315917 -322712 -384244 -398495 -402268 -407319 -379512 -373778 -387306 -381686 -367064
2563 -367064 -282084 -363348 -366982 -381952 -374041 -339235 -364923 -358790 -342258 -367952 -349981 -355196
2551 -355196 -320506 -354991 -386630 -316580 -306993 -360796 -386280 -369016 -298892 -275569 -344604 -379697
2539 -379697 -373311 -345651 -309834 -357761 -377223 -328100 -298241 -271348 -282337 -330083 -351017 -269814
2527 -269814 -342947 -372955 -386853 -348916 -324564 -318605 -329267 -367020 -357874 -397093 -385026 -354001
2515 -354001 -354415 -327395 -335082 -294570 -318998 -257507 -295779 -282183 -284150 -282032 -249720 -228034 -257568
2502 -257568 -270667 -300071 -239122 -209017 -269308 -323164 -311224 -335039 -309585 -253552 -241363 -141878
2490 -141878 -152702 -272121 -313743 -250876 -180565 -185938 -204284 -223462 -249509 -267184 -272829 -277611
2478 -277611 -263688 -148262 -181396 -248242 -231308 -216790 -171340 -164042 -133140 -105417 -96508 -103983
2466 -103983 -138474 -167395 -153979 -104816 -69466 -18929 -58614 23500 34197 -58658 -115931 -94972
2454 -94972 -124237 -82093 31249 -33183 -143243 -153949 -122681 -85629 -50364 -88542 -7982
2443 -7982 10575 -94597 -98086 -64775 -35419 -55540 14522 76158 79566 113818 149867 155221
2431 155221 136727 171378 158242 132770 146801 205252 216519 251830 262352 290884 265834 319604
2419 319604 426343 407414 467571 458250 521102 560815 617492 580344 663486 734443 799178 919058
2407 919058 974049 1055119 1083413 1192484 1351275 1511489 1668334 1755594 1981392 2307229
2397 2307229 2563742 2727765 2799834 2850324 3083425 3474168 3949988 4577907 5394023 6522052
2387 6522052 8047538 10173393 13431445 18690801 25956475 31094570 29869227 24760941
2379 24760941 19255209 14684584 11340883 9014888 7088987 5537830 4441646 3682711
2371 3682711 3180593 2859014 2680514 2611114 2556110 2269463 2038505 1744276 1450422 1261977
2361 1261977 1165741 1080574 949149 869442 799421 700443 710574 674801 593316 613574 519740
2350 519740 498814 485385 477883 418960 272564 357175 306876 283020 279271 209520 195575 234440
2338 234440 177217 101171 92064 168789 93712 118434 154337 29107 -3797 -37601 -77831 -15562
2326 -15562 116355 60386 4005 -34510 -80875 -98584 -82494 -36119 -103955 -136421 -135395 -157783
2314 -157783 -149692 -137096 -160188 -191320 -103457 -120541 -180845 -190422 -190939 -183976 -154605 -151140 -153594
2301 -153594 -191437 -208966 -212566 -228770 -195387 -212406 -127009 -61540 -115731 -141269 -183203 -169624
2289 -169624 -129881 -205250 -234756 -218511 -191014 -189885 -163240 -155030 -217390 -235197 -289860 -267925
2277 -267925 -257608 -210846 -209246 -246069 -292209 -226912 -263260 -268345 -229077 -249996 -262311 -254639
2265 -254639 -287717 -313809 -324761 -279805 -274782 -264995 -254343 -226337 -249716 -282185 -235286 -300049
2253 -300049 -258963 -266044 -209373 -205814 -314657 -371086 -281002 -227558 -243376 -295724 -285464 -255571
2241 -255571 -318565 -337035 -364478 -310283 -317547 -305572 -292205 -254555 -283444 -320903 -264007 -296183
2229 -296183 -323567 -293293 -271515 -292875 -293080 -297110 -293127 -285664 -283002 -252011 -224649 -244459 -259260
2216 -259260 -301177 -310809 -299238 -340623 -322447 -335503 -408962 -323073 -281886 -292864 -273564 -302806
2204 -302806 -350138 -382730 -379097 -357803 -298900 -228564 -197496 -216311 -240749 -224922 -258753 -291803
2192 -291803 -284047 -283287 -351423 -363340 -330808 -322616 -299360 -318581 -279942 -241507 -310706 -347847
2180 -347847 -274318 -246325 -254334 -263080 -278279 -235186 -216684 -278109 -305149 -330367 -317848 -329043
2168 -329043 -347277 -286303 -309099 -341887 -275230 -248779 -288082 -218116 -274653 -344539 -331355 -251743
2156 -251743 -215146 -248847 -201303 -195106 -281908 -303162 -275851 -268652 -295515 -308559 -328237 -352361
2144 -352361 -329600 -230818 -271114 -305356 -295096 -236971 -212004 -177347 -169407 -163779 -229159 -298407
2132 -298407 -276118 -268741 -295966 -274622 -285602 -339765 -303854 -230371 -213950 -247881 -284493 -270132
2120 -270132 -252400 -283444 -286033 -245470 -236631 -194180 -163756 -164131 -148784 -203337 -189516 -230192
2108 -230192 -174491 -140307 -265062 -342473 -270522 -274664 -260407 -233208 -155792 -224034 -301501 -265177
2096 -265177 -207909 -230065 -272780 -226880 -221537 -207429 -170016 -228806 -255130 -227463 -243782 -289801
2084 -289801 -265186 -232146 -223681 -259579 -234737 -211526 -214848 -244019 -266355 -245482 -216771 -279158
2072 -279158 -248853 -223382 -256654 -200811 -241849 -272917 -237220 -285045 -309463 -321001 -260593 -255164
2060 -255164 -275850 -314598 -312358 -317377 -253313 -246558 -267274 -276366 -353552 -363572 -311265 -316960 -297723
2047 -297723 -230987 -313559 -288880 -306609 -330649 -279325 -266716 -290405 -306712 -287752 -216120 -223803
2035 -223803 -223927 -267123 -289541 -342988 -271820 -253924 -252842 -204597 -182399 -196509 -210352 -225414
2023 -225414 -301878 -336441 -313972 -230822 -205630 -251801 -278376 -253112 -224082 -232706 -246504 -247728
2011 -247728 -323828 -312846 -199237 -298709 -310444 -304703 -310520 -368781 -366798 -316615 -263402 -222405
1999 -222405 -251087 -223803 -231313 -186843 -180696 -220541 -249240 -204974 -153053 -163272 -227983 -225781
1987 -225781 -207983 -226836 -199224 -235074 -281578 -222691 -147208 -179904 -230659 -203526 -205725 -173795
1975 -173795 -87850 -138711 -227551 -239878 -195216 -142741 -150828 -190212 -253434 -262328 -238992 -225784
1963 -225784 -220392 -188727 -213221 -236565 -262751 -231877 -232696 -238791 -179678 -214835 -234706 -283342
1951 -283342 -328583 -322749 -339348 -322233 -253418 -220949 -231042 -290064 -207350 -227924 -203802 -147664
1939 -147664 -175719 -200437 -247354 -238838 -182020 -275291 -356351 -259480 -244152 -249872 -220369 -256133
1927 -256133 -259401 -255986 -273069 -277662 -237565 -159783 -182330 -192901 -219265 -261070 -248664 -260189
1915 -260189 -240490 -205606 -236203 -216224 -244731 -160386 -153369 -199682 -207563 -208573 -196902 -205582
1903 -205582 -237426 -260338 -231894 -176660 -173810 -161795 -155914 -215808 -250255 -219131 -289208 -263669
1891 -263669 -164313 -240641 -203326 -215021 -163240 -91427 -172167 -169136 -194696 -242350 -192279 -155444
1879 -155444 -237097 -194003 -189166 -247320 -253345 -275613 -238508 -286110 -260719 -224332 -212328 -139380
1867 -139380 -135611 -135267 -139719 -219965 -210448 -216990 -153636 -109895 -152490 -140170 -158036 -167600 -235734
1854 -235734 -254207 -205203 -200574 -203661 -166940 -101548 -81194 -151744 -216767 -164576 -188067 -245269
1842 -245269 -194712 -184415 -157553 -167599 -138604 -185865 -174470 -164019 -200717 -216218 -271198 -285551
1830 -285551 -214712 -143047 -184209 -182517 -185780 -194379 -180266 -164909 -205358 -168549 -130292 -134654
1818 -134654 -125820 -134959 -179422 -167125 -115562 -176479 -184216 -175117 -149324 -97123 -168909 -217460
1806 -217460 -183462 -187995 -119919 -179870 -208585 -199194 -213262 -257167 -202116 -134393 -165014 -189722
1794 -189722 -171183 -158864 -188770 -170722 -172763 -160401 -188491 -168793 -181898 -170670 -171337 -159767
1782 -159767 -135238 -102417 -115934 -153866 -149710 -130018 -122054 -100148 -126661 -97919 -163449 -149844
1770 -149844 -153242 -172260 -142475 -118826 -72578 -135834 -189860 -207971 -141067 -131936 -160170 -151730
1758 -151730 -179444 -208413 -205058 -171514 -147949 -105777 -118920 -155327 -185755 -209528 -174287 -196742
1746 -196742 -117723 -149224 -159278 -130834 -167265 -168508 -139042 -140692 -165245 -117534 -148248 -158925
1734 -158925 -112980 -100737 -177365 -220401 -149941 -127391 -173779 -242973 -300807 -215635 -186481 -142697
1722 -142697 -126724 -110248 -91471 -130878 -119259 -112968 -114397 -136490 -109850 -158627 -184868 -110295
1710 -110295 -85093 -62384 -102381 -118317 -136708 -150878 -120246 -108618 -187996 -150131 -138423 -141876
1698 -141876 -125756 -165559 -134112 -102407 -138943 -100246 -108365 -134429 -45672 -68097 -83070 -121684
1686 -121684 -150486 -141916 -95762 -80816 -109748 -150093 -113480 -225379 -194741 -182819 -160343 -187812
1674 -187812 -132656 -98294 -127597 -143427 -210847 -142064 -70087 -89328 -116765 -169322 -90015 -73368
1662 -73368 -76905 -110647 -227673 -176751 -187461 -221669 -219522 -195560 -174400 -88153 -117777 -84052
1650 -84052 -99519 -24526 -89977 -97448 -70487 -41697 -66805 -127003 -94851 -103835 -68334 -67416 -94990
1637 -94990 -100038 -138715 -147211 -166522 -155579 -110608 -107655 -138277 -210126 -160025 -124571 -68353
1625 -68353 -124689 -92734 -46649 -97507 -79851 -40017 -67753 -35387 -54151 -65956 -92231 -133749
1613 -133749 -125723 -89093 -98115 -82752 -62095 -99827 -113575 -150028 -140453 -140258 -117006 -61516 -73599
1600 -73599 -85526 -141214 -91126 -48193 -109153 -101735 -70799 -58038 -73968 -132398 -115627 -47207
1588 -47207 -145694 -201690 -163403 -104037 -173529 -205560 -247403 -233854 -140973 -84657 -78029 -134613
1576 -134613 -126544 -176490 -142664 -50003 -60575 -88009 -118789 -144621 -143574 -155960 -132993 -80934
1564 -80934 -50042 -129763 -83903 -35808 -96685 -169784 -123103 -17371 -41816 -54431 -14237 -38445
1552 -38445 -114778 -100233 -72756 -105015 -122033 -72706 -48458 24255 -16102 -45885 -68757 -66643
1540 -66643 -35384 4539 -23620 -22798 -26787 -49000 -96220 -114455 -94694 -106370 -97861 -67895 -78779
1527 -78779 -126393 -28802 -56880 -94874 -113055 -106882 -102173 -124381 -57290 -84277 -92066 -94638 -94454
1514 -94454 -97649 -92910 -91453 -124353 -153521 -123108 -150869 -120916 -72336 -149736 -151258 -145118 -106902
1501 -106902 -92858 -101680 -80839 -102617 -88943 -71333 21926 -98072 -109475 -69968 -62427 -24805
1489 -24805 -30896 -3104 -73979 -92307 -61257 -21886 -25942 -20083 -48476 -110700 -44864 6559
1477 6559 4481 10907 -26382 -21913 -101966 -66673 -44095 -20062 -91499 -71830 -44882 -96313 -89552
1464 -89552 -101092 -77040 -73442 -122181 -82399 -30859 4290 -25138 -99082 -130321 -95858 -70508
1452 -70508 -42480 -101129 -132791 -123761 -65239 -40447 -54084 -66789 -85207 -67639 16886 -17730
1440 -17730 -93839 -114856 -124676 -143377 -81301 -3764 -96827 -104619 -519 -58167 -54006 -8022
1428 -8022 -15201 26500 -7086 26589 -1571 2662 -18274 -21483 -44987 -47424 -55787 -49747 -77402
1415 -77402 -93817 -52471 -6438 -44559 -48683 -27913 1407 -15442 -35605 -54005 -77437 -76809
1403 -76809 -15809 -5400 -116881 -125518 -64514 -39594 -32618 -58374 -56726 -37104 -96250 -112648
1391 -112648 -90587 -92788 -106485 -158224 -93744 -56813 -47921 -118712 -100585 -87874 -63229 -11936
1379 -11936 -36237 -6023 -42288 -13905 -57545 -107956 -105556 -86799 -53627 1196 -7608 -45001
1367 -45001 -1183 -16771 -14727 -6915 -54594 -59638 -124459 -103892 -42846 -27117 21169 -24614
1355 -24614 -41201 5043 16487 -30691 -117181 -76608 -42673 -47128 -46266 -53589 -34788 21165 -23353
1342 -23353 -64274 -61270 -64092 -55817 -95638 -69721 -107010 -97318 9070 17530 -30578 -82571 -80166
1329 -80166 -75440 -8221 -60983 -42577 -1107 28585 20176 -100973 -3713 16557 -39312 -44652
1317 -44652 -126190 -104038 -29963 -2955 -5186 7064 -16794 1133 4676 -3947 -73589 -56185
1305 -56185 -55070 -56341 14965 -41604 -111060 -130219 -90732 13970 -43081 -118081 21979 2363
1293 2363 -54167 -101464 -63164 9123 -64514 -95587 -48780 -72640 -45627 -30577 -84084 -86203
1281 -86203 -102641 -31661 -24488 -74733 -41344 -39532 -7315 -50417 -17904 -19702 26210 112677
1269 112677 103642 72081 -31686 -26202 -31024 -60402 -26343 -29548 -56524 -50691 11506 -46865
1257 -46865 -82874 -40014 -27568 -76945 -8427 -60611 -33730 -52371 -23718 24045 -3269 -48263
1245 -48263 -46971 -2964 19743 -16307 -71683 -36223 -17720 34871 33496 80293 2046 12904
1233 12904 -14305 -18635 42610 25513 14792 2649 -18138 -8329 -21823 -6001 -29021 -49036
1221 -49036 -22027 1154 -11759 -42510 -9879 -69669 -23983 3192 -1440 11352 -40309 -79678
1209 -79678 -62846 -8390 28809 5981 -23454 -46771 -69066 32519 -8681 -81585 -808 -23751
1197 -23751 -14633 12152 -68592 -62604 -66892 -11164 -80221 -68425 9022 4166 -35181 16501 11000
1184 11000 34749 27029 28143 78231 46604 -3391 5920 85820 69161 -40897 -20520 10926
1172 10926 70028 49494 -714 -4127 -35932 -13407 -42729 -54796 -42521 -24869 13714 41707
1160 41707 50645 -539 15788 23435 -33532 47674 100241 70046 -20290 -11141 -38149 -57946
1148 -57946 -23764 20935 13051 45092 90813 72272 46498 -8236 -25453 -32340 -23988 2041
1136 2041 -21295 -27382 -77946 -51910 4731 35799 5605 -43951 -63897 -51944 32579 -7166
1124 -7166 -46735 -33880 2983 9117 -15586 1370 25204 74738 28796 31653 13660 -72443
1112 -72443 -5725 44403 -3099 11491 -34217 -24135 -33372 -4194 54479 102707 107221 34034
1100 34034 50700 54105 13834 16920 -24767 -62504 -22888 43241 31105 47790 72153 56821
1088 56821 45103 73495 19813 -45394 -47577 -21377 33205 65186 49693 67724 60528 50802
1076 50802 48512 21809 68598 24628 65736 52179 12811 84137 60593 -5546 -16992 -6210
1064 -6210 14258 7041 -4897 36269 27321 -4559 -24637 -5203 74701 52114 -12265 -5848 -63025
1051 -63025 -49401 20692 -26313 24690 44095 63859 40760 -30213 45523 28791 -8926 2291
1039 2291 2645 59942 39572 35348 -7181 8659 -25793 -37648 30414 -12656 -29371 32539 -4161
1026 -4161 46174 25960 -39650 -3419 31699 24674 31694 6999 10082 -60728 893 88793 143320
1013 143320 152216 118185 139510 108695 31487 -27746 -6630 72436 112655 62555 105741 68991
1001 68991 71249 48695 17996 52625 59958 54259 26127 45877 -12998 -5420 -53285 -77882 5436
988 5436 -15740 41463 62823 160935 87373 50039 85127 92975 84690 69299 49668 30217 4045
975 4045 -5522 31722 -4548 5141 31656 33887 39072 -17768 1749 -6149 46556 49167 -15414
962 -15414 54896 102967 47888 82814 73346 29495 58137 64168 99758 81399 73537 54682 59531
949 59531 54651 -14011 7711 73301 38305 44449 53307 47314 12766 18833 23531 21180 51326
936 51326 59547 32761 69501 154371 107699 115928 99525 35859 27107 29205 24075 48004 21432
923 21432 1978 -42713 -44053 72151 41669 25683 75606 38916 36274 31239 19678 27968 -5600
910 -5600 61392 75468 47909 119465 124408 62312 -30207 37730 55444 39655 54598 41384
898 41384 -4683 44261 32787 -12478 -14861 -9144 117203 111769 91883 53186 9783 -25988
886 -25988 -15938 -12691 79949 47562 27653 86802 48825 -17007 -31416 1659 34520 3103
874 3103 27967 1910 -34139 -5281 29556 65755 68302 -26508 -27970 35027 25761 9367 27684
861 27684 44735 48240 78303 67441 57548 117905 151659 137524 103830 78193 97111 120282
849 120282 113986 96917 84228 27886 -48736 -106123 -27059 69290 19076 -22544 7666 -40733
837 -40733 -41101 -14161 7642 75153 25067 -19515 38269 68037 77209 93536 53281 61412 27399
824 27399 20390 -3011 28953 62410 11563 81109 25542 20057 89563 114005 32608 71850
812 71850 17457 37869 27718 -17010 49697 38247 19110 -26744 -39742 16585 42980 41648
800 41648 4036 40148 137548 114649 11108 35104 33050 71333 94702 50406 62481 114819
788 114819 156203 147566 125676 49793 104306 194471 154456 127318 34863 45549 48125 40310
776 40310 33863 32914 34304 61505 80534 66791 79846 118154 103763 15253 110567 86017 15291
763 15291 57510 40987 3642 45907 8376 -94755 -99980 -23829 -29631 34304 36676 40450 29871
750 29871 56042 20790 -4653 -5972 19443 53586 62401 113603 129846 140125 158602 74672
738 74672 77229 81020 44388 5623 24300 101471 13953 10660 49661 71763 89214 50310 72642
725 72642 41219 100907 158676 132622 105355 97039 48649 67541 9516 -33224 12112 54618
713 54618 104706 91209 38896 94969 57559 12961 28790 -9332 -22033 -70886 12262 81278
701 81278 99368 22910 44941 69561 17084 56942 141337 89792 43149 15252 8294 80179
689 80179 132877 87979 52829 56004 106996 37064 24910 75239 39009 35675 32590 44119 39791
676 39791 49797 52587 32995 34688 87529 99456 62672 41219 93420 80907 86616 127544 31110
663 31110 41473 30225 37820 85623 65260 29879 5918 55273 40732 22195 63565 18079
651 18079 52377 13501 67000 94852 16955 -27002 78457 68451 30531 83632 63276 50048
639 50048 46559 30318 60895 149861 98726 95175 78704 75135 85530 37405 17383 44503 39401
626 39401 19 -953 -52008 -85984 -449 -24561 14296 7285 -77359 15659 80696 56096 50231
613 50231 128826 106946 19016 -23492 -4426 32637 55463 23955 11221 30792 31680 52852
601 52852 30970 14063 9291 -21177 -41774 26153 32779 104432 92633 48111 21792 82249
589 82249 83074 51262 53307 79952 66949 51121 28228 56161 74153 59793 117328 29158 12858
576 12858 -5915 -7349 46461 140061 115226 88715 72645 48356 64980 53385 13183 15154
564 15154 71803 61030 100668 59787 83182 93491 71959 91011 34348 80749 30297 32005
552 32005 78189 29390 100005 54563 52621 39242 41407 91712 52294 17768 50829 24698
540 24698 -25901 -3449 51328 75290 108437 63341 9725 83623 74390 66083 91635 80879
528 80879 101743 92369 156971 120140 99599 138294 93539 31250 12589 40288 52526 106318
516 106318 56407 34311 78259 39775 44550 96849 37018 15159 51420 33345 18403 89047
504 89047 159887 159549 124262 78546 -5708 58332 1535 -9452 -5361 -14096 37427 -11480 -1026
491 -1026 -15905 1264 59269 20649 55039 49404 80428 105535 68676 56235 82248 49123
479 49123 47960 48314 61601 103166 98073 97720 98184 24529 33075 73106 57693 86629 -6143 -4634
465 -4634 66002 95929 108299 43833 19885 18989 18672 65145 82205 -4011 67377 60569 68668
452 68668 38703 -26031 9304 15414 28316 45258 55763 -3433 11660 26308 31101 81287
440 81287 87190 68454 62550 24887 16118 -13217 -18540 14528 43913 65872 95750 23287 37884
427 37884 10148 7426 7370 -26078 32822 59305 607 -2567 38288 43806 47716 128824 125172 53401
413 53401 5289 21716 35245 100995 111762 122670 101297 100030 69482 44642 78580 85172
401 85172 66946 79283 76452 86895 31885 16256 -16898 18602 86652 15784 -23342 7677
389 7677 92599 87694 53093 16902 36880 46577 37225 70180 62581 72708 24434 -64681 -15411
376 -15411 -23094 16863 31500 77062 109319 82962 35901 54313 51614 -5747 43117 59469
364 59469 77651 122369 92292 50898 16295 55508 5750 64258 113201 54583 56889 40705
352 40705 86878 84280 98640 162763 79968 90080 106736 44301 -14470 -18979 29762 89781
340 89781 62433 47975 18709 12048 56158 -9602 -26690 93484 86648 126552 65446 7283
328 7283 43213 76994 92294 86923 93773 73999 59630 70521 126087 110915 99596 36228 31270
315 31270 54287 82364 83295 37946 50884 73416 49495 120175 153318 138891 64833 82701
303 82701 45165 77461 73165 13735 86191 74051 40659 33810 79714 110583 77135 70971 82369
290 82369 67013 55250 56204 29672 71498 57664 9339 48028 25863 -46098 -53165 -61873 36450
277 36450 120966 162932 118878 105372 152992 108658 75183 -4741 -23860 -29865 -10811 59103
265 59103 74570 -2204 -623 11898 41776 47664 11773 3743 19537 87965 63479 65098 89234
252 89234 9449 29936 12897 22856 73446 88741 20324 43544 107861 78180 113328 79757
240 79757 52649 37289 76521 93236 63330 113911 78807 99866 66012 7460 60094 75398
228 75398 72932 52417 24127 54942 78822 58821 40076 -19224 -38745 -6145 50351 46392
216 46392 68 18084 59258 69484 17492 -6464 44288 55005 57040 90874 114060 120869
204 120869 161079 121531 110887 121153 51802 46545 22526 24805 63031 31024 8486 57367
192 57367 72687 32756 5975 -17912 10876 24365 93664 104767 37505 50545 14417 56907
180 56907 30680 19641 42761 19632 60761 55090 654 -32401 45399 98755 131463 95007
168 95007 49776 27809 44785 21994 18690 46610 73091 67973 68316 85645 65891 51720 66234
155 66234 20840 19316 57302 63356 79354 63531 43873 97220 77308 99527 138903 108516
143 108516 133000 137209 83238 41276 -3547 20635 73029 54289 73586 35458 62339 57411
131 57411 22626 29195 44865 31473 60733 57380 67993 51306 31791 59455 72435 34655
119 34655 36812 49947 14212 88813 142939 70134 29833 34968 74720 72133 31217 92719 88243
106 88243 -11691 8443 81708 89511 77126 91746 51243 84721 51112 8089 34465 48514
94 48514 15770 74487 42848 -7185 54841 32782 87245 78559 90738 109800 87384 81792 83080
81 83080 84335 70684 79229 70154 88296 90015 44174 19166 3982 30257 24051 44653 91284
68 91284 61594 26318 13723 29028 116 31880 103946 92435 84142 55826 69050 65092 26176
55 26176 6026 33502 50334 34428 65660 57433 29906 27914 71619 73817 56206 77821 78141
42 78141 18391 10746 -6837 7219 55909 38382 41279 49627 78602 42459 42159 35701 25943 16521
28 16521 32492 39722 90723 92078 86647 78123 58272 43146 19409 35632 48113 62662 56103
15 56103 17964 18486 62704 57384 58429 53895 8044 32462 39899 78131 73387 130404 127846 74323
1 74323 43619
0 43619
$$ Imaginary data points
##PAGE= N=2
##DATA TABLE= (X++(I..I)), XYDATA
16383 -3762218 -3724089 -3657835 -3621229 -3535760 -3473981 -3441861 -3425652 -3358241 -3362692 -3318523 -3247946
16372 -3247946 -3165622 -3094416 -3015088 -3037023 -3023571 -2967105 -2905191 -2871519 -2839926 -2795288 -2725798
16361 -2725798 -2721921 -2634499 -2567857 -2518675 -2462050 -2424114 -2378293 -2375035 -2330059 -2304969 -2229159 -2191142
16349 -2191142 -2131450 -2028272 -1969316 -1950409 -1962682 -1950688 -1858706 -1777518 -1769264 -1710979 -1651408
16338 -1651408 -1677274 -1636286 -1549078 -1426148 -1401685 -1417150 -1347034 -1259227 -1291913 -1314112 -1255787
16327 -1255787 -1196589 -1135642 -1032323 -1027710 -999496 -902711 -843324 -826743 -823248 -804379 -758955
16316 -758955 -701999 -594933 -590642 -564131 -530658 -488011 -430806 -403393 -366720 -287076 -225350
16305 -225350 -201796 -182942 -205883 -141839 -40642 -20270 8788 48509 52231 113821 153814
16294 153814 206359 220689 244261 263045 259148 350341 381987 474978 469730 500867 612279 652836
16282 652836 676139 662868 705323 688283 720385 805935 821493 842284 922002 959480 974170
16271 974170 994834 1001363 1015813 1082826 1102964 1123051 1183477 1238357 1285930 1282944 1294651 1290496
16259 1290496 1345243 1350722 1365258 1455354 1498982 1526224 1580012 1584512 1640987 1646873 1633287 1652033
16247 1652033 1721187 1775813 1714088 1720071 1825326 1868680 1868712 1931035 1971496 2042012 2040165 2021361
16235 2021361 1995059 1984161 2005596 2025428 2013942 2101535 2148774 2214280 2219373 2219573 2256719 2287505
16223 2287505 2290607 2376747 2406837 2399370 2353050 2368974 2452460 2463751 2500268 2464675 2478398 2522376
16211 2522376 2556120 2564702 2533137 2533130 2566080 2639430 2676642 2735257 2748843 2763975 2825923 2768103
16199 2768103 2763237 2794458 2832394 2831579 2847457 2836894 2855282 2874145 2894672 2900290 2954386 2954977
16187 2954977 2908219 2903779 2962601 2977373 3011009 3001901 2989655 3127739 3108469 3103743 3125604 3092199
16175 3092199 3081396 3137903 3144822 3128658 3184303 3184505 3147913 3212745 3221390 3228279 3281042 3303141
16163 3303141 3307929 3297833 3238624 3205765 3272707 3311813 3295116 3282582 3331933 3335483 3372630 3405579
16151 3405579 3417114 3429700 3440318 3459333 3469513 3462554 3486412 3424107 3422002 3397073 3289274
16140 3289274 3354018 3465889 3445449 3447911 3514495 3497055 3491820 3499797 3507764 3450974 3506249 3520374
16128 3520374 3521905 3530196 3558249 3513632 3555635 3570338 3522751 3562185 3545665 3580543 3608036 3585221
16116 3585221 3578631 3621848 3663804 3729205 3751071 3709282 3625015 3706369 3721653 3707439 3678365
16105 3678365 3658647 3685211 3735722 3718096 3705333 3747669 3748419 3723484 3701841 3717582 3733698 3754869
16093 3754869 3730974 3661355 3693349 3693297 3680135 3649610 3685737 3634227 3682316 3688433 3750567 3747862
16081 3747862 3712896 3705048 3746097 3780003 3760706 3798611 3796552 3748987 3734645 3786189 3741734 3722469
16069 3722469 3695829 3752365 3732867 3786799 3815273 3862322 3845538 3869397 3870607 3848433 3832805
16058 3832805 3782767 3811076 3772831 3766656 3826779 3755765 3797872 3824868 3813362 3811668 3766038 3753201
16046 3753201 3781157 3777457 3803090 3837351 3830685 3776299 3731858 3742411 3808801 3797486 3838424 3791771
16034 3791771 3846694 3827940 3847870 3837649 3824396 3762681 3816541 3933559 3899004 3854774 3803068
16023 3803068 3840112 3858276 3917870 3912014 3881988 3840067 3833257 3881068 3833133 3789640 3812427 3748973
16011 3748973 3738873 3783399 3873163 3861814 3856454 3861834 3909428 3836816 3806436 3924775 3890687
16000 3890687 3798205 3853733 3812540 3819514 3820437 3812056 3813314 3813073 3753225 3796990 3846847 3789859 3797639
15987 3797639 3821959 3827638 3818291 3850679 3796835 3734960 3785213 3793759 3770550 3785574 3839640 3892934
15975 3892934 3810698 3842482 3860298 3795843 3810961 3823016 3806396 3805882 3868819 3862369 3857409 3827202
15963 3827202 3803304 3812502 3826131 3871703 3885103 3881183 3875338 3894740 3854877 3834008 3807478 3829199
15951 3829199 3807617 3843409 3863989 3837999 3851965 3796394 3798977 3795966 3844735 3808044 3867281 3861907
15939 3861907 3784125 3786860 3846770 3906658 3861117 3842127 3876431 3919886 3897807 3915326 3967663
15928 3967663 3892175 3905582 3903495 3849517 3910282 3882509 3822809 3848449 3886267 3800725 3851170
15917 3851170 3900353 3837484 3871211 3848051 3869432 3873868 3778082 3777771 3860849 3889259 3848749 3834242
15905 3834242 3843150 3817342 3890626 3885546 3848410 3853919 3879126 3853128 3843307 3852512 3872443 3949554
15893 3949554 3951193 3984379 3980155 3920685 3936944 3945542 3908846 3926340 3863580 3854178 3888674 3906238
15881 3906238 3905922 3859153 3849112 3951874 3953294 3939236 3900097 3914083 3879486 3847267 3865725 3809593
15869 3809593 3852051 3899062 3904914 3924612 3944703 3911201 3968761 3952514 3936906 3939568 3919366 3893304
15857 3893304 3901838 3962500 3921955 3966879 3940710 3944243 3961809 3935970 3955356 3924419 3895164 3882487
15845 3882487 3908956 3933296 3867330 3837274 3852368 3837531 3893175 3884536 3851593 3903989 4018457
15834 4018457 3992653 3972188 3971638 3940760 3943372 3876743 3852297 3858347 3858738 3914943 3950439 3903432
15822 3903432 3922817 3910732 3948884 3881204 3875166 3863451 3867480 3809352 3844071 3839266 3846210 3968948
15810 3968948 3932140 3891437 3915753 4005028 3984979 3913118 3897840 3873224 3854589 3903846 3910828
15799 3910828 3918339 3857549 3865623 3889799 3921102 3955981 3922026 3932213 4004615 4009604 3923973 3869083
15787 3869083 3919031 3963569 3940832 3976525 3987900 3970301 4009001 3987665 3959543 3966967 3972365 3974553
15775 3974553 4004372 3961787 3949369 3960092 3963604 3940632 3978181 3969645 3981422 3995283 3948220 3969479
15763 3969479 3981307 4039086 4036704 3968365 3958839 3999123 3975399 3973883 3933771 3918086 3980380 4038070
15751 4038070 4058743 3972582 3965013 3960262 3997184 3945530 3913712 3941411 3958089 3929378 3979500 4013582
15739 4013582 3970456 3874016 3925738 3957701 3985815 4019434 3952414 3972399 3946600 3945608 3967489 3934951
15727 3934951 3920339 4006967 3983004 3975311 3931870 3936903 3938754 3993247 4027204 4016275 4002082 3969435
15715 3969435 3996224 3979697 3918310 3971443 3975548 3935466 4010460 4069035 3966034 3967391 3977038 3926486
15703 3926486 3956753 3945247 3936626 3963214 3995589 4011652 4056188 4013854 3943110 4001397 3993405 3965592
15691 3965592 3970280 3931135 3895453 3890370 3912392 3945677 3945654 3939561 3948415 3929848 3996548 3992898 3987964
15678 3987964 4010695 3951656 3953301 3884269 3968355 3953211 3918256 3997915 4016002 4056279 4010431
15667 4010431 3988580 3966257 4022886 3999893 4031930 3992194 3983453 3952424 3911523 3913651 3973964 3905397
15655 3905397 3907013 3928580 3927257 3922986 3968868 3981056 3912621 3933206 3993324 4060171 3980138 3941878
15643 3941878 3969533 4004277 4017119 4063268 4101926 4158778 4114929 4094099 4112209 4096225 4018399
15632 4018399 3995539 4017956 4022015 4054442 4040119 3958755 3975345 4009677 4008875 3999002 3987648 3979261
15620 3979261 4015693 4024088 4033342 4013906 3940927 3944787 3905689 3909486 4017386 4049480 4041208 4019619
15608 4019619 4033194 3998367 4067523 4046190 3993184 3969081 4023103 4017917 3991324 4028467 4065528
15597 4065528 4045308 4022034 4021016 3955927 3992419 4016237 4023575 3979349 3971851 3997575 4097464 4053751
15585 4053751 3969165 4021228 4042476 4012359 4017145 4013020 3999772 4016090 3999021 3967144 3981190 3989875
15573 3989875 4007244 3987348 3974416 4022517 4047864 4085753 4086211 4041358 4021455 4076328 4099933 4038475
15561 4038475 4037823 4093110 4059089 4062553 4047765 4004354 3992369 3985655 4007881 3966993 3965081 4018219
15549 4018219 4095136 4116042 4141005 4162060 4076601 4020144 4011410 3983256 4035174 4103401 4082283
15538 4082283 4086104 4114252 4100546 4073003 4085496 4126789 4102746 4064365 4058556 4048480 4050324 4032849
15526 4032849 4029417 4062674 4122395 4066347 4077972 4076267 4083653 4119355 4033948 4025342 4086807 4051564
15514 4051564 3979143 4032318 4061470 4098167 4202031 4140320 4102370 4108441 4069801 4105571 4050483
15503 4050483 4068935 4112078 4163275 4090329 4062317 4121911 4104160 4001332 4025925 4072740 4121937
15492 4121937 4118751 4131334 4085311 4073920 4125928 4082407 4051381 4110139 4132631 4045890 4063970
15481 4063970 4073796 4100999 4090607 4039675 4019084 4031721 4011598 4031959 4044178 4087308 4089031 4077084
15469 4077084 4044550 4030426 4083365 4055652 4022349 3997928 4064080 4077541 4039680 4052232 4077248
15458 4077248 4057799 4125994 4109992 4093306 4112307 4143073 4162117 4092859 4087400 4054980 4063488 4110435
15446 4110435 4078848 4042407 4070454 4056742 4067773 4122048 4114325 4110173 4099306 4068139 4122630 4132872
15434 4132872 4058720 4101442 4082993 4017185 4085927 4119963 4062853 4020363 4060337 4095617 4107487
15423 4107487 4093851 4165850 4081941 4089238 4120063 4120845 4087358 4113879 4149138 4066734 4039895 4047500
15411 4047500 4081074 4087871 4098314 4185380 4165853 4087886 4025535 4112033 4160341 4183118 4170011
15400 4170011 4071546 4131125 4127427 4142961 4137500 4170402 4139777 4158434 4184769 4219036 4182012 4085217
15388 4085217 4107784 4137148 4191184 4153277 4123698 4131746 4172519 4209767 4149103 4122070 4145357
15377 4145357 4201559 4215836 4191193 4222135 4222595 4191756 4192700 4150395 4133034 4242129 4212076 4230104
15365 4230104 4128048 4099568 4168004 4163307 4147734 4131467 4170921 4155805 4142961 4169002 4151385
15354 4151385 4155303 4158040 4128155 4184710 4130086 4124970 4154083 4162935 4217863 4186863 4163799 4137019
15342 4137019 4106501 4144721 4145873 4115086 4087145 4109040 4089252 4069137 4078572 4180858 4214135
15331 4214135 4218841 4236907 4251611 4223759 4229166 4179434 4082854 4092080 4111209 4173428 4182324 4145673
15319 4145673 4146350 4174014 4200681 4232118 4164556 4155376 4189424 4097138 4053841 4103898 4107303 4200366
15307 4200366 4194990 4235914 4211791 4106802 4135749 4139716 4143313 4163840 4174695 4185000 4222173 4249288
15295 4249288 4199043 4192369 4227166 4195955 4123354 4108970 4131698 4112252 4148156 4126866 4105413
15284 4105413 4173459 4220801 4197533 4147435 4149782 4201682 4256158 4219313 4158402 4209589 4228947
15273 4228947 4270248 4201072 4219736 4234839 4180430 4153765 4220878 4195119 4199672 4228694 4255559
15262 4255559 4262403 4265832 4239847 4233994 4190482 4219560 4293636 4255367 4221915 4219619 4144060 4171509
15250 4171509 4174417 4134225 4136020 4202432 4205770 4164638 4163391 4172371 4191998 4164462 4204461 4236855
15238 4236855 4238474 4238884 4232459 4286558 4260618 4272051 4252370 4198476 4230589 4173419 4197664 4208586
15226 4208586 4234170 4246958 4248231 4209190 4236178 4228232 4214709 4170734 4153141 4159699 4217401 4220852
15214 4220852 4178559 4181694 4282573 4230730 4197717 4146018 4141868 4225001 4187106 4167379 4262106
15203 4262106 4214820 4200132 4172164 4209769 4208941 4159321 4160241 4189267 4236774 4244400 4258467 4272691
15191 4272691 4307445 4320785 4297323 4279501 4281591 4337678 4323659 4318932 4248370 4204957 4257316 4227243
15179 4227243 4208831 4215129 4218359 4183918 4234864 4202041 4203714 4228522 4229296 4269019 4243602 4237028
15167 4237028 4293432 4313669 4264259 4272852 4264638 4218573 4211113 4230432 4284293 4270634 4283812 4260482
15155 4260482 4245994 4240899 4238775 4245578 4283307 4300257 4294888 4263777 4299951 4279987 4238237 4250233
15143 4250233 4175731 4195461 4226236 4214665 4279870 4296264 4241737 4246974 4288296 4303333 4265852
15132 4265852 4216079 4239719 4230230 4258022 4262709 4230887 4275001 4307145 4261450 4280069 4277867 4287853
15120 4287853 4294695 4292746 4299210 4244822 4217226 4245293 4292057 4302308 4345491 4322852 4318510 4288141
15108 4288141 4267199 4268332 4269288 4292313 4327309 4360183 4340741 4290247 4295383 4330638 4306494 4280443
15096 4280443 4253651 4278374 4278330 4354246 4367216 4353885 4338079 4373598 4317862 4294724 4334202 4276634
15084 4276634 4262304 4263477 4285679 4299084 4260392 4255776 4278553 4286752 4368852 4348901 4363496 4332876
15072 4332876 4215171 4230612 4282387 4311938 4266309 4220962 4279281 4266122 4267435 4220415 4278243
15061 4278243 4366110 4277516 4223437 4298185 4357258 4310366 4273874 4257395 4257239 4315510 4306836 4296346
15049 4296346 4363817 4364859 4332078 4336169 4346301 4378495 4375510 4266097 4274128 4305980 4339224 4356579
15037 4356579 4416897 4375553 4258233 4233862 4302716 4340464 4349908 4308671 4270495 4293367 4342269
15026 4342269 4375990 4389990 4335687 4369988 4358476 4295566 4287776 4292104 4216689 4178053 4247058 4173168
15014 4173168 4238954 4270683 4279818 4315575 4309838 4275229 4297870 4271889 4325901 4310677 4314174 4301293
15002 4301293 4270858 4352830 4303347 4326933 4332349 4305155 4304250 4377215 4384330 4347801 4353006 4294282
14990 4294282 4303839 4308923 4295632 4324586 4295404 4351686 4358572 4338065 4313657 4268601 4274529 4261933
14978 4261933 4309884 4368516 4403259 4405759 4406475 4368274 4338590 4352933 4247508 4259898 4314005 4332010
14966 4332010 4342633 4352341 4317128 4308006 4317432 4305368 4405027 4399799 4361300 4358225 4418842 4347665
14954 4347665 4417593 4432617 4410369 4408547 4389779 4319863 4341211 4352906 4373016 4374785 4435878 4517504
14942 4517504 4481001 4478717 4417895 4436492 4487285 4450182 4424964 4365059 4437655 4456982 4435884
14931 4435884 4429932 4421892 4377143 4321953 4371464 4356560 4326977 4395837 4411922 4438826 4468650 4405410
14919 4405410 4318505 4264692 4299505 4284129 4349238 4345065 4394634 4406486 4357767 4344667 4397053
14908 4397053 4398649 4459616 4528173 4433210 4368386 4341878 4362905 4429310 4431520 4385341 4335126 4315330
14896 4315330 4362933 4426411 4433527 4437657 4440685 4452206 4416274 4391496 4423876 4387819 4307682 4417794
14884 4417794 4474522 4479685 4462664 4461470 4464872 4365233 4350146 4453507 4360735 4333479 4293973 4305847
14872 4305847 4385810 4333663 4382926 4421774 4375067 4410511 4486749 4481381 4460825 4447001 4449071 4427306
14860 4427306 4454731 4378625 4334974 4354923 4402674 4338384 4322846 4370695 4459946 4513306 4436246
14849 4436246 4464359 4439311 4400626 4410939 4511275 4443133 4373201 4373290 4393241 4419303 4412982 4404879
14837 4404879 4368406 4387156 4452218 4453332 4424064 4361852 4422806 4526900 4550488 4445241 4360581
14826 4360581 4363728 4378282 4407752 4464339 4472644 4482663 4406848 4395806 4412706 4393444 4391403 4386071
14814 4386071 4378337 4404325 4386425 4315676 4406499 4445138 4451104 4491159 4436131 4365134 4438403 4397422
14802 4397422 4399324 4405356 4463731 4458285 4413436 4437690 4433035 4408460 4447789 4458926 4460851 4460731 4476415
14789 4476415 4489711 4484234 4509781 4550794 4508875 4495062 4430031 4399365 4498830 4525790 4498365
14778 4498365 4459097 4444118 4431702 4440833 4432551 4423686 4457453 4464715 4519363 4526657 4530869 4442312
14766 4442312 4497949 4515984 4452768 4438990 4448872 4390005 4338487 4376672 4412325 4434982 4440092 4460077
14754 4460077 4437992 4462154 4445885 4412817 4415995 4408162 4432656 4418723 4499938 4475760 4459732 4483325
14742 4483325 4480019 4515953 4513135 4455477 4478283 4500987 4447281 4455038 4423436 4499482 4537417 4541518
14730 4541518 4462163 4521577 4565206 4587613 4539785 4511357 4488346 4459005 4491733 4506334 4469793
14719 4469793 4433953 4472453 4450357 4375767 4372052 4470429 4492930 4490961 4483217 4454012 4505326 4516278
14707 4516278 4510578 4474028 4517526 4595994 4519047 4489802 4531065 4513720 4502366 4447088 4399659
14696 4399659 4447014 4457358 4469139 4524911 4480068 4489355 4505111 4496485 4478295 4480541 4491669 4478466
14684 4478466 4480886 4490883 4482399 4497843 4546900 4556683 4523407 4488072 4500753 4540453 4571725 4572221
14672 4572221 4528226 4438709 4446126 4467637 4466743 4446322 4455849 4493150 4488215 4520178 4560177 4568503
14660 4568503 4566542 4553401 4609575 4589052 4531305 4515838 4511319 4483652 4462690 4519994 4495087 4462390
14648 4462390 4489723 4570418 4555335 4500590 4534463 4494236 4468551 4502585 4503504 4511825 4550206 4497654
14636 4497654 4552155 4554542 4530818 4547944 4526469 4574210 4554144 4527116 4475717 4469162 4447185 4451467
14624 4451467 4477429 4541818 4566930 4574881 4565691 4513616 4504493 4519766 4536913 4515927 4552740 4512146
14612 4512146 4481287 4537688 4559608 4574239 4614989 4585014 4585471 4566891 4555754 4562177 4594854 4636981
14600 4636981 4558987 4503439 4551767 4665861 4627848 4557264 4548187 4581682 4565577 4604810 4608584
14589 4608584 4557356 4521574 4513986 4574839 4590551 4638585 4609409 4578547 4624818 4539050 4502586
14578 4502586 4602062 4557223 4532367 4558226 4592938 4600551 4613338 4619858 4627465 4592980 4696199 4736178
14566 4736178 4679722 4652292 4602580 4579629 4587125 4569739 4572768 4612995 4596650 4623383 4569297 4615591
14554 4615591 4670154 4675214 4588652 4516131 4590964 4578128 4582183 4618339 4617896 4607304 4630707 4601943
14542 4601943 4534866 4560729 4609426 4648114 4575639 4561029 4560523 4569275 4654910 4636596 4655833 4640156
14530 4640156 4627483 4597475 4551385 4559928 4567922 4584987 4609504 4635640 4581906 4629041 4640707 4651634
14518 4651634 4621797 4644348 4650132 4618693 4594893 4586570 4642329 4609964 4568803 4612024 4571654 4568677
14506 4568677 4600195 4545919 4507928 4557276 4676159 4611111 4615545 4593321 4654507 4629162 4591886
14495 4591886 4578866 4635500 4651718 4634392 4618931 4618325 4546236 4543327 4629478 4590613 4634963 4582727
14483 4582727 4518149 4543632 4604971 4653937 4603697 4578643 4646966 4681031 4693047 4679341 4637125
14472 4637125 4605362 4637482 4686395 4636946 4574783 4620015 4674587 4693207 4681571 4684320 4664961
14461 4664961 4727626 4681557 4627031 4615023 4620148 4629583 4693426 4659564 4650713 4667199 4652266 4694127
14449 4694127 4714503 4647829 4661742 4693113 4607952 4686361 4721420 4649938 4713305 4735447 4668770
14438 4668770 4623193 4627733 4676994 4649139 4640529 4608578 4628223 4638005 4725937 4701563 4685481 4696874
14426 4696874 4718825 4641894 4588332 4606669 4596645 4603765 4619020 4676470 4615937 4614696 4609020 4646341
14414 4646341 4666417 4624826 4693590 4694232 4753990 4757584 4644835 4670262 4654532 4697886 4653876 4691825
14402 4691825 4725248 4706835 4768006 4767956 4768532 4751810 4741511 4753954 4746729 4751591 4677991 4651378 4684299
14389 4684299 4712713 4694986 4671524 4658924 4669823 4703527 4664756 4612282 4588002 4615004 4631336
14378 4631336 4649075 4651612 4689862 4681652 4651830 4636018 4675683 4722101 4723318 4701970 4747351 4760998
14366 4760998 4756109 4763835 4748543 4718784 4643939 4753340 4754214 4741184 4748086 4754798 4746011 4734717
14354 4734717 4730713 4776237 4776999 4754246 4739510 4729021 4749409 4734850 4778897 4769467 4760550 4735772
14342 4735772 4776525 4727507 4757668 4785039 4820329 4753658 4750199 4784495 4745896 4793440 4799966 4717247
14330 4717247 4670314 4742142 4801353 4820732 4787045 4765736 4774875 4805474 4804423 4799590 4728379 4734580
14318 4734580 4771618 4797913 4763351 4722472 4664321 4711700 4642831 4630032 4731817 4730323 4752277
14307 4752277 4699173 4686563 4623417 4706115 4760808 4692139 4678812 4695678 4708678 4745067 4690156
14296 4690156 4723945 4794389 4844038 4881682 4790841 4748577 4699254 4708018 4733957 4756165 4737733
14285 4737733 4678061 4725841 4733802 4731664 4731764 4755410 4818150 4790301 4730187 4735575 4768470 4805557
14273 4805557 4819689 4852393 4797759 4744068 4815957 4818165 4798277 4754549 4710193 4728832 4713969
14262 4713969 4772214 4831611 4782057 4735946 4752929 4757264 4750273 4780105 4800622 4872820 4867028 4844499
14250 4844499 4897238 4870071 4814713 4793457 4832337 4832520 4807189 4810981 4845190 4824725 4826508 4818534
14238 4818534 4796539 4829034 4818884 4864030 4827348 4796580 4832347 4835065 4757480 4868336 4858265
14227 4858265 4919039 4940799 4849723 4834062 4766177 4739018 4756450 4795467 4752980 4771582 4857658
14216 4857658 4828200 4760631 4803969 4875697 4887457 4841657 4891539 4889777 4809586 4814091 4830071 4793460
14204 4793460 4786412 4798937 4804330 4782592 4873376 4862843 4894016 4860031 4805378 4793828 4784586 4763975
14192 4763975 4772153 4786828 4844776 4822790 4894053 4891910 4832129 4846109 4902523 4842925 4806286 4786717
14180 4786717 4779241 4795921 4807827 4895590 4907364 4890403 4775421 4795604 4850964 4951156 4881503
14169 4881503 4869326 4819151 4894664 4910834 4874030 4801281 4800903 4782808 4819309 4847539 4794473 4756021
14157 4756021 4825372 4842542 4792437 4768000 4798956 4838480 4883151 4936382 4900172 4912981 4862856
$$ [...]
##END NTUPLES=NMR SPECTRUM
##END=
