##TITLE=1H_DE-80H_X3
 200.13MHz, d2o
 8 sc
 
 19ns.26.2.2025
##JCAMPDX= 6.0         $$ Bruker NMR JCAMP-DX V2.0
##DATA TYPE= NMR SPECTRUM
##DATA CLASS= NTUPLES
##ORIGIN= UXNMR, Bruker Analytische Messtechnik GmbH
##OWNER= pz
$$ XWIN-NMR		Version 3.5
$$ Fri Mar 13 10:19:46 2026 Russian Standard Time (UT+4h)  Yarkov@DPX200
##.OBSERVE FREQUENCY= 200.1313
##.OBSERVE NUCLEUS= ^1H
##.ACQUISITION MODE= SIMULTANEOUS
##.ACQUISITION SCHEME= undefined
##.AVERAGES= 8
##.DIGITISER RES= 18
##SPECTROMETER/DATA SYSTEM= spect
##.PULSE SEQUENCE= zg30
##.SOLVENT NAME= CDCl3
##.SHIFT REFERENCE= (INTERNAL, CDCl3, 0, 15.4362)
##AUDIT TRAIL= $$ (NUMBER, WHEN, WHO, WHERE, WHAT)
$$ ##TITLE= Audit trail, XWIN-NMR		Version 3.5
$$ ##JCAMPDX= 5.01
$$ ##ORIGIN= Bruker BioSpin GmbH
$$ ##OWNER= Yarkov
$$ C:/Bruker/XWIN-NMR/data/yarkov2/nmr/H-C/1/pdata/1/auditp.txt
$$ ##AUDIT TRAIL=  $$ (NUMBER, WHEN, WHO, WHERE, WHAT)
(   1,<2026-03-13 10:18:37.65 +0400>,<Yarkov>,<DPX200>,
      <created by zg, POWCHK disabled, PULCHK disabled
       configuration hash MD5:
       00 E9 B6 7A A2 85 ED C7 34 08 36 98 17 FE 4E 26
       data hash MD5: 16K
       A4 A1 48 AA 0B 4B 64 7A B7 7D 60 79 AC AC F6 17>)
(   2,<2026-03-13 10:18:54.15 +0400>,<Yarkov>,<DPX200>,
      <Start of raw data processing
       efp BC_mod = 2 LB = 0.25 FT_mod = 6 PKNL = 1 PHC0 = -5299.148 PHC1 = 6.821927 SI = 16K 
       data hash MD5: 16K
       B5 93 92 45 65 16 85 30 7F C4 8A 32 AE AD 84 23>)
(   3,<2026-03-13 10:19:10.62 +0400>,<Yarkov>,<DPX200>,
      <abs ABSG = 5 
       data hash MD5: 16K
       6F B0 F8 9D 76 7E EA 55 AC 4E 70 77 FD 4A 50 4C>)
$$ ##END=
$$ 
$$ hash MD5
$$ FB 77 F5 8C 83 A3 E2 35 8C 03 73 21 BE 6D 4B 68
##$RELAX= 
##$RELAX= 
##$RELAX= 
##$RELAX= 
##$RELAX= 
##$RELAX= 
$$ Bruker specific parameters
$$ --------------------------
##$DU= <C:/Bruker/XWIN-NMR>
##$EXPNO= 1
##$NAME= <H-C>
##$PROCNO= 1
##$TYPE= <nmr>
##$USER= <yarkov2>
##$AMP= (0..31)
100 100 100 100 100 100 100 100 100 100 100 100 100 100 100 100 100 100 
100 100 100 100 100 100 100 100 100 100 100 100 100 100 
##$AQSEQ= 0
##$AQ_mod= 1
##$AUNM= <au_zg>
##$AUTOPOS= <>
##$BF1= 200.13
##$BF2= 200.13
##$BF3= 200.13
##$BF4= 200.13
##$BF5= 200.13
##$BF6= 200.13
##$BF7= 200.13
##$BF8= 200.13
##$BYTORDA= 1
##$CFDGTYP= 0
##$CFRGTYP= 5
##$CHEMSTR= <none>
##$CNST= (0..31)
1 1 145 1 1 1 1 1 1 1 1 1 1 1 1 1 1 1 1 1 1 1 1 1 1 1 1 1 1 1 1 1 
##$CPDPRG= <>
##$CPDPRG1= <>
##$CPDPRG2= <>
##$CPDPRG3= <>
##$CPDPRG4= <mlev>
##$CPDPRG5= <mlev>
##$CPDPRG6= <mlev>
##$CPDPRG7= <mlev>
##$CPDPRG8= <mlev>
##$CPDPRGB= <>
##$CPDPRGT= <>
##$D= (0..31)
0 0.7 0 0 0 0 0 0 0 0 0 0.03 0 0 0 0 0 0 0 0 0 0 0 0 0 0 0 0 0 0 0 0 
##$DATE= 1773382717
##$DBL= (0..7)
120 120 120 120 120 120 120 120 
##$DBP= (0..7)
150 150 150 150 150 150 150 150 
##$DBP07= 0
##$DBPNAM0= <>
##$DBPNAM1= <>
##$DBPNAM2= <>
##$DBPNAM3= <>
##$DBPNAM4= <>
##$DBPNAM5= <>
##$DBPNAM6= <>
##$DBPNAM7= <>
##$DBPOAL= (0..7)
0.5 0.5 0.5 0.5 0.5 0.5 0.5 0.5 
##$DBPOFFS= (0..7)
0 0 0 0 0 0 0 0 
##$DE= 6
$$ [...]
##$SUBNAM3= <"">
##$SUBNAM4= <"">
##$SUBNAM5= <"">
##$SUBNAM6= <"">
##$SUBNAM7= <"">
##$SUBNAM8= <"">
##$SUBNAM9= <"">
##$SW= 18.0517328524113
##$SWIBOX= (0..15)
0 0 2 0 0 0 0 0 0 0 0 0 0 0 0 0 
##$SW_h= 3612.71676300578
##$TD= 16384
##$TD0= 1
##$TE= 0
##$TE2= 300
##$TE3= 300
##$TEG= 300
##$TL= (0..7)
0 120 120 120 120 120 120 120 
##$TP= (0..7)
150 150 150 150 150 150 150 150 
##$TP07= 0
##$TPNAME0= <>
##$TPNAME1= <>
##$TPNAME2= <>
##$TPNAME3= <>
##$TPNAME4= <>
##$TPNAME5= <>
##$TPNAME6= <>
##$TPNAME7= <>
##$TPOAL= (0..7)
0.5 0.5 0.5 0.5 0.5 0.5 0.5 0.5 
##$TPOFFS= (0..7)
0 0 0 0 0 0 0 0 
##$TUNHIN= 0
##$TUNHOUT= 0
##$TUNXOUT= 0
##$USERA1= <user>
##$USERA2= <user>
##$USERA3= <user>
##$USERA4= <user>
##$USERA5= <user>
##$V9= 5
##$VALIST= <valist>
##$VCLIST= <CCCCCCCCCCCCCCC>
##$VD= 0
##$VDLIST= <DDDDDDDDDDDDDDD>
##$VPLIST= <PPPPPPPPPPPPPPP>
##$VTLIST= <TTTTTTTTTTTTTTT>
##$WBST= 1024
##$WBSW= 4
##$XGAIN= (0..3)
0 0 0 0 
##$XL= 0
##$YL= 0
##$YMAX_a= 884438
##$YMIN_a= -851721
##$ZGOPTNS= <>
##$ZL1= 120
##$ZL2= 120
##$ZL3= 120
##$ZL4= 120
##$ABSF1= 15.49127
##$ABSF2= -2.560579
##$ABSG= 5
##$ABSL= 3
##$ALPHA= 0
##$AQORDER= 0
##$ASSFAC= 0
##$ASSFACI= 0
##$ASSFACX= 0
##$ASSWID= 0
##$AUNMP= <proc_1d>
##$AZFE= 0.1
##$AZFW= 0.1
##$BCFW= 0
##$BC_mod= 2
##$BYTORDP= 0
##$COROFFS= 0
##$CY= -3
##$DATMOD= 1
##$DC= 0
##$DFILT= <>
##$DTYPP= 0
##$F1P= 0
##$F2P= 0
##$FCOR= 1
##$FTSIZE= 16384
##$FT_mod= 6
##$GAMMA= 0
##$GB= 0
##$INTBC= 1
##$INTSCL= 3.241238e-09
##$ISEN= 128
##$LB= 0.25
##$LEV0= 0
##$LPBIN= 0
##$MAXI= 10000
##$MC2= 0
##$MEAN= 0
##$ME_mod= 0
##$MI= 1.114404
##$NCOEF= 0
##$NC_proc= -6
##$NLEV= 6
##$NOISF1= 3.799351
##$NOISF2= 2.8
##$NSP= 0
##$NTH_PI= 0
##$NZP= 0
##$OFFSET= 15.43618
##$PC= 1
##$PHC0= -5299.148
##$PHC1= 6.821927
##$PH_mod= 1
##$PKNL= yes
##$PPARMOD= 0
##$PSCAL= 0
##$PSIGN= 0
##$REVERSE= no
##$SF= 200.130017114578
##$SI= 16384
##$SIGF1= 3
##$SIGF2= 2
##$SINO= 0.751879
##$SIOLD= 32768
##$SREGLST= <19F.Aceton>
##$SSB= 0
##$STSI= 16384
##$STSR= 0
##$SW_p= 3612.71676300578
##$SYMM= 0
##$S_DEV= 0
##$TDeff= 16384
##$TDoff= 0
##$TI= <>
##$TILT= no
##$TM1= 0
##$TM2= 0
##$TOPLEV= 0
##$USERP1= <user>
##$USERP2= <user>
##$USERP3= <user>
##$USERP4= <user>
##$USERP5= <user>
##$WDW= 1
##$XDIM= 16384
##$YMAX_p= 418005960
##$YMIN_p= -1160989
$$ End of Bruker specific parameters
$$ ---------------------------------
##NTUPLES= NMR SPECTRUM
##VAR_NAME=  FREQUENCY,     SPECTRUM/REAL,   SPECTRUM/IMAG
##SYMBOL=    X,             R,               I
##VAR_TYPE=  INDEPENDENT,   DEPENDENT,       DEPENDENT
##VAR_FORM=  AFFN,          ASDF,            ASDF
##VAR_DIM=   16384,         16384,           16384
##UNITS=     HZ,            ARBITRARY UNITS, ARBITRARY UNITS
##FACTOR=    0.220516191357247, 1,           1
##FIRST=     3089.24299054784, 0,            0
##LAST=      -523.473772457936, 0,           0
##MIN=       -523.473772457936, -1160989,    0
##MAX=       3089.24299054784, 418005960,    0
$$ Real data points
##PAGE= N=1
##DATA TABLE= (X++(R..R)), XYDATA
$$ [...]
8096 -337064 -440606 -423481 -386606 -310272 -313079 -337448 -343483 -371630 -388076 -391762 -376900 -442922
8084 -442922 -389455 -382443 -333418 -382781 -391963 -408713 -379250 -379309 -349774 -361160 -388081 -414619 -398438
8071 -398438 -318419 -322826 -301975 -314388 -349246 -349592 -391020 -422485 -438245 -426024 -415225 -429264
8059 -429264 -377826 -339608 -394099 -414584 -398163 -365438 -316868 -357585 -414522 -366832 -368939 -350353
8047 -350353 -348191 -333911 -288150 -327565 -358244 -363630 -416278 -447902 -392075 -300310 -307220 -370817
8035 -370817 -322920 -318531 -399588 -361502 -348623 -358901 -408231 -320531 -327304 -386586 -338686 -340432
8023 -340432 -331286 -328573 -349435 -323792 -363223 -395003 -379263 -432703 -419058 -463737 -440116 -398385
8011 -398385 -429813 -388984 -396817 -367287 -338783 -333185 -372101 -332231 -318202 -353237 -396202 -406125
7999 -406125 -365297 -380206 -362168 -386367 -346029 -335366 -370390 -335149 -338804 -353752 -373259 -365857
7987 -365857 -353442 -351305 -315017 -354705 -365201 -422086 -454024 -410039 -374664 -385371 -435612 -424921
7975 -424921 -433138 -459712 -361686 -333738 -342343 -347058 -347976 -441209 -406271 -384546 -360046 -334808 -388368
7962 -388368 -390643 -360622 -379462 -346741 -343681 -353835 -333121 -360243 -405646 -392003 -315345 -383710
7950 -383710 -354350 -291713 -301346 -294393 -310138 -346989 -356667 -364192 -398972 -345005 -326530 -274022
7938 -274022 -384092 -376804 -348591 -386339 -325990 -357510 -368664 -304118 -318209 -375549 -306044 -318806
7926 -318806 -361834 -368171 -336727 -321705 -336691 -324209 -308912 -349872 -332208 -313343 -323252 -331936
7914 -331936 -353190 -362461 -312017 -276345 -256204 -323838 -374459 -361535 -340196 -292201 -297819 -305878
7902 -305878 -338343 -288623 -354485 -388514 -328605 -376156 -313615 -315785 -327863 -360794 -301781 -286017
7890 -286017 -272794 -348398 -307285 -278441 -375428 -411448 -374327 -342628 -370494 -349840 -353285 -352467
7878 -352467 -385270 -357914 -331423 -308569 -315812 -354068 -339720 -342624 -334558 -317925 -299823 -355115
7866 -355115 -326762 -297081 -339157 -290789 -298085 -345895 -317689 -277406 -304114 -278036 -296841 -297701
7854 -297701 -282404 -350926 -325759 -235823 -257397 -207703 -243826 -273060 -282571 -269402 -270955 -294608
7842 -294608 -320092 -267727 -337339 -357102 -362462 -349748 -301768 -331683 -347491 -339296 -245288 -243327
7830 -243327 -279458 -271674 -282866 -266957 -232798 -242483 -330638 -335359 -322402 -389557 -352435 -305885
7818 -305885 -229504 -223054 -254749 -297337 -306947 -204012 -204206 -299609 -203288 -229632 -286349 -385993
7806 -385993 -299858 -296193 -290200 -288201 -285655 -255956 -300381 -313789 -246960 -260400 -262028 -239445 -301617
7793 -301617 -369016 -427336 -364191 -324314 -292264 -285225 -283021 -331250 -375162 -310383 -329684 -364293
7781 -364293 -396119 -380546 -267862 -256931 -301365 -323250 -355817 -399454 -294503 -303940 -294503 -269622
7769 -269622 -286689 -372284 -357270 -302947 -308535 -273904 -318361 -317604 -267006 -352233 -308532 -250066
7757 -250066 -244485 -279251 -351626 -389056 -330678 -311000 -246822 -274377 -321476 -253380 -306751 -268580
7745 -268580 -253394 -294151 -320394 -286188 -285874 -300657 -237339 -197780 -314296 -337904 -308576 -302851
7733 -302851 -255357 -354198 -305372 -302870 -272048 -164345 -213849 -264288 -318556 -334370 -301495 -247575
7721 -247575 -299845 -379295 -361171 -394955 -403854 -384493 -306800 -252270 -285935 -306261 -234128 -245737
7709 -245737 -253845 -280243 -270162 -293954 -358000 -320891 -334395 -319034 -309572 -322878 -326752 -245670
7697 -245670 -321904 -345438 -280747 -259823 -238146 -270485 -228576 -208014 -181071 -172562 -254528 -238436
7685 -238436 -282762 -283723 -316955 -308003 -264842 -216030 -234218 -269213 -314136 -424206 -380924 -368413
7673 -368413 -336161 -336691 -337615 -304061 -254583 -219324 -199352 -230463 -240291 -279822 -278525 -254747 -257366
7660 -257366 -278507 -296378 -275029 -270879 -245596 -244981 -238508 -310856 -323371 -298603 -235601 -184178
7648 -184178 -274312 -228578 -264948 -312028 -290088 -246374 -202004 -272747 -217125 -184512 -250773 -268436
7636 -268436 -309664 -333700 -281389 -258089 -204236 -238817 -267956 -304505 -246113 -288237 -289653 -281393
7624 -281393 -276112 -329280 -282844 -288500 -221432 -257703 -333475 -324208 -331121 -222913 -258347 -259934
7612 -259934 -247614 -237077 -253262 -281250 -278739 -300421 -288950 -313859 -299447 -256251 -266872 -330164
7600 -330164 -342740 -292228 -285833 -224226 -238108 -226703 -169463 -158320 -221835 -226423 -228149 -206802
7588 -206802 -255733 -227450 -224310 -269403 -269471 -261721 -269970 -221476 -163152 -216347 -223082 -189340 -197118
7575 -197118 -238253 -194070 -115132 -259871 -260676 -299096 -239430 -198852 -210930 -260585 -240388 -196937
7563 -196937 -246891 -167654 -202379 -243428 -176475 -180725 -241812 -247707 -215631 -219408 -222749 -224329 -228919
7550 -228919 -237211 -229892 -262742 -270363 -271386 -170351 -130850 -142488 -186004 -251904 -157020 -173068
7538 -173068 -234809 -286590 -225188 -200886 -174410 -180253 -206587 -155958 -187511 -189752 -147879 -204279
7526 -204279 -261109 -265962 -241983 -234571 -197967 -166600 -214077 -271871 -204328 -227831 -220703 -164444
7514 -164444 -167484 -185221 -206448 -217844 -228598 -199388 -194946 -174253 -158116 -156242 -167170 -159302
7502 -159302 -69540 -138581 -91015 -81904 -128683 -158582 -185467 -230705 -173676 -145298 -200177 -192906
7490 -192906 -183911 -138371 -124057 -113189 -181841 -202424 -177600 -176537 -151743 -91247 -120086 -167564
7478 -167564 -172282 -150122 -132134 -129324 -212919 -172769 -95206 -91209 -172648 -239355 -212980 -184346
7466 -184346 -147635 -136036 -101660 -60247 -204477 -267205 -157674 -131385 -89077 -80395 -98978
7455 -98978 -88320 -86652 -188035 -210367 -209629 -173321 -144675 -141195 -125907 -144005 -209355 -152829
7443 -152829 -85012 -114483 -102964 -105736 -85805 -54462 -71755 -60694 -79173 -144170 -128077 -75210
7431 -75210 -3828 -67513 -110823 -87193 -147886 -218745 -190977 -124450 -176764 -190516 -158325 -141523
7419 -141523 -147401 -152817 -141589 -153920 -134513 -150886 -164260 -206243 -194826 -207129 -172443 -105151
7407 -105151 -175790 -154507 -94079 -89675 -156768 -165680 -121763 -155005 -159673 -137155 -153409 -167995
7395 -167995 -106756 -118031 -127106 -172919 -167261 -110907 -47934 -122297 -228514 -258014 -293212 -262581
7383 -262581 -230437 -168391 -184492 -208405 -230029 -198683 -138747 -125460 -174967 -163863 -160628 -145282
7371 -145282 -137043 -179309 -174214 -175509 -167020 -131971 -152217 -161054 -78941 -73756 -124384 -210376 -193221
7358 -193221 -175683 -127093 -141852 -186406 -207081 -208494 -194973 -126051 -141166 -116034 -112971 -156521
7346 -156521 -64581 -112518 -140525 -135361 -122940 -120022 -120213 -88088 -5355 -66259 -18140 34881
7334 34881 -29431 -67399 -73043 -63399 -98926 -42700 -89771 -162063 -134535 -120701 -106805 -133143
7322 -133143 -102538 -95837 -79097 -54688 -94748 -112819 -102269 -102514 -82177 -58448 -104451 -139987
7310 -139987 -123126 -51985 -41494 -104233 -120379 -150715 -129271 -142331 -189028 -165622 -163533 -110126
7298 -110126 -143943 -184979 -142415 -139250 -215023 -247980 -188197 -146308 -195518 -178328 -129008 -132620
7286 -132620 -142834 -98575 -84974 -80322 -100799 -72132 -70108 -77999 -143405 -157887 -130752 -109368
7274 -109368 -180046 -183996 -83938 -121730 -109068 -127657 -108216 -146854 -131152 -85745 -184443 -162103
7262 -162103 -224819 -223902 -171140 -206240 -105948 -101138 -92442 -111981 -122664 -100057 -52695 -68102
7250 -68102 -42779 -68371 -84828 -66170 -69907 -62644 -59426 -131353 -59752 -35969 -66011 -113561
7238 -113561 -148829 -118119 -89629 -93498 -104267 -97731 -79591 -85174 -113516 -137809 -131431 -81486
7226 -81486 -59859 -98841 -86416 -88941 -173459 -174900 -115851 -115287 -103932 -154246 -177473 -56562
7214 -56562 -79464 -63655 -76718 -113780 -84341 -115793 -94876 -151462 -100916 -176258 -200448 -167790
7202 -167790 -138396 -52894 -86435 -54073 -67291 -45428 -111696 -124328 -125013 -141777 -127060 -105793
7190 -105793 -66523 -47963 -95175 -84703 -118250 -112053 -137287 -65388 -52462 -64750 -60997 -84309
7178 -84309 -136657 -91436 -80583 -71394 -30235 -60019 -100964 -62187 -44920 -36406 6979 16233
7166 16233 -111224 -31158 -1342 -29830 11125 -3451 -35406 -25720 -18165 -36878 -36470 -24954
7154 -24954 -42718 -106678 -66122 -43164 19172 10847 -25779 -107617 -101253 -44596 -79085 -6308
7142 -6308 -11291 -54608 70280 58215 -23265 -84174 -62639 -45067 42434 -9782 -35968 -9803
7130 -9803 80249 57464 -7143 -13901 23082 -16319 -39611 -40641 35639 -32525 -69810 -37343
7118 -37343 -6236 91145 -345 -6491 -17472 1281 -5579 -29033 -57577 -18657 -50579 -83173
7106 -83173 -83429 2616 36650 4113 23047 22527 -18771 13601 60392 66088 54052 -659 -44639
7093 -44639 -46246 30363 47944 51682 48685 51560 25013 -28533 -37478 15329 3776 -9278 35566
7080 35566 566 -40006 63540 86744 -11819 21171 7367 -49906 14149 70223 4363 -37887
7068 -37887 -19593 -51970 20951 4024 -70605 -90307 -79917 -15409 27543 -8606 -22775 -5481
7056 -5481 -8929 -8764 -6674 -50306 -85245 29318 59914 -442 -57929 -5908 54717 -31801 -24688
7043 -24688 41117 21548 17569 -43083 24285 48668 44082 153493 70372 -21917 -22558 -10852
7031 -10852 -28869 -65066 -76679 -54916 12841 36600 -48069 -82777 -17647 -14268 -60047 -26216
7019 -26216 10099 39898 -23722 -58519 62137 39276 -50736 -50967 -1641 -22457 73337 27192
7007 27192 79909 149712 41090 38580 -26204 53265 66142 84597 77702 132417 111992 93529
6995 93529 167165 81012 131084 160084 91558 84409 120346 126295 94991 89875 88030 103082 163121
6982 163121 202997 206150 147060 152965 187690 111422 68708 82755 86636 83689 109274 5258
6970 5258 62121 84334 55421 111169 100544 53924 29082 846 -39258 -18749 47189 17593
6958 17593 -13917 11834 6663 128360 126793 170554 155250 48377 2231 8687 9260 99705
6946 99705 76628 85554 65320 56792 -1476 52190 104052 76640 137224 126716 141173 163876
6934 163876 102997 156405 160691 184534 166152 148354 180205 186158 207500 160716 195318 260227
6922 260227 308483 295978 316341 255843 275137 228088 171261 231186 160575 203019 286078 231065
6910 231065 248929 242229 257734 284638 264747 195921 160701 153131 133299 117301 103581 63187
6898 63187 80702 62249 66780 95077 116935 100591 110978 106346 128016 115340 156419 243737
6886 243737 191483 219194 212431 102425 155337 149123 196120 228282 165721 181968 200652 237868
6874 237868 255979 257175 290248 237814 158236 130127 158193 147372 283398 284074 202488 202372
6862 202372 141786 133396 192790 212455 193960 252689 210313 192564 218162 256388 189272 195383
6850 195383 247833 253310 209356 214202 189224 173586 126504 174788 266057 242612 286867 336738
6838 336738 343168 364551 386595 346502 396082 338936 298828 332514 334417 343205 382834 379957
6826 379957 336114 379366 383741 365637 438336 473734 448420 478311 504312 545207 567570 548358
6814 548358 534463 608378 562487 526471 518263 537006 530192 425745 473921 567291 594660 525753
6802 525753 516972 497266 509331 509043 455117 460611 368046 368383 368433 377279 418747 463329 418167 369396
6788 369396 430891 474381 472466 472531 524796 464769 441086 429067 462028 496977 514111 524776
6776 524776 509066 471229 495385 557774 546304 575556 568812 573651 572639 552814 576141 612850
6764 612850 583254 649866 599486 630847 625300 592613 528403 481370 492282 489341 501863 473419
6752 473419 426608 473248 491893 453863 464024 455635 447894 400825 417738 415243 398072 387502
6740 387502 386514 385659 357090 374788 342493 392415 451865 478262 491144 402885 378324 372470 401048
6727 401048 418193 421735 366769 393499 467346 416051 389174 417586 425776 445487 417457 485843
6715 485843 494864 457896 413789 490283 427090 441282 444057 509621 481877 430551 439907 410211
6703 410211 430542 387045 426187 494964 481703 447629 417023 459216 472070 451110 469469 435196
6691 435196 354870 357500 325935 351094 387889 405015 395252 384907 396225 409929 432215 449964
6679 449964 496377 393038 363702 403959 401846 360815 378650 467601 526066 471408 469020 493593
6667 493593 496698 416910 415295 427775 478462 428239 461693 453692 456437 470889 544680 525865
6655 525865 507079 523734 556959 583361 501061 489708 444500 398665 434882 502256 429204 427678
6643 427678 435000 504074 527445 528167 461739 455870 460593 425660 501709 505514 512936 562581 542360
6630 542360 507686 591080 572442 601282 584158 611345 623614 580824 520439 543530 548570 480165
6618 480165 541780 571578 624336 616154 577006 573919 624347 595734 551157 574305 579602 652126
6606 652126 661252 627630 643325 640042 607701 659786 729229 686999 680922 790232 770960 696148
6594 696148 624398 653465 648337 680304 700743 744092 772442 713920 701832 705955 632045 645490
6582 645490 716746 710589 721860 674975 598072 608378 683113 704044 783296 743532 698298 673443
6570 673443 680329 678999 713092 706700 724440 713000 824214 815845 823844 846924 807479 851682
6558 851682 867194 845092 851159 855072 874534 933280 959615 966410 925837 836849 843055 841086 844221
6545 844221 871428 929602 914336 947763 1048682 1089294 1066229 1024763 991389 976182 885056
6534 885056 810872 790304 777618 877586 923265 904665 904605 849311 773081 783384 841512 852541
6522 852541 900626 888424 795249 890800 964307 918228 983126 929536 856233 882159 882047 818828
6510 818828 815375 901365 872916 945427 919623 944149 1017359 1038712 996737 974667 1016104 1056913
6498 1056913 953930 940636 978464 1024153 987451 977672 931573 887508 898362 915158 1027302
6487 1027302 1001372 1069472 1177918 1188115 1168897 1253118 1312652 1216930 1169398 1167295 1201083
6476 1201083 1204860 1111033 1075735 1079293 1068190 1161447 1253191 1296140 1294543 1314838 1324279 1321435
6464 1321435 1260968 1256433 1271576 1150082 1083820 1003335 962333 1002021 1008065 998511 949166 947999
6452 947999 933282 948448 980830 920392 841037 878718 840199 829182 910611 912020 878560 824896
6440 824896 806213 814382 846788 847559 852680 884520 916770 927864 956933 989410 972286 1026202
6428 1026202 1019560 1024981 1082577 977791 968600 1052831 1135914 1121487 1135225 1180166 1055011 1079696
6416 1079696 1142801 1117240 1136682 1125002 1128535 1098802 1101520 1064931 1101969 1147033 1136093 1176346
6404 1176346 1192853 1191432 1161117 1183250 1169161 1169954 1141866 1115970 1124594 1121316 1099713 1153226
6392 1153226 1233363 1270093 1299086 1296567 1378875 1362377 1354075 1373002 1286968 1308505 1366986 1354464
6380 1354464 1403033 1407183 1407476 1497976 1546798 1491103 1578066 1645642 1646168 1584989 1544044 1522297
6368 1522297 1529619 1638745 1679354 1769586 1733021 1654889 1753183 1850452 1830105 1849152 1877060
6357 1877060 1905272 2037679 2100910 2155681 2201223 2330853 2395395 2408306 2403592 2376825 2359361
6346 2359361 2348510 2430839 2459912 2454110 2445495 2459199 2456301 2475330 2557093 2629336 2627905 2570262
6334 2570262 2558284 2667327 2792649 2855837 2903262 2943050 3095506 3120518 3144546 3193188 3236232
6323 3236232 3278454 3320591 3368172 3506915 3581244 3627583 3794377 3891533 3949323 4008936 4011663
6312 4011663 4073750 4122338 4137256 4211446 4341416 4448729 4589226 4692243 4846040 5001604
6302 5001604 5178272 5378502 5633447 5870199 6091345 6517841 6901635 7302377 7769009 8265123
6292 8265123 8806420 9526385 10290788 11278873 12444625 13965615 15970662 18655887 22102757
6283 22102757 26447158 30656226 33892269 35099596 34065077 31440136 28169685 25169372
6275 25169372 22766118 21303224 20769246 21060387 22345914 24700686 28099591 31819226
6267 31819226 34743674 35663138 34243030 30948163 26638156 22419100 18874199 16076292
6259 16076292 13941022 12296510 11005650 10070339 9354219 8813939 8381719 8079526 7823724
6250 7823724 7692600 7631390 7671164 7632555 7639989 7532667 7415302 7335971 7308391 7309415 7298398
6239 7298398 7285644 7312106 7391719 7474433 7577109 7786928 7925390 8182444 8441322 8815778
6229 8815778 9127308 9546308 10033240 10552457 11172862 11771665 12490969 13199801 14070566 15142812
6219 15142812 16352315 17797746 19694457 22151282 25365051 29769273 35668130 42849350
6211 42849350 50651237 57195646 60517510 59849148 55948011 50292872 44546090 39771874
6203 39771874 36407251 34655444 34574287 36126017 39504802 44591496 50645194 55876228
6195 55876228 58356465 57084388 52262868 45415783 38156408 31494120 26057386 21773798
6187 21773798 18440344 15852290 13907035 12269305 10920719 9939892 9099304 8525013 8051637
6178 8051637 7692699 7353121 7038068 6758553 6565839 6368741 6098575 5892100 5718876 5596822
6168 5596822 5462997 5335198 5298055 5280414 5151420 5041624 4986281 4939617 4887321 4876271 4910827
6157 4910827 4864392 4816405 4824388 4797020 4814744 4791731 4709930 4704077 4645479 4593961 4610517 4597426
6145 4597426 4596834 4598112 4563239 4579599 4501460 4484737 4573653 4644704 4622581 4641231 4597860 4593520
6133 4593520 4627639 4637718 4629868 4686629 4762867 4774015 4783350 4715764 4701506 4759292 4800641 4774795
6121 4774795 4738065 4744774 4756721 4733342 4737734 4820139 4853060 4915772 4944668 4933294 5096184 5162842
6109 5162842 5259629 5368868 5381786 5495154 5578320 5648479 5699047 5754115 5819386 5983417 6099662
6098 6099662 6193291 6324411 6425146 6635330 6913161 7083420 7264095 7509728 7709164 8078675
6088 8078675 8405741 8628108 8771928 8823127 8815654 8789867 8808642 8864364 8920381 9012645 9236179
6077 9236179 9461497 9711946 9934090 10117452 10446187 10824345 11152355 11507145 12047269 12583601
6067 12583601 13113678 13851390 14498023 14880522 15197409 15412187 15639788 15953271 16310352
6058 16310352 16926957 17697043 18567834 19688738 20904107 22299816 23843953 25594146 27686336
6049 27686336 30233339 33608879 38171627 43975705 50910102 57711470 62435220 63845609
6041 63845609 61821717 57386295 51721544 45991277 41114699 37498606 35039404 33491482
6033 33491482 32841622 32877288 33296425 34349829 36063838 38534882 41899497 46205983 52034984
6024 52034984 59708389 68903734 78398131 86080611 89952918 89424693 85441986 79575585
6016 79575585 73603604 68916193 66011395 65077132 65630692 66996336 68682111 70319386
6008 70319386 71554493 72032464 71528355 70099740 68154830 66236424 64791584 64021645 63585850
5999 63585850 63112332 62257659 60796849 59092174 57667748 56946622 57037842 57919422 59637459
5990 59637459 62163280 65089225 68042242 70606235 72563147 73977504 75081068 76336396
5982 76336396 77546246 78200066 77494996 75149862 71501980 67265945 63489302 61027961
5974 61027961 60116162 60237584 60403916 59521198 57090264 53589990 49655955 45910486 42869473
5965 42869473 40586032 38958756 37719457 36477646 35065346 33449608 31822249 30464300
5957 30464300 29508302 29115731 29382158 30471485 32437245 35380276 38911928 42062106 43571798
5948 43571798 42948196 40364699 36585466 32308579 28230530 24755866 21948145 19672472
5940 19672472 17908349 16567874 15502988 14648611 13991606 13440047 13062185 12831993 12690245
5931 12690245 12518040 12406624 12388717 12426326 12487009 12582051 12745089 12906148 13259336 13754064
5921 13754064 14350011 15076443 15908303 16995409 18106461 19219717 20154106 20732818 20752176
5912 20752176 20319485 19784187 19195989 18686794 18421619 18362124 18470523 18711951 18981471 19266024
5902 19266024 19645538 20132856 20647735 21252332 21835632 22311113 22606903 22715085 22637613 22388571
5892 22388571 22149099 21996786 21904833 21976861 22094622 22332181 22559505 22823770 22810593 22682892
5882 22682892 22432250 22181075 22101201 22191280 22348223 22741408 23212189 23658702 24027782 24270932
5872 24270932 24371073 24262922 24137828 23990216 23948241 24042451 24089746 24303592 24610621 24891662
5862 24891662 25200518 25451219 25449628 25048833 24510155 23838565 23146830 22542567 22072121 21715600
5852 21715600 21427666 21138783 20893703 20744052 20531941 20213949 20157328 20234046 20293365 20392873
5842 20392873 20365909 20244699 20005341 19551659 19073726 18567414 17982503 17262233 16566520 15914599
5832 15914599 15285432 14737005 14170747 13576328 13179110 12811429 12584571 12334831 11959287
5823 11959287 11700480 11302518 10922837 10539803 10131773 9718799 9372192 9031232 8790450
5814 8790450 8464830 8080820 7696891 7268042 6924694 6650951 6394496 6122555 5920973 5781271
5804 5781271 5594861 5423969 5287706 5114325 4893478 4599154 4334235 4081677 3872044 3759521
5794 3759521 3569244 3516993 3466457 3302411 3208299 3126307 2980791 2830663 2755545 2627402
5784 2627402 2543576 2493007 2446359 2364314 2335761 2237017 2225457 2127113 2039670 2045128 2047571 1937567
5772 1937567 1901530 1866114 1853717 1796167 1791829 1826518 1816423 1789886 1731066 1783913 1776772 1786305
5760 1786305 1731537 1622314 1655347 1675384 1692512 1673453 1613904 1541229 1557704 1576665 1549609
5749 1549609 1591130 1543068 1527256 1482482 1490063 1494962 1511782 1578147 1510186 1521008 1584810 1435466
5737 1435466 1492152 1530150 1578270 1630676 1656944 1666631 1665832 1662525 1752528 1718114 1654238 1630350
5725 1630350 1582242 1512729 1523608 1508308 1592053 1616031 1543635 1575112 1569817 1605056 1663150 1664010
5713 1664010 1651803 1690759 1772716 1742851 1732494 1831883 1841169 1836540 1768349 1736004 1793286 1811523
5701 1811523 1838242 1782622 1782183 1824484 1800581 1800934 1789904 1811163 1797742 1817123 1817024 1759417 1809976
5688 1809976 1805371 1653972 1673556 1628491 1625035 1723623 1712093 1679393 1662361 1678874 1735495 1650342
5676 1650342 1705263 1743573 1776434 1775516 1807201 1812380 1755002 1800265 1823664 1815766 1840066 1795811
5664 1795811 1833798 1796572 1760272 1750476 1750331 1716419 1741512 1735150 1732661 1679295 1694912 1674915
5652 1674915 1624290 1636500 1596048 1677714 1661420 1634281 1666869 1672410 1676633 1687766 1648430 1746864
5640 1746864 1754146 1757818 1780405 1783212 1774695 1719900 1752386 1744529 1726030 1703214 1709593 1702442 1687107
5627 1687107 1697091 1678375 1701897 1738420 1738638 1728376 1749306 1704798 1691595 1654395 1757652 1668074
5615 1668074 1646103 1673271 1687897 1800087 1816912 1795548 1748960 1750599 1807321 1876433 1876364 1807490
5603 1807490 1772530 1818590 1801282 1788568 1755176 1709141 1790746 1813974 1774498 1758985 1728354
5592 1728354 1726377 1790022 1847971 1903835 1879714 1858011 1907291 1955808 2032539 2098410 2168715 2196468
5580 2196468 2171543 2098856 1994858 1907450 1883217 1862123 1812070 1827279 1749519 1727944 1719351
5569 1719351 1732859 1749642 1705772 1699867 1757303 1823697 1876292 1865815 1971685 2077230 2171876
5558 2171876 2254162 2246373 2270085 2195884 2116548 2032596 2016324 1996259 1847002 1753588 1716323
5547 1716323 1731337 1742739 1722922 1770119 1745179 1817627 1872676 1872280 1793668 1703443 1738123 1739665
5535 1739665 1757712 1659254 1656818 1702051 1728531 1696440 1646914 1591884 1518549 1597332 1560558 1536167
5523 1536167 1533259 1578560 1543151 1572692 1540587 1528986 1562927 1609087 1648166 1604487 1553453 1531349
5511 1531349 1578606 1608905 1579072 1616788 1695520 1679480 1677078 1678721 1664823 1653712 1665465 1656169
5499 1656169 1631281 1609776 1636677 1679738 1705404 1671206 1608044 1595816 1589950 1645834 1692226 1658672
5487 1658672 1625628 1589733 1667226 1661893 1609587 1647570 1635084 1678885 1735854 1739839 1739341 1755386
5475 1755386 1707902 1678666 1670749 1684894 1720084 1745742 1753911 1682159 1679644 1721794 1740563 1799317
5463 1799317 1790561 1756146 1754148 1710574 1626577 1711769 1708593 1741661 1748510 1761927 1742962 1749140
5451 1749140 1692026 1647832 1748327 1740731 1689213 1750701 1820200 1805646 1859438 1814285 1793100
5440 1793100 1771326 1837300 1799796 1728972 1664214 1766748 1836125 1807293 1738551 1774730 1776049
5429 1776049 1774742 1871345 1884747 1844423 1865683 1881652 1938762 1935008 1918719 1957569 1927626 1931075
5417 1931075 1919986 1939411 1918349 1942004 1950431 1952297 1944060 1919863 1984468 1951192 1886516 1949104
5405 1949104 1907880 1890205 1942394 1965214 1935862 1945532 1938846 2050201 2066913 2051514 2048864 2022535
5393 2022535 2085131 2132229 2110314 2056464 2072525 2032436 2027795 2032478 2065134 2022971 2118507 2164729
5381 2164729 2166906 2157352 2189535 2212513 2227835 2290062 2204024 2237473 2263531 2284000 2297990 2358354
5369 2358354 2457147 2423041 2393133 2358501 2412047 2514803 2488234 2453003 2458766 2531723 2589858
5358 2589858 2652897 2669544 2678864 2768994 2769583 2811044 2895299 2906321 2858358 2909653 2944631 2935858
5346 2935858 2964050 2952476 2937407 3049584 3143989 3158855 3182605 3177793 3256407 3209595 3143541
5335 3143541 3170454 3257043 3263585 3335258 3353373 3376879 3405542 3422443 3448456 3450078 3461420 3465650
5323 3465650 3487247 3462624 3544313 3620027 3606828 3637835 3652716 3649265 3685631 3717331 3758967 3733866
5311 3733866 3712939 3715216 3726812 3766243 3715237 3720874 3791492 3791665 3796726 3797674 3855773 3830640 3912469
5298 3912469 3954289 4022142 4083078 4108336 4103934 4140121 4136021 4184394 4317529 4425770 4443993
5287 4443993 4422412 4497154 4516341 4564768 4638119 4722475 4796656 4945360 4972538 4998262 5081640
5276 5081640 5229283 5282308 5386426 5447378 5464870 5606093 5739629 5882651 6072367 6252898
5266 6252898 6477753 6636379 6824554 7035588 7285699 7619497 7919837 8251445 8681704 9156859
5256 9156859 9653753 10381540 11245636 12381212 13847069 15570718 17540818 19161321 19915641
5247 19915641 19929663 19362980 18866590 18562419 18634413 19241706 20424467 22390005 25037470
5238 25037470 28299944 31577985 34267166 36121290 37054736 37440990 37827057 38042313 37889269
5229 37889269 37674564 37908416 38708988 39382680 39970699 40808457 41729285 42470104 43196299
5220 43196299 44408101 45851082 47411290 48917777 49792033 49860841 48857959 47118470 45189014
5211 45189014 43542355 42671682 42186118 41340059 40322534 39522974 38541812 37242037 36011835
5202 36011835 35278888 34964593 34678770 34608786 34960381 35170191 34647278 33349116 30924196
5193 30924196 27629159 24268769 21170498 18787614 17096394 16019575 15467955 15543789 16133006
5184 16133006 17005254 17654040 17438581 16222477 14540010 12714760 11169717 9900401 8857524
5175 8857524 8032819 7432368 7005369 6659536 6308621 6000350 5812777 5647919 5488019 5382970
5165 5382970 5286875 5222717 5117889 5018939 4965411 4879180 4841126 4796747 4810305 4686257 4583287
5154 4583287 4546439 4558218 4520499 4451299 4480380 4429663 4435900 4445177 4345812 4380244 4391460 4392227
5142 4392227 4402813 4468608 4406530 4409435 4458473 4462997 4471242 4409579 4474017 4568590 4577233 4662920
5130 4662920 4750768 4763411 4746665 4717595 4592350 4516356 4526523 4485259 4414944 4433496 4457106
5119 4457106 4485186 4463940 4508264 4449656 4463455 4442378 4527871 4573727 4562837 4606371 4669540
5108 4669540 4727815 4750658 4784546 4837854 4986645 5061220 5147565 5185137 5272664 5325848 5433526
5097 5433526 5549793 5674937 5801573 5849102 5838303 5838679 5769585 5741996 5729896 5726528 5770847
5086 5770847 5836569 5923281 5975834 6051383 6111331 6178910 6316539 6432260 6393245 6422892 6420466
5075 6420466 6353336 6291259 6319160 6282790 6255383 6240714 6169138 6170489 6166252 6262767 6325790 6455562
5063 6455562 6561656 6707669 6820428 6899606 6870237 6860811 6865012 7012239 7113761 7143819 7238331
5052 7238331 7298512 7274808 7377775 7514119 7714989 7818481 7895702 8027780 8095729 8141930
5042 8141930 8177457 8168955 8067242 7952778 7765443 7666860 7591179 7545249 7388918 7397879 7444509
5031 7444509 7432015 7402472 7556800 7791024 7992827 8165665 8149438 8066965 7965380 8042752
5021 8042752 7983477 7932884 7986482 8050352 8070507 8028257 7962047 7896815 7821520 7749470 7762433
5010 7762433 7739249 7742265 7777620 7799989 7853790 7938677 8007166 8103772 8164741 8175518 8301474
4999 8301474 8466665 8501897 8478901 8539320 8604605 8704540 8879458 9017068 9230734 9418436
4989 9418436 9614788 9849775 10147607 10364707 10619457 10913469 11280261 11714868 12200306 12860942
4979 12860942 13577536 14508051 15560253 16608126 17711084 18354514 18460744 18292434 17756778
4970 17756778 17201963 16729004 16336259 15980937 15897572 15980544 16106752 16366851 16734174 17261589
4960 17261589 17947092 18753170 19689231 20705606 21621661 22128711 22172839 21789062 21231089
4951 21231089 20753798 20363905 20189116 20025019 19862993 19813081 19689159 19523069 19446244 19373944
4941 19373944 19457042 19664583 19892590 20044216 20296352 20604305 20914835 21207653 21612675 22044390
4931 22044390 22429917 22751739 23057443 23402608 23760171 24101701 24592415 25228920 26178855
4922 26178855 27443796 28822657 30107596 30971761 31195292 30880005 30267715 29445291 28684844
4913 28684844 28247808 27999684 28013735 28156834 28587552 29216561 30037660 31040520 32194142
4904 32194142 33576419 35105490 36733956 38020085 38826719 39141199 39142319 39056897 39100281
4895 39100281 39305289 39701445 40194124 40750828 41205232 41520766 41781737 41964754 42137647
4886 42137647 42455493 42725657 43100069 43544042 43944065 44327488 44776430 45349572 46230935
4877 46230935 47297643 48718579 50331136 52106161 53940641 55817068 57812413 59856714
4869 59856714 62189345 64586918 66974486 69349242 71485352 73236491 74647152 75658770
4861 75658770 76215908 76518810 76819666 77135500 77821031 78962704 80823329 83849748 88567852
4852 88567852 95339580 103396719 110056505 111829716 108872039 103704642 98661416 94965217
4844 94965217 92855634 92097295 92593978 93997934 96110819 99010053 102669909 107201240
4836 107201240 112852343 120012257 129044689 139416039 148832396 155390002 159905523 163316061
4828 163316061 163753936 159304033 151277105 142528368 134929642 129601243 126178318 124429060
4820 124429060 123802618 123899645 124630735 126039147 128138991 130925477 134802271 140294512 147628846
4811 147628846 155307178 159588764 158355253 153320444 146988437 141587239 138166510 136771344
4803 136771344 137300043 139516492 142945998 147324838 152563876 158742921 165776382 173611354
4795 173611354 181745502 189520855 196277095 201366994 204673921 205984785 205577882 203656660
4787 203656660 200470212 196313292 191444004 186252031 181418633 177627439 174977696 173505699
4779 173505699 173031438 173217182 174077091 175573876 177673207 180428896 183801578 187837036
4771 187837036 192688084 198229967 204335428 211033851 218137011 225356276 232100150 237654987
4763 237654987 241617927 243625347 243457046 241151354 236758397 230068571 221098360 209968265
4755 209968265 197578292 185146411 173609668 163455634 154718766 147171652 140607798
4748 140607798 134930678 130112930 126143929 122832436 120271494 118108740 116284887 114763361
4740 114763361 113360369 112101458 110769082 109259213 107498240 105652901 103516891 101242665
4732 101242665 98498629 95098332 90980606 86367957 81816302 77582071 73735131 70202254
4724 70202254 66722943 62963377 58800847 54358032 50073389 46160563 42681207 39646237
4716 39646237 37179122 35064906 33360490 31915297 30713529 29748633 28969567 28377919 28037059
4707 28037059 27831092 27901618 28258262 28866731 29444243 30062007 30442096 30346867 29708693 28798866
4697 28798866 27757792 26785832 26047791 25595111 25390595 25430889 25796343 26376554 27186675
4688 27186675 28019918 28471967 28479317 27999815 26927145 25655514 24422412 23445748 22629989
4679 22629989 21973659 21486976 21088987 20779394 20619085 20584020 20792201 21030378 21391490 21834146
4669 21834146 22342920 22616468 22596827 22277501 21827739 21237149 20729903 20336283 20070693 20025465
4659 20025465 20116821 20457900 21091235 21938611 22903781 23824595 24399557 24524815 24087119 23381370
4649 23381370 22489055 21616399 21034885 20518988 19944016 19470498 18860168 18246449 17679297
4640 17679297 17203252 16978686 16972564 17168533 17609292 18176403 18804636 19312999 19682498 19680891
4630 19680891 19252307 18485776 17456293 16492118 15632565 14891745 14346554 13813286 13399461
4621 13399461 13065966 12815739 12777727 12773388 12746176 12869304 13030943 13275654 13469187 13617430
4611 13617430 13753797 13710279 13673362 13693468 13666318 13594511 13780963 14100948 14625159 15244526
4601 15244526 15989128 16674895 17241329 17487291 17257015 16636814 15791341 14895156 14094149
4592 14094149 13386098 12883806 12529083 12131729 11820805 11684191 11632395 11550564 11609520 11736843
4582 11736843 11948327 12166865 12278784 12273485 12157107 12061051 12045962 12084450 12242589 12498308
4572 12498308 12748098 12983979 13281703 13664541 14078948 14583261 15155853 15858495 16560044
4563 16560044 17270073 18065682 19015431 20063983 21313741 22717153 24365698 26403697 29270110
4554 29270110 33319467 38841909 46287375 55097117 62785228 66040566 64087921 58716204
4546 58716204 52564278 47530053 44450349 43410759 44679590 48346217 54293049 61417026
4538 61417026 67099123 68405543 65038017 59214315 53401000 49342297 47732201 48983449
4530 48983449 52983657 58504419 62802824 63101489 59199325 53060075 47006725 42237288
4522 42237288 39176457 38019404 38805090 41655447 46469235 51927614 55284126 54280488
4514 54280488 49270839 42302055 35324537 29504197 24912683 21439941 18811701 16877947
4506 16877947 15429322 14284036 13319435 12692923 12201011 11697109 11345383 11018621 10745446
4497 10745446 10604879 10407218 10294899 10179639 10077449 10050777 9891090 9686627 9446237 9242696
4487 9242696 9045353 8890682 8829951 8748915 8584542 8590595 8595508 8539290 8525415 8479550 8453391
4476 8453391 8452604 8462161 8459666 8410078 8343491 8282369 8306693 8326500 8271010 8136330 8092975 8091665
4464 8091665 7969695 7903091 7829811 7781661 7773205 7824553 7886309 7877733 7893275 7837887 7823166 7880938
4452 7880938 7963572 7960044 7955185 7980540 8016938 8065152 8073146 8069058 8067255 8035091 8077223 8033517
4440 8033517 7992993 8037826 8104913 8128180 8164810 8198405 8194197 8343757 8484659 8613292 8716986
4429 8716986 8833274 8895989 8980717 9092280 9178489 9146855 9133720 9236176 9274560 9297590 9406870
4418 9406870 9501319 9665473 9841108 9960149 10013950 10110454 10138157 10166394 10208294 10282361 10314344
4407 10314344 10336277 10465744 10586006 10725683 10879656 10877377 10855451 11031765 11203685 11283033
4397 11283033 11433251 11617626 11831399 12028848 12290991 12534723 12793969 13086533 13304117
4388 13304117 13611680 13939679 14271049 14541840 14992752 15487913 16042331 16697923 17465390
4379 17465390 18180257 18969769 19999628 21062182 22163869 23484688 25090253 27027728
4371 27027728 29426732 32386566 36155783 41052260 46852274 53044973 58621236 62490962
4363 62490962 64315702 64567007 63912322 63127945 62955119 63497978 64036655 63510480 61177229
4354 61177229 57048001 51613761 45387108 39344422 33953558 29567748 26134740 23521085
4346 23521085 21515037 20030428 18840583 17902747 17237402 16752856 16308894 15897377 15641519
4337 15641519 15406755 15180263 14957018 14762175 14545470 14401495 14193778 13988999 13976834 13926128
4327 13926128 13773375 13709284 13654054 13619018 13672038 13689290 13644378 13654259 13597428 13555766 13521833
4316 13521833 13514685 13460984 13460340 13441469 13451679 13522234 13609161 13691954 13836190 13908608 14011509
4305 14011509 14140588 14228347 14449738 14672176 14859060 15098885 15312376 15500537 15725432 15988117
4295 15988117 16301426 16527142 16767890 16987780 17164676 17200088 17309460 17458785 17638803 17865484
4285 17865484 18209578 18556291 19066356 19679297 20313086 20873581 21455054 22088395 22782210
4276 22782210 23684762 24796399 26071747 27690053 29621717 31910824 34685870 38053903
4268 38053903 42300921 47437525 53370699 59509399 64904229 68415855 69796322 69630509
4260 69630509 68879483 68579429 68934156 69432123 69146673 67119024 62924409 57120736 50634341
4251 50634341 44384531 38998482 34599208 30955732 28137934 26096330 24342207 22926876
4243 22926876 21787814 20900092 20202058 19640499 19183470 18773378 18382026 18067981 17772121
4234 17772121 17529471 17293374 17076472 16992489 16832173 16671545 16588019 16554156 16570221 16498021
4224 16498021 16488082 16504824 16491681 16534713 16529934 16587917 16629117 16632894 16729234 16820476 16905107 16915948
4212 16915948 17014133 17170114 17189378 17255733 17398494 17517168 17692728 17797519 17884064 17935344
4202 17935344 17981476 18049264 18110344 18246133 18464084 18644824 18832591 19049503 19214488 19405784
4192 19405784 19641451 19764410 19994786 20191353 20502513 20787727 21089709 21361663 21553718
4183 21553718 21804013 22017936 22305223 22576256 22963489 23373473 23781033 24179007 24630063
4174 24630063 25128512 25659416 26337255 27063649 27788943 28584418 29454328 30451394 31655055
4165 31655055 32986396 34369947 35821709 37402476 38833784 40309347 41750564 43066504
4157 43066504 44293031 45386963 46470987 47434669 48339159 49277195 50117624 51072262 52208217
4148 52208217 53513208 55215011 57138331 59414257 61845284 64186855 66425727 68433972
4140 68433972 70353780 72336016 74193611 76135433 78234989 80445976 82647786 85043799
4132 85043799 87304140 89533650 91710803 93759475 95966075 97963286 99740156 101295484
4124 101295484 102742349 104229773 105956271 108146419 110872319 114524309 118819512 123633259
4116 123633259 128721179 133896055 139310333 146259551 156557353 172933318 195677157 216072030
4108 216072030 219429228 210596787 197780528 179851630 163310816 150956604 141893129
4101 141893129 135872465 131849853 128890277 126646546 124878689 123674775 123209189 123713711
4093 123713711 125120974 127614675 131177725 135716552 140710637 145744410 150311448 154268412
4085 154268412 157819253 161322900 164724146 167970811 170678284 172706801 174170233 175322755
4077 175322755 176201776 176633860 176538754 175621272 174152968 172556026 171195784 170219530 169753765
4068 169753765 169976499 170786983 171973399 173142705 174099304 174687798 174653629 173972896 172722803
4059 172722803 171296032 170084740 169377533 169468178 170321500 171772886 173507572 175160089 176335764
4050 176335764 176745514 176340493 175441612 174268251 173175614 172297947 171179154 169502197 166989556
4041 166989556 163870799 160604346 157435130 154010858 149946984 145212163 140106494 135175360
4033 135175360 130793576 127299328 124718286 122815099 121630516 120961882 120398482 120045895
4025 120045895 119743021 119339767 118763180 117832217 116513153 114767691 112692358 110358416 107975577
4016 107975577 105794413 103947316 102568455 101498677 100703862 99815140 98487398 96372484
4008 96372484 93336923 89589390 85629333 81969119 78913733 76548721 74633462 72907809
4000 72907809 71421879 69932939 68424526 66825110 65089162 63391323 61907529 60685715
3992 60685715 59533178 58584978 57743730 56975568 56196541 55444626 54565590 53587117 52515539
3983 52515539 51206268 49644115 47927322 46045525 44254840 42515036 40922187 39571416
3975 39571416 38469540 37597327 36795425 36127196 35480025 34844136 34270025 33701015 33113580
3966 33113580 32525425 31895245 31204157 30372800 29431253 28520445 27623475 26828406 26149343
3957 26149343 25515739 25016951 24567063 24157434 23764998 23455915 23183213 22921589 22776659
3948 22776659 22704386 22618217 22567700 22442020 22251354 22011152 21872010 21772015 21616679 21487565
3938 21487565 21376916 21366209 21370888 21318158 21263545 21251768 21175684 21157358 21075785 20955967 20754912
3927 20754912 20627207 20525861 20446917 20383594 20232726 20086524 19995379 20011740 20019409 20019385 19919384
3916 19919384 19867803 19815279 19698096 19619813 19600774 19617984 19577208 19556335 19612591 19686587 19738508
3905 19738508 19826147 19853979 19938097 20017549 20146220 20365729 20585872 20827884 21074365 21223908
3895 21223908 21400929 21521431 21651403 21707651 21842435 22109212 22386928 22656991 23097112 23673884
3885 23673884 24147445 24617488 25088060 25398624 25710370 26131802 26592255 27044751 27670167
3876 27670167 28397556 29181741 29987115 30811677 31657162 32740694 34002324 35375186 36988323
3867 36988323 38712860 40528011 42367577 44266254 46031090 47877777 49846978 51715805
3859 51715805 53446166 54978156 56343578 57240417 57793527 58231302 58594071 58943775 59489842
3850 59489842 60350463 61392033 62533781 63704466 64997290 66423611 68026235 69813268
3842 69813268 71614779 73339915 74886220 76184122 77249048 78257363 79019980 79470992
3834 79470992 79737174 79758208 79654223 79378852 79217112 78948619 78564374 78179199 77892255 77677896
3824 77677896 77716960 77888996 78295628 78677657 78879825 78693499 78394835 77957945 77391461 76589936
3814 76589936 75610595 74275955 72615994 70947226 69383845 67744074 66187647 64624717
3806 64624717 63084097 61701173 60635461 59630853 58764390 57938472 57075138 56260051 55325520
3797 55325520 54388925 53704498 53124238 52817729 52666900 52716601 53019520 53427796 53983690 54524816
3787 54524816 55155490 55702648 56230638 56666267 57132497 57488204 57875453 58272263 58785297
3778 58785297 59367088 60063695 60930729 61942344 63097923 64265918 65374744 66429838 67051128
3769 67051128 67315700 67081510 66539405 65728377 64877113 64240495 63878272 63835439 64050049 64459065
3759 64459065 64996888 65381835 65477599 65224286 64723293 63841172 62578777 61005377 59270971
3750 59270971 57505651 55816502 54269248 52808622 51621489 50728134 50058727 49814284 49826202
3741 49826202 49924694 49997290 50130523 50184925 50169635 50181314 50296972 50526188 51004715 51696094
3731 51696094 52448110 53287456 53994984 54563035 54972118 55178152 55035491 54733910 54497397
3722 54497397 54386979 54613658 54983920 55464089 55880567 56150661 56191715 55968506 55706517 55316158
3712 55316158 54776530 54220639 53581269 52890637 52058592 51293540 50409565 49440441 48611824
3703 48611824 47914075 47452013 47252406 47276319 47574123 48100415 48710030 49286404 49727159 50067148
3693 50067148 50426851 51064194 51861983 52800035 53677343 54397935 55166939 56061244 57147955
3684 57147955 58556926 60185853 61817890 63191508 64348221 65175012 65651035 65859515 65873825
3675 65873825 65895027 66092915 66455812 66803215 67055014 67080691 66755518 66272733 65578353 64715603
3665 64715603 63571957 62257890 61037075 59887863 58880519 58127567 57526560 57104939 56920926
3656 56920926 56856930 56511397 55796543 54794574 53792665 52916952 52275535 52047231 52364338
3647 52364338 53050347 54004142 55103622 56165594 57064045 57927604 59132867 60836507 62873235
3638 62873235 65046114 66854271 67952503 68496278 68691896 68892128 69374386 70108811 70960994
3629 70960994 71464101 71213011 70195822 68861666 67523532 66171620 64879289 63612941
3621 63612941 62489103 61606953 60885014 60503843 60643182 61314900 62453571 63830445 64972552
3612 64972552 65169906 63907121 61513654 58861758 56446719 54574140 53325114 52651852
3604 52651852 52523413 53166682 54364198 55643885 56245480 55647720 54049423 52041408 50349892
3595 50349892 49195527 48408431 47994972 48005875 48335700 49093958 50252388 51617113 53234328
3586 53234328 55217451 57438215 59816467 62030054 63585584 64225967 64111137 63722399 63700569
3577 63700569 64543052 65813201 66896925 67300792 66642825 65477609 64152211 63002221 62104454
3568 62104454 61277637 60404050 59536869 58918930 58439669 57950598 57376557 57049573 57030253 57270557
3558 57270557 57224203 56297799 54401119 52108835 50213396 48952187 48332518 48126135 48269211
3549 48269211 48619164 48994428 49434497 49873595 50350669 51007625 51998093 53357981 54801096
3540 54801096 56138147 56925227 56989772 56575114 56080299 55484495 54923267 54536676 54296003
3531 54296003 54408209 54767269 55283643 55770747 56174520 56592504 57103508 57466019 57382564 56820271
3521 56820271 56111665 55641494 55643489 56103992 57067557 58311034 59760105 61505581 63477936
3512 63477936 65346955 66876645 67569171 67172055 65614747 63385422 61044576 58830725
3504 58830725 56998857 55441609 53953218 52616587 51157608 49598356 47754675 45845453
3496 45845453 43989094 42415997 41208003 40419891 39894932 39611024 39596837 39858039 40238937
3487 40238937 40585810 40912750 40946787 40613826 40140208 39653847 39315746 39196556 39197622 39473101
3477 39473101 39770656 40103072 40348731 40596939 40648229 40485433 40069890 39492768 38758124 37912019
3467 37912019 37079331 36616692 36361280 36181271 36158726 36173988 36003800 35563265 34882481 34095084
3457 34095084 33202967 32273520 31500211 30868660 30586987 30422302 30454825 30713625 31006653 31382602
3447 31382602 31678436 31819321 31828187 31597057 31174323 30647911 30103971 29724174 29463443 29330790
3437 29330790 29260182 29215241 29078757 28814606 28415934 28070770 27745842 27374096 27021298 26811593
3427 26811593 26572573 26475427 26546514 26647305 26883100 27263500 27526677 27851706 28177550 28456451
3417 28456451 28711282 28915967 29195979 29608256 30111715 30720917 31485758 32271738 33089685
3408 33089685 33897231 34751175 35756778 37170074 39123120 41661816 44831472 48408947
3400 48408947 51623697 53787133 54826319 54797245 54395972 54255981 54403346 54636638 55236055
3391 55236055 56540211 58850570 61988733 65210783 67510154 68365377 67994246 67283229 67188905
3382 67188905 67863394 69015315 69508481 68570826 65968167 62297724 58334272 54782272 52058799
3373 52058799 49993742 48571461 47777286 47426142 47403258 47841906 48593069 49776430 51438571
3364 51438571 53326867 55731379 58545874 61410314 63978095 66248943 68172174 70018467
3356 70018467 72061400 74523879 77333272 80124310 82450539 84298981 85742144 86962986
3348 86962986 88532616 91031597 94884277 99907901 105502111 110983742 115419451 118970954
3340 118970954 122426162 127031596 133816773 143637130 156990679 172672712 188152209 199618646
3332 199618646 203128503 196950803 183129771 165552817 148001400 132619140 120167972
3325 120167972 110576677 103636952 98938559 96138176 94874008 94820774 96099774 98332708
3317 98332708 101491312 105208992 109444401 114340084 120011896 126618919 133859965 141364237
3309 141364237 148725055 155905742 163572393 172980852 185275830 200264705 215688577 227393850
3301 227393850 231450453 226791032 216000887 203370420 191971765 183122376 176796688 172328411
3293 172328411 168586189 164536070 159767436 154941067 151449661 150271866 151209143 153736053
3285 153736053 157099702 160413329 163261689 164895492 164147251 160344378 153872831 145885363
3277 145885363 137782439 130592727 124928606 121090691 119151593 118696934 119417365 121135289
3269 121135289 123863920 127648775 132828664 139759356 148720517 159747266 172681180 187249958
3261 187249958 203182545 220702059 239847579 260331613 280411307 297504783 310141985
3254 310141985 318746291 325253977 331111696 336251847 340524118 345770886 355802072 373268086
3246 373268086 395875860 414372744 418005960 401096978 367011940 324776857 283339348
3239 283339348 248198589 220987690 201381193 188318957 180650273 177394417 177435938 179251290
3231 179251290 181013797 180769991 176926956 169365914 159351043 148529466 138575298 130247740
3223 130247740 123608484 118561163 114818854 112517970 111675579 112156506 113897456 116707146
3215 116707146 120388572 125103038 131093452 139071072 150297623 166313579 188883893 219239380
3207 219239380 256769809 297619734 333935533 356484769 359582387 344068607 316140722
3200 316140722 282506205 248291761 216378259 188042929 163941265 144204865 128482920
3193 128482920 116155940 106403737 98619301 92263981 86920046 82270481 78271395 74722783
3185 74722783 71348125 67895402 64549923 61490355 58826999 56613988 54971194 53789978
3177 53789978 53079902 52860696 53055543 53522736 54421591 55727632 57304918 59081702 61240780
3168 61240780 64140737 68085536 73139749 79167897 85787002 91871953 96306217 98375229
3160 98375229 97908429 94771146 89441204 82467636 74907291 67872994 61843558 57128227
3152 57128227 53479781 50652424 48268677 46192859 44442494 43030569 42096022 41494889
3144 41494889 41223261 41095831 41153020 41394103 41785594 42517484 43504948 44900786 46939087
3135 46939087 49596309 53227249 58025952 63939227 70925108 78517276 85873265 91619297
3127 91619297 94365203 93516421 89285914 82784387 75502784 68624289 62809274 58379521
3119 58379521 55424994 53612043 52921074 53058646 53780975 55332036 57380068 60182051 63908948
3110 63908948 68725983 74964880 82915259 92813984 104708934 117837446 130749850 141250100
3102 141250100 147128817 147193365 141931076 132999639 122560779 112633688 104678224 99331175
3094 99331175 96788520 97198004 100420783 106319413 114653136 124459683 134051732 141114501
3086 141114501 143425049 140072072 131477051 119471131 106170098 93316284 81947133
3079 81947133 72468215 64774937 58582512 53669817 49433235 45721089 42440038 39443198
3071 39443198 36900189 34654852 32787434 31314841 30074592 29011367 28145655 27292302
3063 27292302 26587989 26052770 25598380 25240480 25015125 24949508 25010667 25193345 25537784 26007548
3053 26007548 26667172 27336714 27996911 28758220 29446648 30338863 31413867 32742286 34402451
3044 34402451 36430040 38811455 41604495 44925430 48767971 53162706 58084703 64067544
3036 64067544 71406721 80526538 92282501 107778544 128168314 153715363 183187089
3029 183187089 212789180 236627251 249174656 247032360 230969593 204977961 174513418
3022 174513418 144451874 117806292 95872525 78555381 65146893 54637880 46419591
3015 46419591 39873375 34683281 30593898 27220191 24517663 22197009 20280273 18771921
3007 18771921 17495167 16274617 15179717 14189953 13324667 12615446 11868246 11190124 10720578
2998 10720578 10221690 9670314 9119346 8723943 8427324 8165371 7811218 7434899 7067849
2989 7067849 6719948 6440352 6144927 5889988 5652754 5437002 5197635 4978632 4845694 4758515
2979 4758515 4639965 4497470 4360534 4287999 4185906 4128075 4093055 4096466 4040563 4023176 3998351
2968 3998351 3922666 3874655 3823716 3789143 3746930 3712400 3633967 3517819 3312296 3094224 2839541
2957 2839541 2545041 2273711 2138878 2000340 1810987 1801996 1768858 1745054 1653527 1649342 1497428
2946 1497428 1468932 1381444 1359610 1327854 1153892 1070903 1041977 968299 989242 1042897 1018506
2935 1018506 1021454 1015125 920421 867023 884928 848493 819973 920843 1030354 1072426 1142258
2924 1142258 1265568 1403790 1584762 1785148 1937201 1994594 1873271 1638017 1410792 1248777
2914 1248777 951369 762076 670997 567415 432762 318550 325688 271254 170799 153693
2904 153693 130032 28994 30884 7957 -129645 -136602 -157899 -207433 -196119 -164460 -215014 -249478
2892 -249478 -296297 -269351 -283121 -260128 -190151 -171788 -172065 -206916 -257981 -211268 -217237 -142523
2880 -142523 -109775 -77133 -103180 -140675 -149269 -95071 -114731 -164647 -142955 -244304 -256804 -288454
2868 -288454 -309603 -329978 -400394 -400870 -485356 -447884 -485420 -486981 -510228 -551212 -527192 -504013
2856 -504013 -463933 -400936 -427380 -450298 -393709 -381178 -320970 -374319 -351166 -336479 -305763 -273635
2844 -273635 -211574 -248977 -322597 -330109 -364061 -348689 -403399 -514130 -597521 -540452 -455860 -506903
2832 -506903 -494767 -526060 -506649 -538895 -584354 -585691 -491979 -463192 -436666 -424511 -368755 -297396
2820 -297396 -261050 -215269 -144600 -189364 -282256 -328961 -314718 -378310 -412513 -393620 -464301 -407879
2808 -407879 -415261 -383338 -336754 -325199 -410351 -431350 -376311 -361741 -389311 -430166 -474420 -520010
2796 -520010 -520311 -526926 -584879 -669532 -697733 -720404 -715616 -762435 -784899 -834186 -829636 -840258 -849657
2783 -849657 -896254 -886468 -868132 -938157 -960974 -942624 -936906 -963376 -944602 -1050575 -1081148 -1082104
2771 -1082104 -1019309 -990005 -1038369 -1043368 -1022583 -1074017 -1111334 -1102759 -1046387 -1015408 -982739 -929957
2759 -929957 -904007 -885212 -911070 -929400 -913892 -971613 -936952 -831577 -769036 -640351 -585220
2748 -585220 -524713 -399652 -247508 -126911 -385 97729 94102 87584 3025 -151804 -309394
2737 -309394 -415247 -561964 -656222 -751707 -787540 -807782 -883126 -849806 -847631 -785723 -830113
2726 -830113 -858825 -878756 -911476 -936231 -969732 -964289 -977194 -921131 -935952 -966965 -951209 -957089
2714 -957089 -917969 -952073 -1019043 -996717 -1029557 -1041765 -1022832 -1067392 -1123222 -1042009 -1049824 -1028917
2702 -1028917 -1032263 -1069437 -1064788 -1064669 -1056367 -1115928 -1080848 -1047912 -1012508 -1034359 -1107714 -1061726
2690 -1061726 -1102526 -1119419 -1066990 -1160989 -1130558 -1101541 -1086538 -1067763 -1109022 -1070312 -954386
2679 -954386 -976270 -988416 -952646 -962462 -975736 -929503 -902459 -918781 -888198 -935258 -972720 -907762
2667 -907762 -850402 -879002 -891557 -809497 -851944 -828868 -783693 -784670 -688880 -772844 -813198 -804485
2655 -804485 -841112 -827137 -853648 -852629 -931361 -928585 -856863 -858981 -867428 -863427 -890175 -822452 -740254
2642 -740254 -694657 -630667 -710066 -691327 -718166 -708798 -722148 -705588 -819371 -838167 -847792 -859925
2630 -859925 -871872 -884352 -876381 -926441 -814900 -782852 -855978 -894512 -872300 -892029 -938025 -993929
2618 -993929 -946953 -896350 -889352 -910705 -887160 -794507 -818127 -846996 -851502 -899412 -894910 -934852
2606 -934852 -902888 -949119 -958477 -926675 -944603 -897607 -884890 -922969 -898667 -884725 -906266 -946823
2594 -946823 -989379 -941036 -920252 -917346 -916534 -975423 -907382 -896045 -914234 -917515 -907787 -930960 -992073
2581 -992073 -986613 -942363 -1029716 -1012711 -940453 -933817 -909841 -907193 -954934 -933467 -966554 -978950
2569 -978950 -934235 -963096 -1016400 -951602 -898677 -862860 -846018 -889687 -958856 -1016108 -967185 -922757
2557 -922757 -908708 -951589 -908118 -900846 -928607 -917658 -910935 -896701 -838701 -798746 -850233 -904209
2545 -904209 -852543 -911483 -894065 -918263 -958550 -895753 -816343 -873093 -888920 -897380 -822260 -871475
2533 -871475 -938318 -850619 -772872 -781841 -757654 -770543 -744076 -810466 -825996 -806863 -836622 -745381
2521 -745381 -749470 -819701 -782740 -782367 -729689 -711771 -772561 -817629 -813979 -695504 -709654 -753876
2509 -753876 -690141 -678740 -737368 -768741 -825467 -759303 -704565 -732089 -729430 -674946 -713389 -753234
2497 -753234 -734613 -761084 -763207 -743461 -729931 -720570 -710789 -635838 -640745 -664109 -642400 -661782
2485 -661782 -708684 -739766 -633120 -631934 -731394 -735039 -732258 -666109 -663037 -588245 -585865 -635118
2473 -635118 -658742 -650289 -577321 -640490 -673378 -535355 -502700 -541013 -609364 -605326 -555638 -561956
2461 -561956 -522649 -463212 -444100 -455344 -468441 -477731 -407037 -411826 -443568 -485236 -506075 -452366
2449 -452366 -452810 -491522 -515722 -494261 -444310 -389521 -447585 -466881 -442520 -394926 -418840 -399776
2437 -399776 -402987 -381053 -335159 -316331 -306446 -339780 -272080 -254940 -236173 -213228 -241464 -327257
2425 -327257 -300205 -271248 -260020 -222152 -203803 -172745 -145651 -127799 -185213 -146337 -85474 -86506
2413 -86506 -91971 -62308 27619 16935 -79208 16706 96827 183406 188657 221026 292356 414941
2401 414941 480560 544757 599600 684156 766138 835297 943372 1077812 1355774 1684818 1971862
2390 1971862 2349419 2723592 2885483 3010277 3161404 3347674 3699316 4265657 5001381 6027334
2380 6027334 7457128 9446948 12384226 16890312 23653790 31429224 35108083 31676803
2372 31676803 24662403 18253277 13419740 10131768 7605927 5852289 4590262 3624303
2364 3624303 2938041 2436566 2112367 2024434 1994282 1926180 1781818 1449239 1167704 923096
2354 923096 780008 652480 612929 536763 473111 396240 340092 218912 111419 61857 -38749
2343 -38749 -116845 -116245 -31218 -73664 -35085 -5622 -101147 -203082 -132622 -163109 -187812 -165365
2331 -165365 -203590 -187218 -186801 -225754 -267195 -271448 -246463 -325040 -337126 -369949 -400260 -465060
2319 -465060 -462895 -557537 -521037 -427655 -461651 -457601 -481058 -545534 -574341 -472395 -440529 -437799
2307 -437799 -454034 -451623 -560613 -582711 -586425 -542489 -550138 -528979 -508136 -466367 -465068 -541659
2295 -541659 -548941 -550546 -530200 -481254 -499442 -510797 -476302 -612249 -637503 -608517 -596321 -560972
2283 -560972 -511364 -434839 -462540 -564888 -609965 -614389 -632258 -591158 -559396 -566849 -578396 -561714
2271 -561714 -594632 -547190 -586276 -617585 -577787 -653596 -652401 -611497 -655899 -697159 -704859 -603840
2259 -603840 -562415 -537330 -552960 -579664 -598127 -633268 -630669 -558568 -487682 -577408 -599921 -585990
2247 -585990 -607846 -617442 -677833 -621975 -584891 -627902 -640383 -635553 -670684 -698403 -610031 -596978
2235 -596978 -550564 -595030 -625417 -643947 -650015 -591842 -608324 -542481 -613258 -612724 -482788 -517146
2223 -517146 -513433 -558429 -534529 -500094 -521504 -511439 -561356 -577297 -628016 -612648 -649383 -541067
2211 -541067 -513679 -586176 -657461 -683136 -619344 -543009 -593447 -555592 -536209 -515192 -528748 -574524
2199 -574524 -585988 -607525 -575870 -595238 -641928 -628808 -563592 -550656 -483879 -510223 -531173 -555590
2187 -555590 -525177 -512225 -509992 -560687 -597761 -682527 -666970 -615489 -607659 -579184 -589985 -494850
2175 -494850 -550065 -559976 -559016 -600378 -590152 -550211 -524520 -550573 -583497 -532006 -547739 -646982
2163 -646982 -625033 -566766 -509235 -524708 -564100 -571951 -553719 -570551 -573272 -587227 -630498 -659957
2151 -659957 -637809 -619068 -561683 -566996 -596690 -583436 -543637 -473953 -483924 -559256 -582384 -521368
2139 -521368 -432878 -499625 -461531 -446236 -505819 -475705 -461297 -517663 -551487 -557548 -568775 -552105
2127 -552105 -459603 -476245 -478468 -506873 -516370 -462203 -451656 -480288 -511466 -471837 -504860 -519117
2115 -519117 -480417 -462587 -470204 -471454 -455086 -463371 -452225 -479657 -472274 -416890 -425789 -435865 -445109
2102 -445109 -461883 -503335 -567366 -598504 -502007 -431025 -506085 -502806 -479089 -530212 -522983 -529904
2090 -529904 -549270 -527713 -491796 -437620 -408687 -458543 -443819 -435706 -485639 -481872 -505128 -463103
2078 -463103 -376818 -447952 -499549 -587285 -610581 -539758 -490122 -521543 -498631 -474438 -557328 -555358
2066 -555358 -518948 -461318 -459187 -507564 -486760 -449501 -500794 -483628 -450398 -441643 -436153 -437320
2054 -437320 -499751 -534017 -518964 -488674 -537589 -516427 -487848 -502581 -460852 -445615 -428225 -481225
2042 -481225 -440287 -466254 -546571 -490676 -431486 -452571 -454201 -520019 -502332 -479109 -469946 -505811
2030 -505811 -481213 -387544 -385715 -402892 -426795 -475296 -417871 -424195 -449749 -460119 -419555 -407604
2018 -407604 -461465 -419212 -457250 -522665 -502391 -490518 -447395 -468495 -487991 -415941 -375187 -438550
2006 -438550 -431596 -458293 -519025 -429932 -408041 -417102 -424329 -481759 -556078 -489807 -417930 -439641
1994 -439641 -463151 -452553 -394701 -352551 -439577 -503132 -439740 -436557 -478526 -457346 -390444 -381355
1982 -381355 -365346 -338137 -343940 -353467 -453748 -497772 -450259 -388388 -418004 -379633 -359976 -479593
1970 -479593 -450992 -426280 -478774 -501094 -420922 -505573 -464958 -418282 -448094 -486044 -467852 -457586
1958 -457586 -418497 -393684 -424378 -436302 -476464 -380927 -422371 -461287 -428347 -418384 -392734 -338598
1946 -338598 -319993 -335587 -416452 -463689 -506969 -472428 -432403 -413481 -421889 -407386 -448921 -469788
1934 -469788 -517837 -505554 -430803 -407729 -482230 -457308 -414724 -443772 -439900 -462082 -406399 -341641
1922 -341641 -380888 -443950 -424491 -425641 -440152 -467676 -475106 -380664 -357361 -414605 -403897 -392723
1910 -392723 -376580 -387450 -436087 -355136 -325993 -387721 -409543 -364271 -359354 -354823 -328596 -338636
1898 -338636 -376183 -354449 -391289 -424706 -392342 -382327 -360608 -402634 -373527 -378650 -332139 -336368
1886 -336368 -341466 -355400 -443524 -384188 -348120 -383958 -343836 -365953 -355658 -383790 -370513 -327672
1874 -327672 -389015 -410820 -405367 -347242 -361696 -416086 -394264 -338004 -390605 -370376 -399211 -356236
1862 -356236 -363419 -393780 -445134 -525183 -455148 -404297 -398663 -366339 -380826 -436457 -437463 -444472
1850 -444472 -445338 -391849 -380403 -328557 -226575 -301177 -392594 -427830 -382420 -378769 -403290 -461813
1838 -461813 -413306 -336992 -318179 -313041 -313565 -325703 -346771 -292701 -296706 -293330 -244216 -249233 -294968
1825 -294968 -284338 -310534 -383403 -339605 -278359 -308740 -340597 -323833 -315802 -268723 -317297 -309413
1813 -309413 -325625 -310301 -284137 -311790 -306866 -313420 -338113 -366577 -368928 -405940 -362112 -357431
1801 -357431 -362450 -319890 -389743 -437740 -426427 -388636 -384030 -406112 -397029 -452928 -342775 -327280
1789 -327280 -342258 -345392 -369624 -364731 -379767 -312096 -325845 -347023 -362965 -305573 -269939 -270548
1777 -270548 -291635 -308913 -299278 -256570 -283613 -286934 -298877 -259910 -265838 -239570 -260190 -307480
1765 -307480 -359375 -404572 -343520 -309180 -290291 -285978 -313075 -297081 -313957 -294617 -300743 -300585
1753 -300585 -370863 -298024 -280597 -278502 -297136 -299457 -211670 -258916 -279901 -339641 -301381 -289113
1741 -289113 -322598 -303631 -304202 -289342 -251538 -292866 -288580 -269689 -226917 -261462 -227382 -272012
1729 -272012 -272855 -235131 -270382 -282403 -276552 -213594 -163865 -214905 -196473 -209803 -227700 -227416 -267330
1716 -267330 -298345 -243741 -236619 -250257 -296155 -281159 -251902 -247979 -293616 -288311 -278178 -272914
1704 -272914 -273257 -266615 -290900 -259339 -192348 -218101 -241828 -286865 -299005 -280491 -292257 -303747
1692 -303747 -268975 -256294 -296536 -303422 -237572 -225493 -261270 -271521 -210296 -254730 -223786 -237841
1680 -237841 -267722 -226040 -284757 -235178 -200480 -193400 -268113 -241500 -191869 -202853 -283709 -239108
1668 -239108 -242837 -194746 -186454 -280099 -242608 -316026 -308510 -276954 -252878 -252534 -270572 -221415 -181580
1655 -181580 -199455 -270763 -236512 -204818 -188357 -223178 -212708 -219842 -283442 -298543 -320742 -264328
1643 -264328 -239583 -132939 -138700 -132983 -166989 -267179 -268213 -197903 -220434 -203669 -185488 -160682
1631 -160682 -193353 -181143 -241417 -207362 -200289 -264658 -227823 -265374 -258810 -212713 -228403 -254779
1619 -254779 -300557 -298291 -214335 -229280 -223347 -204381 -193603 -179366 -216246 -260749 -344878 -361064
1607 -361064 -262848 -185599 -205645 -221243 -168786 -124681 -207481 -209884 -221654 -235592 -232178 -167687
1595 -167687 -215543 -221170 -257092 -232888 -220707 -202853 -138351 -203259 -215770 -190778 -210232 -184844
1583 -184844 -182678 -160275 -134271 -199324 -235139 -238589 -154659 -127045 -160378 -182202 -145423 -197561
1571 -197561 -229117 -206393 -124826 -161275 -205487 -163938 -153287 -179740 -163134 -205084 -258609 -237290
1559 -237290 -196540 -232961 -236093 -237773 -263602 -275094 -178505 -137471 -219033 -211542 -186315 -299734
1547 -299734 -276102 -239276 -138315 -122266 -132724 -165756 -175797 -154239 -116054 -168023 -237174
1536 -237174 -212222 -186812 -99714 -171643 -202527 -112342 -191256 -208707 -132718 -150318 -205044 -219757
1524 -219757 -169020 -137036 -145211 -137645 -142696 -177633 -126417 -65915 -74162 -70279 -81744 -132031 -163113
1511 -163113 -139567 -166995 -160523 -201548 -219463 -177095 -170955 -120112 -84998 -46833 -112751 -135157
1499 -135157 -170985 -166823 -148365 -182710 -143582 -151206 -220003 -186619 -195370 -155664 -116922 -112327
1487 -112327 -128058 -86847 -166537 -194447 -168107 -62391 -69050 -160845 -167052 -65035 -135388 -179390
1475 -179390 -126342 -184478 -165628 -138662 -131502 -198632 -126586 -67406 -134772 -100654 -84012 -181766
1463 -181766 -170527 -178208 -212823 -183889 -89351 -122022 -141537 -177028 -229583 -168742 -106909 -102604
1451 -102604 -159426 -162458 -184000 -189892 -161016 -127057 -161253 -224168 -202300 -131851 -137167 -116821
1439 -116821 -72269 -142703 -227322 -163283 -196546 -144297 -116331 -177636 -169484 -201282 -156512 -114654
1427 -114654 -122027 -100381 -91897 -142256 -141305 -190577 -149144 -171264 -170071 -178615 -196600 -261067 -258143
1414 -258143 -235673 -218118 -154659 -131207 -88961 -122815 -129386 -134565 -134608 -66248 -13871 -50615 -59759
1401 -59759 -67113 -96877 -137934 -176137 -147903 -122769 -126314 -103640 -71466 -55515 -125100 -154469
1389 -154469 -131483 -84624 -108180 -168762 -189316 -170968 -101357 -60645 -69890 -59245 -77982 -133155
1377 -133155 -88614 -126938 -146784 -123854 -77819 -72456 -96847 -91207 -101198 -112144 -125033 -137537
1365 -137537 -147199 -138102 -163448 -174779 -139884 -79840 -106060 -138925 -104740 -78541 -103271 -115360
1353 -115360 -71487 -127974 -133610 -84687 -130522 -156752 -182866 -152124 -99323 -141883 -175595 -180201
1341 -180201 -84803 -107478 -143994 -146889 -105677 -61108 -10284 -100767 -115654 -121640 -163696 -152318
1329 -152318 -117506 -57891 -86638 -105990 -170590 -236190 -177729 -68889 -57441 -91578 -141731
1318 -141731 -100350 -87253 -44435 -7127 -75601 -140833 -182086 -114118 -90644 -83634 -66988 -140976
1306 -140976 -35143 -12171 -82883 -64165 -67761 -113189 -100484 -117597 -81580 -46371 -32812 -44912
1294 -44912 -107305 -55504 -50426 -47743 -22505 -43911 -48771 -28781 -6832 3399 4576 -78002 -85555
1281 -85555 -53082 -100324 -94504 -75727 -98113 -127455 -162396 -113561 -88471 -126170 -190475 -119366
1269 -119366 -127569 -92886 -122569 -88223 -86866 -126492 -107956 -45286 -14142 18679 -15009 -16494
1257 -16494 2098 -88790 -77680 -45954 -1867 19506 -49422 -101425 -117421 -103432 -82489 -35124
1245 -35124 -36178 -113842 -88154 -96075 -74790 -109743 -95253 -50268 -86758 -144979 -104834 -28869
1233 -28869 -12052 23349 18260 -56928 -39451 -64991 -33665 7908 -50790 -70375 -72111 -126671
1221 -126671 -135067 -140065 -73950 -91596 -104989 -96928 -132971 -70705 -6810 37134 -8110 -93081
1209 -93081 -75577 -88281 -87341 -82318 -58075 -34345 -58366 -47500 -78637 -72493 -107151 -89274 32310
1196 32310 47729 24747 -24989 -35124 -54108 -51160 -104229 -55223 -15862 3842 -8045 -44448
1184 -44448 11985 -4199 -10865 -4481 -39282 -102881 -109146 -157568 -110423 -80411 -41426 -30660
1172 -30660 -100109 -123088 -138281 -87257 -105249 -93242 -84160 -74904 -49883 -47602 -22626 -6724
1160 -6724 -123595 -124287 -110109 -106622 -93406 -135026 -132062 -86977 -36540 -28170 -5052 7277 -29443
1147 -29443 -18341 -23298 -64480 -87064 -51126 -81424 2125 -34904 -58177 35255 68357 -20091
1135 -20091 -98823 -50446 -76316 -55816 -95224 -11945 -21237 -42678 -47954 -70699 -62267 -34121
1123 -34121 -11217 17123 -20598 -24327 -80136 -21301 -33789 -84807 -3494 35482 -35743 -20918
1111 -20918 -44100 -45960 -49024 -83104 -12569 -67617 -61389 -57299 -14905 19352 -59171 -73797 -128886
1098 -128886 -81243 -40552 30660 -10142 -61234 -117661 -135198 -65492 -40797 14077 -70746 -20395
1086 -20395 3990 -42736 -72111 -73247 -118369 -88557 -14613 -49984 -72739 -14364 -62375 -58458
1074 -58458 -16793 -20938 -93346 -37001 24861 -34482 -42941 -107742 -92095 -98195 -6386 -6167 4823
1061 4823 51472 65829 61201 31097 -26536 32756 48152 -77844 -144930 -48682 -34767 -4748
1049 -4748 3926 -37510 7910 45344 3939 -20361 58569 37781 -13089 14750 17449 -18935
1037 -18935 11802 -60595 -26685 37863 59684 20880 78860 63634 -25101 -16088 15110 -32178
1025 -32178 2586 31086 30941 64603 106535 21354 37348 28980 11068 -2157 13316 -22165
1013 -22165 -60289 518 -47345 -66640 -81113 -16302 -32403 -60081 -70972 -119526 -70841 15397
1001 15397 -19938 -5262 -65239 -10650 8098 -59217 -47416 -38707 -60221 1827 16403 -11762
989 -11762 -7039 -33211 -1894 9224 6827 -46696 -96718 6735 69364 47023 -27316 -35472
977 -35472 -21748 -62218 34838 40942 77356 17452 -23781 68952 40649 2162 -34157 -68486
965 -68486 -67126 -40714 -27281 -2962 19060 51989 35409 11656 24940 9406 12395 -15763
953 -15763 -50442 -80863 -30069 13859 7764 45945 -30117 -94494 -54676 -13134 44189 56345
941 56345 44665 12675 1381 19191 9890 24178 26771 43094 57732 12509 -24787 -4326
929 -4326 129214 59665 38984 9750 -68258 -78852 24847 28908 8014 -6650 -59257 18555
917 18555 19461 -25453 1082 1345 -21748 -64146 -61058 -70145 -83945 -20599 -40313 9621 5732
904 5732 -58609 -68816 -34602 -467 2097 29067 29372 48276 4604 -13906 32659 6909 51462
891 51462 117626 83361 58972 70172 126016 33648 3505 2642 18589 38090 20043 57481
879 57481 47171 26320 -21247 46541 74402 65883 9697 -28415 -13428 94557 41398 39955
867 39955 29700 7954 -17689 19898 -1086 4445 -8248 -33596 -48735 12348 73653 6510
855 6510 -21606 14461 -50173 -28032 10513 49536 59255 3026 17697 61982 45366 13077
843 13077 140441 128441 83787 62146 91312 193762 191940 165030 25359 31987 26119 28332
831 28332 69120 -37067 -475 -1093 47556 79944 30830 -21134 14044 78379 49564 -14033
819 -14033 -93487 -95976 1961 -14441 -28329 72448 107383 19159 -434 -30439 -4172 5916
807 5916 53652 50876 78737 161301 103958 62927 -29959 15336 63835 45484 76972 92152
795 92152 114602 62465 65227 15733 31610 63747 50015 91830 20902 15701 30342 18587
783 18587 36080 17657 18663 36570 43097 69772 1220 -50530 -39674 -29131 62552 43307
771 43307 83896 72563 1454 -27741 32762 21157 22082 23851 -27717 -45924 -53673 6163 40543
758 40543 81270 92409 38307 82345 156280 131980 58977 -2669 1151 52022 31498 6210
746 6210 -47225 -20627 4961 41220 60431 68174 26783 12683 79663 114973 126846 90872
734 90872 88417 70904 93141 104829 91399 52342 12840 9611 38625 57988 40913 18482
722 18482 66309 53680 46963 -55490 1330 42799 -2074 -15150 23379 122163 86187 104109
710 104109 50385 28379 36302 63331 83564 123356 103303 66069 46476 14305 -8461 -66062
698 -66062 31691 51143 21103 70064 49721 16474 104464 39254 -2745 32961 35674 41974
686 41974 17756 34086 24230 -41974 1189 47780 72931 57684 31498 62685 -17185 -69791
674 -69791 -14416 64054 20701 17578 12395 5821 -21290 676 83611 85851 65618 67258 89260
661 89260 50315 30853 34456 58282 -3431 67546 98149 31130 25070 10609 37011 47018
649 47018 74952 77982 52831 15266 58380 87506 66918 89374 96194 126704 68508 -29654
637 -29654 15011 75076 104038 94196 103503 36593 10184 26425 -19414 7364 30054 75440
625 75440 92915 101425 75649 53338 34932 -6919 -8511 -94298 -85052 17305 20586 134890
613 134890 129052 78398 61482 65578 46431 64055 97380 109686 58307 63703 125063 120700 66503
600 66503 70746 57930 9508 -5528 15919 34816 72254 102768 95908 53287 47430 57880 70814
587 70814 79037 32363 45793 62913 65649 62055 80674 44718 -16210 -22874 10836 -10448 -38080
574 -38080 -24192 33764 47925 65603 22172 51974 81496 8300 -57798 5465 75183 53741
562 53741 39084 -19403 -74254 7200 -11460 21948 57244 50590 22886 21647 -20862 54488
550 54488 132568 59895 33707 30013 49318 112144 70998 79625 63148 -2483 34030 11231
538 11231 -8035 -29651 -46071 -53276 -45240 114 39310 21951 1882 23940 59478 77187
526 77187 60563 79204 45538 29427 40131 7418 -38682 -25644 -3134 -6743 -16350 -7341 3958
513 3958 18088 71435 33966 22335 68413 123025 88889 97087 93467 58802 28728 68038 63325
500 63325 15400 32654 1579 53092 71407 -19070 24458 28253 12552 42802 37213 16031
488 16031 45836 56241 29721 61098 53932 75542 87459 56109 78423 72058 31873 -3014
476 -3014 15422 74874 90755 54205 83864 98567 77091 12777 30189 89405 78105 68879
464 68879 83128 110465 29533 127016 119469 5712 14367 61384 111602 11312 13619 -4238
452 -4238 38146 19730 56951 100380 137316 106549 66877 51953 -29362 -10813 23365 -1640
440 -1640 -25633 5676 2187 18326 -15147 18875 45695 35469 -19390 -41212 -57213 5825
428 5825 -3927 1559 14237 -11639 -16314 23014 39401 -2361 -7106 21935 33176 55289 39098
415 39098 -3473 37815 48221 -4641 27963 40227 57135 60800 8399 39152 35910 16033
403 16033 28927 -30147 -29247 18919 23538 38209 -11847 -16369 -32881 24699 89414 47668 75380
390 75380 43684 5298 14938 12385 47408 -35257 -27799 -57529 -66755 -39592 -13477 -23913 12345
377 12345 36938 5809 -43214 -27206 44455 27973 -3997 4116 -34336 -30904 24578 17305 -35609
364 -35609 41564 67150 64961 39399 -14005 26721 136921 51734 -39417 -49509 12744 108845
352 108845 94355 55703 93709 81866 -740 32209 -63749 3237 -21116 -60939 -37341 -3277
340 -3277 -2282 9114 46551 71417 62326 73720 43447 26109 8502 31552 -9834 -65556 -73763
327 -73763 -12899 55104 56546 10324 49131 73908 17219 14385 -30697 19564 -55682 -75064
315 -75064 -21940 -40078 8766 -5076 30258 42979 36962 22679 34568 16067 -15015 15854
303 15854 56089 23051 -8137 66355 45983 -56555 -65659 -59915 -112175 -70204 -36701 63783
291 63783 92223 78243 61802 72275 110578 147832 66203 60517 63078 7675 44946 45586 51281
278 51281 42526 25718 -14669 -27983 -8375 -2012 -19098 -5534 76372 81259 2051 7099 63650
265 63650 72982 24312 25407 69403 51890 -10670 59490 7076 29317 90683 26677 40590
253 40590 33937 -6079 -33316 -7377 -5082 -16567 -99747 -99313 -37619 -70196 -79863 -121587 -20774
240 -20774 53684 22133 -46165 -19010 72849 55624 44262 22437 -56885 -36558 28739 9994
228 9994 -59192 -24647 -24966 -49681 -1279 58331 71207 47066 9862 -49319 2309 -4993 -5472
215 -5472 68927 39132 6767 -12284 -54829 9992 73905 83933 14163 54669 27091 -10885
203 -10885 -56121 -54624 -40291 -52940 -2371 4780 16221 43704 -39587 -45684 -13465 -38970 -19743
190 -19743 56578 41390 -15074 -37731 -54715 -4199 8483 17646 48247 64371 53441 18315
178 18315 -4424 9821 -17911 -23582 -20281 -11302 50115 50187 47801 28441 75866 122924 64432
165 64432 61424 83950 65220 34011 29207 18249 21002 -7007 8226 40634 -18885 11358 5569
152 5569 -44819 -22529 19236 -1815 -57109 -361 72996 77000 70937 52456 68668 41644 -21030
139 -21030 -41736 809 10760 33019 56500 -9683 -33722 42387 11794 -29789 10969 30267
127 30267 66073 21844 44646 62384 22713 20309 12591 24757 81149 89889 49821 37958 2779
114 2779 38035 22545 51828 82652 131896 121740 45665 73862 52377 91060 37879 22743
102 22743 90268 87776 42106 62377 106391 107108 108086 101176 58767 43897 42657 69840 68201 37368
88 37368 26330 12382 8622 -29423 -4020 38106 51090 81074 74396 101696 86489 124023 101601
75 101601 67682 52422 95148 68182 41816 62443 96400 49470 41822 100746 88212 11294
63 11294 599 61362 74293 86739 114401 65047 87246 79323 21092 19967 70055 93640 89199
50 89199 107168 131274 119131 110343 92958 60442 77754 53619 52533 84551 126920 123011 140422
37 140422 140999 128126 130115 132774 99968 150219 193433 132843 108074 119778 85145 99402 33429
24 33429 51561 68819 63819 99954 119854 117058 94352 72262 117519 141779 117192 116988 46383
11 46383 86673 102172 93337 117304 98776 89698 86734 119987 93896 99542 113764
0 113764
$$ Imaginary data points
##PAGE= N=2
##DATA TABLE= (X++(I..I)), XYDATA
16383 -4023395 -3948123 -3889518 -3872050 -3804409 -3775656 -3751163 -3722071 -3659324 -3593148 -3565810 -3495846
16372 -3495846 -3489725 -3466876 -3405008 -3359945 -3311318 -3229524 -3178190 -3157139 -3104804 -3068326 -3023008
16361 -3023008 -2972562 -2898481 -2805749 -2761610 -2685107 -2649137 -2661151 -2654236 -2642982 -2523701 -2457222
16350 -2457222 -2397177 -2359606 -2307200 -2280313 -2269495 -2205475 -2122677 -2048261 -2005757 -1973707 -1924488
16339 -1924488 -1883383 -1858378 -1769127 -1694298 -1731844 -1737024 -1686391 -1584318 -1564391 -1529475 -1458764
16328 -1458764 -1481522 -1411877 -1374700 -1331953 -1284632 -1273699 -1170570 -1180261 -1084350 -1024148 -1045977
16317 -1045977 -967537 -906650 -880093 -840388 -800271 -699077 -685898 -675755 -634132 -566439 -508012
16306 -508012 -498514 -390167 -350415 -336426 -286038 -281449 -237914 -217135 -219220 -167478 -131696 -80521
16294 -80521 -55702 5144 1110 -5723 81422 117953 179671 200956 224903 279067 325876 290845
16282 290845 309174 339740 368834 442685 479093 518835 564420 665092 704707 701258 663081
16271 663081 700748 708467 743073 841061 896186 980869 990776 1024603 1003090 1022456 1092028 1112213
16259 1112213 1175422 1230139 1198463 1186852 1247946 1319473 1357921 1346532 1346917 1351673 1403276 1444749
16247 1444749 1455449 1468386 1517144 1552453 1534027 1571902 1569765 1600535 1608506 1624255 1697477 1738464
16235 1738464 1801757 1827675 1872843 1932865 1965889 1983347 1951808 1910709 1944628 1985071 2001775
16224 2001775 1982548 2044837 2017633 2063576 2106355 2115556 2214052 2288135 2273746 2266208 2280627 2292017
16212 2292017 2337798 2342873 2321938 2323912 2304049 2311275 2394863 2411511 2439491 2505691 2521416 2593491
16200 2593491 2595129 2567476 2570923 2644202 2630677 2615094 2616843 2617079 2651577 2667869 2669129 2694436
16188 2694436 2722064 2724039 2727382 2693535 2695483 2720745 2708187 2694488 2786544 2867489 2880984 2899573
16176 2899573 2899810 2943312 2924744 2863289 2951573 2977289 2921696 2895893 2917088 2944222 2929002 2972084
16164 2972084 2988200 2989541 3026238 3068977 3121144 3085595 3080920 3105207 3142520 3175391 3169429 3187211
16152 3187211 3186257 3159046 3158857 3192812 3239439 3164851 3133953 3159341 3156257 3187403 3254630 3279127
16140 3279127 3272347 3223962 3230071 3313820 3350090 3308405 3252873 3222345 3213866 3242724 3279424 3243123
16128 3243123 3255260 3284450 3235894 3202783 3229275 3272618 3301934 3279146 3252129 3236813 3290416
16117 3290416 3377090 3338779 3334505 3357419 3297258 3308493 3376701 3386215 3376548 3430257 3444363 3484429
16105 3484429 3453615 3389297 3336267 3396847 3419909 3409182 3439456 3458238 3520248 3471083 3453855
16094 3453855 3497114 3460017 3437485 3443215 3443440 3481222 3489197 3504671 3470473 3536672 3504514 3482198
16082 3482198 3492060 3434463 3436768 3459090 3518114 3524317 3529512 3555796 3531993 3491012 3522091 3580696
16070 3580696 3527242 3528779 3623391 3613408 3576067 3566016 3481127 3497983 3532275 3513592 3494880 3520401
16058 3520401 3553332 3542331 3529461 3512626 3496180 3504301 3511920 3591957 3533142 3484642 3522113 3550563
16046 3550563 3596861 3568794 3610579 3571331 3534728 3562888 3595532 3579066 3574285 3574331 3584509 3576562
16034 3576562 3593029 3563205 3619738 3644435 3663945 3671650 3625968 3644862 3667570 3696726 3643257
16023 3643257 3642551 3591232 3586295 3553638 3497869 3535228 3506746 3519028 3624090 3604784 3580173 3650874
16011 3650874 3636223 3649770 3607949 3564357 3635583 3587355 3613215 3598761 3644714 3667071 3630214
16000 3630214 3640916 3674426 3678196 3691658 3703753 3701122 3676168 3569332 3617888 3552385 3545368 3617365
15988 3617365 3679106 3646979 3607809 3549463 3555542 3568126 3549672 3644927 3601111 3576131 3643421
15977 3643421 3665922 3657519 3612771 3650784 3704146 3659347 3607451 3617180 3628125 3596675 3603198 3671678
15965 3671678 3680097 3572878 3583500 3662649 3663577 3617958 3570859 3594065 3645773 3608401 3623206 3696560
15953 3696560 3700327 3635232 3647875 3668874 3627607 3567445 3616587 3631830 3575332 3631826 3651418
15942 3651418 3610705 3625455 3601156 3548306 3534687 3584324 3679023 3616295 3621839 3648276 3662054
15931 3662054 3643930 3630163 3678485 3664589 3627378 3606787 3654452 3656304 3628256 3642596 3657910
15920 3657910 3681662 3747048 3716428 3744935 3710110 3647620 3656727 3649234 3627237 3669301 3626578 3622555
15908 3622555 3661700 3628318 3582690 3642378 3703851 3679926 3695896 3676860 3680861 3636415 3648496
15897 3648496 3639762 3673626 3673005 3662493 3665004 3679308 3609660 3610198 3676468 3642223 3660827 3647671
15885 3647671 3713210 3738521 3665910 3605371 3665834 3636381 3655695 3685017 3652285 3612181 3527305
15874 3527305 3566913 3623638 3673471 3686745 3649558 3640815 3700056 3743081 3679186 3637216 3687636
15863 3687636 3659563 3676452 3674006 3693359 3669060 3640687 3620251 3648350 3689626 3649205 3642706 3675087
15851 3675087 3651256 3626459 3630530 3648586 3655694 3699090 3711428 3691835 3691935 3682121 3695514 3734021
15839 3734021 3740805 3771146 3784925 3729831 3711190 3692955 3723862 3739458 3714621 3585099 3669146
15828 3669146 3752640 3650571 3637713 3683028 3682602 3592982 3700732 3740232 3741220 3748938 3678673 3630052
15816 3630052 3621449 3597854 3648467 3772075 3728518 3689376 3742353 3668680 3652001 3739465 3763925
15805 3763925 3751304 3713533 3726641 3746969 3683407 3658501 3725134 3741999 3800175 3745339 3691835
15794 3691835 3701961 3732284 3758603 3735650 3707473 3705102 3664387 3659610 3735674 3726355 3655770 3684103
15782 3684103 3673893 3670306 3623468 3618733 3650652 3699054 3676805 3665384 3712479 3609344 3670380
15771 3670380 3715242 3702531 3726686 3718171 3757175 3750428 3759616 3737764 3771930 3795483 3783293 3797434
15759 3797434 3804564 3789256 3764215 3768350 3755649 3751396 3757131 3824541 3819731 3795423 3765440 3734106
15747 3734106 3794072 3830073 3787299 3770471 3767221 3725957 3781519 3765573 3713888 3720705 3695890 3729325
15735 3729325 3752911 3696173 3701246 3698901 3687027 3728203 3750076 3758709 3775071 3822695 3790900 3800196
15723 3800196 3817616 3827751 3797656 3723960 3706843 3691681 3683895 3707387 3751928 3808999 3783054
15712 3783054 3807939 3790223 3730068 3692046 3722417 3806203 3733691 3751320 3786644 3745726 3713813
15701 3713813 3701679 3747467 3745388 3710785 3743338 3698715 3704296 3735171 3731651 3759191 3744594 3734274
15689 3734274 3716173 3747639 3755268 3808613 3801970 3788140 3800206 3801895 3809332 3762201 3702220 3740655
15677 3740655 3781349 3788094 3772464 3694615 3719281 3758931 3776283 3812167 3778354 3732716 3687222
15666 3687222 3738585 3756575 3764220 3794406 3849706 3806255 3790606 3827043 3862491 3806303 3782254
15655 3782254 3833379 3876762 3869737 3837201 3808139 3774629 3845974 3865747 3822601 3773160 3814396
15644 3814396 3796975 3819551 3833727 3834185 3828397 3779115 3772423 3792776 3846151 3847342 3844269 3869075
15632 3869075 3873641 3838883 3783989 3865221 3879213 3875473 3854756 3820262 3843225 3918553 3842397 3770607
15620 3770607 3704920 3696134 3705550 3736322 3719612 3739430 3854501 3832102 3853116 3932217 3868296
15609 3868296 3877600 3872558 3814620 3818191 3776812 3833789 3916461 3861932 3828450 3841960 3807141 3831470
15597 3831470 3875434 3845035 3822497 3863125 3849487 3803062 3772132 3828198 3853442 3854082 3796484 3763510
15585 3763510 3802862 3819606 3869636 3856576 3874376 3838066 3859010 3879513 3811504 3756550 3829206
15574 3829206 3828440 3845853 3860937 3840111 3842591 3797421 3828348 3864740 3890266 3814791 3787588 3734129
15562 3734129 3777230 3806805 3854468 3908386 3846325 3869152 3845409 3832972 3881570 3814257 3843111
15551 3843111 3836785 3841063 3828475 3852737 3850060 3894136 3918777 3914766 3927033 3857091 3842254 3864070
15539 3864070 3855896 3840534 3817215 3791331 3761157 3793064 3794888 3784172 3759691 3781445 3818274 3774973
15527 3774973 3825961 3890229 3869521 3796614 3846942 3872560 3865618 3947511 3981950 3933352 3880359
15516 3880359 3911995 3943928 3977802 3955141 3914561 3917184 3935126 3907231 3945360 3867609 3866509 3903394
15504 3903394 3854014 3813028 3807752 3802705 3813687 3833637 3751097 3770447 3770222 3855009 3851239 3857551
15492 3857551 3901736 3851534 3836311 3834380 3848847 3923990 3867671 3839553 3900747 3921250 3961337
15481 3961337 3905373 3787050 3817543 3835264 3827474 3790138 3831944 3774499 3759142 3772167 3822565
15470 3822565 3842303 3807836 3810059 3844566 3863188 3900917 3873065 3852640 3876139 3844681 3803517
15459 3803517 3813447 3878330 3859454 3836935 3864255 3945242 3955258 3878811 3856107 3882165 3894061
15448 3894061 3927410 3882238 3859667 3834129 3845391 3889350 3871072 3783710 3861829 3873991 3872616
15437 3872616 3895354 3896087 3921452 3857667 3762186 3820645 3812424 3819338 3896448 3869908 3904606 3913939
15425 3913939 3879582 3894722 3921316 3891087 3919089 3948044 3906933 3926173 3985480 4024828 3979212
15414 3979212 3911414 3840516 3821926 3888623 3932644 3920485 3946475 3926744 3945281 3936728 3835601
15403 3835601 3874357 3862282 3952960 3957140 3967327 3976212 3882025 3838154 3912829 3940639 3994136 3952303
15391 3952303 3895784 3925875 3881876 3852409 3903937 3931435 3939257 3949306 3925892 3993777 4022642
15380 4022642 3959339 3966507 3982472 3900190 3915487 3938772 3925267 3953186 3950254 3999862 4021918 3954439
15368 3954439 3949753 3952398 3985513 3920939 3903225 3921013 3935010 3991261 3961931 3904437 3944262 3943046
15356 3943046 3963043 3996464 3972713 3940605 3873850 3901682 3966914 3995365 4036054 3998915 3978292
15345 3978292 4001086 3985170 3984926 3933635 3963920 3999926 3928734 3946524 3997394 4012446 3984738 3990868
15333 3990868 3972680 3934798 3930269 3911004 3931334 4015773 4009531 4012221 3995765 3968717 3922578 3926987
15321 3926987 3912979 3922692 3945157 3882689 3944249 3999034 4019166 3993100 4018372 4013968 3968308 4031017
15309 4031017 4032447 3931024 3986142 3977893 3911971 3993112 3994285 4048039 4039252 4030878 3994325 4012009
15297 4012009 3991152 3937187 3893137 3889646 3998860 4038849 4056406 3972679 4006953 3979347 3926367
15286 3926367 3907860 3936758 4001997 3975201 3991716 3992454 4011529 4011453 3929041 4036667 4023475 3962554
15274 3962554 4070967 4021500 3967081 3963863 4013039 4030687 3992967 3996883 3962525 3967433 3955364 3918631
15262 3918631 3949351 4003304 4019258 4014836 3941789 3954034 3991912 3991305 3960560 4007189 3985159 4008626
15250 4008626 3980469 3994301 3989267 3962516 3934275 3933726 4001653 3979655 3910260 3969278 4047587 4033573
15238 4033573 4062536 4034318 3991219 3965445 3977390 4040673 4038201 4006446 4071021 4005187 3999119 4045301
15226 4045301 4075180 4100829 4106756 4035451 4043439 3995349 4013675 3976647 3949751 3912761 3950024 4011976
15214 4011976 4041427 4032684 3927353 3992274 3983136 3939084 3983296 4012853 3995002 4001366 4098068 4111009
15202 4111009 4051614 3992537 3997028 4047659 4015329 4002714 4049557 4009362 4015066 4058802 4086568 4114051
15190 4114051 4012681 3974117 3953154 3970567 4008776 3964452 3984100 4007758 4017864 4021580 4036269
15179 4036269 4053178 4071616 4025028 3927308 3986638 4039113 3983070 3989250 4037888 3981748 3988999 3985566
15167 3985566 4037356 4055185 4050288 4038702 4024036 3989999 4004388 3972399 4081327 4124983 4070903
15156 4070903 4056196 4007711 4066830 4058579 4074398 4122131 4068171 4055048 4020330 4020786 4022296 4047190
15144 4047190 4113171 4079873 4055100 4078205 4090464 4005662 3998939 4053561 4079536 4075470 4043392 3995611
15132 3995611 4062388 4071024 4005585 4057387 4110657 4087190 4087004 4137961 4060114 4006941 4091612 4128762
15120 4128762 4119665 3983624 3977216 4030275 4058273 4140623 4149930 4072140 4064551 4126295 4132277 4077850
15108 4077850 4054338 4115697 4075045 4033491 4124159 4127594 4121929 4081426 4037674 4047492 4070124 4106790
15096 4106790 4087347 4051122 4070770 4061884 4051867 4125854 4173189 4135819 4110714 4171650 4174657 4118976
15084 4118976 4100572 4158269 4153026 4102364 4142723 4130432 4189538 4184838 4126470 4124971 4134322 4074986
15072 4074986 4090321 4174441 4155968 4086231 4109846 4100609 4138918 4117797 4098578 4097156 4108569 4146617
15060 4146617 4083936 4135818 4177912 4139860 4154253 4144872 4111882 4158362 4112125 4079716 4088722 4112774
15048 4112774 4147590 4200248 4127638 4118916 4099983 4140259 4113387 4106218 4180385 4092318 4108488 4150360
15036 4150360 4184810 4207734 4118441 4128444 4229790 4230797 4126934 4108692 4222972 4212599 4151274
15025 4151274 4069823 4061924 4074682 4088326 4156626 4099204 4098968 4109064 4083118 4091715 4097364 4120399
15013 4120399 4162966 4125958 4120532 4104587 4137115 4219892 4185315 4099813 4121892 4135626 4113069
15002 4113069 4154981 4153307 4139057 4156195 4176573 4154017 4115709 4149589 4128919 4103866 4134777
14991 4134777 4124775 4145319 4185023 4160581 4192767 4177897 4222581 4194187 4222557 4237017 4178839
14980 4178839 4228252 4187748 4186152 4253965 4231965 4215659 4227970 4156125 4202675 4240954 4251134
14969 4251134 4211098 4278482 4201186 4206924 4195773 4183691 4257948 4221176 4187348 4203264 4185186
14958 4185186 4216979 4213660 4138938 4190269 4213925 4192326 4181687 4200614 4247550 4253469 4265727 4274489
14946 4274489 4265526 4283293 4202001 4162639 4221721 4288794 4266209 4300648 4255406 4261423 4271279 4231702
14934 4231702 4220671 4234135 4197421 4213458 4281183 4235109 4180833 4139560 4201371 4202010 4228216 4231194
14922 4231194 4203673 4252073 4251948 4245367 4179283 4163497 4207392 4224856 4227636 4245413 4180359 4226391
14910 4226391 4296531 4293325 4287913 4271453 4220608 4145699 4149581 4209901 4224240 4237047 4183979 4186959
14898 4186959 4192495 4206372 4187091 4236508 4273378 4244632 4286159 4225575 4179375 4207162 4196514
14887 4196514 4148659 4098290 4081115 4164143 4214688 4232918 4155988 4181455 4245503 4258032 4178379
14876 4178379 4205589 4219729 4301503 4333605 4269890 4202149 4277608 4258861 4219813 4196583 4221361
14865 4221361 4242495 4207971 4132301 4204285 4175197 4111876 4186886 4230612 4238355 4180826 4220298
14854 4220298 4227463 4228472 4267032 4288103 4295040 4248175 4216365 4213375 4271940 4284622 4201823 4162736
14842 4162736 4165421 4225435 4218991 4212100 4249702 4290363 4273630 4215591 4248871 4326431 4334985 4286382
14830 4286382 4300469 4293112 4250914 4253458 4276230 4255079 4215093 4169932 4100713 4127314 4156660 4217314
14818 4217314 4247583 4291123 4307748 4268272 4222580 4212779 4263322 4257818 4206562 4344544 4349777 4347515
14806 4347515 4332629 4277884 4234443 4288460 4272985 4263735 4271355 4235540 4279256 4303006 4230737 4280391
14794 4280391 4231741 4208752 4251635 4252126 4320818 4292988 4189684 4284223 4321703 4267382 4324351
14783 4324351 4337935 4327557 4367299 4339938 4325987 4287730 4259709 4243640 4215542 4185244 4241547
14772 4241547 4275568 4348871 4339614 4330337 4344756 4318547 4290869 4290573 4332038 4294460 4292536 4358284
14760 4358284 4277574 4293131 4329375 4318827 4357565 4335361 4313572 4300594 4338770 4309632 4319629
14749 4319629 4384963 4429480 4326751 4305163 4280861 4328208 4291781 4355583 4355710 4303449 4305949 4366749
14737 4366749 4344990 4309825 4308591 4300713 4305182 4290983 4279644 4267828 4232493 4315839 4367095 4361097
14725 4361097 4325926 4366708 4354707 4331474 4277153 4359501 4329893 4347706 4382629 4349857 4440813
14714 4440813 4429770 4349610 4348423 4330187 4377720 4391817 4403434 4394641 4342514 4379160 4435066 4315981
14702 4315981 4382788 4395182 4318973 4367114 4320661 4297030 4414571 4447002 4335742 4363643 4360211
14691 4360211 4364175 4322288 4294510 4259377 4232830 4276911 4388595 4401799 4406749 4408016 4359804 4344680
14679 4344680 4342294 4313677 4403807 4374399 4322790 4324305 4357774 4351395 4387960 4391165 4337253 4365539
14667 4365539 4372370 4357467 4408259 4449487 4389204 4313364 4304285 4301093 4386942 4363546 4438332 4401501
14655 4401501 4410264 4395743 4386243 4331848 4386798 4370226 4336719 4343760 4380094 4414014 4395785 4392899
14643 4392899 4400651 4403246 4378802 4436858 4419180 4393119 4421220 4436452 4425286 4375650 4361528 4373991
14631 4373991 4404131 4414102 4374895 4353140 4376624 4425868 4401078 4433905 4402025 4390685 4351168
14620 4351168 4416391 4425864 4397791 4355083 4343230 4383696 4386130 4380991 4414908 4422583 4356275 4372462
14608 4372462 4440473 4437187 4406505 4437878 4510130 4477910 4386619 4367590 4455782 4410138 4453149
14597 4453149 4506298 4510691 4479547 4426609 4443602 4435341 4415290 4464700 4393728 4420982 4463015 4442773
14585 4442773 4448216 4428487 4385856 4352037 4402366 4458680 4446844 4352846 4381034 4455551 4379105
14574 4379105 4415236 4421380 4413494 4488509 4458417 4414648 4370729 4459733 4485627 4478692 4438589 4406209
14562 4406209 4355089 4356713 4375070 4438864 4457100 4445313 4460722 4395803 4337203 4447405 4413501
14551 4413501 4334892 4413107 4419833 4428686 4431661 4480493 4470283 4465875 4500832 4458979 4471262 4502384
14539 4502384 4435018 4468835 4461438 4460219 4420163 4442929 4514096 4494194 4463321 4406156 4418088 4431672
14527 4431672 4422131 4395973 4339272 4417358 4461242 4423094 4461328 4498748 4409583 4398243 4471292
14516 4471292 4516617 4455938 4468104 4474332 4439566 4468313 4480205 4462034 4442761 4465061 4487979
14505 4487979 4445771 4444748 4506136 4444792 4447450 4393986 4475257 4499470 4573164 4547603 4512928 4464419
14493 4464419 4469249 4443386 4416143 4518371 4506626 4425444 4416000 4446355 4440257 4458508 4528112 4578903
14481 4578903 4509756 4540861 4471952 4453315 4476654 4481473 4515450 4480999 4467304 4436702 4396317
14470 4396317 4424105 4460227 4476124 4436259 4451103 4477331 4476110 4491495 4528661 4529256 4528057 4485408
14458 4485408 4438366 4445345 4439390 4481910 4498339 4541404 4535268 4497101 4495350 4524016 4558071 4566470
14446 4566470 4601267 4590565 4527945 4559816 4513686 4460039 4482176 4539078 4506097 4530639 4510568
14435 4510568 4465327 4519750 4559639 4601657 4563729 4610388 4540376 4552928 4560244 4528543 4515091
14424 4515091 4508186 4519085 4550577 4555858 4517903 4541936 4578704 4604334 4537760 4469997 4462702 4503259
14412 4503259 4469238 4494375 4530870 4455715 4413952 4526397 4604200 4575984 4542048 4536609 4508429
14401 4508429 4520229 4554322 4522109 4595808 4648727 4609750 4575025 4624584 4597171 4543538 4553869
14390 4553869 4586143 4580354 4539533 4543421 4575486 4493105 4492021 4504704 4488486 4515474 4531695 4494063
14378 4494063 4496290 4528702 4595785 4539941 4481584 4517824 4478498 4500219 4549337 4534492 4550672
14367 4550672 4514693 4568555 4600229 4623270 4602995 4552380 4533624 4502193 4552439 4528210 4619730
14356 4619730 4630225 4624529 4640939 4600400 4549894 4565371 4570884 4578499 4583870 4574307 4555858 4580215
14344 4580215 4569072 4589438 4627299 4661870 4578235 4522483 4565522 4568504 4556995 4579506 4574393 4604278
14332 4604278 4645033 4615391 4666593 4716012 4694775 4706164 4643194 4624973 4552111 4610498 4628039
14321 4628039 4678774 4693245 4667672 4634862 4604022 4583035 4554419 4577048 4550502 4633138 4629402
14310 4629402 4594196 4577922 4560827 4565114 4656194 4641761 4625656 4642662 4568310 4561151 4666765
14299 4666765 4662079 4695383 4603129 4609228 4656251 4608018 4569416 4569853 4578366 4595078 4648582 4626371
14287 4626371 4645834 4627702 4609972 4619903 4606668 4571233 4472889 4522636 4570144 4538953 4611404
14276 4611404 4654607 4584852 4649008 4657519 4592287 4583567 4565166 4593498 4593517 4572382 4650075 4644703
14264 4644703 4659509 4645874 4624979 4571875 4538956 4559209 4607005 4590316 4553508 4571084 4585229
14253 4585229 4621524 4702813 4622598 4586401 4688989 4661507 4723260 4679679 4580936 4674442 4677247
14242 4677247 4691575 4685936 4622807 4653530 4604144 4607481 4631582 4609975 4592504 4598608 4623373 4626866
$$ [...]
##END NTUPLES=NMR SPECTRUM
##END=
