##TITLE=1H_DE-80H_X3
 200.13MHz, d2o
 8 sc
 
 19ns.26.2.2025
##JCAMPDX= 6.0         $$ Bruker NMR JCAMP-DX V2.0
##DATA TYPE= NMR SPECTRUM
##DATA CLASS= NTUPLES
##ORIGIN= UXNMR, Bruker Analytische Messtechnik GmbH
##OWNER= pz
$$ XWIN-NMR		Version 3.5
$$ Wed Mar 11 10:23:37 2026 Russian Standard Time (UT+4h)  Yarkov@DPX200
##.OBSERVE FREQUENCY= 200.1313
##.OBSERVE NUCLEUS= ^1H
##.ACQUISITION MODE= SIMULTANEOUS
##.ACQUISITION SCHEME= undefined
##.AVERAGES= 8
##.DIGITISER RES= 18
##SPECTROMETER/DATA SYSTEM= spect
##.PULSE SEQUENCE= zg30
##.SOLVENT NAME= CDCl3
##.SHIFT REFERENCE= (INTERNAL, CDCl3, 0, 15.4417)
##AUDIT TRAIL= $$ (NUMBER, WHEN, WHO, WHERE, WHAT)
$$ ##TITLE= Audit trail, XWIN-NMR		Version 3.5
$$ ##JCAMPDX= 5.01
$$ ##ORIGIN= Bruker BioSpin GmbH
$$ ##OWNER= Yarkov
$$ C:/Bruker/XWIN-NMR/data/yarkov2/nmr/H-C/1/pdata/1/auditp.txt
$$ ##AUDIT TRAIL=  $$ (NUMBER, WHEN, WHO, WHERE, WHAT)
(   1,<2026-03-11 10:22:47.35 +0400>,<Yarkov>,<DPX200>,
      <created by zg, POWCHK disabled, PULCHK disabled
       configuration hash MD5:
       00 E9 B6 7A A2 85 ED C7 34 08 36 98 17 FE 4E 26
       data hash MD5: 16K
       CF DB 2F CF 2F F3 35 1C 16 8C CE AB 89 B9 C5 60>)
(   2,<2026-03-11 10:22:52.96 +0400>,<Yarkov>,<DPX200>,
      <Start of raw data processing
       efp BC_mod = 2 LB = 0.25 FT_mod = 6 PKNL = 1 PHC0 = -5299.148 PHC1 = 6.821927 SI = 16K 
       data hash MD5: 16K
       C8 D4 98 B3 77 F7 AD 25 FD AA E1 29 11 0E C7 58>)
(   3,<2026-03-11 10:23:01.37 +0400>,<Yarkov>,<DPX200>,
      <abs ABSG = 5 
       data hash MD5: 16K
       19 AF D5 76 B1 04 70 AB 28 63 C3 1D D8 5A 0B EC>)
$$ ##END=
$$ 
$$ hash MD5
$$ 33 53 0A 6D E4 88 87 7C 70 62 C2 09 9E 7E BB 47
##$RELAX= 
##$RELAX= 
##$RELAX= 
##$RELAX= 
##$RELAX= 
##$RELAX= 
$$ Bruker specific parameters
$$ --------------------------
##$DU= <C:/Bruker/XWIN-NMR>
##$EXPNO= 1
##$NAME= <H-C>
##$PROCNO= 1
##$TYPE= <nmr>
##$USER= <yarkov2>
##$AMP= (0..31)
100 100 100 100 100 100 100 100 100 100 100 100 100 100 100 100 100 100 
100 100 100 100 100 100 100 100 100 100 100 100 100 100 
##$AQSEQ= 0
##$AQ_mod= 1
##$AUNM= <au_zg>
##$AUTOPOS= <>
##$BF1= 200.13
##$BF2= 200.13
##$BF3= 200.13
##$BF4= 200.13
##$BF5= 200.13
##$BF6= 200.13
##$BF7= 200.13
##$BF8= 200.13
##$BYTORDA= 1
##$CFDGTYP= 0
##$CFRGTYP= 5
##$CHEMSTR= <none>
##$CNST= (0..31)
1 1 145 1 1 1 1 1 1 1 1 1 1 1 1 1 1 1 1 1 1 1 1 1 1 1 1 1 1 1 1 1 
##$CPDPRG= <>
##$CPDPRG1= <>
##$CPDPRG2= <>
##$CPDPRG3= <>
##$CPDPRG4= <mlev>
##$CPDPRG5= <mlev>
##$CPDPRG6= <mlev>
##$CPDPRG7= <mlev>
##$CPDPRG8= <mlev>
##$CPDPRGB= <>
##$CPDPRGT= <>
##$D= (0..31)
0 0.7 0 0 0 0 0 0 0 0 0 0.03 0 0 0 0 0 0 0 0 0 0 0 0 0 0 0 0 0 0 0 0 
##$DATE= 1773210166
##$DBL= (0..7)
120 120 120 120 120 120 120 120 
##$DBP= (0..7)
150 150 150 150 150 150 150 150 
##$DBP07= 0
##$DBPNAM0= <>
##$DBPNAM1= <>
##$DBPNAM2= <>
##$DBPNAM3= <>
##$DBPNAM4= <>
##$DBPNAM5= <>
##$DBPNAM6= <>
##$DBPNAM7= <>
##$DBPOAL= (0..7)
0.5 0.5 0.5 0.5 0.5 0.5 0.5 0.5 
##$DBPOFFS= (0..7)
0 0 0 0 0 0 0 0 
##$DE= 6
$$ [...]
##$SUBNAM3= <"">
##$SUBNAM4= <"">
##$SUBNAM5= <"">
##$SUBNAM6= <"">
##$SUBNAM7= <"">
##$SUBNAM8= <"">
##$SUBNAM9= <"">
##$SW= 18.0517328524113
##$SWIBOX= (0..15)
0 0 2 0 0 0 0 0 0 0 0 0 0 0 0 0 
##$SW_h= 3612.71676300578
##$TD= 16384
##$TD0= 1
##$TE= 0
##$TE2= 300
##$TE3= 300
##$TEG= 300
##$TL= (0..7)
0 120 120 120 120 120 120 120 
##$TP= (0..7)
150 150 150 150 150 150 150 150 
##$TP07= 0
##$TPNAME0= <>
##$TPNAME1= <>
##$TPNAME2= <>
##$TPNAME3= <>
##$TPNAME4= <>
##$TPNAME5= <>
##$TPNAME6= <>
##$TPNAME7= <>
##$TPOAL= (0..7)
0.5 0.5 0.5 0.5 0.5 0.5 0.5 0.5 
##$TPOFFS= (0..7)
0 0 0 0 0 0 0 0 
##$TUNHIN= 0
##$TUNHOUT= 0
##$TUNXOUT= 0
##$USERA1= <user>
##$USERA2= <user>
##$USERA3= <user>
##$USERA4= <user>
##$USERA5= <user>
##$V9= 5
##$VALIST= <valist>
##$VCLIST= <CCCCCCCCCCCCCCC>
##$VD= 0
##$VDLIST= <DDDDDDDDDDDDDDD>
##$VPLIST= <PPPPPPPPPPPPPPP>
##$VTLIST= <TTTTTTTTTTTTTTT>
##$WBST= 1024
##$WBSW= 4
##$XGAIN= (0..3)
0 0 0 0 
##$XL= 0
##$YL= 0
##$YMAX_a= 519066
##$YMIN_a= -484524
##$ZGOPTNS= <>
##$ZL1= 120
##$ZL2= 120
##$ZL3= 120
##$ZL4= 120
##$ABSF1= 15.51441
##$ABSF2= -2.537439
##$ABSG= 5
##$ABSL= 3
##$ALPHA= 0
##$AQORDER= 0
##$ASSFAC= 0
##$ASSFACI= 0
##$ASSFACX= 0
##$ASSWID= 0
##$AUNMP= <proc_1d>
##$AZFE= 0.1
##$AZFW= 0.1
##$BCFW= 0
##$BC_mod= 2
##$BYTORDP= 0
##$COROFFS= 0
##$CY= -3
##$DATMOD= 1
##$DC= 0
##$DFILT= <>
##$DTYPP= 0
##$F1P= 0
##$F2P= 0
##$FCOR= 1
##$FTSIZE= 16384
##$FT_mod= 6
##$GAMMA= 0
##$GB= 0
##$INTBC= 1
##$INTSCL= 3.241238e-09
##$ISEN= 128
##$LB= 0.25
##$LEV0= 0
##$LPBIN= 0
##$MAXI= 10000
##$MC2= 0
##$MEAN= 0
##$ME_mod= 0
##$MI= 1.114404
##$NCOEF= 0
##$NC_proc= -7
##$NLEV= 6
##$NOISF1= 3.799351
##$NOISF2= 2.8
##$NSP= 0
##$NTH_PI= 0
##$NZP= 0
##$OFFSET= 15.44169
##$PC= 1
##$PHC0= -5299.148
##$PHC1= 6.821927
##$PH_mod= 1
##$PKNL= yes
##$PPARMOD= 0
##$PSCAL= 0
##$PSIGN= 0
##$REVERSE= no
##$SF= 200.130016012455
##$SI= 16384
##$SIGF1= 3
##$SIGF2= 2
##$SINO= 0.751879
##$SIOLD= 32768
##$SREGLST= <19F.Aceton>
##$SSB= 0
##$STSI= 16384
##$STSR= 0
##$SW_p= 3612.71676300578
##$SYMM= 0
##$S_DEV= 0
##$TDeff= 16384
##$TDoff= 0
##$TI= <>
##$TILT= no
##$TM1= 0
##$TM2= 0
##$TOPLEV= 0
##$USERP1= <user>
##$USERP2= <user>
##$USERP3= <user>
##$USERP4= <user>
##$USERP5= <user>
##$WDW= 1
##$XDIM= 16384
##$YMAX_p= 470413262
##$YMIN_p= -445631
$$ End of Bruker specific parameters
$$ ---------------------------------
##NTUPLES= NMR SPECTRUM
##VAR_NAME=  FREQUENCY,     SPECTRUM/REAL,   SPECTRUM/IMAG
##SYMBOL=    X,             R,               I
##VAR_TYPE=  INDEPENDENT,   DEPENDENT,       DEPENDENT
##VAR_FORM=  AFFN,          ASDF,            ASDF
##VAR_DIM=   16384,         16384,           16384
##UNITS=     HZ,            ARBITRARY UNITS, ARBITRARY UNITS
##FACTOR=    0.220516191357247, 1,           1
##FIRST=     3090.34575600647, 0,            0
##LAST=      -522.371006999306, 0,           0
##MIN=       -522.371006999306, -445631,     0
##MAX=       3090.34575600647, 470413262,    0
$$ Real data points
##PAGE= N=1
##DATA TABLE= (X++(R..R)), XYDATA
$$ [...]
5952A7164295j146987q15366r31070o85248m86886m07742m87924k78605j94558
5943A1729909l27315j36991j23331k60956j84285k78509j99722L1793r6076j24794
5933A0029723K5829J78901K0405K1111J73878L84181M59038N23146M26316J23169
5923A2365697n1859r3344M5867k00180j58781n9214l3906j9229o2478l1972K82427
5912A1983028J31886K04376K33829J61634J27561N0879J63619J86947K46710J28584
5902A3619053K21747J68093J66590j739j22650J8004O4040j33144l76599l99222
5892A3224173k72984k52677q2969J92841L97745L17091J95556J1897M9711j10087
5882A3670297N2386J00703J50957K15157K56803L31614Q2297M8783j10906j45750
$$ y = [17164295, 16017308, 15201942, 14270872, 13585624, 13098738, 12690996, 12203072, 11924467, 11729909, 11402594, 11265603, 11142272, 10881316, 10697031, 10418522, 10218800, 10250593, 10154517, 10029723, 10055552, 10234453, 10254858, 10275969, 10449847, 10834028, 11293066, 11816212, 12242528, 12365697, 12313838, 12220494, 12266361, 12066181, 11907400, 11848186, 11814280, 11795051, 11732573, 11700601, 11983028, 12114914, 12319290, 12553119, 12714753, 12842314, 12893193, 13056812, 13243759, 13490469, 13619053, 13840800, 14008893, 14175483, 14173744, 14051094, 14069098, 14133138, 13999994, 13623395, 13224173, 12951189, 12698512, 12615543, 12808384, 13206129, 13523220, 13718776, 13730673, 13780384, 13670297, 13722683, 13823386, 13974343, 14189500, 14446303, 14777917, 14860214, 14908997, 14798091, 14652341]
5872A4652341J0602J84582R3667j21793O826N0915p533P5638K94335K22166J41656
5861A5603402J78139j49322l49060j93235k62316l19673l11705j85556k35109
5852A3775565l7359j29242j40727j03954J465k0477J65745K45965Q4027K02163
5842A4043171j4852k43729n14507n30327n86192l57624m67564m28269n91249o29608
5832I679250o63770j83131p0690k31086o236k13861j73362J0234q2765j20828
5822G943755k77286m5524p5066k37392r4014k80653l29955k59496l27488k52612
5812E764269k98098l70399k76421j01573j99996k89216j99547q3281j02606m5995
5802C797137M4171J08736j31526r6602j17169l04137K0190r9244p9300j98334
$$ y = [14652341, 14662943, 14847525, 14941192, 14819399, 14826225, 14877140, 14869607, 14945245, 15239580, 15461746, 15603402, 15781541, 15632219, 15283159, 15089924, 14827608, 14507935, 14196230, 14010674, 13775565, 13738206, 13608964, 13468237, 13364283, 13365748, 13345271, 13511016, 13756981, 13841008, 14043171, 14028319, 13784590, 13270083, 12739756, 12153564, 11795940, 11328376, 10900107, 10308858, 9679250, 9015480, 8832349, 8761659, 8530573, 8524337, 8310476, 8137114, 8147348, 8064583, 7943755, 7666469, 7620945, 7545879, 7308487, 7214473, 6933820, 6603865, 6344369, 6016881, 5764269, 5466171, 5095772, 4819351, 4717778, 4517782, 4228566, 4029019, 3945738, 3843132, 3797137, 3841308, 3950044, 3818518, 3721916, 3604747, 3300610, 3320800, 3221556, 3142256, 2943922]
5792B943922J89165L0435k02904j56246q8995j18074k4936L2682o8615p981j21957
5781B406496j01417r6796J1675J8634j07406j60709N712P0357n0380j4362P562
5770A989366L766N0335J63825J50151L5616Q063m5232j9771n1184j12523j24253
5759B048159j28212k3708R4033n1506R8063Q958K7324M7879J87097Q1762k7191
5748B362658q3482p8648r0603L0281m6923r7025p8475n9122J4938n221L0143j02788
5736A795733j02686o746k3904K6729Q8993K1811J96616J36869j0317q5868K8597
5725B065827P7777q8962j14512m4173L5358M2619J0266m2319p4139J31225k00245
5714A798722M4688K176K1593m0669R0152p862m9908J01310L8600J01831n7849
$$ y = [2943922, 3133087, 3163522, 2960618, 2804372, 2715377, 2597303, 2572367, 2605049, 2536434, 2528453, 2406496, 2305079, 2208283, 2219958, 2238592, 2131186, 1970477, 1976189, 2046546, 1996166, 1981804, 1989366, 1993132, 2043467, 2207292, 2357443, 2393059, 2401122, 2355890, 2336119, 2284935, 2172412, 2048159, 1919947, 1896239, 1990272, 1938766, 2036829, 2045787, 2073111, 2120990, 2308087, 2389849, 2362658, 2279176, 2200528, 2109925, 2140206, 2093283, 1996258, 1917783, 1858661, 1873599, 1868378, 1898521, 1795733, 1693047, 1686301, 1662397, 1689126, 1778119, 1799930, 1996546, 2133415, 2123098, 2037230, 2065827, 2143604, 2054642, 1940130, 1895957, 1931315, 1973934, 1984200, 1941881, 1867742, 1998967, 1798722, 1843410, 1845586, 1867179, 1826510, 1916662, 1908800, 1858892, 1960202, 1998802, 2100633, 2042784]
5703B042784j38541j06817N0411j68446O4814M071R1970L2561o5073J1371j7776
5692A801329Q2491q8073J4899o0027J16696J82035R3030k4698O64o9348r9043
5681A949955L1940J42373O3745R0444n9287O585p7911m581J0225p8326J4185k7619
5669B061728j04359L2049P823j11088J27866m8429M0512j125R9897j612L7709
5658B140971J28334P6928R6677M1323l6201O514j84038j22613L4127j1486m669
5647B165867l0224p1232k8346P5364k7039n0445k0824J1766m4926o9599O5113
5636A975475Q7701m0983L2889J48855J17997j9898j34938r6393m470K6051J64469
5625B256755R9619q9018L6347j7422o4400k24468m2211N1033J16620R2441L4815
$$ y = [2042784, 1904243, 1797426, 1847837, 1679391, 1744205, 1748276, 1840246, 1872807, 1807734, 1819105, 1801329, 1883820, 1795747, 1810646, 1750619, 1867315, 2049350, 2142380, 2117682, 2118346, 2048998, 1949955, 1981895, 2124268, 2188013, 2278457, 2219170, 2225755, 2147844, 2143263, 2153488, 2075162, 2089347, 2061728, 1957369, 1989418, 1997241, 1886153, 2014019, 1965590, 2006102, 2004977, 2104874, 2103262, 2140971, 2269305, 2346233, 2442910, 2484233, 2448032, 2454546, 2270508, 2147895, 2182022, 2170536, 2165867, 2135643, 2064411, 2036065, 2111429, 2084390, 2033945, 2013121, 2024887, 1979961, 1910362, 1975475, 2063176, 2022193, 2055082, 2203937, 2321934, 2302036, 2167098, 2070705, 2066235, 2092286, 2256755, 2356374, 2267356, 2303703, 2286281, 2221881, 1997413, 1955202, 2006235, 2122855, 2215296, 2250111]
5614B250111k5652l2086M4647j62293N8523m1561q186r8163j57955Q4833n7973
5603A854245q6885M3343K4978K4773J24145o4263j12360N4393K16214N5470M5614
5592B179667M4778k3020m0419n1231M4186n1358j0902J3996l1960O684r5761m2559
5580A942101j27273K6089j4071O4551Q200k3339j75556Q2009J77298O0164r5088
5569A925085o5399R7068O2103j7236N0885n3955j33074N7199L9611l7032J05226
5558B030481p4116j91684J32961r7628O3947K571r6543r8328J18313j6231J5079
5547A788822l628K3343L9171J19269k0038j6947j18067n278j06690N9078O7736
5536A826771q2464L6694k4634J6307j29641M6005n89j84212p4604J23293J26136
$$ y = [2250111, 2224459, 2192373, 2237020, 2074727, 2133250, 2091689, 2083503, 1985340, 1827385, 1912218, 1854245, 1767360, 1810703, 1835681, 1860454, 1984599, 1920336, 1807976, 1862369, 2078583, 2134053, 2179667, 2224445, 2201425, 2161006, 2109775, 2153961, 2102603, 2091701, 2105697, 2073737, 2080421, 1984660, 1942101, 1814828, 1840917, 1826846, 1891397, 1899597, 1876258, 1700702, 1782711, 1960009, 2020173, 1925085, 1859686, 1956754, 2018857, 2001621, 2052506, 1998551, 1865477, 1922676, 1962287, 1925255, 2030481, 1956365, 1764681, 1897642, 1800014, 1863961, 1866532, 1769989, 1671661, 1789974, 1773743, 1788822, 1785194, 1808537, 1847708, 1966977, 1946939, 1929992, 1811925, 1806647, 1699957, 1759035, 1826771, 1744307, 1781001, 1756367, 1772674, 1643033, 1689038, 1688449, 1504237, 1429633, 1552926, 1679062]
5525A679062L8887j15381l5543n1761P7679J197j7925P0740J620o3930l6094p315
5513A541236L0269J90314n3608Q914J54963L0748j76412q2651Q1752j89442Q6887
5502A622970m2989k5405O7829J4213M9967k2142j34529J0617j6099O4593J21255
5491A710280m3992O9318M9720P409n8651o7810M7687N7503K396L9058k56o0376
5479A752286p5545o4320n9521N849Q4996O3147n3557J01422J4191J4565q5343
5468A698170n2149L1031K5189L7023P6663K5000M482j60150P8526r834j10345
5457A643606m8066J23798J94095j63560j04632J34260M3300J27331M2768p458
5447A985442N5303l8491j14652k8049J37923J43815j83706m7834j53751J92705
$$ y = [1679062, 1717949, 1602568, 1567025, 1515264, 1592943, 1594140, 1576215, 1646955, 1648575, 1584645, 1548551, 1541236, 1571505, 1761819, 1708211, 1717125, 1872088, 1902836, 1726424, 1643773, 1725525, 1536083, 1622970, 1579981, 1554576, 1622405, 1636618, 1686585, 1664443, 1529914, 1540531, 1524432, 1589025, 1710280, 1666288, 1735606, 1785326, 1792735, 1734084, 1666274, 1713961, 1771464, 1773860, 1812918, 1812662, 1752286, 1676741, 1612421, 1552900, 1558749, 1643745, 1706892, 1653335, 1754757, 1768948, 1783513, 1698170, 1646021, 1677052, 1702241, 1739264, 1815927, 1840927, 1845409, 1685259, 1763785, 1753951, 1643606, 1595540, 1719338, 1913433, 1749873, 1645241, 1779501, 1822801, 1950132, 1992900, 1985442, 2040745, 2002254, 1887602, 1859553, 1997476, 2141291, 1957585, 1909751, 1756000, 1948705]
5437A948705O6586Q5715l4156j01484J66202P1323r7257j6072J07992j75905K04812
5426B226461j56608p7059k1569J64897j24661r75Q5732J04821J03013L1705k6900
5415B308857Q3340L3709l384j21000J2377q85R2382L312J15039j1895q8906M5700
5403B468646l7534P8589l1344N1533K4451R865K1107J16133O3842r2733Q7174
5392B759729K2800j8633J45620l1529j39839J49775M0752M0876K25672q9334J19993
5381C225882r3799J36599J06835j77524m4499J42581K15742O4693j863L6407J05360
5370C716414R1604J13344K2886p4501J6647Q8296N4376L4063J5879l0126q3236
5359C965646m6851J81998P6724J12082J75422m3235J35365N3476k1672J8844J07173
$$ y = [1948705, 2015291, 2101006, 2066850, 1965366, 2131568, 2202891, 2105634, 2089562, 2197554, 2021649, 2226461, 2069853, 1992794, 1971225, 2136122, 2011461, 2010486, 2096218, 2201039, 2304052, 2335757, 2308857, 2392197, 2425906, 2422522, 2301522, 2313899, 2313014, 2405396, 2408708, 2523747, 2511852, 2422946, 2468646, 2431112, 2509701, 2478357, 2529890, 2554341, 2564206, 2585313, 2701446, 2765288, 2672555, 2759729, 2782529, 2763896, 2909516, 2877987, 2738148, 2887923, 2928675, 2969551, 3195223, 3105889, 3225882, 3132083, 3268682, 3375517, 3197993, 3153494, 3296075, 3511817, 3576510, 3574647, 3611054, 3716414, 3808018, 3921362, 3944248, 3869747, 3886394, 3974690, 4029066, 4063129, 4079008, 4048882, 3965646, 3918795, 4100793, 4177517, 4289599, 4465021, 4421786, 4557151, 4610627, 4588955, 4607799, 4714972]
5348D714972M0737l4608J6298o5621j07119P8929M5232Q8709K3440m4563P6034
5337D832440j687p2628n1863J09600L437j7353K4598n5777J63982O5670M6291
5326E046710j9036j10429Q4174n6513R432L5717p7604J14872K32732K5402m3121
5315E242336J6162N0768N3136J855K6646J23852N7225O3368j4482q9818M6159
5304E577207J19962J65678O6437P0324J90274J69744J83135O629J36991L7218
5294F723599J89351J4146K27717Q5870j0438J16850K41759L57300K31656J04434
5284H282244J72297L16455L07650K65095K89190L84103L89588L93857M78374L87049
5274A1665902L70508O70581O63520P69199Q82997J353226J557627K193788L178530
$$ y = [4714972, 4755709, 4721101, 4737399, 4671778, 4564659, 4643588, 4688820, 4777529, 4800969, 4756406, 4832440, 4830753, 4758125, 4706262, 4815862, 4819299, 4801946, 4826544, 4770767, 4934749, 5000419, 5046710, 5027674, 4917245, 5001419, 4944906, 4954338, 4990055, 4912451, 5027323, 5260055, 5285457, 5242336, 5258498, 5309266, 5362402, 5364257, 5390903, 5514755, 5571980, 5635348, 5620866, 5531048, 5577207, 5697169, 5862847, 5929284, 5999608, 6189882, 6359626, 6542761, 6549390, 6686381, 6723599, 6912950, 6927096, 7154813, 7240683, 7230245, 7347095, 7588854, 7946154, 8177810, 8282244, 8454541, 8770996, 9078646, 9343741, 9632931, 10017034, 10406622, 10800479, 11278853, 11665902, 12036410, 12706991, 13370511, 14139710, 15022707, 16375933, 17933560, 20127348, 23305878]
5265B3305878M603692N335137M727194K682920K28130j298447j835827j610566
5257C6138111q50961L73702K061700L671875N804017P733484Q424290P559689
5249G0915907N482944L543160K183524J231234N77431k33413m37425J46998Q90553
5240H4300913J040700P28806J335213K179059K240814K347282K860489L810823
5232A00844099M549955M508797L516496J302641j304555l709266m403654l825196
5224A01479317k825311k083263j971186k395443k350063k020343k317832k773788
5216H2742088k034777q96526j36846M42725O49046R52170R7578k294865m740710
5207G4779883p013888q377964q210809p005878n215795l687890k141943n38584
$$ y = [23305878, 27909570, 33244707, 37971901, 40654821, 40882951, 39584504, 37748677, 36138111, 35287150, 35660852, 37722552, 41394427, 47198444, 54931928, 63356218, 70915907, 76398851, 79942011, 82125535, 83356769, 83934200, 83700787, 83263362, 83410360, 84300913, 85341613, 86070419, 87405632, 89584691, 91825505, 94172787, 97033276, 100844099, 105394054, 109902851, 113419347, 114721988, 113417433, 109708167, 105304513, 101479317, 98654006, 96570743, 94599557, 92204114, 89854051, 87833708, 85515876, 82742088, 80707311, 79810785, 79673939, 80116664, 80765710, 81717880, 81815458, 79520593, 74779883, 67765995, 59388031, 51177222, 44171344, 38955549, 35267659, 33125716, 32587132]
5199C2587132J389589K576773K365284Q58400k005059l902596m417692m101255
5191B5350576l527425k823706k296324j805960j466010j206027r72269p52377
5183A0500478o31258m70915l54817j95739l73385k92015l86974k00440k24746
5174G370189k31926l29159k75710k09233o1976M4989j92487J9958j79353m6245
5164E909047o7567j9530k48107j25352N560m963r4034m4342q3434L1739p571J2224
5152E263670k9159l5211r2015M5440j14247r7471J87728L4711k22667r9168R1939
5141D933550K08041K05986J4029o9984l8075O8421k37481j65276r3280j31747
5131D694184O1155J06918N4231r0740R2982j30094o8279q5024J54661M5658l5070
$$ y = [32587132, 33976721, 36553494, 38918778, 39777178, 37772119, 33869523, 29451831, 25350576, 21823151, 18999445, 16703121, 14897161, 13431151, 12225124, 11252855, 10500478, 9869220, 9398305, 9043488, 8847749, 8474364, 8182349, 7795375, 7594935, 7370189, 7138263, 6809104, 6533394, 6324161, 6262185, 6307174, 6114687, 6134645, 5955292, 5909047, 5841480, 5821950, 5573843, 5448491, 5454051, 5449088, 5355054, 5310712, 5227278, 5259017, 5251446, 5263670, 5234511, 5199300, 5107285, 5152725, 5038478, 4941007, 5128735, 5163446, 4940779, 4841611, 4933550, 5141591, 5347577, 5361606, 5291622, 5253547, 5321968, 5084487, 4919211, 4825931, 4694184, 4755339, 4862257, 4916488, 4825748, 4918730, 4788636, 4720357, 4635333, 4789994, 4835652, 4800582]
5120D800582M8790K5023J93504k4006k0500J35314J12429M2845J10787N0889L46451
5109E822108J71926J04814J11151K00002j22744j15n9879m6309j905j42515q5296
5098E951238N3095J56913L3210L9622J52568J54436J88082L23608J50743j70470
5088G033045j66116J5102j58318j30553l6343j44254J52543J62409K3924n7160
5078F694279j1797l7810N2089r5134j42743M12O719J47574J1254J07343k2495
5067F709691K04051L9139R0348J26993J13776J21695J67604K76243J70617J63563
5057H183720M50254L88062J43965L31876J35050l3910j71852m35298j96925j1645
5047H783297j16878j16716M4164J17492J1098J64576J59365K79354K43216n386
$$ y = [4800582, 4849372, 4874395, 5067899, 5043893, 5023393, 5158707, 5271136, 5313981, 5424768, 5475657, 5822108, 5994034, 6098848, 6209999, 6410001, 6287257, 6287142, 6227263, 6180954, 6179049, 6036534, 5951238, 6004333, 6161246, 6194456, 6234078, 6386646, 6541082, 6729164, 7052772, 7203515, 7033045, 6866929, 6882031, 6723713, 6593160, 6556817, 6412563, 6565106, 6727515, 6751439, 6694279, 6682482, 6644672, 6696761, 6601627, 6458884, 6459296, 6466015, 6613589, 6624843, 6732186, 6709691, 6913742, 6952881, 7043229, 7170222, 7283998, 7405693, 7573297, 7849540, 8020157, 8183720, 8633974, 9022036, 9166001, 9497877, 9632927, 9599017, 9427165, 8991867, 8794942, 8783297, 8666419, 8549703, 8593867, 8711359, 8722457, 8887033, 9046398, 9325752, 9568968, 9563582]
5037I563582p1241l93546l83727k90182k57008N9877m913J12679R1682Q9267L1212
5026H547682P1661K9707k7556p3495j80471j26658p0717J8924L0752j066k3159
5015H195604n865p5492L01074J06148o1226L4260q8078j2104j491J20202J74576
5004H687608K7875J09436N7384J99703J24800Q7332J29066M2548J47303L80698
4994I993753K49490K73350N81563O20529Q64752P38660M30638K13312j75262l59928
4984A3430857l62898l94377j81723k87655o3649q458Q5984p8591J67034K31744
4974A2538268M60453P48171O32176P26584P25198M14957J08000k64199l16134
4965A5773474m76188j97261L294j06427O2708n5066m3854j20508j30014Q0934
$$ y = [9563582, 9492341, 9098795, 8715068, 8424886, 8167878, 8227755, 8222842, 8335521, 8427203, 8516470, 8547682, 8619343, 8649050, 8621494, 8547999, 8367528, 8240870, 8170153, 8189077, 8219829, 8218763, 8195604, 8189739, 8114247, 8415321, 8521469, 8460243, 8494503, 8406425, 8394321, 8392830, 8513032, 8687608, 8715483, 8824919, 8882303, 9082006, 9206806, 9294138, 9423204, 9465752, 9613055, 9993753, 10243243, 10516593, 11098156, 11718685, 12583437, 13322097, 13752735, 13966047, 13790785, 13430857, 13067959, 12673582, 12491859, 12204204, 12140555, 12132097, 12218081, 12139490, 12306524, 12538268, 12998721, 13746892, 14379068, 15105652, 15830850, 16245807, 16353807, 16089608, 15773474, 15297286, 15100025, 15103319, 14996892, 15059600, 15004534, 14960680, 14840172, 14710158, 14791092]
4955A4791092J37117j29595l4293K30808l022J67449L42697K77245L89637P09336
4945A6878471P92576P19220P84840N92293O32409N00595M67082N28962O34163
4936B2530611O60615P65811N91359M50491m7486m93375m72449p17048q08507m51988
4926B2008034n51565q1635j00833K22133K98780L50218N44525Q17875J138479
4917B4646011J355983J401477J120229P45734R3381m22250o68323n15163k60003
4908B7497076k06224k04737j0678J08036J77658m2942K67372L75799M33767P44302
4898B9139429Q41311P99246R69745Q78611Q73383J141998J268824J328192J494418
4889C8735157J228368R02426P74090P50505M87151K72974M25772O83513R65981
$$ y = [14791092, 14928209, 14798614, 14764321, 14995129, 14992107, 15159556, 15502253, 15779498, 16169135, 16878471, 17671047, 18390267, 19175107, 19767400, 20399809, 20900404, 21367486, 21896448, 22530611, 23191226, 23957037, 24548396, 24998887, 24951401, 24458026, 23985577, 23268529, 22460022, 22008034, 21456469, 21374834, 21274001, 21496134, 21794914, 22145132, 22689657, 23507532, 24646011, 26001994, 27403471, 28523700, 29269434, 29362815, 28940565, 28272242, 27757079, 27497076, 27290852, 27086115, 27075437, 27183473, 27361131, 27318189, 27585561, 27961360, 28395127, 29139429, 29980740, 30779986, 31749731, 32628342, 33501725, 34643723, 35912547, 37240739, 38735157, 39963525, 40865951, 41640041, 42390546, 42877697, 43150671, 43576443, 44259956, 45225937]
4880D5225937J101595J510315J689088J622117J720395K108665K151620K440768
4872E9570500K640968L153906L514141M532199N693712P846232J1543594J6848708
4864A15343960K2162075K2707718J6388552M070106q127911j4245051j4885823
4857A43413626j2989206j0206673p563475m877111k731793o24762J633312L938928
4849A09992846P135374J1915899J8445343K4823245K7337689K5838705K1171863
4842B46660964J6362762J0917422J901396r681359j8590475k1034438j8529829
4835B08006443j4294840r615867m980784j097218K310549M819361O485813Q228198
4827A99861655J0166002J3633473J8655004K2195503J9596734R374900m828092
$$ y = [45225937, 46327532, 47837847, 49526935, 51149052, 52869447, 54978112, 57129732, 59570500, 62211468, 65365374, 68879515, 73411714, 79105426, 86951658, 98495252, 115343960, 137506035, 160213753, 176602305, 180672411, 172544500, 158299449, 143413626, 130424420, 120217747, 112654272, 107777161, 105045368, 104420606, 106053918, 109992846, 117128220, 129044119, 147489462, 172312707, 199650396, 225489101, 246660964, 263023726, 273941148, 275842544, 266161185, 247570710, 226536272, 208006443, 193711603, 184095736, 179114952, 178017734, 180328283, 185147644, 191633457, 199861655, 210027657, 223661130, 242316134, 264511637, 284108371, 293483271, 288655179]
4820B88655179j5631590j9842209j9482827j6830804j3053183r461328o337964
4813A88015274l516949n84766K234576M710465O891295Q457792R926166J1162302
4805B27296155J2685378J4541706J6395427J7149408J6480491J4252457J1158187
4798C29959209P885636M997134K520933K72584k720037n924235r023146j0731613
4790C17236465j0951354r963100q840276q207916p650525o582109m705792k322727
4782B58012666k69980J113765J757833K049379K443891L127221M435061O182735
4774B78852571Q116666R307738J0739084J2312143J3415751J3314262J1586472
4767C57644687Q137603L882590O2482k193159l122515m126714o100426r504157
$$ y = [288655179, 273023589, 253181380, 233698553, 216867749, 203814566, 194353238, 188015274, 184498325, 183913559, 186148135, 190858600, 197749895, 206207687, 216133853, 227296155, 239981533, 254523239, 270918666, 288068074, 304548565, 318801022, 329959209, 337844845, 342841979, 345362912, 345635496, 342915459, 336991224, 327968078, 317236465, 306285111, 296322011, 287481735, 279273819, 271623294, 265041185, 260335393, 258012666, 257742686, 258856451, 260614284, 262663663, 265107554, 268234775, 272669836, 278852571, 286969237, 296276975, 307016059, 319328202, 332743953, 346058215, 357644687, 365782290, 369664880, 369727362, 367534203, 364411688, 360284974, 354184548, 344680391]
4759C44680391j3551513j6714765j8173469j7463278j5544553j3578141j2313321
4752B37341351j1491575j1009280j0217016r047565p336480n743402l862337k321995
4744A76311701m75099N70059J196292J271826N25941k68864o33853o94787j012270
4735A76790946j481551l384568n876270q727040j0487879j1342079j1086094j0269401
4727A14136064r395456q532026p714357p014139o337629n505039m283337l479733
4719F1874348l171846l128990l261643l209945l004740k868625k572757k150078
4711C8505724j895032j647849j420571j226273q32536p75764o26264k63577k22689
4702B9595169M9868J89105J76334K17198J39647j08554n70223q02076j042912
$$ y = [344680391, 331128878, 314414113, 296240644, 278777366, 263232813, 249654672, 237341351, 225849776, 214840496, 204623480, 195575915, 188239435, 182496033, 178633696, 176311701, 175836602, 176406661, 177602953, 178874779, 179400720, 179131856, 178498003, 177803216, 176790946, 175309395, 171924827, 166048557, 157321517, 146833638, 135491559, 124405465, 114136064, 104740608, 96208582, 88494225, 81480086, 75142457, 69637418, 65354081, 61874348, 58702502, 55573512, 52311869, 49101924, 46097184, 43228559, 40655802, 38505724, 36610692, 34962843, 33542272, 32315999, 31483463, 30707699, 30081435, 29817858, 29595169, 29645037, 29834142, 30010476, 30227674, 30367321, 30258767, 29688544, 28886468, 27843556]
4693B7843556r06082j012742p97859n35916m20680k06926j09912j84147N4462
4684B3723754L87416N72478P78667P42855L86539j35323n44115q91117j045427
4675B3975727p27836o17570p33816m37099m72210j85911n0055L2499L58292K99343
4665B1441364M75775K22137j29843m19697p92436p80742p75302o56029m04534
4656A8180693k53216j50373M9421j4207J60032M85591O73217R01398J066851Q09567
4646B1908974N69315J05745j84548n14753q45534q92463r58973o58096n59431
4637A7970236l91355m13291o18047m29628k34356q7418J49802J70708M69277O82784
4627A7268712P27987O15155J50595l36523p83335j001145j019140p40128n50980
$$ y = [27843556, 26937474, 25924732, 25126873, 24590957, 24170277, 23963351, 23853439, 23669292, 23723754, 24111170, 24683648, 25462315, 26205170, 26591709, 26456386, 25912271, 25021154, 23975727, 23247891, 22630321, 21896505, 21459406, 20987196, 20801285, 20751230, 20783729, 21142021, 21441364, 21917139, 22139276, 22009433, 21589736, 20797300, 20016558, 19241256, 18585227, 18180693, 17927477, 17777104, 17826525, 17812318, 17972350, 18457941, 19131158, 20032556, 21099407, 21908974, 22478289, 22584034, 22399486, 21884733, 21039199, 20146736, 19187763, 18529667, 17970236, 17578881, 17165590, 16547543, 16117915, 15883559, 15796141, 15945943, 16116651, 16585928, 17268712, 17996699, 18611854, 18762449, 18425926, 17642591, 16641446, 15622306, 14882178, 14331198]
4618A4331198k40810j53114j90844R7944q2047j45734R1754K8871J0560Q214J6205
4607A3772197m9966j1874m3143p667P2419J95244J00896K22475J95319L14092
4597A4759992N50660N02981Q09121J016950J138076J035890O76920J01457l58227
4588B0233820n90260n61807k27915l02732K442L30713J59500J87459L88224P26124
4578B0345568O94890Q56062J157764J356585J552833J741083J940470K032998
4570C1678253K258566K680473L684669M797351P045626J1011200J6560699K1694692
4562A01411529K2649753J6847681N189568o656298j3363326j4746621j2130572
4555I9201714p800239k236166M433709J1703326J7494332J7876375J1457063K04083
$$ y = [14331198, 14090388, 13937274, 13746430, 13844374, 13762327, 13616593, 13708347, 13737218, 13747778, 13755992, 13772197, 13722231, 13710357, 13667214, 13659547, 13731966, 13927210, 14028106, 14250581, 14445900, 14759992, 15310652, 15813633, 16622754, 17639704, 18777780, 19813670, 20490590, 20592047, 20233820, 19643560, 19081753, 18853838, 18551106, 18553548, 18884261, 19043761, 19231220, 19619444, 20345568, 21040458, 21896520, 23054284, 24410869, 25963702, 27704785, 29645255, 31678253, 33936819, 36617292, 40301961, 45099312, 52144938, 63156138, 79716837, 101411529, 124061282, 140908963, 146098531, 139442233, 126078907, 111332286, 99201714, 91401475, 89165309, 93599018, 105302344, 122796676, 140673051, 152130114, 152334197]
4547A52334197r937466j4761934j3976871r360256k317219N549510J2001436J3253612
4539A32785009P903880k147631j0966964j4565124j4394633j1338118p231149
4532H0045270k349175L692406J0059002J4356755J3139549O012362m509821j2699263
4524A07747085j6127713j5739044j3384154j0532739p910801o099593m615106
4517C3337935l519503k618467k000672j608487j352014j266091j178069r25102
4509A8869530q83032p31099o97179p52886o32075l89720m16125m31216m22007
4500A3514191k23983j87536l87049J169j29537k06120j52256j08440r8267O372
4490A2028544J94615m2626j26967k40905j46638K8360j01642o4653j51004N2438
$$ y = [152334197, 142396731, 127634797, 113657926, 104297670, 101980451, 107529961, 119531397, 132785009, 140688889, 138541258, 127574294, 113009170, 98614537, 87276419, 80045270, 77696095, 81388501, 91447503, 105804258, 118943807, 124956169, 120446348, 107747085, 91619372, 75880328, 62496174, 51963435, 44052634, 37953041, 33337935, 29818432, 27199965, 25199293, 23590806, 22238792, 20972701, 19794632, 18869530, 17986498, 17255399, 16558220, 15805334, 15173259, 14783539, 14367414, 13936198, 13514191, 13290208, 13102672, 12715623, 12716792, 12587255, 12381135, 12228879, 12120439, 12022172, 12028544, 12223159, 12180533, 12053566, 11812661, 11666023, 11694383, 11592741, 11528088, 11377084, 11429522]
4480A1429522J62189P1808N0997P7576N2542m550N8371R9018J46409J83554k4512
4469A2302924J3909J91660J84173J42378K26919K24734M81734M42656N29296M94551
4459A5234934L75538O13603O35766O23384J021860J252384J332070J677528K266473
4450B5033540K842889L973292N595613P538979R276348R629474Q120400M568607
4442G6579142R59940j675237j913972n18611J567607L052110K449335n7622l654252
4433G6788440p104281q701895q854400p997682o808012n277860m084557l360561
4425B4599192k544478k042908j561931j308978q91525p05857n46778o45524o81537
4416A3669676o08584n02614m38511k57681m70104m04240j97329k36237o0539j1190
$$ y = [11429522, 11591711, 11663519, 11714516, 11792092, 11844634, 11840084, 11898455, 11997473, 12143882, 12327436, 12302924, 12316833, 12508493, 12692666, 12835044, 13061963, 13286697, 13768431, 14211087, 14740383, 15234934, 15610472, 16224075, 16859841, 17483225, 18505085, 19757469, 21089539, 22767067, 25033540, 27876429, 31849721, 37445334, 44984313, 54260661, 63890135, 72010535, 76579142, 77539082, 75863845, 73949873, 73431262, 74998869, 78050979, 80500314, 80442692, 76788440, 69684159, 60982264, 52127864, 44130182, 37322170, 32044310, 27959753, 24599192, 22054714, 20011806, 18449875, 17140897, 16249372, 15543515, 14996737, 14351213, 13669676, 13061092, 12558478, 12119967, 11862286, 11392182, 10987942, 10790613, 10554376, 10493837, 10482647]
4406A0482647p9002j20475j58132j6948k07181p2008k818J7579P8079J28441J02458
4395A0152640R1720K05892J91045N8111q8925R2528o9964j67845j07175r1761
4385A0266266j64993j77035j61844j30191m5466o0189l115M4628n2622Q1880j18382
4374I478937J45526O5559J02247n5087k2523N7126O0554K20937J05603l7627J64416
4363A0285668n37n2810O3233k3883j15427j10860O2716q1427j39127L4074q8764
4352I832856q5096o4585K2409L8728j17318L6558K4952K8720J49428J73780j4235
4341A0026197R7122P6078n9435O7703J75764J31701n9252j5141N8945O1261K01273
4330A0762216J23776K9569n3029k6603J04876J16505J73091J37185P0819r7066
$$ y = [10482647, 10403645, 10283170, 10125038, 10108090, 9900909, 9828901, 9826083, 9843662, 9921741, 10050182, 10152640, 10244360, 10450252, 10641297, 10699408, 10610483, 10703011, 10633047, 10465202, 10358027, 10266266, 10101273, 9924238, 9762394, 9632203, 9586737, 9526548, 9523433, 9568061, 9515439, 9597319, 9478937, 9624463, 9690022, 9792269, 9737182, 9714659, 9771785, 9832339, 10053276, 10158879, 10121252, 10285668, 10285131, 10232321, 10295554, 10271671, 10156244, 10045384, 10108100, 10026673, 9887546, 9921620, 9832856, 9747760, 9683175, 9705584, 9744312, 9626994, 9663552, 9688504, 9717224, 9866652, 10040432, 10026197, 10123319, 10199397, 10139962, 10207665, 10383429, 10515130, 10455878, 10440737, 10499682, 10560943, 10762216, 10885992, 10915561, 10862532, 10835929, 10940805, 11057310, 11230401, 11367586, 11438405, 11341339]
4320A1341339N8918N2193R3181K16311m4512l1718P8714K80895J89528J23075
4310A2357924l1180r5144J02419K39168L88266L45392M60353L61001J72481n196
4300A4295484P6636j14057k34517M7246P5614J78455L15188K81914K57097K14039
4290A5393099J26797P0520k19711j16104j24370Q7368K37276K34519L93586M34378
4280A6517358J72297R394M3459K21178Q6555L13330L27695M34741O94194O23334
4270A9443535P97003J157494J104774J241561J516720J923707K448005L017393
4262C2650192L682025L662802L007315K354982J563230Q26129N80854P14548P12698
4253D9754775O88442N60950O9396n19216j147392j597691j544865j448306j367119
$$ y = [11341339, 11400257, 11452450, 11545631, 11761942, 11717430, 11685712, 11764426, 12045321, 12234849, 12357924, 12326744, 12231600, 12334019, 12573187, 12961453, 13306845, 13767198, 14128199, 14300680, 14295484, 14372120, 14258063, 14023546, 14070792, 14146406, 14324861, 14640049, 14921963, 15179060, 15393099, 15519896, 15590416, 15370705, 15254601, 15130231, 15217599, 15454875, 15689394, 16082980, 16517358, 16689655, 16699049, 16742508, 16963686, 17050241, 17363571, 17691266, 18126007, 18820201, 19443535, 20240538, 21398032, 22502806, 23744367, 25261087, 27184794, 29632799, 32650192, 36332217, 39995019, 43002334, 45357316, 46920546, 47746675, 48327529, 49042077, 49754775, 50443217, 51004167, 51073563, 50554347, 49406955, 47809264, 46264399, 44816093, 43448974]
4244D3448974j446865j327196j031015j069677q31211p82591m60988m76523o98005
4235C5324903j153566j394712j948673k097393j861544j701847j387749j343588
4227B2435831j101419r41688n60858n06586m39418k47196k05397k72120j16549
4218A8044600p1103m6915j33928k9334j69776j19696j9706J18377Q6502R9132
4208A7758153K21310J30626M8627J45217K29625J42233L25607K00374K47692J71846
4198A9621310k0528J92527K14315K42891J58900K34405L03136K84824L80330K62407
4188B1874517L72300L81101M59346M28392O59371N73296N90437N15294O95096
4179B6549150P47984O07365P21820R92606R60396R16209J035780J049723J179490
$$ y = [43448974, 42002109, 40674913, 39643898, 38574221, 37743010, 36960419, 36499431, 36022908, 35324903, 34171337, 32776625, 30827952, 28730559, 26869015, 25167168, 23779419, 22435831, 21334412, 20392724, 19831866, 19325280, 18885862, 18638666, 18433269, 18161149, 18044600, 17973497, 17926582, 17792654, 17763320, 17593544, 17473848, 17454142, 17572519, 17659021, 17758153, 17979463, 18110089, 18158716, 18303933, 18533558, 18675791, 19001398, 19201772, 19449464, 19621310, 19600782, 19793309, 20007624, 20250515, 20409415, 20643820, 20946956, 21231780, 21612110, 21874517, 22246817, 22627918, 23087264, 23515656, 24175027, 24748323, 25338760, 25854054, 26549150, 27297134, 27904499, 28626319, 29618925, 30579321, 31495530, 32531310, 33581033, 34760523]
4170C4760523J517819J627976J842019K063134K369373K553759K704216K726008
4162E2164827K374386J763608J512290J177000R30935O50988M74792K75271O70367
4153F1994464Q46144J363478K193329K817698L332335L920666M436367M338866
4145H5243347L726076L225552K619452K770431K631502K818177K793472L022865
4137A08850874L457026L636817L944067N302975P579358J2178219K0515468L3122370
4129A98587174L9073704L4711624J6512159j2591067k5005431k6130991k2152219
4122B03004953j5382043q076066k530709k34354n97762j652815k581873k396531
4114A69552800j500745l31020L26041O97969R05551Q37695P40744N51196Q60294
$$ y = [34760523, 36278342, 37906318, 39748337, 41811471, 44180844, 46734603, 49438819, 52164827, 54539213, 56302821, 57815111, 58992111, 59923046, 60574034, 61048826, 61324097, 61994464, 62840608, 64204086, 66397415, 69215113, 72547448, 76468114, 80904481, 85243347, 88969423, 92194975, 94814427, 97584858, 100216360, 103034537, 105828009, 108850874, 112307900, 115944717, 119888784, 125191759, 132771117, 144949336, 165464804, 198587174, 237660878, 272372502, 288884661, 276293594, 251288163, 225157172, 203004953, 187622910, 179546844, 177016135, 176781781, 176184019, 174531204, 171949331, 169552800, 168052055, 167721035, 168047076, 168745045, 169650596, 170488291, 171229035, 171780231, 172640525]
4105A72640525P18749L00779j90767q40497j710154k217230k203228j822551n62328
4096A64113298J109384L451903N749039P710136R301380Q898339P721980O034610
4088B14090069N223721M901371N580820N804937N332848M141117K976397K817116
4080B50868396K632726J829200N10913j560607l055438l662481l502490l163675
4072B40896544j920822m42013J393296L184769M579052N449543N363132M200283
4064B62703784J877700q33746l466077n013927n086886l932399k438538m47884
4056B43362027J090892K356932L158256L228925K212253O03464j018688j797470
4048B53196591j817525j429395r83167j471007l042763l770879l161615k160830
$$ y = [172640525, 173359274, 173660053, 173469286, 172628789, 170918635, 168701405, 166498177, 164675626, 164113298, 165222682, 168674585, 174423624, 182133760, 191435140, 200333479, 208055459, 214090069, 219313790, 224215161, 229795981, 235600918, 240933766, 245074883, 248051280, 250868396, 253501122, 255330322, 255841235, 254280628, 251225190, 247562709, 244060219, 240896544, 238975722, 238533709, 239927005, 243111774, 247690826, 253140369, 258503501, 262703784, 264581484, 263747738, 260281661, 255267734, 250180848, 246248449, 243809911, 243362027, 244452919, 246809851, 249968107, 253197032, 255409285, 256012749, 254994061, 253196591, 251379066, 249949671, 248966504, 247495497, 244452734, 240681855, 237520240, 235359410]
4040B35359410j806167l249362o073156r071298j0507537j0596446r385433p669075
4032A77000936n371287k976426r28924N78449J516284J413369J273935J281575
4024A73787911P69591K13520n57255j662934k593543l157749l566063l246846
4016A59986632k530932j502918o9506J227296J233787r4085k722956n844340p992087
4007A41690891q660615p735004o369790m591947l138405j955053j336812j571504
3999A06331761j977347k637932k905358k701745k465724k141230j830685j626945
3991H8044795j520254j346581j060790r81388r84836j188048j204978j713593
3983G8044327k697928l241170l860525l846846l736636l143281k390946j896461
$$ y = [235359410, 233553243, 230303881, 224230725, 215159427, 204651890, 194055444, 184670011, 177000936, 171629649, 168653223, 167724299, 168302748, 169819032, 171232401, 172506336, 173787911, 174557502, 174771022, 174213767, 172550833, 169957290, 166799541, 163233478, 159986632, 157455700, 155952782, 155883276, 157110572, 158344359, 158250274, 155527318, 149682978, 141690891, 133030276, 125295272, 118925482, 114333535, 111195130, 109240077, 107903265, 106331761, 104354414, 101716482, 98811124, 96109379, 93643655, 91502425, 89671740, 88044795, 86524541, 85177960, 84117170, 83135782, 82150946, 80962898, 79757920, 78044327, 75346399, 72105229, 68244704, 64397858, 60661222, 57517941, 55126995, 53230534]
3975E3230534j424663j171171q82077q95637q29459p88897n92396l63449n93042
3966D5689743p02692j002267j312410j629693j724418j626330j714354j553683
3958C4423896j245312j102697j002823q87296p44924n59027m67959m40641m77890
3949B7495327j75576k22552j99374l79969k32090l59652j64787k85993l13502
3940B5161832l52228k63867j54591j64229j57740J1509O73j84785l1561k94390
3930B3570623j56905r9342j34509j40384p5215N0700l9068j32778J4m6657L6799
3919B2833278O244O2682J8069N9371k9353j9528J79301L23171K19121l4297K22121
3908B3840180J79315J08981O9599J19051L56939M77660M41359M76319M40351M31283
$$ y = [53230534, 51805871, 50634700, 49752623, 48856986, 48027527, 47238630, 46646234, 46282785, 45689743, 44987051, 43984784, 42672374, 41042681, 39318263, 37691933, 35977579, 34423896, 33178584, 32075887, 31073064, 30185768, 29440844, 28881817, 28413858, 27973217, 27495327, 27319751, 27097199, 26897825, 26517856, 26285766, 25926114, 25761327, 25475334, 25161832, 24809604, 24545737, 24391146, 24226917, 24069177, 24080686, 24081359, 23896574, 23865013, 23570623, 23413718, 23314376, 23179867, 23039483, 22964268, 23014968, 22975900, 22843122, 22843136, 22796479, 22833278, 22839522, 22902204, 22920273, 22979644, 22950291, 22930763, 23110064, 23433235, 23652356, 23618059, 23840180, 24019495, 24128476, 24198075, 24317126, 24674065, 25151725, 25593084, 26069403, 26509754, 26941037]
3898B6941037M82304M64442M91742N09401M63422N39914O48497O37251M76992
3889C1655002P36571R81457J126462J572087J891982K141215K074701K055709
3881D4235186K014185K104927K200523K349774K351088K246279J861130J299769
3873F0662861Q49965J001149Q47912P17920Q45707O72191N36757L34741N8708
3864F6527911P7577L27721M64336M37844N08916O00488M75531K22906m25553p22827
3854F8494850j002042j036790j024789r28337p40939j120808j186493j361203
3846F0093449j435561j177022j336624j063226m97384m04376K2566K30912L93331
3837E4826065M56161L44177N18816L19649J52270J78330J45343J17738P2191r2305
$$ y = [26941037, 27423341, 27887783, 28379525, 28888926, 29352348, 29892262, 30540759, 31178010, 31655002, 32391573, 33373030, 34499492, 36071579, 37963561, 40104776, 42179477, 44235186, 46249371, 48354298, 50554821, 52904595, 55255683, 57501962, 59363092, 60662861, 61512826, 62513975, 63361887, 64079807, 64925514, 65597705, 66134462, 66469203, 66527911, 66605488, 66933209, 67397545, 67835389, 68344305, 68944793, 69420324, 69643230, 69217677, 68494850, 67492808, 66456018, 65431229, 64502892, 63761953, 62641145, 61454652, 60093449, 58657888, 57480866, 56144242, 55081016, 54583632, 54179256, 54201822, 54432734, 54826065, 55282226, 55626403, 56145219, 56464868, 56617138, 56795468, 56940811, 57058549, 57130740, 57038435]
3827E7038435j54024r364J2674o5221L90235N31536N75912M96364M11504K00778
3817E9428829J84339K03296K05376N11819Q98595P84828O24381M69890J48349
3808F3459702Q1481Q5281j7259N8569O40870Q53837J059833J301477J399506J396480
3798G0319777J313488R55026N97916Q3700n00807j218498j131151j272320j314400
3789F7832731j058837o85584M4075R03567J517577J903111J879848J437368P93138
3780G4566994j47240j061553j682397k024290k295383k196225j906740j639718
3772F1613448j249999q05299l46723J28814K99379L80662J43144j51166k95175
3763E9717085l84293o05059m29408k85896O5197q1601n14378q95662j205239j630494
$$ y = [57038435, 56884411, 56875047, 56887721, 56822500, 57212735, 57744271, 58320183, 58816547, 59228051, 59428829, 59613168, 59816464, 60021840, 60533659, 61432254, 62217082, 62841463, 63311353, 63459702, 63541183, 63626464, 63609205, 63667774, 64308644, 65162481, 66222314, 67523791, 68923297, 70319777, 71633265, 72588291, 73186207, 73269907, 72769100, 71550602, 70419451, 69147131, 67832731, 66773894, 66088310, 66132385, 67035952, 68553529, 70456640, 72336488, 73773856, 74566994, 74419754, 73358201, 71675804, 69651514, 67356131, 65159906, 63253166, 61613448, 60363449, 59558150, 59211427, 59340241, 59639620, 60020282, 60163426, 60012260, 59717085, 59332792, 58727733, 58298325, 58012429, 58077626, 57996025, 57481647, 56585985, 55380746, 53750252]
3753E3750252j418179j277782j089189m78206k10052J27456N88021R59476J119636
3744E2071433R91133L12870j71203p37854j161671j266826j063132o47896j66373
3735D8160481J32044M60050N74672M94342L57929K63599K39959J91589K24572
3726E1099237N98901J060542J261620J372248R31317N63191k3732l22468j68016
3717E6372840r7174J67133J95296J26049o5910l30701q77324n38913m09074O709
3707E4548931P42994J046067J348033J456699R89372M80469j03238n03675p26668
3698E9278984p33959o98367q73646j003731j148509j398103j392917j129102j111463
3689D9789187j171289j138444q14804n44350k04849k14009L2859j90945l92889
$$ y = [53750252, 52332073, 51054291, 49965102, 49486896, 49276844, 49404300, 49992321, 50951797, 52071433, 53062566, 53375436, 53204233, 52466379, 51304708, 50037882, 48974750, 48326854, 48160481, 48292525, 48752575, 49327247, 49821589, 50179518, 50443117, 50683076, 50874665, 51099237, 51698138, 52758680, 54020300, 55392548, 56323865, 56887056, 56863324, 56540856, 56372840, 56275666, 56442799, 56638095, 56764144, 56698234, 56367533, 55490209, 54951296, 54542222, 54548931, 55291925, 56337992, 57686025, 59142724, 60132096, 60612565, 60509327, 60005652, 59278984, 58545025, 57846658, 56973012, 55969281, 54820772, 53422669, 52029752, 50900650, 49789187, 48617898, 47479454, 46664650, 46120300, 45915451, 45701442, 45734301, 45543356, 45150467]
3680D5150467l69303l03609q0149L26390N41672J093568J663438K441857K936320
3671E3400651K955899K514295J660188P90358K28106J75818K23047N15053R60908
3662F3424323J482004J758752J760303J664891J341488R19383Q34369R68698J041597
3653G5195808O42912L2250k32160l20358j00392L85959O56417L45317j8177r71401
3643G5616175j887140k096154j905430j579809j082475q93310q93346j018361
3635F4260150r72432r96331o12905J2876P78092J700290J740318J220418O7763
3626F7198239j397195j868914j816245j482563l25680O17146J489168J708683
3618F4122639J302670M18390o14532j142894j225686j240037j045423r73823j061201
$$ y = [45150467, 44781164, 44477555, 44397406, 44723796, 45265468, 46359036, 48022474, 50464331, 53400651, 56356550, 58870845, 60531033, 61321391, 61549497, 61725315, 61948362, 62463415, 63424323, 64906327, 66665079, 68425382, 70090273, 71431761, 72351144, 73185513, 74154211, 75195808, 75838720, 75870970, 75638810, 75318452, 75218060, 75604019, 76260436, 76605753, 76587576, 75616175, 73729035, 71632881, 69727451, 68147642, 67065167, 66171857, 65278511, 64260150, 63287718, 62291387, 61678482, 61691358, 62469450, 64169740, 65910058, 67130476, 67198239, 65801044, 63932130, 62115885, 60633322, 60307642, 60924788, 62413956, 64122639, 65425309, 65843699, 65229167, 64086273, 62860587, 61620550, 60575127, 59601304, 58540103]
3609E8540103j391952j203946j023788p11340k32255Q7588L76706N32734P88284
3600E5762134R36292J298959J803528K232616K636585K973209K850064K326445
3592G2819832J689002J238824N82090Q4683J24884N12687J353090K195742K828909
3583H3429743K579100K062725P58970o6985o16467j069138j599555k164733k894389
3574H0419271l361469l902097m144522m026922l570128k783137j612680p12012
3566E6306304J3425Q9736r8505o89470j398308j527848j381409r78384j90785
3557E0144756q6257p46394j438995j707106j598677j335702p52273l57137n5645
3548D2066570r0766K40959K89129L77528O44836J199027J837570K655481L169965
$$ y = [58540103, 57148151, 55944205, 54920417, 54209077, 53976822, 54064410, 54441116, 54973850, 55762134, 56698426, 57997385, 59800913, 62033529, 64670114, 67643323, 70493387, 72819832, 74508834, 75747658, 76329748, 76414431, 76539315, 77052002, 78405092, 80600834, 83429743, 86008843, 88071568, 88830538, 88763553, 88147086, 87077948, 85478393, 83313660, 80419271, 77057802, 73155705, 69011183, 64984261, 61414133, 58630996, 57018316, 56306304, 56319729, 56409465, 56310960, 55621490, 54223182, 52695334, 51313925, 50335541, 50144756, 50058499, 49312105, 47873110, 46166004, 44567327, 43231625, 42479352, 42122215, 42066570, 41975804, 42216763, 42505892, 42883420, 43528256, 44727283, 46564853, 49220334, 52390299]
3539E2390299L007306K354778J494992O50618J64083n0357k91009l99966m48496
3530E8872248m39412J037N2219O6161m23662r95526j521775j810261k009141j672381
3520E0119507j354521p63252J91715R34327J530666J813641J618595J700987J811915
3511E7603580K244045K565332L113428L520608M232947M129679K771882J77614
3503H0359115k494839m450718n018275n002386m941066m533303m019297l743884
3495D6155347l246541k727466k215949j812766j320337j029369r29990o26140
3487C2246789o78687m29610m04611m12598o03678o24803n40927k65458k24529
3478B8061888k16979j41250N1625j25412j55629j71138r7009k71516k19453l87384
$$ y = [52390299, 55397605, 57752383, 59247375, 59897993, 60062076, 60011719, 59720710, 59320744, 58872248, 58432836, 58433873, 58486092, 58552253, 58128591, 57133065, 55611290, 53801029, 51791888, 50119507, 48764986, 48001734, 48193449, 49127776, 50658442, 52472083, 54090678, 55791665, 57603580, 59847625, 62412957, 65526385, 69046993, 73279940, 77409619, 80181501, 80359115, 77864276, 73413558, 68395283, 63392897, 58451831, 53918528, 49899231, 46155347, 42908806, 40181340, 37965391, 36152625, 34832288, 33802919, 32872929, 32246789, 31568102, 31138492, 30733881, 30321283, 29717605, 29092802, 28551875, 28286417, 28061888, 27844909, 27703659, 27755284, 27629872, 27474243, 27303105, 27206096, 26934580, 26715127, 26327743]
3468B6327743j68941r9344Q8879M6371J75969M87649M35351M67150L29033J77588
3458B8267448K66712L5183j90660j55546j92078n6964L7214K17048L72823K4047
3448B8625227J64163L54495l7768o4993q9715K0760o5257r4724J72433K37245
3438B9221866L18373O78431O19977N11848N79725O53779O09924O87853R85736
3429C4867512J584031K693036L886058M438241M047300K384722J68628j723535
3421E2345993l008440l318983k942887k465312j871417j051971q62737k89703
3413C6534543J82141N48458J059973J716376K542656L685751M952499O020274
3405E7242671N725114M198761K014438j63755j081977m12456Q65857J879964J832802
$$ y = [26327743, 26158802, 26059458, 26148337, 26194708, 26370677, 26858326, 27293677, 27760827, 28089860, 28267448, 28534160, 28569343, 28378683, 28223137, 28031059, 27974095, 28011309, 28228357, 28601180, 28625227, 28789390, 29143885, 29106117, 29041124, 28951409, 28972169, 28906912, 28812188, 28984621, 29221866, 29540239, 30218670, 30838647, 31350495, 31930220, 32583999, 33193923, 33881776, 34867512, 36451543, 39144579, 43030637, 47468878, 51516178, 53900900, 54069528, 52345993, 49337553, 46018570, 43075683, 40610371, 38738954, 37686983, 36824246, 36534543, 36716684, 37265142, 38325115, 40041491, 42584147, 46269898, 51222397, 57242671, 62967785, 67166546, 69180984, 69017229, 67935252, 67522796, 68388653, 70268617, 72101419]
3396G2101419M11076j688584l781273n025260n198355m708433l927582l258957
3388D4924051k594831j953510j459667q44044m25832j17767K33569K84997K50706
3379C8297672L01032L36526K66838M17426P22719O88312M61502M74070N86891
3370D2552988N16347P44837R76676J368806J776354K632484L751442N007490N833116
3361F5160540O145415N542532L953421K082025N52833L84825J255263K254154
3353H7331008K785910K223417M20258j453301l144947m176390m388656m051866
3345G5545433l022837k080605r82836m043M82264J181306K175227K997217L660986
3336G9952112M149879M141260L644038L050187K198022K286894L726141O104807
$$ y = [72101419, 72512495, 70823911, 67042638, 62017378, 56819023, 52110590, 48183008, 44924051, 42329220, 40375710, 38916043, 38071999, 37646167, 37528400, 37761969, 38046966, 38297672, 38598704, 38935230, 39202068, 39619494, 40342213, 41030525, 41492027, 41966097, 42552988, 43069335, 43814172, 44790848, 46159654, 47936008, 50568492, 54319934, 59327424, 65160540, 71305955, 76848487, 80801908, 82883933, 83436766, 83821591, 85076854, 87331008, 90116918, 92340335, 92760593, 91307292, 88162345, 83985955, 79597299, 75545433, 72522596, 70441991, 69459155, 69455112, 69937376, 71118682, 73293909, 76291126, 79952112, 84101991, 88243251, 91887289, 94937476, 97135498, 99422392, 103148533, 109253340]
3328A09253340Q763980J0216148Q311448L456442k782760p274741r113382r029729
3320A11800746p502902n472192l621828k194858m30104J146518K228356K993545
3312I8947281L436415M029873N110447N995536N923714M766924K713772N9808
3304A30983770j536839k200917j053990J514249N042665R044787J2371150J3156082
3296A67320957J0662340N289755m95399m571004o291591o018537m620641l137233
3288A58138647j701383p56090L87122K076556L937489P044715J1490219J8775089
3280A99392364K9361100M3295976N6551393O1894610N2471358K7446461n608411
3273D64804851l4192340m9983489n2941143m7151599l7591510k8229478k0224751
$$ y = [109253340, 118017320, 128233468, 136544916, 140001358, 137218598, 129943857, 120830475, 111800746, 104297844, 98825652, 95203824, 93008966, 92578862, 93725380, 95953736, 98947281, 102383696, 106413569, 111524016, 117519552, 123443266, 128210190, 130923962, 130983770, 129446931, 127246014, 126192024, 127706273, 132748938, 141793725, 154164875, 167320957, 177983297, 183273052, 182777653, 178206649, 171915058, 165896521, 161275880, 158138647, 156437264, 155681174, 156068296, 158144852, 162082341, 169127056, 180617275, 199392364, 228753464, 272049440, 328600833, 390495443, 442966801, 470413262, 464804851, 430612511, 380629022, 327687879, 280536280, 242944770, 214715292, 194490541]
3266A94490541j3968378q856138m741372p85340L542326Q361869J3490810J8528950
3258B10063268K1643934K2496401K0901202J7613280J3546773R896572O687092
3251C22848522M060884K052580M93955j432654m831684r840026j5486366j9957619
3243B77907592k2299991k1457588j8335024j4195810j0015635o340029l566269
3236A81697246n62756L308768R545414J9409435L2300040M5689230N3450837M9657484
3228C94495698L1506078M047831k3572554m3460934n1529032n0173711m3107531
3221B18205845l4718826k6819642k0518075j5565809j2133444r480585p811581
3214I1157883o561512n793223n052989m191107l427736k723502k123159j716006
$$ y = [194490541, 180522163, 171666025, 166924653, 166139313, 169681639, 178043508, 191534318, 210063268, 231707202, 254203603, 275104805, 292718085, 306264858, 316161430, 322848522, 326909406, 328961986, 329455941, 328023287, 323191603, 313351577, 297865211, 277907592, 255607601, 234150013, 215814989, 201619179, 191603544, 185263515, 181697246, 181134490, 184443258, 193988672, 213398107, 245698147, 291387377, 344838214, 394495698, 426001776, 430049607, 406477053, 363016119, 311487087, 261313376, 218205845, 183487019, 156667377, 136149302, 120583493, 108450049, 98969464, 91157883, 84596371, 78803148, 73750159, 69559052, 66131316, 63407814, 61284655, 59568649]
3206E9568649j468811j274302r92860p32882m55787m35075o87785p34384m71336
3197E2315427n87960l63900J59826L19125N79872Q25745P96778Q77790J197069
3188E6119772J283353J402124J616908J580062J297988J106207Q88377Q34794
3180F6129585Q68606J679604K737272M050779O103320Q575501J0491086J0737854
3172A11373607Q907567M735825k78351n089933q647804r939037r806302q860300
3164H2395272p242155n422391l686046j928102k07995J325069J975175K067237
3156F9276064J450992M27925p93449k176556l373820m527906m785862m604607
3148E0892781m176101l288552k588909k200789j742890j264551q58179p50273
$$ y = [59568649, 58099838, 56825536, 55832676, 55099794, 54644007, 54208932, 53521147, 52786763, 52315427, 51727467, 51363567, 51523393, 51842518, 52422390, 53248135, 54044913, 54922703, 56119772, 57403125, 58805249, 60422157, 62002219, 63300207, 64406414, 65294791, 66129585, 66998191, 68677795, 71415067, 75465846, 81569166, 90144667, 100635753, 111373607, 120281174, 125016999, 124738648, 119648715, 111000911, 101061874, 91255572, 82395272, 75153117, 69730726, 66044680, 64116578, 63908583, 65233652, 67208827, 69276064, 70727056, 71154981, 70361532, 68184976, 64811156, 60283250, 55497388, 50892781, 46716680, 43428128, 40839219, 38638430, 36895540, 35630989, 34772810, 34022537]
3140C4022537q17079m87595n06050p83238q14658n74716l97326m08092k37581
3131B8996202K15026N49086O80131P30669N79494p0003l28188n46670p20113o77754
3121B9407880n72034l22598j85306j3082M39706N03050P06878J147903J028263
3112C2140660Q87510R43776J004377J075118J237692J416166J539124J720009
3104D1964432K026439K305259K847625L685251M870191O642544Q316668R745101
3096H2403510J0379239R071743O220544K246746j399898l721007m556127m021059
3088I6623691k799144r71278R47964L342688N787197Q101105J0043385J0190064
3080A31265672Q759583O107608L929332L103051M969893J0600276J8872380K8702438
$$ y = [34022537, 33205458, 32717863, 32211813, 31428575, 30613917, 30039201, 29641875, 29233783, 28996202, 29211228, 29760314, 30440445, 31171114, 31750608, 31680605, 31352417, 30805747, 30085634, 29407880, 28835846, 28513248, 28327942, 28314860, 28754566, 29257616, 29964494, 31112397, 32140660, 33028170, 33971946, 34976323, 36051441, 37289133, 38705299, 40244423, 41964432, 43990871, 46296130, 49143755, 52829006, 57699197, 64341741, 72658409, 82403510, 92782749, 101854492, 108075036, 110321782, 108921884, 105200877, 100644750, 96623691, 93824547, 92853269, 93801233, 97143921, 102931118, 111032223, 121075608, 131265672, 140025255, 146132863, 150062195, 153165246, 158135139, 168735415, 187607795, 216310233]
3072B16310233L7180890M0842982L5880002K2346608L099829j7017983l2530112
3065C06112449m0848672m2074320l8251010l2338083k6046541k0501439j6124687
3058H9927697j2801436j0035803q192476o664685n455320m397873l608052k973239
3050C5798813k382428k027888j639397j599758j479013j434017j347821j090578
3042B2797913r40263j049286j082569q44801r63590q57428p07019q80552p90327
3033A4682078o83242o41283m88068n28027n23731m53559l70474m00637n13279
3024A0079778l27040m27611k34048n3868l04800j40085j43163k97709o806k37545
3014G907103j96484k03681j79230j73224J28544k78354l92711r1204q9350k29752
$$ y = [216310233, 253491123, 294334105, 330214107, 352560715, 355660544, 338642561, 306112449, 265263777, 223189457, 184938447, 152600364, 126553823, 106052384, 89927697, 77126261, 67090458, 58897982, 52233297, 46777977, 42380104, 38772052, 35798813, 33416385, 31388497, 29749100, 28149342, 26670329, 25236312, 23888491, 22797913, 21857650, 20808364, 19725795, 18880994, 17917404, 17059976, 16352957, 15472405, 14682078, 13998836, 13357553, 12869485, 12341458, 11817727, 11364168, 10993694, 10593057, 10079778, 9752738, 9325127, 9091079, 9037211, 8732411, 8592326, 8449163, 8151454, 8144648, 7907103, 7710619, 7506938, 7327708, 7154484, 7283028, 7004674, 6611963, 6520759, 6431409, 6201657]
3004F201657k45505j85841k12943n6257j06809q9664r2260m1742J97762K22799
2994E591197K36037P3709L4952k46434k69389k52776m61767k14037j90095k72351
2984D029046j01714k75246O3642k19635j35784q7122o6172j3455m8987J87350
2974C331923J29519J68085m104j6862l0586l3181r2060J9879M0526l7908j77604
2963C297627l7346j02420q1270k15788q4541J2153k16634k3693j8939k08444j826
2952B318879l2032M0500O2462J15715K02383K46291J99425J65614J29901n3654
2942C395484k00940j29512j90850l48483j67493k27324k45905k32569k10720l4854
2932A406834q7241M6485j57720j51018k2989P0747m7413J9419j7057j41834j11215
$$ y = [6201657, 5956152, 5770311, 5557368, 5501111, 5394302, 5304638, 5212378, 5170636, 5368398, 5591197, 5827234, 5900943, 5935895, 5689461, 5420072, 5167296, 4705529, 4491492, 4301397, 4029046, 3927332, 3652086, 3715728, 3496093, 3360309, 3273187, 3207015, 3193560, 3144573, 3331923, 3461442, 3629527, 3625423, 3608561, 3577975, 3544794, 3452734, 3472613, 3513139, 3475231, 3297627, 3260281, 3157861, 3076591, 2860803, 2776262, 2788415, 2571781, 2548088, 2529149, 2320705, 2318879, 2286847, 2327347, 2389809, 2505524, 2707907, 2954198, 3153623, 3319237, 3449138, 3395484, 3194544, 3065032, 2874182, 2525699, 2358206, 2130882, 1884977, 1652408, 1441688, 1406834, 1319593, 1366078, 1208358, 1057340, 1034351, 1105098, 1057685, 1077104, 1060047, 918213, 806998]
2921H06998n1919r4916R2377p1882K6569j45417r6932L9402n2999O8896k458J94263
2909G11982R6906j38291j21951r4517J6608J31275p242L4968j1923j19642L6166
2898E34339J27610J04338p6244k49585l1738R2243j771J922M1878J72591R3426
2887H09009R7603J33722j14124r4126M9663J59763p5430j05901j24163R1942l523
2876H24435n3724P452m9690J47967J3278j91547M9509p7464N2887K9001q7255
2865F64849p7388k6956j19202L1906K08609r4496j85653J17159p5060j2440P9773
2854E11101Q570P226J1079k2901j9554K5490M2149R8402M5715k6362m5124j30916
2842E04875j51723p2119J05488p3968j17640k3854N1124O6575p7562L3416m3813
$$ y = [806998, 755079, 660163, 752540, 680658, 707227, 561810, 464878, 504280, 451281, 520177, 517719, 711982, 808888, 670597, 548646, 454129, 470737, 602012, 594770, 629738, 617815, 498173, 534339, 661949, 766287, 690043, 440458, 408720, 500963, 499192, 501114, 542992, 715583, 809009, 906612, 1040334, 926210, 832084, 881747, 1041510, 966080, 860179, 736016, 827958, 824435, 770711, 778163, 728473, 876440, 889718, 698171, 747680, 670216, 723103, 752104, 664849, 587461, 560505, 441303, 473209, 681818, 587322, 401669, 518828, 443768, 431328, 511101, 519671, 526897, 537976, 515075, 495521, 521011, 563160, 661562, 707277, 680915, 635791, 504875, 353152, 281033, 386521, 312553, 194913, 171059, 222183, 288758, 211196, 244612, 200799]
2831B00799K9390O5610J8964p4674N3757k4701L5678K8190o8735j03907J4020
2820A74391N3716N908q1655M8735O5498Q0043n0414L1349J10662J19871j4525
2809E43579P5797m453R159M7869L1547p3785q0602m6036k516J57984j762p0744
2797E86037J6980J110J15480M887o9104J1608o334j45840L83774L02868M3747
2786A245213L26300K06439P1464k73013p8776k00434p1683l47909j72707r3671
2776F11223k51840q4061q4671N526N0071l9919j04154P6546K5698j36398K073
2765G0094L8622r2146j15838L9723M7030n89r2947k12928n4538J58606J65090
2754d9821j61937o8775J75454J23286j10736j25820j7534r2208q2651l4524J63060
$$ y = [200799, 230189, 295799, 314763, 240089, 293846, 269145, 304823, 333013, 264278, 160371, 174391, 228107, 234015, 152360, 201095, 266593, 346636, 296222, 327571, 438233, 558104, 543579, 619376, 614923, 624082, 671951, 703498, 629713, 549111, 503075, 500559, 658543, 656781, 586037, 603017, 604127, 719607, 724494, 655390, 666998, 660664, 514824, 898598, 1201466, 1245213, 1571513, 1777952, 1849416, 1576403, 1497627, 1297193, 1225510, 877601, 704894, 611223, 359383, 275322, 190651, 196177, 246248, 206329, 102175, 178721, 204419, 68021, 70094, 108716, 16570, -99268, -59545, -12515, -13104, -106051, -318979, -373517, -214911, -49821, -211758, -280533, -105079, 18207, -92529, -218349, -235883, -328091, -410742, -445266, -282206]
2743b82206J19522L7282j24359P7881Q4692l9462m3000L1730k54125l5246J65421
2732b61870J31156j8207n9328o000j24472L2845J35472r997n8593n9458R1289
2721b07163R7329j35253J15619l2578m7903o4300n4089J3505J7799j03918K05057
2710a95895N5504m6027J1962R144Q5775K7814K61m2721J8050K3841l3109n4396
2698a39797m0646j35083m5761J15537j9716k3292J9914N2160M4018j27965J19898
2687a80733N0027j6655k3908N7004m2172r040J65145Q86l1789O7840Q2430r4139
2675B4896r9308j63611N2240O9721Q891J08533q962p2011J85822J00577j25551
2664H1237q0909J17461l3552R2027m991N6803M9785k9984P946n9028k1419k6708
$$ y = [-282206, -162684, -125402, -249761, -171880, -87188, -126650, -169650, -137920, -392045, -427291, -261870, -130714, -148921, -208249, -214249, -338721, -305876, -170404, -180401, -238994, -298452, -207163, -109834, -245087, -129468, -162046, -209949, -274249, -328338, -314833, -297034, -400952, -195895, -140391, -186418, -174456, -165312, -79537, -51723, -51462, -94183, -76133, -52292, -85401, -139797, -180443, -315526, -361287, -245750, -265466, -288758, -268844, -216684, -172666, -300631, -180733, -130706, -147361, -171269, -114265, -156437, -165477, -332, 554, -31235, 36605, 119035, 24896, -74412, -238023, -185783, -116062, -107171, 1362, -7600, -79611, 106211, 206788, 81237, 328, 117789, 84237, 176264, 171273, 228076, 277861, 247877, 255823, 196795, 175376, 148668]
2652A48668l4540p3950n486N2504j6420j18489P4269L4043j17703J8408M2478
2641C782J7325J69458R2653J76220j33397k4505k2076o810P0507j73047m0795
2630A29315j00956j17039m2295Q8172R5068L898j03864M413Q726o3501J9776J1254
2618f7033p2222L659o4090o6079J881j29437J37411j36701P0277J21624M4284
2607a56426K4521K4833m5239j13861J13487L5187j21529j5421J90283l0220l2244
2596a26629M3936N7370j55028J9518O2001L5902O3835k8683n6241n8919n8917
2585b01855k2801p1393J5449R7720K4461O0184j05053K2695J06590q3432l7916
2574a95351j28626l685K54624q4887j20263M2462N3839J6043O728P3980m9977
$$ y = [148668, 114128, 40178, 34692, 87196, 70776, -47713, 26556, 60599, -57104, -38696, 3782, 21107, 190565, 283218, 459438, 326041, 301536, 279460, 272650, 343157, 170110, 129315, 28359, -88680, -130975, -42803, 52265, 56163, -47701, -43288, -34562, -98063, -78287, -67033, -139255, -135596, -199686, -265765, -263884, -393321, -255910, -392611, -322334, -200710, -156426, -131905, -107072, -152311, -266172, -152685, -117498, -239027, -254448, -64165, -94385, -126629, -82693, -25323, -180351, -160833, -98832, -62930, 905, -27778, -84019, -142938, -201855, -224656, -296049, -280600, -182880, -158419, -98235, -203288, -180593, -74003, -157435, -195351, -323977, -327662, -73038, -157925, -278188, -235726, -181887, -165844, -159116, -85136, -135113]
2563a35113P5469N4314j85545j7157M6556O3518K10631k2174k21480K2829j13047
2552b21199R2058m0673K1470J16288m7666L8873K7461n8106Q05J0917j5262J8520
2540e6514o8223n5951m4371N4790N9100L8985J2276L2300Q6914j85118j1712J28871
2528h653n9099M183N6731N933N5124k9694k01472J07956m7134J9148o1663M8070
2516a10570q1450K1363N0963K8062K8639j7067m041o9960m7399J07511J32152
2505C8203K0751j00481l853K3447J01586q5261k0116M7154l1437K5268m2522n1111
2493g8372m1167J03502M7358n5557K4730M4817q3456n6896m1965R0477M6522q47
2481h54k5058M6673j9344O4595j000R0694k6867j23671N8844J49234O6777N4484
$$ y = [-135113, -59644, -5330, -190875, -208032, -161476, -97958, 112673, 90499, -130981, -108152, -221199, -129141, -169814, -148344, -32056, -79722, -40849, -13388, -71494, -70689, -59772, -75034, -56514, -124737, -180688, -225059, -170269, -111169, -72184, -59908, -27608, 59306, -125812, -137524, -8653, -67752, -63569, -6838, -905, 54219, 24525, -176947, -68991, -116125, -96977, -158640, -110570, -192020, -170657, -119694, -91632, -62993, -80060, -84101, -154061, -201460, -93949, 38203, 58954, -41527, -45380, -21933, 79653, -5608, -25724, 21430, -10007, 15261, -27261, -78372, -119539, -16037, 31321, -24236, 494, 45311, -38145, -95041, -137006, -46529, -7, -854, -25912, 20761, 1417, 66012, 65012, 155706, 128839, 5168, 64012, 213246, 280023, 334507]
2469C34507j27183m6738K2302j78088L9469J25870N3453k7227j8476K9839m8811
2458A58917k0772L8133J16368L437M9572q6681L9023n6901J02057R2318N2724
2447D88195Q9386K2872J5767p3331M9159O0358o9399n0853q5614O8320k0723r9340
2435C94797N1533l3788Q4770j6234n4315L5623k8577J24407J3276j29613J25157
2424E67036K3712J47169j6254L3387n2202L3560n9626Q9325O2689O4608K9115
2413I22519j9955J70823q4800j0583M4704K09926k3899L8057R6424P8571m0397
2402A381390L3253m005J4486J14713N8231Q4201k986J70021J93085J64579K32680
2391B439648J86865K71771K47082J66643M48279O57083P15654O46145M05373K13721
$$ y = [334507, 207324, 160586, 182888, 4800, 44269, 170139, 223592, 196365, 177889, 207728, 158917, 138145, 176278, 292646, 296083, 345655, 258974, 297997, 241096, 343153, 435471, 488195, 577581, 600453, 616220, 542889, 592048, 652406, 583007, 532154, 446540, 514860, 494137, 394797, 446330, 412542, 497312, 481078, 426763, 462386, 433809, 558216, 571492, 441879, 567036, 590748, 737917, 721663, 755050, 702848, 736408, 676782, 766107, 828796, 893404, 922519, 902564, 1073387, 988587, 978004, 1022708, 1232634, 1208735, 1246792, 1343216, 1421787, 1381390, 1414643, 1410638, 1425124, 1539837, 1598068, 1682269, 1679283, 1849304, 2042389, 2206968, 2439648, 2626513, 2898284, 3145366, 3312009, 3760288, 4417371, 5133025, 5779170, 6184543, 6398264]
2381F398264K36046J48282M68167P07803R41838J185854J808298K684112M070358
2372A8649022O894041J4359472K0187542J6176150L965526j0140638j5880898
2365E4210217j3133225r813525p203019n270083l955799l146864k543588j670102
2357G474012r69692o20708j07504j01739k84098o08540n81356l67387m48082l64196
2347C020710l04368k47470l24862j71315j6493k28345j33211j21977k03118j23549
2337A146002N5697k0642j86812m3530r7824q9638j17444j29996j30169K62293
2327F47937n347K4435j20941m6113j28585K8660Q953r9808K4735J08751O5320
2316E07997j15984L099N6192j80816J1925L2967L9554l6335r7085l8319o5834
$$ y = [6398264, 6634310, 6782592, 7250759, 7958562, 8900400, 10086254, 11894552, 14578664, 18649022, 25543063, 39902535, 60090077, 76266227, 80231753, 70091115, 54210217, 41076992, 31263467, 24060448, 18790365, 14834566, 11687702, 9144114, 7474012, 6504320, 5883612, 5776108, 5674369, 5390271, 4781731, 4200375, 3832988, 3384906, 3020710, 2716342, 2468872, 2144010, 1972695, 1956202, 1727857, 1594646, 1472669, 1269551, 1146002, 1201699, 1181057, 994245, 950715, 852891, 763253, 645809, 515813, 385644, 647937, 642590, 667025, 546084, 499971, 371386, 400046, 408999, 309191, 333926, 442677, 507997, 392013, 395112, 451304, 270488, 282413, 315380, 354934, 318599, 221514, 183195, 117361]
2305A17361K181J5899J06366p4502r1043O3277r0203O2418j6830l7842n0294J07691
2293A14479J44812m1440o5473o4228K1084l8151j7043R1388j44759K72N4298o2810
2281g571J35806j4571K9108o0042j42415n4985N1009J42541j42759J09563M3180
2270H8864q2616Q5961j43211j71952K1815J73842L800k8262j79934m5539L638
2259b73594J67770K5704J09643k8219j81792N7281O9177k00687K25046N7744j25463
2248i7390Q0768r2925j5223R445n4285N958p3004N2009L5049K1714J7650J13070
2236B836o1849j92968N8992k8163r0739P883J67380k9884m9699L9321n6308l5329
2224b68527k958M2595O802o6246K3688K6593K5355J773J20247q5029o2098N8745
$$ y = [117361, 119542, 135441, 241807, 167305, 76262, 139539, 49336, 111754, 94924, 57082, 6788, 114479, 259291, 217851, 152378, 88150, 109234, 71083, 54040, 145428, 669, 941, 55239, -7571, 128235, 113664, 142772, 82730, -59685, -114670, -63661, 78880, -63879, 45684, 88864, 6248, 92209, -51002, -222954, -201139, -27297, -23497, -51759, -231693, -277232, -273594, -105824, -80120, 29523, 1304, -180488, -123207, -54030, -254717, -29671, 28073, -97390, -16622, -109547, -124770, -115325, -169610, -163652, -236656, -184647, -149598, -127884, -110234, 2836, -59013, -251981, -192989, -221152, -311891, -304008, -136628, -166512, -216211, -176890, -233198, -268527, -271485, -228890, -222088, -288334, -264646, -238053, -212698, -210925, -90678, -175707, -237805, -179060]
2212a79060j44595q795M266M2929J43791J45348k25812k6821J66519j24514k0180
2201b26924J0050m3580O3446K8250M1523R2067n3331r7510O7957l8600p1050n0226
2189b77928m8703J23946j08718P3542J19701m435n4799o4998L4512N7172J42511
2178h197L0807k42787m4177J00860j32147J3373P4784J1474l6166J4123L0476
2167a87577K0740l918o2514K7657M1394l3473k6823o5536j7327P7899K8310J2168
2155a89000l3458L3628R8351J22379j48608k4764L6319p4428j6241m90l6333J4649
2143b17996N3927m9347j10902J30618j18770J03179J25655q4692j6403r4206o9568
2132c48505J31750M0398O7660J73458j41315j35249M6775k2193J0130J43817j02265
$$ y = [-179060, -323655, -332450, -328184, -285255, -141464, 3884, -221928, -248749, -82230, -206744, -226924, -216874, -260454, -197008, -168758, -127235, -35168, -88499, -186009, -118052, -156652, -227702, -277928, -326631, -202685, -311403, -237861, -118160, -122595, -177394, -242392, -207880, -150708, -8197, 22610, -220177, -264354, -163494, -295641, -282268, -207484, -196010, -232176, -218053, -187577, -166837, -170755, -233269, -205612, -164218, -197691, -224514, -290050, -307377, -229478, -201168, -189000, -222458, -188830, -90479, 31900, -116708, -141472, -105153, -179581, -195822, -196312, -232645, -217996, -164069, -213416, -324318, -193700, -312470, -209291, -83636, -168328, -184731, -278937, -348505, -216755, -176357, -108697, 64761, -76554, -211803, -165028, -187221, -177091, -33274, -135539]
2121a35539j5461l5904j01346R1264N6437j2721r4235Q2313O5872L7557k7374
2110h9137m4713k7313l1318O9186O8285j2033O6199J05367R3324P8778k9062J29218
2098C76781l0239J388j07758k17807n9588M0901j34376j24540R2896N9374K9810
2087g3158n0287j3934L4922n5368p8878m6077J9320K01377j42246j73151J24527
2076b52953k1628P7620L9872M3110O7437j13104q3111J80710q915j32105n5017
2065b58084o173P8120K1117j13708M5510J7724J63642m4503j9483j2822j24253
2054b52913J00631N2424O0350J9392k4181q5258N2665K1979q5720K8009N506L2039
2042g5077K5280R3447k5427j46143j10751N6574J5833K625O9895P8900j41449
$$ y = [-135539, -151000, -186904, -288250, -196986, -140549, -153270, -247505, -165192, -99320, -61763, -89137, -133850, -161163, -192481, -123295, -55010, -67043, -844, 104523, 197847, 276625, 247563, 376781, 346542, 347930, 240172, 22365, -37223, 3678, -130698, -255238, -162342, -102968, -73158, -123445, -137379, -102457, -157825, -236703, -282780, -263460, -62083, -204329, -377480, -252953, -274581, -196961, -157089, -113979, -46542, -159646, -242757, -62047, -70962, -203067, -258084, -264257, -186137, -165020, -278728, -233218, -215494, -51852, -96355, -115838, -128660, -252913, -152282, -99858, -39508, -20116, -44297, -129555, -76890, -54911, -140631, -112622, -107116, -75077, -49797, 43650, 18223, -127920, -238671, -182097, -166264, -163639, -93744, -14844, -156293]
2031a56293J55086o4585j6605K5840n7147p8848j26240J52799L925P3090R2252
2020C274o1412J9108K1747j96190J9098Q3389m4461L7282N3325o0863o9026Q6180
2008a08549L7385r3475J8418n5883j32357Q93Q9531K2961J58982p5605M4535n6653
1996a49817q8281M126K7407j6974n6635o6425J25393n523j8203n6411M9688N1764
1984a99891N3650R3935j04408J4129O7120O171J6063o0169k4442P8764q0922L3950
1972a06050M1747q1181l6650J9184J35949N3122R1162j35699j7153M9733J5487
1961B9651j03409l9730L2295r8580k135r6625J30890M2635p9675M3899p8473J5537
1949b03720J7275J19111Q3257j03554P5209K6489k1264L7872o199n1748j05999
$$ y = [-156293, -1207, -65792, -82397, -56557, -113704, -192552, -318792, -165993, -162068, -88978, 3274, -58138, -39030, -17283, -213473, -194375, -110986, -155447, -118165, -64840, -125703, -194729, -108549, -71164, -164639, -146221, -202104, -334461, -333568, -244037, -221076, -62094, -137699, -93164, -149817, -238098, -233972, -206565, -223539, -280174, -346599, -221206, -226729, -244932, -301343, -251655, -199891, -146241, -52306, -156714, -142585, -75465, -69294, -53231, -113400, -137842, -59078, -140000, -106050, -64303, -145484, -182134, -162950, -27001, 26121, 117283, -18416, -35569, 14164, 29651, -73758, -113488, -81193, -179773, -181908, -278533, -147643, -105008, -184683, -140784, -219257, -203720, -186445, -67334, 15923, -87631, -12422, 14067, -7197, 30675, 24476, -27272, -133271]
1938a33271M1736K1296r3010K1216j58612j40834N2430J63616R785N8067q7020
1927b44601j2210J97305J2620K2119K2354j22805j04020J51657K6518j08664k3915
1916a83642p1666J38943P1832L6753j43966L1833J33370r8025j33123l7925J05489
1905a50127R9318p8455k9576l7869N9857O75l4787M702M9659J6357p379M3141
1893f4484j06679M9122Q8714m24J6389M6165j05787l468p2401q0992K6201Q9148
1881a18496o6911o26j39702K745J95687M7757q675M9573j6598J1182J9090p4662
1869i9636J23259l6475J0819L0154j00013k05371l5831P1504M3806J8771J41550
1858c7463p0803n3854k0688O7755k5046q0693L9462P8931j4185Q2397M4148r8423
$$ y = [-133271, -91535, -70239, -163249, -142033, -300645, -441479, -389049, -225433, -215648, -157581, -244601, -256811, -59506, -46886, -24767, -2413, -125218, -229238, -77581, -51063, -159727, -183642, -255308, -116365, -44533, -7780, -151746, -119913, 13457, -84568, -217691, -255616, -150127, -50809, -129264, -158840, -196709, -136852, -136177, -170964, -166262, -116603, -100246, -107625, -64484, -171163, -122041, -33327, -33751, -17362, 28803, -76984, -80452, -152853, -233845, -207644, -118496, -185407, -186033, -325735, -322990, -127303, -79546, -88221, -38648, -55246, -44064, -24974, -99636, 23623, -12852, -2033, 28121, -71892, -277263, -313094, -241590, -197784, -179013, -37463, -108266, -162120, -182808, -115053, -140099, -220792, -181330, -102399, -116584, -34187, 9961, -88462]
1846h8462r2141J62141l2901o8322j0953m7845N8214L4694j23649m9730J18203
1835a40751M6502k7675n5447J76179M1223j06601M5200j50221j56750J90656J97002
1824E9317k8007j45538n3307o2135J62144j221O0978j46216R2217J44787l9933
1813D3086j37309J67864J07319r1226j63360p4103o3090Q5966N2345R1935k6147
1802f720J2578j3471k14014J37568Q2781p1006j8797L8395k03227L5712J9664
1791b00537K19287K4429K648k7315q8636J72935K6035j27556l798r3877O6174
1780c0211o2099j31479L35l7984J60433n2895M4579J2867L5380L6972J35307p6435
1768C4770j47481P5480P4099K5944n4238j07479r4708N4233Q9117J9133q0072
$$ y = [-88462, -180603, -18462, -51363, -119685, -130638, -178483, -120269, -85575, -209224, -258954, -140751, -94249, -121924, -177371, -1192, 40031, -66570, -21370, -171591, -328341, -137685, 59317, 31310, -114228, -167535, -229670, -67526, -68747, -7769, -153985, -61768, 83019, 43086, -94223, 73641, 180960, 89734, -73626, -147729, -210819, -124853, -72508, 19427, -6720, 5858, -7613, -221627, -84059, -1278, -72284, -91081, -52686, -255913, -220201, -200537, 18750, 43179, 45827, 18512, -70124, 102811, 128846, 1290, -2508, -96385, -30211, -92310, -223789, -223454, -261438, -101005, -153900, -109321, -96454, -61074, -24102, 111205, 34770, -112711, -37231, 36868, 62812, 8574, -98905, -193613, -139380, -50263, -31130, -111202]
1757a11202k8142J37513L7817k9345k3643j0984r1123j4850l1637k5860N6783
1746a34673K4085M0403M4238l0908o398L5929n2461L0293L0752p3099o7733O9982
1734h9590R430j28966M3922J01613M6663n7810m9057N0086m149k4492j17341L5151
1722a84540J18723O0358k628l4687j54059R9189J53172k3894m3563l0941L2674
1711a0196L5804o2032L0782Q821J01352j1259j00213n0226q2350O6794N4448j17992
1699a36267K405J923J88467M4377k4664j22474k1612N8643j24009J30097q4353
1688h7467N1235k5205l3624j1425n2574L8483J9861P2455m5503J6156K9377p1
1676b8302J4433J899o9270j07379J40855J4954n8790l8622L9905O3871j72043
$$ y = [-111202, -139344, -1831, 35986, 6641, -17002, -27986, -119109, -133959, -165596, -191456, -134673, -110588, -70185, -25947, -56855, -63253, -27324, -79785, -49492, -18740, -91839, -159572, -89590, -80160, -209126, -165204, -63591, -16928, -74738, -123795, -73709, -77858, -102350, -219691, -184540, -65817, -5459, -8087, -42774, -196833, -97644, 55528, 31634, -11929, -42870, -10196, 25608, -36424, -5642, 3179, 104531, 93272, -6941, -57167, -139517, -72723, -18275, -136267, -133862, -131939, 56528, 100905, 76241, -46233, -67845, -9202, -133211, -3114, -87467, -36232, -61437, -95061, -106486, -159060, -120577, -100716, -28261, -73764, -57608, -28231, -28302, -13869, -11970, -81240, -188619, -47764, -32810, -91600, -130222, -90317, -26446, -198489]
1665a98489L5630J88375l7660j21784J6304J47422l609l6821N886K4060j86562
1654a67248O4361L4730L1039O3909n4158N9485M8103M8432j10044n1261J03386
1643G0734j07011j38197J5760J809J26848O6929o9810r0290P775L2484R1593n3310
1631d4686J3084J06055p9383m4567M3701o2412R0768O5369K062j00583R8173j61961
1619g4380L466K3283l2862J06206j36929j01128k172R1524O1189k4149k4292M9007
1607f1237j5382o8921k0930L0899J8018n9014q014J4038K909m9396J007J97126
1595a8897l3673K8933M198k9156R8675N7493q9213P1972q8722l256J8040l0453
1583a4059M2294o1164P462j3544j60367P2158O4980m6372M0632P2733k6273R760
$$ y = [-198489, -162859, 25516, -12144, -133928, -117624, 29798, 26189, -10632, -4746, 19314, -167248, -102887, -68157, -37118, 26791, -27367, 32118, 80221, 128653, 18609, -32652, 70734, -36277, -174474, -158714, -156905, -30057, 36872, -32938, -123228, -115453, -82969, 8624, -44686, -31602, 74453, -4930, -49497, -5796, -68208, 22560, 87929, 89991, -10592, 87581, -74380, -70914, -47631, -80493, 25713, -111216, -212344, -214516, -122992, -61803, -85952, -110244, -61237, -76619, -145540, -166470, -135571, -117553, -176567, -184581, -170543, -167634, -217030, -216023, -18897, -52570, -23637, -19439, -48595, 50080, 107573, 18360, 90332, 1610, -1646, 16394, -14059, 28235, -32929, -25467, -39011, -199378, -127220, -62240, -108612, -67980, 4753, -21520, -11760]
1571a1760Q0333P8390j37279j01069J31242k1686l1589L2925m015q8308J7299
1560e5517p377m915j7673j3724l2892J10508J5309j06863O7331J54407M2610K4270
1548A75474j98417R937O9552R084M2450j87478k9736J7765k3756p4970L5943j2113
1536a66265J03317R1165P697O470L2825j71123J00536K7029M3989K9329q5958
1525A9011K151q0435k7612M7724J42905O471j25195K7591q1702k3411j6359P6085
1513c2776n870J28025l631j8399P0548n4680N5495l5443O4151j37908j4235j6300
1501a023j16394K3010J26731p9445L5103q678O0729P7426j65159O4500L4441q8740
1489c7499O4396j6178P7156k5552J28180N6004r7781j57792o0861r760M1695j5865
$$ y = [-11760, 68573, 146963, 9684, -91385, 39857, 18171, -13418, 19507, 15492, -72816, -55517, -62894, -67809, -85482, -99206, -132098, -21590, -6281, -113144, -45813, 108594, 151204, 175474, -22943, -13006, 56546, 65630, 108080, -79398, -109134, -91369, -115125, -190095, -154152, -166265, -62948, 28217, 35914, 42384, 75209, -95914, 4622, 31651, 75640, 104969, 19011, 21162, -59273, -86885, -39161, 103744, 110215, -14980, 12611, -69091, -92502, -108861, -32776, -38646, 89379, 85748, 67349, 137897, 83217, 138712, 103269, 167420, 29512, 15277, -1023, -117417, -94407, 32324, -47121, -12018, -20696, 40033, 117459, -47700, 16800, 51241, -37499, 26897, 10719, 87875, 62323, 190503, 246507, 148726, -9066, -69927, -79687, -37992, -53857]
1477e3857n7606M8742k1769Q7848J42840P0726j17849o8253k1694L1256Q0006
1466A20390M596L7449o5210m2837l5713o7634Q505R7754l3171p5119M4510J18407
1454A11927j40139L950J15853M0882q9257j08443l4077J22989J0594R4228P7612
1443B06119j64088m4450m0781j10391Q3532J27205K8272N6675L5833p7284r8311
1432B331J42827r8565M9056n934k5395P702k6082l4438N5607L6175j84378O9357
1420a1737M7470q3652J99738K3285n2378k366n4793N3668N1796m7230o2077M5820
1408A07544r8405p54P2061p4496r986Q1079q00j04170Q6156M6435j34307l5319
1396f4962P9842r826R3791p6012K299n5711j7808M6965N9536o6258K2946J09631
$$ y = [-53857, -111463, -62721, -84490, 3358, 146198, 216924, 99075, 30822, 9128, 40384, 120390, 124986, 162435, 97225, 54388, 18675, -48959, -40454, 57300, 24129, -50990, -6480, 111927, -28212, -24262, 91591, 132473, 43216, -65227, -99304, 23685, 34279, 128507, 206119, 42031, -2419, -43200, -153591, -70059, 57146, 85418, 142093, 177926, 100642, 2331, 145158, 46593, 95649, 89715, 64320, 72022, 45940, 11502, 67109, 103284, -81094, -11737, 35733, -47919, 151819, 175104, 122726, 120360, 65567, 119235, 171031, 123801, 61724, 107544, 9139, 8385, 80446, 5950, -4036, 77043, 76243, -27927, 58229, 104664, -29643, -64962, 14880, 5054, 98845, 22833, 25132, -30579, -48387, -1422, 58114, -8144, 14802, 124433]
1384A24433O3073j01433j86013M6903j4652Q3084M2998k01m6370q2330P3081K2251
1372B4824R5804M9014o5439p4311j09566J7075J01658L6721O6770P2299j93451
1361B1398Q275n1070p4184p9892L7480R6179N7428o041n2811m7134R8001l6924
1349b9295j07652P0338J60818M7091j36108o9034J40393m5461n52o4001k0685
1338e4148K538j32242K2953J20626J15737r1582m2503k8150K58981j52571n9976
1327d0337P3316N8204j02251J012k5890L1290O1630r9274M6439j7507m1653q3641
1315a38662J29253L0133j56057l2585R2133J33131l7016j12506J42743P0044j63953
1304d3342P6217K2268l8326m0581Q7788O2599j14496J10328O1443k9236n6099
$$ y = [124433, 187506, 86073, -99940, -53037, -67689, 15395, 58393, 58192, 11822, -70508, 2573, 24824, 120628, 169642, 104203, 29892, -79674, -62599, 39059, 75780, 142550, 214849, 21398, 29673, -21397, -95581, -175473, -137993, -41814, 15614, 9573, -43238, -90372, 7629, -29295, -136947, -66609, 94209, 141300, 5192, -63842, 76551, 31090, 30538, -33463, -54148, -51610, -183852, -160899, -40273, 75464, -16118, -58621, -86771, 172210, 19639, -40337, 32979, 91183, -11068, -10056, -35946, -4656, 56974, -42300, 4139, -13368, -55021, -138662, -9409, 20724, -135333, -167918, -75785, 57346, 20330, -92176, 50567, 120611, -43342, 32875, 55143, 16817, -23764, 64024, 126623, 12127, 122455, 183898, 154662, 98563]
1293I8563r7653J29214M578j51283n6654J43717k6576n2041P3802k2983k7515
1282A5169n1948J1864L9483j8115L5491j3204n6343J51841r2771L2259J4070j0549
1270E7247j62794K8693N0152Q5322J7048p2056o6296J8977m2990r2215J59839
1259a9073K12035q7067l2187L1289L2682r3713n1924K6281O647P0736L4718k3680
1247A06744K6289j17782p7786P3204J33417k535j33021l2312P5958K7676K2836
1236A02688P2676j09077k0887n8866L4428k3116R1088o892n0446p7768q1485L3834
1224i3823R5268L3629j550j41910l9604N0556M9794p0724M7736P4686j34863m2174
1212a72979J10067J33905p4536k2008M4152m7196p2771P7121o5597q6267M3155
$$ y = [98563, 910, 130124, 134702, -16581, -73235, 70482, 43906, -8135, 65667, 42684, 15169, -36779, -24915, 14568, -3547, 31944, 18740, -37603, 114238, 21467, 53726, 67796, 57247, -105547, -76854, -26702, 58620, 75668, 3612, -62684, -43707, -86697, -178912, -19073, 192962, 105895, 73708, 104997, 137679, 43966, -7958, 18323, 24970, 95706, 130424, 106744, 133033, 15251, -62535, 10669, 144086, 141551, 8530, -23782, 52176, 79852, 102688, 175364, 66287, 45400, -13466, 20962, -2154, 88934, 82042, 31596, -46172, -127657, -93823, 1445, 35074, 33524, -108386, -147990, -97434, -47640, -118364, -70628, 4058, -130805, -172979, -62912, 70993, -3543, -25551, 18601, -28595, -101366, -24245, -89842, -176109, -132954]
1201a32954m2674P8354K9278j21040J09769R4166j07318l9899L6496J09996M2825
1190E6999j3553q7784K288J7611J22548p3512n2769M3686p9381o3816J46128K1946
1178D0391l9295L8943n8738n9332O7139J6276J31376J0583m817J8891Q0835q755
1166B33497j42639l3570k2110j14026m7575J10585l2513N3126M8723q14m3051
1155I633Q7908m6110j43345J2595M1827q0095J10096m3972J25349j7751q6931
1144c0796n1402O0017K6852n3388j9109J7623J11916j16443O3835P9043p4001
1133A4147N9070J06780O5956q9046q8138j38733P8488P903J59271p0486j44933
1122c9721J20892J0682l7426j22898J18580P0405K1578m7759j02263j607J04976
$$ y = [-132954, -175628, -97274, -67996, -189036, -79267, 14899, -92419, -132318, -95822, 14174, 56999, 43446, -44338, -42050, -24439, 98109, 24597, -28172, 15514, -63867, -127683, 18445, 40391, 1096, 40039, -18699, -78031, -10892, 5384, 136760, 147343, 142526, 161417, 242252, 233497, 90858, 57288, 35178, -78848, -126423, -15838, -48351, 4775, 53498, 52684, 9633, 97541, 51431, -91914, -79319, -37492, -117587, -7491, -51463, 73886, 56135, -30796, -82198, -22181, 4671, -48717, -67826, -50203, 61713, -54730, 9105, 88148, 14147, 73217, 179997, 245953, 156907, 68769, -69964, 8524, 16427, 175698, 105212, -39721, 81171, 91853, 54427, -68471, 50109, 120514, 142092, 94333, -7930, -9537, 95439]
1111I5439M8839L2492J1597j1458k5778o4403l1424J47479o1975M4699m0488J143
1099A46162M1412j85050m5458k7660M1415L4766j21932J22441J49593m5353J5152
1088A25488Q5908j52423j65L9653m5979r8244j58768K27975J46273j6742n7510
1077I5466J2416K6144O49j5201M0023J4055p754k7608r2364L1936K3931L8232
1065A39925j10102p8790j8276L0086K0721j5622O5727j03981j1258J48571n1461
1054A5540R5308J8978j69876Q4748J62027j5763p0578j23123j47552Q219j1882
1043a53954R9936J07170n8646l1676N1573L2359p6279l971r169q4001R7398o3899
1031i3159k9468O0147N6022l360o8152j3445Q3252j7836J07686q685r1824K26658
$$ y = [95439, 144278, 176770, 188367, 176909, 151131, 86728, 55304, 202783, 140808, 185507, 145019, 146162, 187574, 2524, -42934, -70594, -29179, 5587, -116345, 6096, 155689, 110336, 125488, 211396, 58973, 58808, 98461, 52482, -45762, -204530, 23445, 169718, 152976, 95466, 107882, 134026, 134675, 119474, 159497, 173552, 165798, 138190, 45826, 77762, 101693, 139925, 29823, -48967, -67243, -37157, -16436, -32058, 33669, -70312, -81570, 67001, 15540, 110848, 129826, -40050, 44698, 206725, 190962, 120384, -2739, -150291, -142072, -153954, -54018, 53152, -5494, -37170, 14403, 46762, -29517, -33488, -42657, -126658, -29260, -93159, -122627, -62480, -6458, -9818, -77970, -91415, -8163, -25999, 81687, 73002, -18822, 207836]
1019B07836j43357j70728J09729J06261j1450j53241J0508o860p9341J11443r386
1008b8586k4751J4226J02489k0951j8828p2153N7293K8325P5346J1901l0029o9810
996B4472o6551P2201P1696K8728j05001O0604K3873Q9000K8256n9475r0128k7285
984E0390r8424k9252k9099J47624J39240K3286j11741q1476K2042J5686j9984
973B8292q2519k9500J77856J8465n9891n3401k3488N8911j1169Q1146L321r8453
961I570J72398M6729m2711J9995k03912n7308M6138K0721J13605q537j05038o5160
949e3510k6533K31603l2729q5884r7195O0610N6653n9942k2610q4385O8962k1626
937f6586j8531l9758k7584M2379R0219R7372M2979l502J2811m0685M4326Q5334
$$ y = [207836, 64479, -106249, 3480, 109741, 98291, -54950, -44442, -51302, -130643, -19200, -28586, -53337, -39111, 63378, 42427, 23599, -48554, 8739, 37064, 112410, 124311, 94282, 24472, -42079, 30122, 101818, 130546, 25545, 86149, 110022, 199022, 227278, 167803, 77675, 50390, -48034, -77286, -106385, 41239, 180479, 203765, 92024, 10548, 32590, 48276, 28292, -54227, -83727, 94129, 112594, 52703, -698, -24186, 34725, 23556, 104702, 108023, 9570, 181968, 228697, 185986, 205981, 2069, -55239, -9101, 11620, 125225, 116688, 11650, -53510, -80043, 151560, 118831, 32947, -64248, -3638, 53015, -6927, -29537, -113922, -44960, -66586, -85117, -124875, -152459, -110080, -19861, 77511, 120490, 116988, 129799, 89114, 133440, 218774]
925B18774j75300r7804P8991R7207O5488j46668j6157Q2595J4001l3071J8637
914A06693L2555k4931P2885n1137j03882N7584o8566K6933R0647j55983P0890
903E3688o9983Q0913k92l0934J8251j9071Q7341j31441j6348K9126k1735r5600
891a16085J10475j9028J5621J69396j21943L2933J84643L1623k75182j34137o4894
880a86578m0014J61598J42199J8639l8450k24006M4065J37673N4281O7003j05550
869C0860j3368J04996p9436k5305J30658K075L3857P1587j26509j1145P975K3432
857A49677n341J6220o8298K149q8256L0701M2541o1678M5534P9141O9345j59287
845E2448L2537n5040j29315j2403M5960k7549O1358J26364J1132k04427n5188
$$ y = [218774, 43474, -54330, 24661, 121868, 187356, 40688, 24531, 107126, 121127, 88056, 106693, 139248, 114317, 187202, 136065, 32183, 89767, 21201, 48134, 138781, -17202, 53688, -16295, 64618, 64326, 33392, 51643, 32572, 119913, -11528, -27876, 1250, -20485, -116085, -5610, -24638, -9017, 160379, 38436, 71369, 256012, 287635, 12453, -121684, -186578, -226592, -64994, 77205, 95844, 57394, -166612, -122547, 15126, 69407, 136410, 30860, 17492, 122488, 43052, 17747, 148405, 150480, 184337, 255924, 129415, 118270, 126245, 149677, 144336, 160556, 92258, 94407, 6151, 36852, 79393, 17715, 63249, 142390, 211735, 52448, 84985, 29945, -99370, -111773, -65813, -93362, -32004, 94360, 105492, -98935, -154123]
834a54123P523J42975M3321M6112j1624k5704O5997r1659n4197J35220M841J2734
822A21416n8652M227j41986J58945J34458j50156O0104j03995J21064j08871J428
811C7982J20608l4518o4709n1086J03574o8862K4756j08651k3344J66282p3525
800B8507J1606Q4239O671j80641n5983J23816k2357P606Q5568J5854j02795q952
788f861O3077Q3239J1962n2457k5534o8107j05089j5800Q1612M243k8121j6339
776g4175p5495P4677J30375K7799J30285J1214r211L6246j51799P6769M3693j50410
764F9968m9300O0667L1923j00486n2327J25651N949n8029J7841K9634Q5322J2576
752A79389n6188q7217k381j16482R0863J1265L097o8619J5102P7405p3828j29249
$$ y = [-154123, -146600, -3625, 39696, 85808, 74184, 48480, 114477, 22818, -31379, 103841, 108682, 121416, 62764, 66991, -74995, 83950, 218408, 68252, 128356, 24361, 145425, 36554, 37982, 158590, 124072, 59363, 8277, 111851, 42989, 67745, -40906, -64250, 102032, 28507, 40113, 124352, 131023, -49618, -105601, 18215, -4142, 3464, 89032, 104886, 2091, -6861, 56216, 139455, 151417, 98960, 73426, 5319, -99770, -115570, -33958, -29715, -57836, -74175, -149670, -74993, 55382, 83181, 213466, 224680, 215469, 251715, 99916, 176685, 220378, 69968, 20668, 81335, 113258, 12772, -39555, 86096, 92045, 34016, 51857, 81491, 166813, 179389, 123201, 35984, 33603, -82879, 7984, 19249, 22346, -46273, -31171, 46234, -27594, -156843]
740a56843N6168K6303N6470M0896j1165m71l9850Q7429Q7862R3701m6086j72933
728B1481O4848j14813L8830r1540m3114J02431p9656J30692N3373k1230P0574
717A31876O0940j54030L4702Q1944l3285k2574o4378k1826J1361o5035J10713
706G0408R905O909k6323j9585n2675r6378J25233J98149n3718O0640m2079q7841
694I2645j08868K3781j3513j744L3165J14712k809o6433Q280J8181j0298l5098
682E2001k1190j5007j01365l7417J5328j8277K41095R1768L2672j02323l8405
671I8880M2337j09426J06572Q396q7574O372P0644n1176p3439J70399L1048j24339
659H8694k59m6527q5370k2760r1173K02795L2681j56873P3988K4805j0767L8638
$$ y = [-156843, -100675, -74372, -17902, 22994, 11829, 11358, -28492, 58937, 146799, 240500, 194414, 21481, 86329, -28484, 10346, -81194, -124308, -21877, -101533, 29159, 82532, 61302, 131876, 192816, 38786, 73488, 155432, 122147, 99573, 35195, 13369, 24730, -40305, 70408, 80313, 87222, 60899, 41314, -11361, -107739, 17494, 215643, 161925, 222565, 180486, 92645, -16223, 7558, -5955, -7699, 25466, 140178, 137369, 70936, 79216, 97397, 87099, 52001, 30811, 15804, -85561, -122978, -107650, -125927, 115168, 206936, 239608, 137285, 98880, 141217, 31791, 138363, 146759, 59185, 65557, 136201, 85025, 11586, 181985, 213033, 88694, 88435, 41908, -43462, -66222, -157395, 45400, 78081, -78792, -4804, 20001, 9234, 47872]
647D7872j6464Q0036m6579J60745N3655J5032j86364j05456o8930n822O7005o4224
635f9494n2322R975R1494j3781M2623J15619p3592J4657N312N30j5345n832N6671
622A06515m4103K1271n4464R5804l0446k8624m0129K827k2395r2312P4792k5709
610c6973n9209J63426R732K7802P4298j79516r1880M7798L4554N800K2587p7377
598e8958J39173K502n1080K1229j46947M2818q5808j9428R7382R4610J8884j9256
586C5121n334n2022N7838J2640o7186l0212n1579P0667J2761n0696r2395J0529
574a49868K36615m3086j2855L9711j8696R2882r2925k4378o5151j9897j6969P0592
562d025k378j09992J21027J4109j2429o3976K2326j31811N0784O4134o7563J40708
$$ y = [47872, 31408, 111444, 64865, 225610, 279265, 294297, 107933, 2477, -66453, -72275, -5270, -69494, -121816, -111841, -20347, -34128, 8495, 124114, 50522, 65179, 70491, 71021, 55676, 49844, 106515, 62412, 83683, 29219, 125023, 94577, 65953, 25824, 28651, 6256, -86056, -11264, -36973, -96182, 67244, 76976, 104778, 179076, -440, -92320, -44522, -9968, -4168, 18419, -58958, 80215, 82717, 31637, 52866, -94081, -51263, -137071, -156499, -59117, 35493, 54377, 35121, 29787, -22235, 35603, 48243, -18943, -49155, -100734, -30067, -17306, -68002, -160397, -149868, 86747, 43661, 30806, 70517, 51821, 144703, 51778, 27400, -37751, -57648, -74617, -4025, -6403, -116395, 4632, 18741, 6312, -57664, -35338, -167149, -116365, -52231, -119794, 20914]
550B0914N0945q0889M1281j15628p5029J53319r6833j817p5457M6458K18901K6932
538A13097r2449o1518M504K35608m4399L5748j55701j55941Q5149O6174l862M0219
526F6629r841O8012J30571o4699O0228j19475p7517J8270q70j7054J6746m6560
514B4440l1989L6735l941k0961j63370R3667L5562O7811n215J2671j4474q4849
502e3913K4906l0559q9704j22799J10730O4726Q7860p5J0706j6117r286j92736
490b16261L0717K5669J18054n0295P0853M1579P1588n1339k9434O1372r3764R2584
478G1323N6875L7589p5176N8685r8124m5071K9281J2575L5325l9908Q1331p4733
466D9972j9515K458r5363J56J14207l932k8599L0090k5241Q6J9282N2822p9401
$$ y = [20914, 71859, -9030, 32251, -83377, -158406, -5087, -101920, -103737, -179194, -132736, 86165, 113097, 20648, -40870, -36366, 199242, 154843, 190591, 34890, -121051, -35902, 30272, 26410, 66629, 56788, 124800, 255371, 190672, 250900, 131425, 53908, 72178, 71308, 54254, 71000, 24440, -7549, 29186, 25245, 4284, -159086, -65419, -29857, 37954, 32739, 45410, 30936, -53913, -29007, -59566, -149270, -272069, -161339, -96613, -8753, -8828, 1878, -14239, -23525, -216261, -185544, -159875, -41821, -92116, -21263, 20316, 91904, 40565, 11131, 72503, -21261, 71323, 128198, 165787, 90611, 149296, 51172, 6101, 35382, 47957, 83282, 43374, 124705, 49972, 30457, 32915, -62448, -62292, 51915, 47983, 19384, 49474, 24233, 24319, 43601, 96423, 17022]
453A7022n5715J15025n220p8838M9041j13933k7746l5506J32866Q5577K9320n7404
441E4489j09102O3321r3079k2215O4364N7002o7198K1079j3866j26291n8856J50240
429h0112J23272J3966j73259L3166j7148k2520J22844K128K6906j155p9605j37850
417a89367J13467M4266n5863n0374Q547r6943J18791Q1517L753n6263J32044m87
405E3088j23210O7757J4149K891k4426R492k4904N6718M8243j07362j7561J14256
393F9131j2679r9084K6392J7802O0006r9641j45747M8344M9852o413Q9425p2646
381g5258L6209K4035K1984J338k7916k0525n0723J3100K0698J8832j06032l9730
369a83988R337R3220K0328j4218J0531J6743J23235p9816k836J32159o4164l2518
$$ y = [17022, -38693, 76332, 71112, -7726, 41315, -72618, -100364, -135870, -3004, 82573, 111893, 54489, -54613, 8708, -84371, -106586, -42222, 14780, -52418, -31339, -45205, -171496, -230352, -80112, 43160, 57126, -116133, -82967, -100115, -122635, 209, 2337, 29243, 28088, -51517, -189367, -75900, -31634, -87497, -137871, -129324, -226267, -107476, -25959, -22206, -78469, 53575, 53088, -70122, -2365, 11784, 14675, -9751, -259, -25163, 31555, 79798, -27564, -45125, 69131, 56452, -42632, -16240, 1562, 61568, -38073, -183820, -135476, -85624, -92037, -2612, -75258, -39049, -15014, 6970, 8308, -19608, -40133, -90856, -77756, -57058, -38226, -144258, -183988, -174651, -81431, -61103, -75321, -64790, -48047, 75188, -4628, -7464, 124695, 60531, 28013]
357B8013j4591M9555o610j07108q1825P4072J7767N2950L9399K962m2792j21942
345a10150J41118p0100j61908j841P8081R0679K8291j3784m7520k9477l4231n112
333a35954j1108J11777j11377J71314K7881l9331m2881O1383j5568J5453Q2445
322A14034Q882j39077J10683j11234p2185l2489l1082J21836j7244j31465j0918
311a90259O5428j2898J4783K05671L4925n5525o9m6564P654j6418n515j53652
299a52439J02584J9775m5964M9245P6330l0493j6332q0564K2140k457P6111r6457
287g8521P4568Q5157j2904r5135N9176R8618j39267j0696K7267j22012L8372Q5244
275I867J27854o9164p9353j76574l8959P7612k798J71934o5224j11098J10158
$$ y = [28013, 13422, 62977, 56367, -50741, -132566, -58494, -40727, 12223, 51622, 54584, 11792, -110150, 30968, -39132, -201040, -202881, -124800, -34121, -5830, -19614, -67134, -96611, -130842, -135954, -147062, -35285, -146662, 24652, 52533, 13202, -29679, 31704, 16136, 31589, 114034, 122916, -16161, 94522, -16712, -88897, -121386, -152468, -30632, -47876, -179341, -190259, -124831, -137729, -122946, 82725, 117650, 62125, 62056, 15492, 23146, 6728, 1213, -152439, -49855, -30080, -76044, -26799, 49531, 19038, 2706, -77858, -55718, -58175, 17936, -78521, -3953, 81204, 68300, -26835, 32341, 130959, -8308, -19004, 8263, -113749, -75377, 9867, 137721, 68557, -10796, -187370, -226329, -148717, -151515, 20419, -44805, -155903, -45745]
264d5745p5475M7682L1573R275o6907L1061P5981j1548M847n3657N526j56955
252b04342n266J05380K8620J36145N0132m2218r3832L0861l2828m3847j01505
241a72700p0697P6358O1524k8168j8128M6977J21454L894p3426Q260O3009K161
229B0518m2187N3726N3799j7744j53056L5873P4944m5362j15369O5206q001m7688
217a25341J6944M7286l9783J30656j15596J37427L1866o0568n9699j0107Q0052
206C3137m7116m7774O5511n4575n1056Q2992p6857n3992P4420J07155j85200j6530
194a69885Q3073J49762L7553o1686K3621m3778l517k4520J07091q6653j60197
183a49136J3578P1551r7248K8608M9074p7386l3071k6251r1274Q243J42543J06725
$$ y = [-45745, -121220, -73538, -41965, -32690, -99597, -68536, 7445, -4103, 744, -52913, -47387, -204342, -209608, -104228, -75608, 60537, 110669, 68451, -25381, 5480, -27348, -71195, -172700, -243397, -167039, -105515, -133683, -151811, -104834, 16620, 20514, -52912, -44652, 18357, 20518, -21669, 32057, 85856, 68112, -84944, -49071, 25873, -19489, -134858, -69652, -77653, -125341, -108397, -61111, -100894, 29762, -85834, 51593, 83459, 22891, -36808, -46915, 33137, -13979, -61753, 3758, -50817, -101873, -18881, -95738, -149730, -75310, 31845, -153355, -169885, -86812, 62950, 100503, 38817, 62438, 18660, 15143, -9377, 97714, 11061, -149136, -135558, -64007, -161255, -132647, -83573, -160959, -194030, -220281, -311555, -303312, -160769, -54044]
171e4044l218q846l4455m1080p4733N16K0197j4197K5701r8207P4720J88317R7458
158G8129n9369j02094M0626j3788L1060m3144r0387k7681J3968J9978R9651K1654
146c1397l1204L1554j9080P1056n2405M9935j661k7976L099k9199j9064J59316
134A02974J1753j02003R1493j38096r8402j1454J1775l1665r4391Q1072N4325
123a22619L2081L5811M6213o0425J3098J0104L4445n8707j0552K4020J6030o6609
111a07110P3747Q3024j9225j37116L1662J7530j2133j4396j7507P0028M3248R495
99B1247m6072N6993l7899l3849j489l7329N2038p2466L2533M8768m7345k3868
87h8738P5409j0608l3566K5395p9650l9853J6532L0108O8554j513n7919L5057
$$ y = [-54044, -57262, -66108, -100563, -141643, -216376, -215860, -195663, -209860, -184159, -282366, -207646, -19329, 78129, 18760, -83334, -42708, -56496, -25436, -68580, -158967, -186648, -172680, -152702, -53051, -31397, -62601, -31047, -50127, 20929, -31476, 18459, 16798, -11178, -8079, -37278, -56342, 102974, 114727, 12724, 104217, -33879, -132281, -143735, -131960, -163625, -258016, -176944, -122619, -90538, -54727, -8514, -68939, -55841, -45737, -11292, -69999, -80551, -56531, -40501, -107110, -33363, 49661, 30436, -106680, -75018, -57488, -69621, -84017, -101524, -31496, 11752, 21247, -24825, 32168, -5731, -39580, -41069, -78398, -26360, -98826, -66293, -17525, -64870, -88738, -13329, -23937, -57503, -32108, -111758, -151611, -135079, -104971, -36417, -37930, -95849, -60792]
$$ [...]
##END NTUPLES=NMR SPECTRUM
##END=
