##TITLE=1H_DE-80H_X3
 200.13MHz, d2o
 8 sc
 
 19ns.26.2.2025
##JCAMPDX= 6.0         $$ Bruker NMR JCAMP-DX V2.0
##DATA TYPE= NMR SPECTRUM
##DATA CLASS= NTUPLES
##ORIGIN= UXNMR, Bruker Analytische Messtechnik GmbH
##OWNER= pz
$$ XWIN-NMR		Version 3.5
$$ Tue Mar 17 10:37:42 2026 Russian Standard Time (UT+4h)  Yarkov@DPX200
##.OBSERVE FREQUENCY= 200.1313
##.OBSERVE NUCLEUS= ^1H
##.ACQUISITION MODE= SIMULTANEOUS
##.ACQUISITION SCHEME= undefined
##.AVERAGES= 8
##.DIGITISER RES= 18
##SPECTROMETER/DATA SYSTEM= spect
##.PULSE SEQUENCE= zg30
##.SOLVENT NAME= CDCl3
##.SHIFT REFERENCE= (INTERNAL, CDCl3, 0, 15.4483)
##AUDIT TRAIL= $$ (NUMBER, WHEN, WHO, WHERE, WHAT)
$$ ##TITLE= Audit trail, XWIN-NMR		Version 3.5
$$ ##JCAMPDX= 5.01
$$ ##ORIGIN= Bruker BioSpin GmbH
$$ ##OWNER= Yarkov
$$ C:/Bruker/XWIN-NMR/data/yarkov2/nmr/H-C/1/pdata/1/auditp.txt
$$ ##AUDIT TRAIL=  $$ (NUMBER, WHEN, WHO, WHERE, WHAT)
(   1,<2026-03-17 10:36:40.85 +0400>,<Yarkov>,<DPX200>,
      <created by zg, POWCHK disabled, PULCHK disabled
       configuration hash MD5:
       00 E9 B6 7A A2 85 ED C7 34 08 36 98 17 FE 4E 26
       data hash MD5: 16K
       A9 50 BA 6D B7 0E DC EA 86 C0 A4 12 87 7B 4C E7>)
(   2,<2026-03-17 10:36:47.67 +0400>,<Yarkov>,<DPX200>,
      <Start of raw data processing
       efp BC_mod = 2 LB = 0.25 FT_mod = 6 PKNL = 1 PHC0 = -5299.148 PHC1 = 6.821927 SI = 16K 
       data hash MD5: 16K
       55 92 89 8F E5 97 6C C7 55 15 DC 3B 52 69 D4 9C>)
$$ ##END=
$$ 
$$ hash MD5
$$ 35 81 13 06 5B BA 93 BD 06 9E C5 D8 72 D2 3C E5
##$RELAX= 
##$RELAX= 
##$RELAX= 
##$RELAX= 
##$RELAX= 
##$RELAX= 
$$ Bruker specific parameters
$$ --------------------------
##$DU= <C:/Bruker/XWIN-NMR>
##$EXPNO= 1
##$NAME= <H-C>
##$PROCNO= 1
##$TYPE= <nmr>
##$USER= <yarkov2>
##$AMP= (0..31)
100 100 100 100 100 100 100 100 100 100 100 100 100 100 100 100 100 100 
100 100 100 100 100 100 100 100 100 100 100 100 100 100 
##$AQSEQ= 0
##$AQ_mod= 1
##$AUNM= <au_zg>
##$AUTOPOS= <>
##$BF1= 200.13
##$BF2= 200.13
##$BF3= 200.13
##$BF4= 200.13
##$BF5= 200.13
##$BF6= 200.13
##$BF7= 200.13
##$BF8= 200.13
##$BYTORDA= 1
##$CFDGTYP= 0
##$CFRGTYP= 5
##$CHEMSTR= <none>
##$CNST= (0..31)
1 1 145 1 1 1 1 1 1 1 1 1 1 1 1 1 1 1 1 1 1 1 1 1 1 1 1 1 1 1 1 1 
##$CPDPRG= <>
##$CPDPRG1= <>
##$CPDPRG2= <>
##$CPDPRG3= <>
##$CPDPRG4= <mlev>
##$CPDPRG5= <mlev>
##$CPDPRG6= <mlev>
##$CPDPRG7= <mlev>
##$CPDPRG8= <mlev>
##$CPDPRGB= <>
##$CPDPRGT= <>
##$D= (0..31)
0 0.7 0 0 0 0 0 0 0 0 0 0.03 0 0 0 0 0 0 0 0 0 0 0 0 0 0 0 0 0 0 0 0 
##$DATE= 1773729400
##$DBL= (0..7)
120 120 120 120 120 120 120 120 
##$DBP= (0..7)
150 150 150 150 150 150 150 150 
##$DBP07= 0
##$DBPNAM0= <>
##$DBPNAM1= <>
##$DBPNAM2= <>
##$DBPNAM3= <>
##$DBPNAM4= <>
##$DBPNAM5= <>
##$DBPNAM6= <>
##$DBPNAM7= <>
##$DBPOAL= (0..7)
0.5 0.5 0.5 0.5 0.5 0.5 0.5 0.5 
##$DBPOFFS= (0..7)
0 0 0 0 0 0 0 0 
##$DE= 6
##$DECBNUC= <off>
##$DECIM= 32
##$DECNUC= <off>
##$DECSTAT= 4
##$DIGMOD= 1
##$DIGTYP= 9
##$DL= (0..7)
0 120 120 120 120 120 120 120 
##$DP= (0..7)
$$ [...]
##$SUBNAM2= <"">
##$SUBNAM3= <"">
##$SUBNAM4= <"">
##$SUBNAM5= <"">
##$SUBNAM6= <"">
##$SUBNAM7= <"">
##$SUBNAM8= <"">
##$SUBNAM9= <"">
##$SW= 18.0517328524113
##$SWIBOX= (0..15)
0 0 2 0 0 0 0 0 0 0 0 0 0 0 0 0 
##$SW_h= 3612.71676300578
##$TD= 16384
##$TD0= 1
##$TE= 0
##$TE2= 300
##$TE3= 300
##$TEG= 300
##$TL= (0..7)
0 120 120 120 120 120 120 120 
##$TP= (0..7)
150 150 150 150 150 150 150 150 
##$TP07= 0
##$TPNAME0= <>
##$TPNAME1= <>
##$TPNAME2= <>
##$TPNAME3= <>
##$TPNAME4= <>
##$TPNAME5= <>
##$TPNAME6= <>
##$TPNAME7= <>
##$TPOAL= (0..7)
0.5 0.5 0.5 0.5 0.5 0.5 0.5 0.5 
##$TPOFFS= (0..7)
0 0 0 0 0 0 0 0 
##$TUNHIN= 0
##$TUNHOUT= 0
##$TUNXOUT= 0
##$USERA1= <user>
##$USERA2= <user>
##$USERA3= <user>
##$USERA4= <user>
##$USERA5= <user>
##$V9= 5
##$VALIST= <valist>
##$VCLIST= <CCCCCCCCCCCCCCC>
##$VD= 0
##$VDLIST= <DDDDDDDDDDDDDDD>
##$VPLIST= <PPPPPPPPPPPPPPP>
##$VTLIST= <TTTTTTTTTTTTTTT>
##$WBST= 1024
##$WBSW= 4
##$XGAIN= (0..3)
0 0 0 0 
##$XL= 0
##$YL= 0
##$YMAX_a= 522042
##$YMIN_a= -498753
##$ZGOPTNS= <>
##$ZL1= 120
##$ZL2= 120
##$ZL3= 120
##$ZL4= 120
##$ABSF1= 0
##$ABSF2= 0
##$ABSG= 0
##$ABSL= 0
##$ALPHA= 0
##$AQORDER= 0
##$ASSFAC= 0
##$ASSFACI= 0
##$ASSFACX= 0
##$ASSWID= 0
##$AUNMP= <proc_1d>
##$AZFE= 0.1
##$AZFW= 0.1
##$BCFW= 0
##$BC_mod= 2
##$BYTORDP= 0
##$COROFFS= 0
##$CY= -3
##$DATMOD= 1
##$DC= 0
##$DFILT= <>
##$DTYPP= 0
##$F1P= 0
##$F2P= 0
##$FCOR= 1
##$FTSIZE= 16384
##$FT_mod= 6
##$GAMMA= 0
##$GB= 0
##$INTBC= 1
##$INTSCL= 3.241238e-09
##$ISEN= 128
##$LB= 0.25
##$LEV0= 0
##$LPBIN= 0
##$MAXI= 10000
##$MC2= 0
##$MEAN= 0
##$ME_mod= 0
##$MI= 1.114404
##$NCOEF= 0
##$NC_proc= -6
##$NLEV= 6
##$NOISF1= 3.799351
##$NOISF2= 2.8
##$NSP= 0
##$NTH_PI= 0
##$NZP= 0
##$OFFSET= 15.4483
##$PC= 1
##$PHC0= -5299.148
##$PHC1= 6.821927
##$PH_mod= 1
##$PKNL= yes
##$PPARMOD= 0
##$PSCAL= 0
##$PSIGN= 0
##$REVERSE= no
##$SF= 200.130014689469
##$SI= 16384
##$SIGF1= 3
##$SIGF2= 2
##$SINO= 0.751879
##$SIOLD= 32768
##$SREGLST= <19F.Aceton>
##$SSB= 0
##$STSI= 16384
##$STSR= 0
##$SW_p= 3612.71676300578
##$SYMM= 0
##$S_DEV= 0
##$TDeff= 16384
##$TDoff= 0
##$TI= <>
##$TILT= no
##$TM1= 0
##$TM2= 0
##$TOPLEV= 0
##$USERP1= <user>
##$USERP2= <user>
##$USERP3= <user>
##$USERP4= <user>
##$USERP5= <user>
##$WDW= 1
##$XDIM= 16384
##$YMAX_p= 286999747
##$YMIN_p= -1045523
$$ End of Bruker specific parameters
$$ ---------------------------------
##NTUPLES= NMR SPECTRUM
##VAR_NAME=  FREQUENCY,     SPECTRUM/REAL,   SPECTRUM/IMAG
##SYMBOL=    X,             R,               I
##VAR_TYPE=  INDEPENDENT,   DEPENDENT,       DEPENDENT
##VAR_FORM=  AFFN,          ASDF,            ASDF
##VAR_DIM=   16384,         16384,           16384
##UNITS=     HZ,            ARBITRARY UNITS, ARBITRARY UNITS
##FACTOR=    0.220516191357247, 1,           1
##FIRST=     3091.668578301, 0,              0
##LAST=      -521.048184704779, 0,           0
##MIN=       -521.048184704779, -1045523,    0
##MAX=       3091.668578301, 286999747,      0
$$ Real data points
##PAGE= N=1
##DATA TABLE= (X++(R..R)), XYDATA
$$ [...]
6032A7640111J382018J674531K108931K640247L365790M122328M705078N153021
$$ 17640111 19022129 20696660 22805591 25445838 28811628 32933956 37639034 42792055
6024D2792055N123578M782279M135839L260130K366629J379467K66083o78270
$$ 42792055 47915633 52697912 56833751 60093881 62460510 63839977 64106060 63427790
6016F3427790j808238k490311k697697k634536k029252j358857o91473o9242N48864
$$ 63427790 61619552 59129241 56431544 53797008 51767756 50408899 49717426 49648184 50197048
6007E0197048J051898J605544K098677K583810L257810L902297M290793M699516
$$ 50197048 51248946 52854490 54953167 57536977 60794787 64697084 68987877 73687393
5999G3687393M922463M593675L817862K872606J564011Q5076j890984l948154
$$ 73687393 78609856 83203531 87021393 89893999 91458010 91543086 89652102 85703948
5991H5703948n638483o359339o220785n552388m615842l485177k594108j704981
$$ 85703948 80065465 73706126 67485341 61932953 57317111 53831934 51237826 49532845
5983D9532845r97636p89454j145709j873200k719217l277699l600938l583140
$$ 49532845 48535209 47745755 46600046 44726846 42007629 38729930 35128992 31545852
5975C1545852l291273k946906k404316k097215j726197j521983j307230j004553
$$ 31545852 28254579 25307673 22903357 20806142 19079945 17557962 16250732 15246179
5967A5246179r35369p29418o25693n21861m72625l94196l54181l85352l14802
$$ 15246179 14310810 13581392 12955699 12433838 11961213 11567017 11212836 10827484 10512682
5958A0512682l83398l15154l29047k74656k63722k90512k34879j35644j73993
$$ 10512682 10129284 9814130 9485083 9210427 8946705 8656193 8421314 8285670 8111677
5949H111677j65283j81359j34154j14095j44230j89854r4989j51294r8477j4136
$$ 8111677 7946394 7765035 7630881 7516786 7372556 7182702 7087713 6936419 6837942 6823806
5939F823806p1339j80050q0754J6302J4838L1857M0309P9704R9778Q0390M2997
$$ 6823806 6752467 6572417 6491663 6507965 6522803 6554660 6594969 6674673 6774451 6854841 6897838
5928F897838m5699n8283j53895k03560k2680j09757r6571m07L154Q7535J51234
$$ 6897838 6852139 6793856 6639961 6436401 6413721 6303964 6207393 6206986 6210140 6297675 6448909
5917F448909P0221J41750K10990K44449K62461K25249K69179K99389L03563L20446
$$ 6448909 6519130 6660880 6871870 7116319 7378780 7604029 7873208 8172597 8476160 8796606
5907H796606K39550P8538L6596p5347j03564k20405j70677j32881j26074L3455
$$ 8796606 9036156 9114694 9151290 9075943 8972379 8751974 8581297 8448416 8322342 8355797
5897H355797P539J00146J08535L02191M13521N59122Q32723Q55726Q80177J019070
$$ 8355797 8363336 8463482 8572017 8874208 9287729 9846851 10679574 11535300 12415477 13434547
5887A3434547Q68624O44128L42149J07752j05672j86044k28113j36943j85479
$$ 13434547 14303171 14947299 15289448 15397200 15291528 15105484 14877371 14740428 14554949
5878A4554949j42558P334J61483L02485L85576N16065M33918M62029N43553O05175
$$ 14554949 14412391 14419725 14581208 14883693 15269269 15785334 16219252 16681281 17224834 17830009
5868A7830009N10841N60723M80711L99001L40199L68535L33700Q2762n1927r3766
$$ 17830009 18340850 18901573 19382284 19781285 20121484 20490019 20823719 20906481 20854554 20760788
5858B0760788k36499j72944L389K32514L25276M00108N39524M10555K73565Q6956
$$ 20760788 20524289 20351345 20354734 20587248 20912524 21312632 21852156 22262711 22536276 22623232
5848B2623232l4768j77605k11548j7458j29522k38506l83621m60216m90792m98936
$$ 22623232 22588464 22410859 22199311 22181853 22052331 21813825 21430204 20969988 20479196 19980260
5838A9980260l51785k39034n4226J5983J91148K83143K66883L86456L59088K36159
$$ 19980260 19628475 19389441 19335215 19351198 19542346 19825489 20092372 20478828 20837916 21074075
5828B1074075K07570j5465l08295n83629q23493r48940r53848r94362q72140p66888
$$ 21074075 21281645 21266180 20957885 20374256 19550763 18601823 17647975 16653613 15781473 15014585
5818A5014585n98686n70304m61501l73715k66854o8072N0422O9155J43127K13367
$$ 15014585 14415899 13845595 13384094 13010379 12743525 12675453 12725875 12795030 12938157 13151524
5808A3151524P8913L1629j57379m13614n25901m98129m65210n30788n84336n48760
$$ 13151524 13230437 13262066 13104687 12691073 12165172 11667043 11201833 10671045 10086709 9537949
5798I537949n94445n58588m35243l29852m53474l95676k85173k82323k12838j67284
$$ 9537949 8943504 8384916 7949673 7619821 7166347 6770671 6485498 6203175 5990337 5823053
5788E823053j51944q5647j19980q4328k9962r4722j57955k59415k46475k43889
$$ 5823053 5671109 5585462 5465482 5381154 5351192 5256470 5098515 4839100 4592625 4348736
5778D348736k39458l16441j37121j39977j80927q6943j54609j28788o0246p3651
$$ 4348736 4109278 3792837 3655716 3515739 3334812 3247869 3093260 2964472 2904226 2830575
5768B830575j19567j41752j03537n4570j03490j03911j21054j9126k2754m6173
$$ 2830575 2711008 2569256 2465719 2411149 2307659 2203748 2082694 2063568 2040814 1994641
5758A994641l7725q5456o0582n620q4127J1315m889o1429m4528J5843k1156n9140
$$ 1994641 1956916 1871460 1810878 1805258 1721131 1732446 1727557 1666128 1621600 1637443 1616287 1557147
5746A557147o1824j3565k6616o8116k2894L7640k5210l4496O5036Q551n0651j5397
$$ 1557147 1495323 1481758 1455142 1387026 1364132 1401772 1376562 1342066 1407102 1415653 1365002 1349605
5734A349605l8110j979k0010j3650j3627r0200O739l475J0412P013j6741m1411
$$ 1349605 1311495 1309516 1289506 1275856 1262229 1172029 1178768 1175293 1185705 1192718 1175977 1134566
5722A134566J4402k74l6089J6636L2189m1775N5558J9047k2139O8812K1368K827
$$ 1134566 1148968 1148694 1112605 1129241 1161430 1119655 1175213 1194260 1172121 1240933 1262301 1265128
5710A265128N1744J6309N4683k4386r0899P2034K2621k0916k3170J9903o0565
$$ 1265128 1316872 1333181 1387864 1363478 1272579 1344613 1367234 1346318 1323148 1343051 1282486
5699A282486j9188m8061j3527L1138M3440l7383j8253J2643j8150M4202j7457
$$ 1282486 1263298 1215237 1201710 1232848 1276288 1238905 1220652 1233295 1215145 1259347 1241890
5688A241890J5756l4551M3641j3398K662r351l9030k1496L9275K2725n015j244
$$ 1241890 1257646 1223095 1266736 1253338 1256000 1246649 1207619 1186123 1225398 1248123 1243108 1241864
5676A241864n4800j11357M3784K8548l4352k5561L251J4992j4987m5933r3438
$$ 1241864 1187064 1075707 1119491 1148039 1113687 1088126 1091377 1106369 1091382 1045449 952011
5665I52011L7344J7020Q694n9365j6016K708K1170K536q4087L1292k4116o308
$$ 952011 989355 1006375 1015069 955704 939688 942396 963566 966102 882015 913307 889191 882883
5653H82883j5580Q0078n615m0458J8703l8251J529M6331r0871K1129N4293j9888
$$ 882883 867303 947381 941766 901308 920011 881760 883289 929620 838749 859878 914171 894283
5641H94283l0998J8673K7722l4881M5248j6849j7521n0K9372K0815k6530k349
$$ 894283 863285 881958 909680 874799 920047 903198 885677 885627 914999 935814 909284 906935
5629I06935r800j9034J8933R768k9902j2049L2366p2180M854r294O03q2621J8837
$$ 906935 897135 878101 897034 906802 876900 864851 897217 825037 829891 820597 821200 738579 757416
5616G57416M9610l846n616L7899M0140j9461j5861q7221Q922K7093l4613K7754
$$ 757416 807026 803180 797564 835463 875603 856142 840281 753060 761982 789075 754462 782216
5604G82216m3774M805L5307J9174N2268l933J9497J3253o6317J381J1500N9903
$$ 782216 738442 743247 778554 797728 849996 846063 865560 878813 812496 813877 825377 885280
5592H85280l0231p615N4989j8384j3123n6409M6087J22573J05460q770L6954M9826
$$ 885280 855049 847434 902423 884039 870916 814507 860594 983167 1088627 1079857 1116811 1166637
5580A166637r130k9784j2713N1919n1574L3764M6926k3974K1246l5406R796j0209
$$ 1166637 1157507 1127723 1115010 1166929 1115355 1149119 1196045 1172071 1193317 1157911 1167707 1157498
5568A157498o233J4552O0890Q4140J9849L4852L6965k795o913M2455l7556r7515
$$ 1157498 1151265 1165817 1226707 1310847 1330696 1365548 1402513 1399718 1392805 1435260 1397704 1300189
5556A300189l0183j17070o7352O865o101j3397k8678k7660k6026M390M0622m926
$$ 1300189 1270006 1152936 1085584 1092449 1086348 1072951 1044273 1016613 990587 994977 1035599 1030673
5544A030673M9438M5367Q855o892J1098q749m6592m0607K0209j113q5158j6399
$$ 1030673 1080111 1125478 1134333 1127441 1138539 1129790 1083198 1042591 1062800 1061687 976529 960130
5532I60130l0402L89J327K5385l3241J9293j8972j07282J1361J2678N7859m0451
$$ 960130 929728 930117 931444 956829 923588 942881 923909 816627 827988 840666 898525 858074
5520H58074m4504M7420K4302Q2282P920l1129K434q578K7306M341J8349o3739
$$ 858074 813570 860990 885292 967574 975494 944365 946799 938221 965527 969868 988217 924478
5508I24478p8540l6815J281K525m2045L2328R825l060O614j11726l2872L8244
$$ 924478 845938 809123 810404 812929 770884 803212 813037 809977 816591 704865 671993 710237
5496G10237k216o575J0367o798K5155o680N138m0825J0412k7409J9315P9102k0049
$$ 710237 708021 701446 711813 705015 730170 723490 728628 687803 698215 670806 690121 769223 749174
5483G49174Q388p0827N1252k4444p6396j03144k3196L5521K65k9L2449k8673K1177
$$ 749174 757562 686735 737987 713543 637147 534003 510807 546328 546593 546564 579013 550340 571517
5470E71517Q0838l3247j6254k4365j6727o0845n5783J01079K1152o183l6635K6889
$$ 571517 652355 619108 602854 578489 561762 500917 445134 546213 567365 561182 524547 551436
5458E51436N4586r0662j7934k4283n3439M4488M7326p9813K3844Q2962J4462o0379
$$ 551436 606022 515360 497426 473143 419704 464192 511518 431705 455549 538511 552973 492594
5446D92594J5140L0775M5157p095l3115M9871j7827L8470j3696p6354j9718J9411
$$ 492594 507734 538509 583666 576571 543456 593327 575500 613970 600274 523920 504202 523613
5434E23613k1478p6883k0873Q9546P142J9339n7517N907P3714r225J4804K9211
$$ 523613 502135 425252 404379 493925 501067 520406 462889 468796 542510 533285 548089 577300
5422E77300l9618j3529K8170l9056K4429K6848N2619q6702K3313J8598K8636L7462
$$ 577300 537682 524153 552323 513267 537696 564544 617163 530461 553774 572372 601008 638470
5410F38470m1935M2307J953j3392j0834L5397O136m1098k6198M8089K2054L4362
$$ 638470 596535 638842 640795 627403 616569 651966 658102 617004 590806 638895 660949 695311
5398F95311p1967m6413k6629k4745Q6813k8373K8608J38665L2978l748m5812K9477
$$ 695311 623344 576931 550302 525557 612370 583997 612605 751270 784248 780500 734688 764165
5386G64165O9542j10760j0252L9758l2097q40m1329m0828P8115Q7861n1726o892
$$ 764165 833707 722947 712695 752453 720356 719516 678187 637359 715474 803335 751609 744717
5374G44717K5258O1621l3201n9680m9027j785R1476j4585J8544m9192L0364P2016
$$ 744717 769975 831596 798395 738715 689688 687903 779379 764794 783338 734146 764510 836526
5362H36526O284L4952J9319j9061j8004j5760J7943j79k7696J2780L4448L3912
$$ 836526 842810 877762 897081 878020 860016 844256 862199 862020 834324 847104 881552 915464
5350I15464r511j0846N0540m9044l1260J0987l3821R4L2402o016J7474l4732P6509
$$ 915464 905953 895107 945647 896603 865343 876330 842509 842603 875005 868989 886463 851731 928240
5337I28240Q845J5908J8133l9547k3380L8605k1467R940j3152R815N3608j109
$$ 928240 937085 952993 971126 931579 908199 946804 925337 935277 922125 931940 985548 984439
5325I84439n8483k7402L7139m4032L863N7813J4195j9999N1847p224n183Q766
$$ 984439 925956 898554 935693 891661 895524 953337 967532 947533 999380 992156 986973 995739
5313I95739R962P7579K2800L9493K770j03432L1980p8276J2610q332L1595M0896
$$ 995739 1005701 1083280 1106080 1145573 1148343 1044911 1076891 998615 1011225 1002893 1034488 1075384
5301A075384M9434n7148M0819J07905P2710P1060J6321m9331J7175J1854n2541
$$ 1075384 1124818 1067670 1108489 1216394 1289104 1360164 1376485 1327154 1344329 1356183 1303642
5290A303642n574K049k5568K5141L2347r802K5560R8926N0622J2829L0358P9922
$$ 1303642 1298068 1300117 1274549 1299690 1332037 1322235 1347795 1446721 1497343 1510172 1540530 1620452
5278A620452N8005J16447J31401K7273J40048J60564J52753K21543L19383L70090
$$ 1620452 1678457 1794904 1926305 1953578 2093626 2254190 2406943 2628486 2947869 3317959
5268C317959M45323L42507J84310l6966j16801j00640j21431l6354J44454L36072
$$ 3317959 3763282 4105789 4290099 4253133 4136332 4035692 3914261 3877907 4022361 4358433
5258D358433M13383N36583P01183P69054O42659M30613L22988J55869J52075O2709
$$ 4358433 4771816 5308399 6009582 6778636 7421295 7851908 8174896 8330765 8482840 8545549
5248H545549J0595o343N2878J25815R0489O4193J42162K58309K32425K93702L70113
$$ 8545549 8556144 8549801 8602679 8728494 8818983 8883176 9025338 9283647 9516072 9809774 10179887
5237A0179887L60011M22594L91316K35114l6046k15489k99442k81599k81873k47087
$$ 10179887 10539898 10962492 11353808 11588922 11552876 11337387 11037945 10756346 10474473 10227386
5227A0227386k15958k50141l06562k08158k44948k60162j30500q8075q2733K1344
$$ 10227386 10011428 9761287 9454725 9246567 9001619 8741457 8610957 8522882 8440149 8461493
5217H461493P8479P9325M8482j94556k38818n14193o87705p57816o60161n22899
$$ 8461493 8539972 8619297 8667779 8473223 8234405 7720212 7032507 6274691 5614530 5091631
5207E091631m34388l11846j63764L1764J32799J48488J15502m8247k17233l26973
$$ 5091631 4657243 4345397 4181633 4213397 4346196 4494684 4610186 4561939 4344706 4017733
5197D017733m10958l04674k84319k67025k31276r3433j53168j79156o6904m9837
$$ 4017733 3606775 3302101 3017782 2750757 2519481 2426048 2272880 2093724 2026820 1976983
5187A976983k6375n5510k1324r1832p9702J3128L7481k621n3762n2459o2064l9963
$$ 1976983 1950608 1895098 1873774 1781942 1702240 1715368 1752849 1750228 1696466 1644007 1581943 1541980
5175A541980j869P498J3687l4529K1873k620K6049K5528L1423j8058K2194l7940
$$ 1541980 1540111 1547609 1561296 1526767 1548640 1546020 1572069 1597597 1629020 1610962 1633156 1595216
5163A595216J2254Q0218m8077j4598K5980L4620o3044m926P860n2938M0437m1846
$$ 1595216 1607470 1687688 1639611 1625013 1650993 1685613 1622569 1617643 1625503 1572565 1613002 1571156
5151A571156J5731J814n3063K5728k5671Q4695k6702r72L137m0183M0807j9565
$$ 1571156 1586887 1588701 1535638 1561366 1535695 1620390 1593688 1592716 1595853 1555670 1596477 1576912
5139A576912l1723Q947K2266L833k3186K7045Q744n891Q826O0513L1585K7691
$$ 1576912 1545189 1554136 1576402 1580235 1557049 1584094 1592838 1586947 1595773 1656286 1687871 1715562
5127A715562m1020K2049Q193R1572j8108q0441m147M0256O0932J0424J1723O073
$$ 1715562 1674542 1696591 1704784 1796356 1778248 1697807 1693660 1733916 1794848 1805272 1816995 1823068
5115A823068k5371j4299Q9720q087N9131O1015k7703L3137N4103l0075J7602N8833
$$ 1823068 1797697 1783398 1873118 1865031 1924162 1985177 1957474 1990611 2044714 2014639 2032241 2091074
5103B091074K5692N6844J35752K2735m1631L1560j053k311M586L2470J4077m3963
$$ 2091074 2116766 2173610 2309362 2332097 2290466 2322026 2320973 2318662 2323248 2355718 2369795 2325832
5091B325832K5845N2102j7814N8876j0588K1170M5152P038Q8118P3262N0898o8531
$$ 2325832 2351677 2403779 2385965 2444841 2434253 2455423 2500575 2507613 2595731 2668993 2719891 2651360
5079B651360k8481N9628k6804n6085M591M7483l729K1138P7015P0632L9127J00585
$$ 2651360 2622879 2682507 2655703 2599618 2604209 2651692 2647963 2669101 2746116 2816748 2855875 2956460
5067B956460P0284N1534J10218L0418O7756J53518M3511M6026J12341K750p870
$$ 2956460 3026744 3078278 3188496 3218914 3286670 3440188 3483699 3529725 3642066 3644816 3636946
5056C636946l534n0620p9317j6200p246m4496m1573k2852m2154P9822K3436M4324
$$ 3636946 3633412 3582792 3503475 3487275 3480029 3435533 3393960 3371108 3328954 3408776 3432212 3476536
5044C476536k2895M1681M8637L6994N0391n1979l9762m7345k0633l4115N604J1188
$$ 3476536 3453641 3495322 3543959 3580953 3631344 3579365 3539603 3492258 3471625 3437510 3443114 3454302
5032C454302J1795Q7827l3786K0317n4736j02459K7428P726m6005N730q677K4538
$$ 3454302 3466097 3553924 3520138 3540455 3485719 3383260 3410688 3418414 3372409 3378139 3369462 3394000
5020C394000k2933K1119Q741m0715l746K5417O0767J22860R9814Q2708P9354Q5553
$$ 3394000 3371067 3392186 3400927 3360212 3356466 3381883 3442650 3565510 3665324 3748032 3827386 3912939
5008C912939J69847J72719J63429J03012K29718K98936J71173K60412K81479M08526
$$ 3912939 4082786 4255505 4418934 4521946 4751664 5050600 5221773 5482185 5763664 6172190
4998F172190O27695P45757R87972J277222J293918R41102N08162j05410n25513
$$ 6172190 6799885 7545642 8533614 9810836 11104754 12045856 12554018 12448608 11923095
4989A1923095p58899p10308q24344o54703n41016l35572k01831j23441K3334K28218
$$ 11923095 11164196 10453888 9629544 8974841 8433825 8098253 7896422 7772981 7796315 8024533
4979H024533M95015Q90610J028408J127715R94668N95616J12993l74271p63042
$$ 8024533 8519548 9410158 10438566 11566281 12560949 13156565 13269558 12895287 12132245
4970A2132245r36313q75300p52466n64451m25849k85092j33564Q4596J77697K55715
$$ 12132245 11195932 10320632 9568166 9003715 8577866 8292774 8159210 8243806 8421503 8677218
4960H677218K15965J93212R7075j0745j0449k0934l8614j57j4097J17109J64265
$$ 8677218 8893183 9086395 9183470 9172725 9162276 9141342 9102728 9102571 9088474 9205583 9369848
4949I369848K27427L28623M38121N00829O20831Q08548R84414J252537J486196
$$ 9369848 9597275 9925898 10364019 10864848 11485679 12294227 13278641 14531178 16017374
4940A6017374J655069J559557J287287O54978q9702o78239j070339j133919j091481
$$ 16017374 17672443 19232000 20519287 21174265 21084563 20406324 19335985 18202066 17110585
4931A7110585r24266o80733m45787k95965j13357J54802L66637N59379R44184
$$ 17110585 16186319 15505586 15059799 14763834 14650477 14805279 15171916 15731295 16675479
4922A6675479J130793J225428J255223P67132P2368o07708j085792j255605j246784
$$ 16675479 17806272 19031700 20286923 21054055 21126423 20518715 19432923 18177318 16930534
4913A6930534r95386p42925p28930n30370l07923j10992J13197L36766M00231
$$ 16930534 15935148 15192223 14463293 13932923 13625000 13514008 13627205 13963971 14364202
4904A4364202M48590K48794J10278o9186p1006k0597j07539L9329J64213J47439
$$ 14364202 14812792 15061586 15171864 15102678 15031672 15011075 14903536 14942865 15107078 15254517
4894A5254517K79660N34997N64924P14380P76490J119677J264174J397448J439999
$$ 15254517 15534177 16069174 16634098 17348478 18124968 19244645 20508819 21906267 23346266
4885B3346266J337710J333672J291952J257541J186195J069546R36213P95785
$$ 23346266 24683976 26017648 27309600 28567141 29753336 30822882 31759095 32554880
4877C2554880O94422O58683N42459O54346Q60342J130389J402764J696981K420854
$$ 32554880 33249302 33907985 34450444 35104790 35965132 37095521 38498285 40195266 42616120
4868D2616120K764041K732881K249977J289380N65930K99631L24560M32227N97073
$$ 42616120 45380161 48113042 50363019 51652399 52218329 52517960 52842520 53274747 53871820
4859E3871820P66092Q99443J156719J494384J669753J900434K148622K410319
$$ 53871820 54637912 55537355 56694074 58188458 59858211 61758645 63907267 66317586
4851F6317586K617679K691881K618597K338735J861233J321063O56547j60591
$$ 66317586 68935265 71627146 74245743 76584478 78445711 79766774 80423321 80262730
4843H0262730j140987j843682j961200j802608j250776q28287l78453j36071O5533
$$ 80262730 79121743 77278061 75316861 73514253 72263477 71435190 71056737 70920666 70986199
4834G0986199n8716j71375j01182M5913M91595J029349J285536J066996M54220
$$ 70986199 70927483 70756108 70654926 70700839 71192434 72221783 73507319 74574315 75028535
4825G5028535n26592j286950j632292j698538j583795j272671q66842l66444q3761
$$ 75028535 74501943 73214993 71582701 69884163 68300368 67027697 66160855 65794411 65710650
4816F5710650J29536j9599j87327k54801j55213J28620M47276Q11980J253760
$$ 65710650 65840186 65820587 65633260 65378459 65223246 65351866 65799142 66611122 67864882
4807F7864882J604568J855834J962590J816535J516899J146339R09029Q56269
$$ 67864882 69469450 71325284 73287874 75104409 76621308 77767647 78676676 79532945
4799G9532945O08829L54824J83064k12387p12613j114687j332319j439336j347288
$$ 79532945 80141774 80496598 80679662 80467275 79754662 78639975 77307656 75868320 74521032
4790G4521032j066601q63807n76751j34468K94643Q52619J617979K254704K925301
$$ 74521032 73454431 72590624 72013873 71879405 72174048 73026667 74644646 76899350 79824651
4781G9824651L736806M206305M335148M029119L513720K929103K546120K442862
$$ 79824651 83561457 87767762 92102910 96132029 99645749 102574852 105120972 107563834
4773A07563834K646372K724567K460489J924256J126066K12481o54140j424436
$$ 107563834 110210206 112934773 115395262 117319518 118445584 118658065 118003925 116579489
4765A16579489j691693j790614j839675j834761k162880k807120l479509m030392
$$ 116579489 114887796 113097182 111257507 109422746 107259866 104452746 100973237 96942845
4757I6942845m291241m149438l819880l224510k657457k172445j767625j316618
$$ 96942845 92651604 88502166 84682286 81457776 78800319 76627874 74860249 73543631
4749G3543631j092957q63874o95101m36387k84480m32262o96739j096116j433456
$$ 73543631 72450674 71586800 70891699 70455312 70170832 69738570 69041831 67945715 66512259
4740F6512259j652737j909476j960291j963673j980901j796368j621861j346329
$$ 66512259 64859522 62950046 60989755 59026082 57045181 55248813 53626952 52280623
4732E2280623r90360q34239r02044j339737j980856k648703k934270k866878k767407
$$ 52280623 51290263 50456024 49553980 48214243 46233387 43584684 40650414 37783536 35016129
4723C5016129k494004k167642j816811j489389j211379q44064o14570n03848l62203
$$ 35016129 32522125 30354483 28537672 27048283 25836904 24992840 24378270 23874422 23512219
4714B3512219k94792n76929o97652p02192o19601o06341n73396m50067k88383
$$ 23512219 23217427 22640498 21942846 21240654 20621053 20014712 19441316 18991249 18702866
4705A8702866j96110m2883K811J31859L63373N72180Q61954J147532J525151J384719
$$ 18702866 18506756 18463873 18466684 18598543 18961916 19534096 20396050 21543582 23068733 24453452
4695B4453452J195204P15300r7247q47362j224051j316070j249460j120538r21900
$$ 24453452 25648656 26363956 26266709 25419347 24195296 22879226 21629766 20509228 19587328
4686A9587328o16158k26635q4201J94853L06819L79056K66709K06892l0286j9216
$$ 19587328 18971170 18744535 18660334 18855187 19162006 19541062 19807771 20014663 19984377 19965161
4676A9965161L9721L1726o2277k51934l76818n73227p44855o82583m65220l22062
$$ 19965161 20004882 20036608 19974331 19722397 19345579 18772352 18027497 17344914 16879694 16557632
4666A6557632p00J57700M76501P86511J246441J529661J396381Q75388K58134
$$ 16557632 16556932 16714632 17191133 17977644 19224085 20753746 22150127 23025515 23283649
4657B3283649n23005j122497j204022j283528j288453j025595p47011o40227k95536
$$ 23283649 22760644 21638147 20434125 19150597 17862144 16836549 16089538 15449311 15153775
4648A5153775n2173p982R5349J61084J13954O9913J90551K73468L20143K79319
$$ 15153775 15101602 15093620 15188969 15350053 15464007 15533920 15724471 15997939 16318082 16597401
4638A6597401N9969k21517m26837m88562l88743k64520n7267J4287L35494P19786
$$ 16597401 16657370 16435853 16009016 15520454 15131711 14867191 14809924 14824211 15159705 15879491
4628A5879491J226910J513064J609203J450657Q65529k5646p18516j234079j532960
$$ 15879491 17106401 18619465 20228668 21679325 22544854 22519208 21800692 20566613 19033653
4619A9033653j498795j433232j199464r97562q18497p07672l91287l41241j31693
$$ 19033653 17534858 16101626 14902162 13904600 13086103 12378431 11987144 11645903 11514210
4610A1514210J21703K78889M37912Q00349R75981R20783O84668R7428l34851o92295
$$ 11514210 11635913 11914802 12352714 13153063 14129044 15049827 15734495 15831923 15497072 14804777
4600A4804777q76979r45883q33210o81533n14316m15521l18233j43091n9850N1871
$$ 14804777 13927798 12981915 12148705 11467172 10952856 10537335 10219102 10076011 10016161 10068032
4590A0068032O4576P639j6945k21827k96683k49532j48830m0409m8038k0664M7280
$$ 10068032 10132608 10140247 10123302 9901475 9604792 9355260 9206430 9166021 9117983 9097319 9144599
4579I144599J60585K66611L22183M25250N17320P18674Q68419J108774J397902
$$ 9144599 9305184 9571795 9893978 10319228 10836548 11555222 12423641 13532415 14930317
4570A4930317J531851J481041J408288J269532J149024P61764j7993q01021j476646
$$ 14930317 16462168 17943209 19351497 20621029 21770053 22531817 22513824 21712803 20236157
4561B0236157j707010j560672j090808o77133j83497N10152J026079J315884J044365
$$ 20236157 18529147 16968475 15877667 15200534 15017037 15527189 16553268 17869152 18913517
4552A8913517K91866m91264j069641j221492q92610l42294J72224O84034Q64171
$$ 18913517 19205383 18714119 17644478 16422986 15530376 15188082 15360306 16044340 16908511
4543A6908511P08663P9815o89424j091611j208220j156040q04244m01387L0629
$$ 16908511 17617174 17696989 17007565 15915954 14707734 13551694 12747450 12346063 12376692
4534A2376692N71495R83948J033361O55743m3192p68420j251811j375530j316170
$$ 12376692 12948187 13932135 14965496 15621239 15578047 14809627 13557816 12182286 10866116
4525A0866116j002790q36665o85340n31621m77428k98636k72769k54517j95789
$$ 10866116 9863326 9026661 8341321 7809700 7332272 7033636 6760867 6506350 6310561
4516F310561j63690j07599l1108l3946l7206n6626p7500m0817j39127q2300j29573
$$ 6310561 6146871 6039272 6008164 5974218 5937012 5880386 5802886 5762069 5622942 5540642 5411069
4505E411069n5915n9005q8196o4170q5148l9512n7045j2774m9020L454l9826j31603
$$ 5411069 5355154 5296149 5207953 5143783 5058635 5019123 4962078 4949304 4900284 4903738 4863912 4732309
4493D732309k8927k4843j7638N4834n6472K6202l2237J5950m2643j2015k7601
$$ 4732309 4703382 4678539 4660901 4715735 4659263 4685465 4653228 4669178 4626535 4614520 4586919
4482D586919m5280m5762k8787K4998N717k2806J0681P028R923k8451r5011k2005
$$ 4586919 4541639 4495877 4467090 4492088 4497805 4474999 4485680 4492708 4502631 4474180 4379169 4357164
4470D357164o114l6905l5297l6642J9618m555p916l7995J9534J8394k3729l8604
$$ 4357164 4351050 4314145 4278848 4242206 4261824 4257269 4249353 4211358 4230892 4249286 4225557 4186953
4458D186953K780k1191k8989O3284j1233k457L6357o3278l673O5028L7720M0334
$$ 4186953 4189733 4168542 4139553 4202837 4191604 4189147 4225504 4162226 4158553 4223581 4261301 4301635
4446D301635J9264j988K4600m3056r6594l0244o0319j0537j1628Q50p0027k5597
$$ 4301635 4320899 4318911 4343511 4300455 4203861 4173617 4113298 4102761 4091133 4091983 4021956 3996359
4434C996359m4598l8935J7293k8413j0070R3328M5216Q3642K9275k5795R463N1174
$$ 3996359 3951761 3912826 3930119 3901706 3891636 3984964 4030180 4113822 4143097 4117302 4126765 4177939
4422D177939r039o4554n2750Q1318J035M2651Q3525n5993K1314q162N0370m6285
$$ 4177939 4168900 4104346 4051596 4132914 4133949 4176600 4260125 4204132 4225446 4217284 4267654 4221369
4410D221369N8090Q9682K0039Q5521j1910L0411o5774m4306J20812l5302k2336
$$ 4221369 4279459 4369141 4389180 4474701 4462791 4493202 4427428 4383122 4503934 4468632 4446296
4399D446296J06292J8019K5947p725K3576P5800j0667J7339J02999J9675J9048
$$ 4446296 4552588 4570607 4596554 4588829 4612405 4688205 4677538 4694877 4797876 4817551 4836599
4388D836599n617K4489j9930L8077J16835j0720K0928M4283K5047L4506M1888
$$ 4836599 4830982 4855471 4835541 4873618 4990453 4979733 5000661 5044944 5069991 5104497 5146385
4377E146385k3086J673L9265J15769Q0996O2084K6007R3560L9429J18437O1638
$$ 5146385 5123299 5124972 5164237 5280006 5361002 5423086 5449093 5542653 5582082 5700519 5762157
4366E762157K3582Q5879O1548N1102R4864J73658J28924J08621J39974R9527K15151
$$ 5762157 5785739 5871618 5933166 5984268 6079132 6252790 6381714 6490335 6630309 6729836 6944987
4355F944987K15129K40549L17876L11251M70424O36895R21783J150078J261884
$$ 6944987 7160116 7400665 7718541 8029792 8500216 9137111 10058894 11208972 12470856
4346A2470856J209185R22743M19332R2069k17275j00870R9563L42643L64305J75271
$$ 12470856 13680041 14602784 15022116 15114185 14896910 14796040 14895603 15238246 15602551 15777822
4336A5777822k69082o46926r59312j158970j116205r51442q07419o83417n61361
$$ 15777822 15508740 14861814 13902502 12743532 11627327 10675885 9868466 9185049 8623688
4327H623688l43643l36797k55421k25339j11881j69126k17796n7339q0264q5861
$$ 8623688 8280045 7943248 7687827 7462488 7350607 7181481 6963685 6906346 6826082 6740221
4317F740221p5606J9990J3556p278o7034J10224j0363J9579O2709L1605J8066
$$ 6740221 6664615 6684605 6698161 6690883 6623849 6734073 6723710 6743289 6805998 6837603 6855669
4306F855669M4106L3384Q1551Q4051Q9801O9504J08025O5028O7113Q6200Q6150
$$ 6855669 6899775 6933159 7014710 7098761 7188562 7258066 7366091 7431119 7498232 7584432 7670582
4295G670582Q5325Q9142N8027Q2083J1548O55R5823N8664p6955m9670J0621M3561
$$ 7670582 7755907 7845049 7903076 7985159 7996707 7997362 8093185 8151849 8074894 8025224 8035845 8079406
4283H079406J4748n9015l2272m5811L801K3536L2397N7113M3514J9634N1805P0693
$$ 8079406 8094154 8035139 8002867 7957056 7960857 7984393 8016790 8073903 8117417 8137051 8188856 8259549
4271H259549J3068P7598J31217L9463M1383J74290J85875K55560K48875K94646
$$ 8259549 8272617 8350215 8481432 8520895 8562278 8736568 8922443 9178003 9426878 9721524
4261I721524M25067L63147L96373N57676O31121N85422P43473R36437J031339
$$ 9721524 10146591 10509738 10906111 11463787 12094908 12680330 13423803 14360240 15391579
4252A5391579J219697J562685J884532K384848K953548L832782M611985N046189
$$ 15391579 16611276 18173961 20058493 22443341 25396889 29229671 33841656 38887845
4244C8887845N218757M903941M125402L219490K227793J457342R24129M16242
$$ 38887845 44106602 49010543 53135945 56355435 58583228 60040570 60964699 61380941
4236F1380941J19503l58635j151177k154070l228957m266939m982353n110150
$$ 61380941 61500444 61141809 59990632 57836562 54607605 50340666 45358313 40248163
4228D0248163m880530m384182l741746l158276k582502k182242j655588j374131
$$ 40248163 35367633 30983451 27241705 24083429 21500927 19318685 17663097 16288966
4220A6288966j173106r61308p94180o46724n39523l70732m25209l07698k61937
$$ 16288966 15115860 14154552 13360372 12713648 12174125 11803393 11378184 11070486 10808549
4211A0808549k46045k33317k25407j17957j17708j50718j19538j03354j19115
$$ 10808549 10562504 10329187 10103780 9985823 9868115 9717397 9597859 9494505 9375390
4202I375390O505k7153j3272r2554r0008m1934J7047J1416L0249L3456Q673n4521
$$ 9375390 9381895 9354742 9341470 9248916 9158908 9116974 9134021 9145437 9175686 9209142 9217815 9163294
4190I163294O5799L5478l2055O0634k9362N0444M7101J91835O3362R145M7957
$$ 9163294 9229093 9264571 9232516 9293150 9263788 9314232 9361333 9553168 9616530 9625675 9673632
4179I673632J48077J13093J60726K15019K65473K44977K75219K32812K09564M13471
$$ 9673632 9821709 9934802 10095528 10310547 10576020 10820997 11096216 11329028 11538592 11952063
4169A1952063M64322M60260M98975O09379P24070O62604O96140Q09260P80149
$$ 11952063 12416385 12876645 13375620 13984999 14709069 15371673 16067813 16877073 17657222
4160A7657222O55869O40916O86086O74702O01978O93423P09258P35623R10329
$$ 17657222 18313091 18954007 19640093 20314795 20916773 21610196 22319454 23055077 23965406
4151B3965406R63041J022637J140693J140482J295671J604975K110801K781298
$$ 23965406 24928447 25951084 27091777 28232259 29527930 31132905 33243706 36025004
4143C6025004M181623O742529R924541J0863032Q514386L021930l688981o840067
$$ 36025004 40206627 46949156 56873697 67736729 76251115 79273045 75584064 68743997
4135F8743997p058680n390536l812906l065879k457683j736558j110592q11677
$$ 68743997 61685317 56294781 52481875 49415996 46958313 45221755 44111163 43299486
4127D3299486m69702q9889K44597M73072P47993J048149J138732J094865J168197
$$ 43299486 42829784 42739895 42984492 43457564 44205557 45253706 46392438 47487303 48655500
4118D8655500J279053J374705J517060J516126J396736J212978R11101P14758
$$ 48655500 49934553 51309258 52826318 54342444 55739180 56952158 57863259 58578017
4110E8578017M93231M40791L80672J99964K41724K34117K12818K84902J62635
$$ 58578017 59071248 59512039 59892711 60092675 60334399 60568516 60781334 61066236 61228871
4101F1228871K38256J99999J02564K10301K80051M86782N94072Q22796J095306
$$ 61228871 61467127 61667126 61769690 61979991 62260042 62746824 63340896 64163692 65258998
4092F5258998J348160J614507J896481K205443K469622K645021K511407K307338
$$ 65258998 66607158 68221665 70118146 72323589 74793211 77438232 79949639 82256977
4084H2256977K059647J852779J618181J520223J335750J011916P03735N69420
$$ 82256977 84316624 86169403 87787584 89307807 90643557 91655473 92359208 92928628
4076I2928628M56959K97866J27618k1794k12701k95067j30709O3015L37210N37996
$$ 92928628 93385587 93683453 93811071 93789277 93576576 93281509 93150800 93213815 93551025 94089021
4066I4089021O92202M77593K09310j39951l86943n51292o35827o03949m09140
$$ 94089021 94781223 95258816 95468126 95328175 94941232 94389940 93754113 93150164 92741024
4057I2741024l42707j09L28840O37237Q07694O98197O30179L58995J61354n2259
$$ 92741024 92398317 92398208 92727048 93364285 94171979 94870176 95500355 95859350 96020704 95968445
4047I5968445l56838p26729j144200j427564j462081j401447j424426j582300
$$ 95968445 95611607 94884878 93740678 92313114 90851033 89449586 88025160 86442860
4039H6442860k146658k741130l045063l142612k890795k295338j787872j210495
$$ 86442860 84296202 81555072 78510009 75367397 72476602 70181264 68393392 67182897
4031F7182897o80849k14197L3524K90286N28388O24399N39889L22596R2383k37861
$$ 67182897 66502048 66287851 66321375 66611661 67140049 67764448 68304337 68626933 68719316 68481455
4021F8481455l98845o78588q70046p64475o48296n21084k93106k32493j81535
$$ 68481455 68082610 67404022 66533976 65769501 65121205 64600121 64307015 64074522 63892987
4012F3892987n22221j015465j546213j953637k018073j740781j402602j037974
$$ 63892987 63370766 62355301 60809088 58855451 56837378 55096597 53693995 52656021
4004E2656021p56090n63514o54661q21040q96717r38007j012514r13823r19208
$$ 52656021 51899931 51336417 50681756 49860716 48963999 48025992 47013478 46099655 45180447
3995D5180447j057305j122905j136503j317870j354577j226747j151550j069203
$$ 45180447 44123142 43000237 41863734 40545864 39191287 37964540 36812990 35743787
3987C5743787r71712r97102r44499j014726j196526j252798j281759j165634j097963
$$ 35743787 34772075 33774973 32830474 31815748 30619222 29366424 28084665 26919031 25821068
3978B5821068q04466p11236p25593o96022o43462n43155n80065m79716m26182
$$ 25821068 25016602 24305366 23579773 22883751 22240289 21697134 21117069 20637353 20211171
3969B0211171l17904l87904l37896k90818m11746m33093m52957n84359n58416
$$ 20211171 19893267 19505363 19167467 18876649 18464903 18031810 17578853 16994494 16436078
3960A6436078m78216m11898l77166m16947l15984l59159l87688l20592k94616
$$ 16436078 15957862 15545964 15168798 14751851 14435867 14076708 13689020 13368428 13073812
3951A3073812j99528q5797j31095j29432j05571j49800k17800j54630j56796j63944
$$ 13073812 12874284 12788487 12657392 12527960 12422389 12272589 12054789 11900159 11743363 11579419
3941A1579419o0115j30993j22944K6556j5549j4586p6911p1134q1299q5683j05968
$$ 11579419 11519304 11388311 11265367 11291923 11276374 11261788 11184877 11113743 11032444 10946761 10840793
3930A0840793j11605k3060n9842o1489l9035j34980j26015j28212j08746p8151
$$ 10840793 10729188 10706128 10646286 10584797 10545762 10410782 10284767 10156555 10047809 9969658
3920I969658k04579j34709j20598j08593k1832r9817r9135o1881K151n3557l8760
$$ 9969658 9765079 9630370 9509772 9401179 9379347 9279530 9180395 9118514 9120665 9067108 9028348
3909I028348o3819j01427m5528L8293p6169n0638j0304q5377m2017O1745K2776
$$ 9028348 8964529 8863102 8817574 8855867 8779698 8729060 8718756 8633379 8591362 8653107 8675883
3898H675883R7382n6629j1780M6066k4856R905k0522m501n672N4163O7726P1921
$$ 8675883 8773265 8716636 8704856 8750922 8726066 8735971 8715449 8710948 8705276 8759439 8827165 8899086
3886H899086N6067J52779J14068J69891J28081P0996K4949M4768N0104J04804
$$ 8899086 8955153 9107932 9222000 9391891 9519972 9590968 9615917 9660685 9710789 9815593
3876I815593J01916R5953J87136J69280K20989J99451K80045K91207K30938L01200
$$ 9815593 9917509 10013462 10200598 10369878 10590867 10790318 11070363 11361570 11592508 11893708
3866A1893708L31873L85668M03903L89108M47099N11772M80223M16340M23465
$$ 11893708 12225581 12611249 13015152 13404260 13851359 14363131 14843354 15259694 15683159
3857A5683159N11177M52939M76423M41979M26558L77161L82595M44434L11373
$$ 15683159 16194336 16647275 17123698 17565677 17992235 18369396 18751991 19196425 19507798
3848A9507798K61332L57032M97356N99146N80761P16077Q99808R71315J134071
$$ 19507798 19769130 20126162 20623518 21222664 21803425 22519502 23419310 24390625 25524696
3839B5524696J114779J279795J396717J383694J431547J411923J375678J466623
$$ 25524696 26639475 27919270 29315987 30699681 32131228 33543151 34918829 36385452
3831C6385452J401320J185752J191267J156091J060487J084567J097107J156453
$$ 36385452 37786772 38972524 40163791 41319882 42380369 43464936 44562043 45718496
3823D5718496J089454J024016J044817J046129J025492J030522J004788Q22585
$$ 45718496 46807950 47831966 48876783 49922912 50948404 51978926 52983714 53806299
3815E3806299N64827K14735j20254j67335l96034o43276p81955q87774j025440
$$ 53806299 54371126 54585861 54465607 54298272 53902238 53258962 52477007 51589233 50563793
3806E0563793j236740j168071j160042j137434j098018j204073j324895j238708
$$ 50563793 49327053 48158982 46998940 45861506 44763488 43559415 42234520 40995812
3798D0995812j240239j327905j337929j284671j262891j144966r85808r23871
$$ 40995812 39755573 38427668 37089739 35805068 34542177 33397211 32411403 31487532
3790C1487532q40946o93011n97352m16601k09327J3158J04157J73668L59312M67824
$$ 31487532 30646586 29953575 29356223 28939622 28730295 28743453 28847610 29021278 29380590 29848414
3780B9848414M76404N90700N40514N21938N78045N80337O33681Q39853Q28284
$$ 29848414 30324818 30915518 31456032 31977970 32556015 33136352 33770033 34609886 35438170
3771C5438170Q43594P96258O21583O85040N80159L90959L38056K86272J97916
$$ 35438170 36281764 37078022 37699605 38384645 38964804 39355763 39693819 39980091 40178007
3762D0178007N1361l3576r4799k84910m85084l99106m70268m97240n51062n47116
$$ 40178007 40229368 40195792 40100993 39816083 39330999 38931893 38461625 37964385 37413323 36866207
3752C6866207m93704n54543n74443n48175o52301o64505o62104p42425p21582
$$ 36866207 36372503 35817960 35243517 34695342 34043041 33378536 32716432 31974007 31252425
3743C1252425q00097p68033q36554q24394p25244n93333l81214k87856j4326Q9019
$$ 31252425 30452328 29684295 28847741 28023347 27298103 26704770 26323556 26035700 26021374 26110393
3733B6110393J66051K53075K15151K22196J71618L57018L10299M22690M15016
$$ 26110393 26276444 26529519 26744670 26966866 27138484 27495502 27805801 28228491 28643507
3724B8643507N38696M73281N49323N27185M44138L47551L72223M85266M65513
$$ 28643507 29182203 29655484 30204807 30731992 31176130 31523681 31895904 32381170 32846683
3715C2846683N00825M93302N16008N88636M28551K41618K27358J47161L2613l0873
$$ 32846683 33347508 33840810 34356818 34945454 35374005 35615623 35842981 35990142 36022755 35991882
3705C5991882j03124k43622l70343m74308n80070o81236p61547p08432q10250
$$ 35991882 35888758 35645136 35274793 34800485 34220415 33539179 32777632 32069200 31258950
3696C1258950q76339q73211p19503n96571n47877m67048m27976l71177l38545
$$ 31258950 30382611 29509400 28789897 28193326 27645449 27178401 26750425 26379248 26040703
3687B6040703l46772l74827m00385l24105k71024j78544o926J88491L21855M09421
$$ 26040703 25693931 25319104 24918719 24594614 24323590 24145046 24138120 24326611 24648466 25057887
3677B5057887N76615M28261M23862M71103M90616O36064Q19806Q52885J006585
$$ 25057887 25634502 26062763 26486625 26957728 27448344 28084408 28904214 29757099 30763684
3668C0763684J209747J213347J233387J152971J167699J108521J023392R49095
$$ 30763684 31973431 33186778 34420165 35573136 36740835 37849356 38872748 39821843
3660C9821843Q37131N94712M66536M26405K32082J47134j17433k22984m34164
$$ 39821843 40658974 41253686 41720222 42146627 42378709 42525843 42408410 42185426 41751262
3651D1751262n22236n74858o91576p44053o91830o74757o52152o01637m66239
$$ 41751262 41229026 40654168 39962592 39218539 38526709 37851952 37199800 36598163 36131924
3642C6131924m62528l71027l62833k62220k99173k67337j72582q9620p626K8013
$$ 36131924 35669396 35298369 34935536 34673316 34374143 34106806 33934224 33844604 33836978 33864991
3632C3864991p3291k62658k94465l16661k74216l39334j86794k32381l01137l16202
$$ 33864991 33791700 33529042 33234577 32917916 32643700 32304366 32117572 31885191 31584054 31267852
3622C1267852j93715N1875K04594N34400P01201Q26133Q07257O28603N34255M48734
$$ 31267852 31074137 31126012 31330606 31865006 32566207 33392340 34199597 34828200 35362455 35811189
3612C5811189M04063M89712N48806P36294P89094O36556L35888r9526l77135n45481
$$ 35811189 36215252 36704964 37253770 37990064 38779158 39415714 39751602 39652076 39274941 38729460
3602C8729460o45219o73810o62944o63813o18945o37185n98110p83368r49349
$$ 38729460 38084241 37410431 36747487 36083674 35464729 34827544 34229434 33446066 32496717
3593C2496717r72656r44374p77513n39391j09518J72089L93303N31798O16575
$$ 32496717 31524061 30579687 29802174 29262783 29153265 29325354 29718657 30250455 30867030
3584C0867030O87302Q21503Q48543P47112Q78248Q43836O60195M40396J66152
$$ 30867030 31554332 32375835 33224378 33971490 34849738 35693574 36353769 36794165 36960317
3575C6960317r8835l74169o61418p97358r33722r13755r66807j018558q32465
$$ 36960317 36861482 36487313 35825895 35028537 34094815 33181060 32214253 31195695 30363230
3566C0363230m19397j44603J52414L45470M46688M06007R8381n9198l87706p06108
$$ 30363230 29943833 29799230 29951644 30297114 30743802 31149809 31248190 31188992 30801286 30095178
3556C0095178q80732j053183j130429j149242j164218j073831j048710r78062
$$ 30095178 29214446 28161263 27030834 25881592 24717374 23643543 22594833 21616771
3548B1616771q13261p45945p33189o35857n32286n58166m74063l37611k47854
$$ 21616771 20803510 20057565 19324376 18688519 18156233 17598067 17124004 16786393 16538539
3539A6538539k27160M2712K12571L98264N71426O00828N82229N32175L94032K99802
$$ 16538539 16311379 16354091 16566662 16964926 17536352 18137180 18719409 19251584 19645616 19945418
3529A9945418L53931M07856M88112O70968Q51185Q44951R10620P59266N43775
$$ 19945418 20299349 20707205 21195317 21866285 22717470 23562421 24473041 25232307 25776082
3520B5776082M34303K79736K20634J50675L30683L47259M33964O65609P53572
$$ 25776082 26210385 26490121 26710755 26861430 27192113 27539372 27973336 28638945 29392517
3511B9392517P25167O43846O46294O90990P75462O28529O80059P09739N10020
$$ 29392517 30117684 30761530 31407824 32098814 32874276 33502805 34182864 34892603 35402623
3502C5402623M08372J82013k40154n86232j044841j513455j636390j656867j630754
$$ 35402623 35810995 35993008 35752854 35166622 34121781 32608326 30971936 29315069 27684315
3493B7684315j517764j447738j236829j089385q07339n51170m62263l10728k07261
$$ 27684315 26166551 24718813 23481984 22392599 21585260 21034090 20571827 20261099 20053838
3484B0053838k98563m22056k37527j18880j23847J3605J66370K23223J79079P4724
$$ 20053838 19755275 19333219 19095692 18976812 18852965 18866570 19032940 19256163 19435242 19509966
3474A9509966j4183l684q5825o8898j06830p422n5831O9124J56292J68732K62445
$$ 19509966 19495783 19492099 19406274 19337376 19230546 19223124 19167293 19236417 19392709 19561441 19823886
3463A9823886L59502M34643M40232N92125O58466O77430O92463N74882M28628
$$ 19823886 20183388 20618031 21058263 21650388 22308854 22986284 23678747 24253629 24682257
3454B4682257K25014J127J8201j7465O963P4275K84320J44412P9414j37047l24788
$$ 24682257 24907271 24908398 24926599 24909134 24916097 24990372 25274692 25419104 25498518 25361471 25036683
3443B5036683m63403o12996o13630o87764o35959m29811l81873j54711J10442
$$ 25036683 24573280 23960284 23346654 22658890 22022931 21593120 21211247 21056536 21166978
3434B1166978J92669M72695O79701N47968N95480M31976J58088o594r6258p0824
$$ 21166978 21359647 21832342 22512043 23060011 23655491 24087467 24245555 24238961 24142703 24071879
3424B4071879J17791L42171M69811O11688M96535M39673L61506J19489k869r5423
$$ 24071879 24189670 24531841 25001652 25613340 26109875 26549548 26911054 27030543 27027674 26932251
3414B6932251k12981k28584l06580j76740j23168p1860r4762m6504o3959j67181
$$ 26932251 26719270 26490686 26184106 26007366 25884198 25812338 25717576 25671072 25607113 25439932
3404B5439932l08925l56844l69664j52987j28963J19375M23598O61238J143176
$$ 25439932 25131007 24774163 24404499 24251512 24122549 24241924 24665522 25326760 26469936
3395B6469936J574355K015794K150008J908187J189507L16584m53090j029265
$$ 26469936 28044291 30060085 32210093 34118280 35307787 35624371 35171281 34142016
3387C4142016j102325r38208n07338j57624o830M7040q4633k80916l05046k29677
$$ 34142016 33039691 32101483 31594145 31436521 31429691 31476731 31392098 31111182 30806136 30576459
3377C0576459k42082r1081j27388l23110l64047n33542m05282l00847k48581n2911
$$ 30576459 30334377 30243296 30115908 29792798 29428751 28895209 28489927 28189080 27940499 27887588
3367B7887588q3073K3442K21446K94036N31380P11702R04750J172238J318946
$$ 27887588 27804515 27827957 28049403 28343439 28874819 29586521 30491271 31663509 32982455
3358C2982455J532008J674433J789667J800627J546673J264646J201743J187901
$$ 32982455 34514463 36188896 37978563 39779190 41325863 42590509 43792252 44980153
3350D4980153J433022J939722K264830K219767J814687R60762N8420n12044o76996
$$ 44980153 46413175 48352897 50617727 52837494 54652181 55612943 55671363 55159319 54482323
3341E4482323m85400m1676O1471k09484n50127j012092j268253j020978p06844
$$ 54482323 53996923 53955247 54016718 53807234 53257107 52245015 50976762 49955784 49248940
3332D9248940k97007K9496J92783L42702M99072O34153J034872J475628J917348
$$ 49248940 48951933 48981429 49174212 49516914 50015986 50650139 51685011 53160639 55077987
3323E5077987K462573L005933L955429N468923P706360J0647246J4206343J7402994
$$ 55077987 57540560 60546493 64501922 69970845 77677205 88324451 102530794 119933788
3315A19933788J8510379J6193465J0367693K578387m700671r413717j1177937
$$ 119933788 138444167 154637632 165005325 167583712 162883041 153469324 142291387
3308A42291387j0874271r404288p378175n408992l616177k322847j694521j523775
$$ 142291387 131417116 122012828 114634653 109225661 105609484 103286637 101592116 100068341
3300A00068341j538908j484230j180831m02874P36180J978905L311532M640966
$$ 100068341 98529433 97045203 95864372 95461498 96197678 98176583 101488115 106129081
3292A06129081N783519O814403P928014R693911J2168404J4246480J4273053J0617637
$$ 106129081 111912600 118727003 126655017 136348928 148517332 162763812 177036865 187654502
3284A87654502M034442l228685q777826j1310320j1016275r231167p080722n417823
$$ 187654502 191688944 188460259 179682433 168372113 157355838 148124671 141043949 135626126
3276A35626126m441549l946654l846251l679721l020388k145618j543445j135252
$$ 135626126 131184577 127237923 123391672 119711951 116691563 114545945 113002500 111867248
3268A11867248r70333j025109q58565n54052j76819k81244q50727j806308k865477
$$ 111867248 110896915 109871806 109013241 108459189 108282370 108001126 107150399 105344091 102478614
3259A02478614l280206l177769k591806j458939j37469J196186K645999M152860
$$ 102478614 99198408 96020639 93428833 91969894 91832425 93028611 95674610 99827470
3251I9827470N578062P082733Q736240J0084628J1636014J3305992J5376505J7412198
$$ 99827470 105405532 112488265 121224505 131309133 142945147 156251139 171627644 189039842
3243A89039842J8901451J8816040J6955602J4180110J1265320Q988975O436684
$$ 189039842 207941293 226757333 243712935 257893045 269158365 278147340 284584024
3236B84584024K415723l897081j1434199j8397520k2971325k4465931k3512472
$$ 284584024 286999747 283102666 271668467 253270947 230299622 205833691 182321219
3229A82321219k0884886j7711985j4478926j1772996r594146p610855n915272
$$ 182321219 161436333 143724348 129245422 117472426 107878280 100267425 94352153
3222I4352153m834289m237827l738912l670582l784354l870858l784781l649765
$$ 94352153 89517864 85280037 81541125 77870543 74086189 70215331 66430550 62780785
3214F2780785l345043k866822k429772k011039j682452j261288r07533m85455
$$ 62780785 59435742 56568920 54139148 52128109 50445657 49184369 48276836 47791381
3206D7791381q7844K41303N58997R88087J410747K213717L254467M637752O057100
$$ 47791381 47703537 47944840 48503837 49491924 50902671 53116388 56370855 61008607 67065707
3197F7065707P121091O969382N436875K724961q8360k483572l821193m310822
$$ 67065707 74186798 81156180 86593055 89318016 89229656 86746084 82924891 78614069
3189G8614069m598213m680250m734305m689295m322887l789453l306324k615916
$$ 78614069 74015856 69335606 64601301 59912006 55589119 51799666 48493342 45877426
3181D5877426k198807j941266j723579j515004j488165j490429j446984j231450
$$ 45877426 43678619 41737353 40013774 38498770 37010605 35520176 34073192 32841742
3173C2841742j094705r67698p20509n81729n01621m62043m58976n06132m01086
$$ 32841742 31747037 30779339 30058830 29477101 28975480 28513437 28054461 27548329 27147243
3164B7147243l37198k55888k51263j17284r2402j80480j50206k43824j60114j06532
$$ 27147243 26810045 26554157 26302894 26185610 26093208 25912728 25762522 25518698 25358584 25252052
3154B5252052n8208J56856K43229M19079O24441O84816R08243J019502J218465
$$ 25252052 25193844 25350700 25593929 26013008 26637449 27322265 28230508 29250010 30468475
3145C0468475J397297J729720K424622L368715M481103N826527O895498P449555
$$ 30468475 31865772 33595492 36020114 39388829 43869932 49696459 56591957 64041512
3137F4041512O983618N288894K641866l45774l158490n230790o302043o442485
$$ 64041512 71025130 76314024 78955890 78610116 75451626 70220836 63918793 57476308
3129E7476308n914536n170936m290500l458816k749270j968366j357274q46589
$$ 57476308 51561772 46390836 42100336 38641520 35892250 33923884 32566610 31720021
3121C1720021l59573M2935M09759L32714J10608j17342n75465j044090j262498
$$ 31720021 31360448 31403383 31813142 32145856 32256464 32139122 31563657 30519567 29257069
3112B9257069j326412j218626j002632r07389o88263m84567l59311k22162j16895
$$ 29257069 27930657 26712031 25709399 24802010 24113747 23629180 23269869 23047707 22930812
3103B2930812m1539J22541O8819J54921J94022J91698L66459M21924N74816O93217
$$ 22930812 22889273 23011814 23080633 23235554 23429576 23621274 23987733 24409657 24984473 25677690
3093B5677690R62263J300366J367762J442136J644336K047825K344634K584931
$$ 25677690 26639953 27940319 29308081 30750217 32394553 34442378 36787012 39371943
3085C9371943L042781L651224M564695N820352P508634R441205J1502465J3393111
$$ 39371943 42414724 46065948 50630643 56450995 63959629 73400834 84903299 98296410
3077I8296410J4139092J2909587R747540N048290j87714m287970o715835p172090
$$ 98296410 112435502 125345089 135092629 140140919 139953205 135665235 128949400 121777310
3069A21777310n782242l311929n0787L323975O158662P631406O787799L886414
$$ 121777310 115995068 112683139 112632352 115956327 122114989 129746395 136534194 140420608
3061A40420608n57519n451380r385641j1787746j2602165j2132580j0986124r701108
$$ 140420608 139863089 134411709 125026068 113238322 100636157 88503577 77517453 67816345
3053F7816345q337140o979317n699652m736006l955170l296415k582901k020549
$$ 67816345 59479205 52499888 46800236 42064230 38109060 34812645 32229744 30209195
3045C0209195j640589j291684r86662p16020n32088m32301k57219k71671k43300
$$ 30209195 28568606 27276922 26290260 25574240 25042152 24609851 24352632 24080961 23837661
3036B3837661l64243l55694k99570m31940k90990k82619j60452o7804N6324K67723
$$ 23837661 23473418 23117724 22818154 22386214 22095224 21812605 21652153 21584349 21640673 21908396
3026B1908396M30955Q70147J394566J996774K945174M060928N106754N690427
$$ 21908396 22339351 23209498 24604064 26600838 29546012 33606940 38713694 44404121
3018D4404121N238708L728229J429225j166022l345310m802898n345964n104121
$$ 44404121 49642829 53371058 54800283 53634261 50288951 45486053 40140089 35035968
3010C5035968m552707l886501l259949k721307k104381j722859j314252j090030
$$ 35035968 30483261 26596760 23336811 20615504 18511123 16788264 15474012 14383982
3002A4383982q62390p24589o95330o34437o29632m99973m18827l76045l93761
$$ 14383982 13521592 12797003 12101673 11467236 10837604 10337631 9918804 9542759 9148998
2993I148998l20877k88191k69765k42743k84951k83088j10489k20848k07352j79710
$$ 9148998 8828121 8539930 8270165 8027422 7742471 7459383 7348894 7128046 6920694 6740984
2983F740984k15750j37792r9568r9811j22550r7760j41871j61563o4413j05338
$$ 6740984 6525234 6387442 6287874 6188063 6065513 5967753 5825882 5664319 5599906 5494568
2973E494568k17221j01863j23288l9868l6737j04852j5280p8250p0052K389k053
$$ 5494568 5277347 5175484 5052196 5012328 4975591 4870739 4855459 4777209 4707157 4709546 4707493
2962D707493m9140M3222L8745P3276j6033k9709O941M8698J4888J4673l4311j45318
$$ 4707493 4658353 4701575 4740320 4813596 4797563 4767854 4774795 4823493 4838381 4853054 4818743 4673425
2950D673425n8855j09382j89673k22169j91422n2645j40597k12463k3714l4546
$$ 4673425 4614570 4505188 4315515 4093346 3901924 3849279 3708682 3496219 3472505 3437959
2940C437959j14185p7359q6845j34448m8401k1688o4359k1408j8904m4106q0872
$$ 3437959 3323774 3246415 3159570 3025122 2976721 2955033 2890674 2869266 2850362 2806256 2725384
2929B725384J8381l5203q7193q6254K4682J724p9645q3293j3711l8126L425O6279
$$ 2725384 2743765 2708562 2621369 2535115 2559797 2561521 2481876 2398583 2384872 2346746 2350171 2416450
2917B416450J9401q4562o6221M8151Q736l642M5169N3853k1723n694k2137o6651
$$ 2416450 2435851 2351289 2285068 2333219 2341955 2338313 2383482 2437335 2415612 2409918 2387781 2321130
2905B321130r2632j3088l7030j1989p1194k6427k1309m7568J7717j2301m1022
$$ 2321130 2228498 2215410 2178380 2166391 2095197 2068770 2047461 1999893 2017610 2005309 1964287
2894A964287L8386o5992q6990k23j6316n2044n6436L3574M5808k8655k1078q5061
$$ 1964287 2002673 1936681 1849691 1849468 1833152 1781108 1724672 1758246 1804054 1775399 1754321 1669260
2882A669260Q5596j1425r8210k2828M9613J2095O78j5266k5627J7063N1174n1910
$$ 1669260 1754856 1743431 1645221 1622393 1672006 1684101 1684779 1669513 1643886 1660949 1712123 1660213
2870A660213J570J6999L2733j0024l9521j3121o0746n308j4168j1796L5796L9087
$$ 1660213 1661783 1678782 1711515 1701491 1661970 1648849 1588103 1582795 1568627 1556831 1592627 1631714
2858A631714n0969J4597j9636K3081M5524K8423M3246j01517R7792q636l3903
$$ 1631714 1580745 1595342 1575706 1598787 1644311 1672734 1715980 1614463 1712255 1703619 1669716
2847A669716q980j36836q923p1370q5467k2978Q4533k6897n1695m9566J9927N7944
$$ 1669716 1660736 1523900 1514977 1443607 1358140 1335162 1419695 1392798 1341103 1291537 1311464 1369408
2835A369408o1077r3530N6887j6396l9556L3913o2386K9263L7809o9760l616l0448
$$ 1369408 1308331 1214801 1271688 1255292 1215736 1249649 1187263 1216526 1254335 1184575 1180959 1150511
2823A150511R367k0846J4065p0614n07M4208j6524K6949m9732k0611L1420L5735
$$ 1150511 1159878 1139032 1153097 1082483 1081976 1126184 1109660 1136609 1086877 1066266 1097686 1133421
2811A133421n8863l466K445R2982j8006M519j7344m6617M9564j9918K7800M0494
$$ 1133421 1074558 1071092 1073537 1166519 1148513 1153032 1135688 1089071 1138635 1118717 1146517 1187011
2799A187011P7740j1O1946M4222L9448J9461N2754R3201M1775O089R793m0386
$$ 1187011 1264751 1264740 1326686 1370908 1410356 1429817 1482571 1575772 1617547 1623636 1633429 1593043
2787A593043J6824P695q7969o4664L4514k778L0533M8072r5933P8697j7455K7916
$$ 1593043 1609867 1617562 1529593 1464929 1499443 1496665 1527198 1575270 1479337 1558034 1540579 1568495
2775A568495n3303q6637j00714j20872p9833k9030L6949j09207q6309J2247j3231
$$ 1568495 1515192 1428555 1327841 1206969 1127136 1098106 1135055 1025848 939539 951786 938555
2764I38555o2858k2778n4305L5396J1479l1376k5652m9095N3398j0208q084K1340
$$ 938555 875697 852919 798614 834010 845489 814113 788461 739366 792764 782556 774472 795812
2752G95812l1599K4761o936L3303J7150j4254j3011o358L040j6575o2349K4128
$$ 795812 764213 788974 782038 815341 832491 818237 805226 798868 801908 785333 722984 747112
2740G47112j5924l7630N0219L3500l6411j2120N8367J18534k3106j4757j096j7114
$$ 747112 731188 693558 743777 777277 740866 728746 787113 905647 882541 867784 866688 849574
2728H49574j8590k7617j4880M0062o6737j7237o2811o1703N5989p987l7860m170
$$ 849574 830984 803367 788487 828549 761812 744575 681764 620061 676050 668063 630203 626033
2716F26033K752n3932j0696L8631j0878q876l1402J10400K0910o9842P635j8079
$$ 626033 628785 574853 564157 602788 591910 583034 551632 662032 682942 613100 620735 602656
2704F02656K1387M9607p824J1207l4566n7151K5107m3644k8265J6310L0730K3943
$$ 602656 624043 673650 665826 677033 642467 585316 610423 566779 538514 554824 585554 609497
2692F09497n319p5778M3173J0858l6880m3915O392p325l8561N768J08541M601
$$ 609497 604178 528400 571573 582431 545551 501636 508028 500703 462142 467910 576451 581052
2680E81052o653l5213o554P186J8051K4458k068l7667j8515Q3492K5526m9269
$$ 581052 574399 539186 532632 539818 557869 582327 580259 542592 524077 607569 633095 583826
2668E83826R900o8699L319k6036Q5907N5052p242l5199o3219N8827K1226k6220
$$ 583826 593726 525027 528346 502310 588217 643269 636027 600828 537609 596436 617662 591442
2656E91442N4552K4899l8572m06j945L4619m3832k8933K3364k542L8637J4803
$$ 591442 645994 670893 632321 631915 629970 664589 620757 591824 615188 612646 651283 666086
2644F66086L1278J3744o7947r7534P2983k3617j1326m4514N856L7952K9984L6671
$$ 666086 697364 711108 643161 545627 618610 594993 583667 539153 545009 582961 612945 649616
2632F49616N3878N4456J3474m495j2924m8604m9553j6761m048n9860r1443j0765
$$ 649616 703494 757950 771424 766929 754005 705401 655848 639087 635039 575179 483736 472971
2620D72971J9260O0948l7798R272R633o374l310k0083K6125N8124l9010j5834
$$ 472971 492231 553179 515381 524653 534286 527912 524602 504519 530644 588768 549758 533924
2608E33924k1490j98n082R20J31p8201L4859K5197m9728P0615M013m6753Q360
$$ 533924 512434 512236 507154 508074 508205 430004 464863 490060 440332 510947 514960 468207 476567
2595D76567k1099m8005k7912R90Q1500n1577k4874m909O1936k547K978l8921J7975
$$ 476567 455468 407463 379551 380541 462041 410464 385590 380681 442617 440070 443048 404127 422102
2582D22102M6861K7383k7573J8971r1418k3170j0838l8431O9177J9188l2995l5613
$$ 422102 468963 496346 468773 487744 396326 373156 362318 323887 393064 412252 379257 343644
2570C43644O6861k161R85q886k2703M4424N7641l9332q233r292L322K1333n1486
$$ 343644 410505 408344 409329 400443 377740 422164 479805 440473 432240 422948 426270 447603 396117
2557C96117k1793O6854j9469J9127M0o5091l469q778J2951p641k9808O5981j1728
$$ 396117 374324 441178 421709 440836 440876 375785 372316 363538 376489 368848 339040 405021 393293
2544C93293P053l1048l5060k8918K7106Q9141m268L4002m5032P469j1358j7733
$$ 393293 400346 369298 334238 305320 332426 421567 417299 451301 406269 413738 402380 384647
2532C84647L433j9041p8074P274p3615M6866Q6488O758j4638l6121p982j5456
$$ 384647 388080 369039 290965 298239 224624 271490 357978 364736 350098 313977 305995 290539
2520B90539J6048j0515Q2091j0092J8600N0735p668n3587l2369M3965n027K0534
$$ 290539 306587 296072 378163 368071 386671 437406 429738 376151 343782 387747 382720 403254
2508D03254n0191j4160K4665p141L0669N4081p0703j00865R1201J01644J6326
$$ 403254 353063 338903 363568 356427 387096 441177 370474 269609 360810 462454 478780
2497D78780m8499q6356K9843n4540p335M1143j5538Q98o060L660o84M664J0270
$$ 478780 430281 343925 373768 319228 311893 353036 337498 338396 332336 335996 335312 339976 350246
2484C50246k960K646k8283l7101K8898P3930L8913n4740K9518j9619K3348l5197
$$ 350246 347286 349932 321649 284548 313446 387376 426289 371549 401067 381448 404796 369599
2472C69599L6582n7415r0388J03902J1277J6387J9489o827J6832L6476K5710j805
$$ 369599 406181 348766 258378 362280 373557 389944 409433 402606 419438 455914 481624 479819
2460D79819K4773p8002n7930K1837K5946J4649M4620l7935o0705P89J1425k0945
$$ 479819 504592 426590 368660 390497 416443 431092 475712 437777 377072 377861 389286 368341
2448C68341N3797l6399R6778J1275M370k7755Q3529n610p0900k741j312N0216
$$ 368341 422138 385739 482517 493792 498162 470407 553936 548326 477426 474685 473373 523589
2436E23589O5087k5016Q5119l7641j75016O5307P9597k048L4862o657r1833N4649
$$ 523589 588676 563660 648779 611138 436122 501429 581026 578978 613840 607183 515350 569999
2424E69999k8465m3885M7740N2517R751O762n8602o7872M7520Q5082l5243J7088
$$ 569999 541534 497649 545389 597906 607657 614419 555817 487945 535465 620547 585304 602392
2412F02392J14124l8479J3586M8132l0133J3393K2797k7765N3962O1477m3692
$$ 602392 716516 678037 691623 739755 709622 723015 745812 718047 772009 833486 789794
2401G89794m583M1819M8176k4647K2622N9472O0816N2285R4095K6646L1012M9295
$$ 789794 785211 827030 875206 850559 873181 932653 993469 1045754 1139849 1166495 1197507 1246802
2389A246802N9202Q8611O4975J04343J18639J06278J35913J64095L80307M41310
$$ 1246802 1306004 1394615 1459590 1563933 1682572 1788850 1924763 2088858 2469165 2910475
2379B910475L52191L51883K40398L01645K94562J60600L35421M10287N89983Q78805
$$ 2910475 3262666 3614549 3854947 4156592 4451154 4611754 4947175 5357462 5947445 6826250
2369F826250J456553K187857L644833O118124P843530O941919L634507j632675
$$ 6826250 8282803 10470660 14115493 20233617 28077147 35019066 38653573 37020898
2361C7020898n183347n999797n306910l907040l126063k768989k114108j623913
$$ 37020898 31837551 25837754 20530844 16623804 13497741 10728752 8614644 6990731
2353F990731j180580r12912n41561k51861k31347k53572k89610k57595l27890
$$ 6990731 5810151 4897239 4355678 4103817 3872470 3618898 3329288 3071693 2743803
2344B743803j85097j58629j93571j21677j33464j59722j16499j15265o5543j03670
$$ 2743803 2558706 2400077 2206506 2084829 1951365 1791643 1675144 1559879 1494336 1390666
2334A390666k2560k9097n6203k3148n9413P67m6011q8228N7544n6942m0224M8744
$$ 1390666 1368106 1339009 1282806 1259658 1200245 1201012 1155001 1066773 1124317 1067375 1027151 1075895
2322A075895o1935j20763K9048l0890n8821l2978j5308q680k5031r4696L1194
$$ 1075895 1013960 893197 922245 891355 832534 799556 784248 775568 750537 655841 687035
2311F87035K2253O8732k0466p2148l6603k3074j4705K43r7166j5211P168K1123
$$ 687035 709288 778020 757554 685406 648803 625729 611024 611267 514101 498890 506058 527181
2299E27181L4394j1391j9964p1877L1201k8902m7634N3283J3957m5831l7089N1355
$$ 527181 561575 550184 530220 458343 489544 460642 413008 466291 480248 434417 397328 448683
2287D48683k7978q376o8664j7259Q923L8839N4130l5242R8l8580J6355n1105j8046
$$ 448683 420705 412329 343665 326406 335329 374168 428298 393056 393154 354574 370929 319824 301778
2274C01778K5080J2612n008l63o0639N5825P392k0473k25L7254q450l2645J540
$$ 301778 326858 339470 334462 334099 273460 329285 336677 316204 315979 353233 344783 312138 313678
2261C13678O2012l7049r2977O5784J971L7488l4278k2324j0824k1405K154k2057
$$ 313678 375690 338641 245664 311448 313419 350907 316629 294305 283481 262076 264230 242173
2249B42173k7669p394q828L2647k5152O0076j882j3258P4900k5914q4514m1176
$$ 242173 214504 207110 198282 230929 205777 265853 263971 250713 325613 299699 215185 174009
2237A74009Q7202N7696N2992j23968r895J2348k2820j9592K2269O8178o2690j4951
$$ 174009 261211 318907 371899 247931 238036 250384 227564 207972 230241 298419 235729 220778
2225B20778K605K7395M0874j14681K1979m1368m3386O2786L4238O2451J9563l5145
$$ 220778 223383 250778 291652 176971 198950 157582 114196 176982 211220 273671 293234 258089
2213B58089N5720o3385l8317K0305k9793M962l0685L5410K2075M4198j8028k2956
$$ 258089 313809 250424 212107 232412 202619 207581 176896 212306 234381 278579 260551 237595
2201B37595n1535p185m2108M837K1301K5473j642l9616J2478k3010O7435q479
$$ 237595 186060 178875 136767 141604 162905 188378 186736 147120 159598 136588 204023 195544
2189A95544o0812L6774m707p4304Q1574N0362j0333r383K2570k3184q3396R214
$$ 195544 134732 171506 166799 92495 174069 224431 214098 204715 227285 204101 120705 129919
2177A29919R647Q6526k8487n5062k9779p915j3624L6390r298k0251m0646j4870
$$ 129919 139566 226092 197605 142543 112764 104849 91225 127615 118317 98066 57420 42550
2165D2550K3108N2481J2303p573p213N1520J3301j1868L7213k7351m3939J4822
$$ 42550 65658 118139 130442 122869 115656 167176 180477 168609 205822 178471 134532 149354
2153A49354l3365p254O155p471K6520k2828L5446N822r054j3226o911M350O752
$$ 149354 115989 108735 114890 107419 133939 111111 146557 152379 143325 130099 123188 127538 134290
2140A34290k1438R912r719q2072M4131M5724K6875l658K0360j4953k5265J7759
$$ 134290 112852 122764 113045 30973 75104 120828 147703 144045 164405 149452 124187 141946
2128A41946k3989p6324o0291N4000L8427o562J9151L5993M0395l0420k0818N97
$$ 141946 117957 41633 -18658 35342 73769 67207 86358 122351 162746 132326 111508 112105
2116A12105N7246J0220k6918K3947m6067k4577M605N9459p4396r730n220L1595
$$ 112105 169351 179571 152653 176600 130533 105956 110561 170020 95624 85894 80674 112269
2104A12269O0140J4640l9392m5249n7615J56289J9681n635M4640k676n3276M4206
$$ 112269 172409 187049 147657 102408 44793 201082 220763 215128 259768 257092 203816 248022
2092B48022O872l2099K6685j840p2721l6232q887K196M619J4858k8758p1422N4118
$$ 248022 254894 222795 249480 247640 174919 138687 129800 131996 136615 151473 122715 51293 105411
2079A05411l0300J2585M6767j0016K2596M358J1220Q439k4928L5098K3768j10490
$$ 105411 75111 87696 134463 124447 147043 151401 162621 171060 146132 181230 204998 94508
2067I4508j8299R9532K4501L2362j0157k0434n6472n5222M1716l2489M692M1720
$$ 94508 76209 175741 200242 232604 222447 202013 145541 90319 132035 99546 104238 145958
2055A45958L6560j21341m0033N4248k0611L0987j9361R727l3291O769L2130k0782
$$ 145958 182518 61177 21144 75392 54781 85768 66407 76134 42843 49612 81742 60960
2043F0960J2813M0605n9412m1860k185k5347K9688P6920p8705J5151m0041O7181
$$ 60960 73773 114378 54966 13106 10921 -14426 15262 92182 13477 28628 -11413 55768
2031E5768K2280Q4302Q358n6705m4090L6630j4512m3417M28k3537O4594m7989
$$ 55768 78048 162350 170708 114003 69913 106543 92031 48614 49042 25505 90099 42110
2019D2110j4755M6251Q0078q3371r617Q076K9158j1042p0325J07457j5991R284
$$ 42110 27355 73606 153684 70313 60696 68772 97930 86888 16563 124020 108029 117313
2007A17313O1674o1761j13366O6495K0886k3856j0783k0423O0754p039J4251K2460
$$ 117313 178987 117226 3860 70355 91241 67385 56602 36179 96933 89894 104145 126605
1995A26605n4201J3736J2031j2850P6798K5730p4666M2508j6887J4519l5803o1781
$$ 126605 72404 86140 98171 85321 162119 187849 113183 155691 138804 153323 117520 55739
1983E5739K5837K3359k6787J3270R2576o0082j08609K0347k305j9735J0308m8793
$$ 55739 81576 104935 78148 91418 183994 123912 15303 35650 33345 13610 23918 -24875
1971b4875p494L8285K1174k460k9528j9985K2964N0483K1236K8268k0495p454
$$ -24875 -32369 5916 27090 24630 -4898 -24883 -1919 48564 69800 98068 77573 70119
1959G0119K5421l1809J0634M9826K9704q6365Q178m9166K3803j1168L1990M0997
$$ 70119 95540 63731 74365 124191 153895 67530 75708 26542 50345 39177 71167 112164
1947A12164l9444j8391O534k9903K6401J1321k5742n5344M7251O5475o8583n2720
$$ 112164 72720 54329 60863 30960 57361 68682 42940 -12404 34847 100322 31739 -20981
1935b0981o5554N8762J82294o3017n0617j0418n0543L2411k2393p678j9231M6384
$$ -20981 -86535 -27773 154521 91504 40887 30469 -20074 12337 -10056 -17734 -36965 9419
1923I419n388M9067l8362n651J07029p6517k8968K2365L2880j9100j272O6868
$$ 9419 4031 53098 14736 9085 116114 39597 10629 32994 65874 46774 45502 112370
1911A12370j9110o3536J3009J1427O8669p2120k3476K2579k1365M1437j9617k5033
$$ 112370 93260 29724 42733 54160 122829 50709 27233 49812 28447 69884 50267 25234
1899B5234k7774l962j0786o1l8053j3249M1856q148J1953M2J4430L5688R9K5073
$$ 25234 -2540 -6502 -17288 -17349 -55402 -68651 -26795 -34943 -22990 -22948 -8518 27170 27269 52342
1885E2342K1385k5021P146p4926R550N8939K750m5736R453L0163J2231L9627k0168
$$ 52342 73727 48706 55852 -19074 -9524 49415 52165 6429 15882 46045 58276 97903 77735
1872G7735Q575j60406J9389J16603l7409k1089N8814k5133l2756N5461O28n8954
$$ 77735 86310 -74096 -54707 61896 24487 3398 62212 37079 4323 59784 60412 1458
1860A458o6500K4554J6216J1168p028K7440l0403j5427J2005P0776j0446L4827
$$ 1458 -65042 -40488 -24272 -13104 -20132 7308 -23095 -38522 -26517 44259 33813 68640
1848F8640M4325l1061r8755m3032J0474N741J5821o3997K078j2291R6382K8099
$$ 68640 112965 81904 -16851 -59883 -49409 -43668 -27847 -91844 -89766 -102057 -5675 22424
1836B2424K1515p9412N2953K1073L4821l4181J6080l9834J5977n998Q882j0932
$$ 22424 43939 -35473 17480 38553 73374 39193 55273 15439 31416 25418 34300 23368
1824B3368k7554l2453L2934K8705j4268M941n721j1038l1823M7479j9369j6999
$$ 23368 -4186 -36639 -3705 25000 10732 15673 9952 -1086 -32909 14570 -4799 -21798
1812b1798k3637k3083K7190Q8818J948J356j14143Q0774j2487l3134R769j4487
$$ -21798 -45435 -68518 -41328 47490 49438 50794 -63349 17425 4938 -28196 -18427 -32914
1800c2914l584k7009L9975K2706L6315m621l1142k7028k9790m60Q0920l0908n4951
$$ -32914 -36498 -63507 -23532 -826 35489 30868 -274 -27302 -57092 -57552 23368 -7540 -62491
1787f2491O6943L3127M2983M5074k0475p7382m6936k2229N3385J1287M0270O2175
$$ -62491 4452 37579 80562 125636 105161 27779 -19157 -41386 11999 23286 63556 125731
1775A25731k6065N30m5750L6109k0036m7613q6593j9401N3853M2684M853M5731
$$ 125731 99666 100196 54446 90555 70519 22906 -63687 -83088 -29235 13449 18302 64033
1763F4033k9715j5031R083o6252Q0317k2965M168n3738M3685j7703L5649j0089
$$ 64033 34318 19287 28370 -37882 42435 19470 23638 -30100 13585 -4118 31531 21442
1751B1442m9830P3326L2958j3067l0087p6395K9327P1724p9873J8987J7175o513
$$ 21442 -28388 44938 77896 64829 34742 -41653 -12326 59398 -20475 -1488 15687 9174
1739I174P1113q5956l9143K5088l4267P9298L511j5098o4811m230Q0518l3655
$$ 9174 80287 -5669 -44812 -19724 -53991 25307 28818 13720 -51091 -55321 25197 -8458
1727h458j548P5631n9639k5848N7478n2884o053O4120r6133j5568M9933J4393
$$ -8458 -10006 65625 5986 -19862 37616 -15268 -21321 42799 -53334 -68902 -18969 -4576
1715d576M9119L3873j7232n4370j3312n0783l8423N4577M0209k7239K4451m9468
$$ -4576 44543 78416 61184 6814 -6498 -57281 -95704 -41127 -918 -28157 -3706 -53174
1703e3174o727L7973j3702L0438J239N042k4355J847j8591R336L9294k9281m671
$$ -53174 -59901 -21928 -35630 -5192 -3953 1089 -23266 -21419 -40010 -30674 8620 -20661 -25332
1690b5332j1308L099L0687K5944P014l1553r438N1890J2715J3424k6485o484J3639
$$ -25332 -36640 -33541 -2854 23090 30104 -1449 -10887 41003 53718 67142 40657 34173 47812
1677D7812o6032J0257l3998j7362N0920P0367R112j1944N9371K8692r8903q148
$$ 47812 -18220 -7963 -41961 -59323 -8403 61964 71076 59132 118503 147195 48292 40144
1665D0144L9957l8819q7145l7665N4525n318j2916J4948N3643n3930N0927K7171
$$ 40144 80101 41282 -45863 -83528 -29003 -34321 -47237 -32289 21354 -32576 18351 45522
1653D5522o0777l111j9596J3784L3957J7116m0423Q961L9668Q578M156o1922k8851
$$ 45522 -15255 -18366 -37962 -24178 9779 26895 -13528 -4567 35101 43679 47835 -14087 -42938
1640d2938K7439o0239K9853P6083j5628k3061J3076K245n228M6909N0829p5293
$$ -42938 -15499 -75738 -45885 30198 14570 -8491 4585 6830 1602 48511 99340 24047
1628B4047K3459M5852l313n6283m1776j1740j6035N5351R109N557n8810J6350
$$ 24047 47506 93358 90045 33762 -8014 -19754 -35789 19562 28671 34228 -24582 -8232
1616h232l4482m105Q4612k48k6755k0812K2894k021j2274j2899J6058Q948K6213
$$ -8232 -42714 -46819 37793 37545 10790 -10022 12872 10851 -1423 -14322 1736 10684 36897
1603C6897L8033l7065k9112k0909Q7521o3527J392n61r9837K8960J2518J3526
$$ 36897 74930 37865 8753 -12156 75365 11838 13230 12669 -87168 -58208 -45690 -32164
1591c2164J0181j300l0486M8956M0233n1322j2384N941r937O0703J6742m6021
$$ -32164 -21983 -23283 -53769 -4813 35420 -15902 -28286 -22345 -32282 28421 45163 -858
1579h58O6489m5387k9636K5850K6296l9228k7715K384o3172P453P3548j685j12666
$$ -858 65631 20244 -9392 16458 42754 3526 -24189 -21805 -84977 -77524 -3976 -5661 -118327
1566a18327R1691k7043o2921Q7080L8676J4829m2300l9926Q5224n7689J3153P153
$$ -118327 -26636 -53679 -116600 -29520 9156 23985 -18315 -58241 26983 -30706 -17553 -10400
1554a0400J5157L7592m2773Q263M8745k2850l9596o4272n796m688n5296K4350
$$ -10400 4757 42349 -424 7839 56584 33734 -5862 -70134 -75930 -80618 -135914 -111564
1542a11564O0897N1492M5572M9251m1811m9208O105o618l0495J4433L7270k1549
$$ -111564 -50667 825 46397 95648 53837 4629 10734 4116 -26379 -11946 25324 3775
1530C775k4573J050m9842l1642n1743M6804L1709J4918M9394L4425j5620p2671
$$ 3775 -20798 -19748 -69590 -101232 -152975 -106171 -74462 -59544 -10150 24275 8655 -64016
1518f4016L6997m33p2978j343K396N9076L9897k5306q969n556n8005N1634K2342
$$ -64016 -27019 -27452 -100430 -101773 -99377 -40301 -404 -25710 -34679 -40235 -98240 -46606 -24264
1505b4264j950J7794j9206o7936L159J4918M3139m2678J2126l043O5128o707n3151
$$ -24264 -26214 -8420 -27626 -95562 -92403 -77485 -34346 -77024 -64898 -67941 -2813 -9520 -62671
1492f2671k701O0630O4329j39984N0169N7969k1343P681J6799k5560k422m609
$$ -62671 -65372 -4742 59587 -80397 -30228 27741 6398 14079 30878 5318 2896 -1713
1480a713l4504N43K4070J6670j2580M3618L235o6331R070p5909J7681r727K7117
$$ -1713 -36217 -35674 -11604 5066 -7514 36104 39339 -26992 -17922 -93831 -76150 -85877 -58760
1467e8760P369k0610m6836R077K7262M4328L5632K2830m9744k4567L630k8589
$$ -58760 -51391 -72001 -118837 -109760 -82498 -38170 -2538 20292 -29452 -54019 -50389 -78978
1455g8978N6275J3903r164j0241M7360l0437n5261M7542L8445l2596n0278k155
$$ -78978 -22703 -8800 -17964 -28205 19155 -11282 -66543 -19001 19444 -13152 -63430 -65585
1443f5585O5126k9971O9951O6080r5199k7218j5809q029m7393M826l7306O827
$$ -65585 -459 -30430 39521 105601 10402 -16816 -32625 -40654 -88047 -83221 -120527 -113700
1431a13700M9664K7528O4793k3578k3939r733m9185K7023R677q023l5240J6330
$$ -113700 -64036 -36508 28285 4707 -19232 -28965 -78150 -51127 -41450 -49473 -84713 -68383
1419f8383J2739N2523L3066m6957l2853J7515l287k7591N881J2344O0150l8624
$$ -68383 -55644 -3121 29945 -17012 -49865 -32350 -35637 -63228 -57347 -45003 15147 -23477
1407b3477K173k6017M8065N8338o9391l107M6603j2359j1096q0135J3684j7433
$$ -23477 -21304 -47321 744 59082 -10309 -13416 33187 20828 9732 -70403 -56719 -74152
1395g4152R155n929n2336l884J4664j6631O6537m245J4378k1187k3168J02669
$$ -74152 -64997 -70926 -123262 -127146 -112482 -129113 -62576 -66821 -52443 -73630 -96798 5871
1383E871J4921l5858n1229P4358o429l65k0190L7610P136p6394L3953l1127n335
$$ 5871 20792 -15066 -66295 8063 1634 1269 -18921 18689 25825 -50569 -16616 -47743 -53078
1370e3078l9366L3441M0256J7557k7861M5873K4239L524j10887m5224N7024j855
$$ -53078 -92444 -59003 -18747 -1190 -29051 16822 41061 44585 -66302 -111526 -54502 -56357
1358e6357q109k8875P5433L7806J2792k0242k3774m980k0025J307J0696m737j9684
$$ -56357 -64466 -93341 -17908 19898 32690 12448 -11326 -16306 -36331 -35024 -24328 -29065 -48749
1345d8749l1014Q5526n2340m0158P1272j9540j1303j8729m4250M3116M046O0555
$$ -48749 -79763 5763 -46577 -86735 -15463 -35003 -46306 -65035 -109285 -66169 -62123 -1568
1333a568k098R109k6485n7985J3375k4933O4477Q352j0050m2012l6583n6206L7566
$$ -1568 -3666 5443 -21042 -79027 -65652 -90585 -26108 -17756 -27806 -69818 -106401 -162607 -125041
1320a25041J13878M9269J9924p6126M2962J223o2454k1263j817L9939m9400k1811
$$ -125041 -11163 38106 58030 -18096 24866 26089 -36365 -57628 -59445 -19506 -68906 -90717
1308i0717J0407m8986K7059K8762l5170L3029K0042m982J4817p5381L8977M9209
$$ -90717 -80310 -129296 -102237 -73475 -108645 -75616 -55574 -60556 -45739 -121120 -82143 -32934
1296c2934J5859M4680l1032j10057M0876O1991l3186N151M9963l1900L0130k0979
$$ -32934 -17075 27605 -3427 -113484 -72608 -10617 -43803 -38652 11311 -20589 9541 -11438
1284a1438l175m0795J9906L735L8889N4278L0940n5224o1666l1032m013J8318
$$ -11438 -14613 -55408 -35502 -31767 7122 61400 92340 37116 -24550 -55582 -59595 -41277
1272d1277k0749l5000J5811J0828P23M3971m1778L7190k1258O038j8906K0646
$$ -41277 -62026 -97026 -81215 -70387 -69664 -25693 -67471 -30281 -51539 -45501 -64407 -43761
1260d3761m0377K2819J9285J7577k4197K8648j5396j1670K5218M7234k7147n6437
$$ -43761 -84138 -61319 -42034 -24457 -48654 -20006 -35402 -47072 -21854 25380 -1767 -58204
1248e8204J2676J220j6930p4689j5583r900K5839O0551J1465O2658P306m4140
$$ -58204 -45528 -44308 -61238 -135927 -151510 -161410 -135571 -75020 -63555 -897 6409 -37731
1236c7731l0488M2640L438M8861k6885q893k4784n1665K2481r281P877J63N4998
$$ -37731 -68219 -25579 -22141 26720 -165 -9058 -33842 -85507 -63026 -72307 -64430 -64267 -9269
1223i269M1259l5965j32003M4032J5059k5338L442Q715N7290l9417N8418j0037
$$ -9269 31990 -3975 -135978 -91946 -76887 -102225 -98783 -90068 -32778 -72195 -13777 -23814
1211b3814k5092l6337N372L0172J9426m252m4339N4791j5361k6839K36j1394P329
$$ -23814 -48906 -85243 -79871 -49699 -30273 -34525 -78864 -24073 -39434 -66273 -66037 -77431 -70102
1198g0102m100m183L4704m8854l0869j7055K8442k571N8908J2921m01L4904P659
$$ -70102 -74202 -78385 -43681 -92535 -123404 -140459 -112017 -114588 -55680 -42759 -43160 -8256 -597
1185e97P3873p6425o4780L5023l789m5832N3106l2870K8350L6660m1508q1136
$$ -597 73276 -3149 -67929 -32906 -36695 -82527 -29421 -62291 -33941 2719 -38789 -119925
1173a19925k6346O3345M3063M0379m6693J5562n921k4823k2979j3520k2102Q2988
$$ -119925 -146271 -82926 -39863 516 -46177 -30615 -36536 -61359 -84338 -97858 -119960 -36972
1161c6972m984K0143l6827j6472j4327L8288k5699l0212N7374j6384L0904J6879
$$ -36972 -41956 -21813 -58640 -75112 -89439 -51151 -76850 -107062 -49688 -66072 -35168 -18289
1149a8289k8251j6242p580l9983L9448N5619j8754k0291K1759K5242j771k3827
$$ -18289 -46540 -62782 -70362 -110345 -70897 -15278 -34032 -54323 -32564 -7322 -9093 -32920
1137c2920m316j1722J287m0576P1010j7297k7431m9434m3522O4886M9219N6879
$$ -32920 -37236 -48958 -47671 -88247 -17237 -34534 -61965 -111399 -154921 -90035 -40816 16063
1125A6063l0747j1045k3104m5530L0872j518q412o786L9334k5617l8263J0150
$$ 16063 -14684 -25729 -48833 -94363 -63491 -65009 -73421 -80207 -40873 -66490 -104753 -94603
1113i4603k639j7467L3443p488n2866M6797L2136n7717N1567K1209n4715l7603
$$ -94603 -97242 -114709 -81266 -88754 -141620 -94823 -62687 -120404 -68837 -47628 -102343 -139946
1101a39946L3168o898k0712K8530P7355p026j06152L4307n44l1215M0747J5191
$$ -139946 -106778 -113676 -134388 -105858 -28503 -35529 -141681 -107374 -107918 -139133 -98386 -83195
1089h3195J5896k6344j9149K0440o9148M9974O4830l1213J2482K9841n5695j2869
$$ -83195 -67299 -93643 -112792 -92352 -161500 -111526 -46696 -77909 -65427 -35586 -91281 -104150
1077a04150J3446k2099L1769K1565l2761J254l3119N9991n578j422j5106N5563
$$ -104150 -90704 -112803 -81034 -59469 -92230 -90976 -124095 -64104 -69682 -71104 -86210 -30647
1065c0647O076l2565J160j2022l0917Q7691M2055n2272r399o3313J4737K8581
$$ -30647 -24571 -57136 -55976 -67998 -98915 -11224 30831 -21441 -30840 -94153 -79416 -50835
1053e0835r2993k4486O5317k319j789j6805o078J0950J2876L4884m7461r317J581
$$ -50835 -143828 -168314 -102997 -105316 -107105 -123910 -129988 -119038 -106162 -71278 -118739 -128056 -126475
1040a26475R589M5767l5444K199M4535J990k6674L2508q6651P7817J3295M529
$$ -126475 -116886 -71119 -106563 -104364 -59829 -57839 -84513 -52005 -138656 -60839 -47544 -43015
1028d3015O4245m3134p131N323q487o6487Q839K457M132N0149N5573j3179m9454
$$ -43015 21230 -21904 -29035 -23712 -32199 -98686 -89847 -87390 -83258 -33109 22464 9285 -40169
1015d0169M523m4263J1327q948J471p7826l159K9517N4600j5035l5973J6626j2000
$$ -40169 -35646 -79909 -68582 -77530 -76059 -153885 -157044 -127527 -72927 -87962 -123935 -107309 -119309
1002a19309K6544l1259L1493K4067J7919r0671m6760K0588L1358R8140l9619P646
$$ -119309 -92765 -124024 -92531 -68464 -50545 -141216 -187976 -167388 -136030 -37890 -77509 -69863
990f9863j9220o4116R0422r066l7396j933r136M0747q657l0424K9261N840J9473
$$ -69863 -89083 -153199 -62777 -71843 -109239 -111172 -120308 -79561 -88218 -118642 -89381 -83541 -64068
977f4068K5135O407l0246j9480L6484M5484J0169k1949k5785n1079K5845M0424
$$ -64068 -38933 -32526 -62772 -82252 -45768 -284 9885 -12064 -37849 -88928 -63083 -22659
965b2659k3367k3247M1179M5865p3260n0343j4401P1458j6689m8799Q0943m7063
$$ -22659 -46026 -69273 -28094 17771 -55489 -105832 -120233 -48775 -65464 -114263 -33320 -80383
953h0383o417p2791O0451r640J19l9232Q501N2303l7310N5550J0484P73K921J3677
$$ -80383 -86800 -159591 -99140 -108780 -108661 -147893 -139392 -87089 -124399 -68849 -58365 -57592 -54671 -40994
939d0994J962M1539j9657q1865L3950J2721k1231L4424k9805J6689O164o5601
$$ -40994 -39032 2507 -17150 -99015 -65065 -52344 -73575 -39151 -68956 -52267 -46103 -111704
927a11704n0656K5576N4180j496l2374J2246L6588k924p436l5743j3214j2286
$$ -111704 -162360 -136784 -82604 -84100 -116474 -104228 -67640 -70564 -78000 -113743 -126957 -139243
915a39243j4690K9937K3611l1068n1546o888N1934J8866J8443O8263p5461k5115
$$ -139243 -153933 -123996 -100385 -131453 -182999 -189887 -137953 -119087 -100644 -32381 -107842 -132957
903a32957J7765R445k1598K0212P994J12659n0093l6025k5425O7367j1951J445
$$ -132957 -115192 -105747 -127345 -107133 -99139 13520 -36573 -72598 -98023 -30656 -42607 -41162
891d1162k587L6871o5265M1179L297l6712r719o6097K1737m4940O8748p338k0372
$$ -41162 -43749 -6878 -72143 -30964 -27667 -64379 -74098 -140195 -118458 -163398 -94650 -101988 -122360
878a22360k9578P7908r772j5364j7867m1227K4818l941p433J0816M7630L2524
$$ -122360 -151938 -74030 -83802 -99166 -117033 -158260 -133442 -137383 -144816 -134000 -86370 -53846
866e3846j5187o4725l8224R6651L0256l7523q5530k511K1059N4963r306j6110
$$ -53846 -69033 -133758 -171982 -75331 -45075 -82598 -168128 -170639 -149580 -94617 -103923 -120033
854a20033j5281M1901n27l0332O078k6593M4581O4248p8457K3865K8200M7873
$$ -120033 -135314 -93413 -93940 -124272 -118194 -144787 -100206 -35958 -114415 -90550 -62350 -14477
842a4477q7958l2973M5297O64N8375J0109o3396J9363L6068j03997J0111k6525
$$ -14477 -102435 -135408 -90111 -89447 -31072 -20963 -84359 -64996 -28928 -132925 -122814 -149339
830a49339M5625m2020K4828O9956n030K2600r1481Q654J4756r798m6428K6860
$$ -149339 -103714 -145734 -120906 -50950 -55980 -33380 -124861 -116207 -101451 -111249 -157677 -130817
818a30817k1865L7704M8771j2629O7847m3632j6543k7319M490k9807m307J8466
$$ -130817 -152682 -114978 -66207 -78836 -10989 -54621 -71164 -98483 -93993 -123800 -128107 -109641
806a09641j794K6163j0674m63L2857k2494j4779K3248K5923j5719n749l4495N864
$$ -109641 -111435 -85272 -95946 -96409 -63552 -86046 -100825 -77577 -51654 -67373 -73122 -107617 -101753
793a01753j1150J0853J1898p9485J0380M6473k393m871m2350r24j1203j473m922
$$ -101753 -112903 -102050 -90152 -169637 -159257 -112784 -115177 -120048 -162398 -163322 -174525 -175998 -180920
780a80920N4460J5504l9976L2715m3098K4332O0024J1027k0611n390j6113N935
$$ -180920 -126460 -110956 -150932 -118217 -161315 -136983 -76959 -65932 -86543 -91933 -108046 -102111
768a02111n070m9500J1099R352j8802L3523K9474K2101k7119N5546l8347k8215
$$ -102111 -107181 -156681 -145582 -136230 -155032 -121509 -92035 -69934 -97053 -41507 -79854 -108069
756a08069M8075r005j5587L3767O3657o957k1166k8660J9892J2770k9535n5160
$$ -108069 -59994 -68999 -84586 -50819 12838 5881 -15285 -43945 -24053 -11283 -40818 -95978
744i5978q64N208k6637K4795k979L4082l5969J2636L7784j9287r60K4844m6107
$$ -95978 -96842 -91634 -118271 -93476 -96455 -62373 -98342 -85706 -47922 -67209 -68169 -43325 -89432
731h9432l0878R9742r711l0971j37125Q483M8549L9576M3177k9628N2517n8269
$$ -89432 -120310 -20568 -30279 -61250 -198375 -189892 -141343 -101767 -58590 -88218 -35701 -93970
719i3970J0540L0674m6518n0496j8763J6973L795J6129n3065J7568N1533N1679
$$ -93970 -83430 -52756 -99274 -149770 -168533 -151560 -147765 -131636 -184701 -167133 -115600 -63921
707f3921o4543l2115Q9144J1976j0824K1918o1574O356k9516K7679L2750j7848
$$ -63921 -128464 -160579 -71435 -59459 -70283 -48365 -109939 -103583 -133099 -105420 -72670 -90518
695i0518l0348j6942M1452J1286n372J6760j3069N1348J2029o90L308K5347J5201
$$ -90518 -120866 -137808 -96356 -85070 -90442 -73682 -86751 -35403 -23374 -24064 -20756 4591 19792
682A9792o1540K1685n9026r528K6934j9789p8229L4308L3419J3238o0236j0431
$$ 19792 -41748 -20063 -79089 -88617 -61683 -81472 -159701 -125393 -91974 -78736 -138972 -149403
670a49403P2511k1555M3390r059j6403k3790N043L2520R086l946L9451k1498q4835
$$ -149403 -76892 -98447 -55057 -64116 -80519 -104309 -99266 -66746 -57660 -61606 -22155 -43653 -128488
657a28488J12843K8588k8411o986q2862n052L9959J5424M992o9013J8421n556
$$ -128488 -15645 12943 -15468 -22454 -105316 -110368 -70409 -54985 -49993 -119006 -100585 -106141
645a06141j2098J7041j1323k0656M6651m2796J3307Q1767m2033m8667k272m0498
$$ -106141 -118239 -101198 -112521 -133177 -86526 -129322 -116015 -34248 -76281 -124948 -127220 -167718
633a67718L1436J5404K229K2734k6351J6598M2889n8971L717Q7641j6506j7998
$$ -167718 -136282 -120878 -118649 -95915 -122266 -105668 -62779 -121750 -118033 -30392 -46898 -64896
621f4896o2387l366M9453M192R873J9109m0292n3524M2937J6011K0065k5980k8371
$$ -64896 -127283 -130649 -81196 -77004 -67131 -48022 -88314 -141838 -98901 -82890 -62825 -88805 -117176
608a17176Q257k0347p5127K3891L2059N3210K1562J251l8226k5157K0922m4988
$$ -117176 -108919 -129266 -204393 -180502 -148443 -95233 -73671 -72420 -110646 -135803 -114881 -159869
596a59869M7087j2898Q3464o249k6770K0466N2258n6491J6218J84J4892j7649
$$ -159869 -112782 -125680 -42216 -48465 -75235 -54769 -2511 -59002 -42784 -42600 -27708 -45357
584d5357r175J3551l6972r768J4474n1519Q339L4454l925q401m3710l8065N9204
$$ -45357 -54532 -40981 -77953 -87721 -73247 -124766 -116427 -81973 -85898 -94299 -138009 -176074 -116870
571a16870N0866p2157R911Q5343m6514j8156r593M74j2189k2908j3099k2537M7232
$$ -116870 -66004 -138161 -128250 -42907 -89421 -107577 -117170 -116696 -128885 -151793 -164892 -187429 -140197
558a40197l794O199J5294K7998n6655M1258j4898l7649k9409O4325J5387l311
$$ -140197 -143991 -137792 -122498 -94500 -151155 -109897 -124795 -162444 -191853 -127528 -112141 -115452
546a15452R658N603j7066m2204k6615K1666J4066J7520o1656L0921O6152J1446
$$ -115452 -105794 -100191 -117257 -159461 -186076 -164410 -150344 -132824 -194480 -163559 -97407 -85961
534h5961l483n4051l1009O9319l5523k614L9965J4020K917l0964M359M6442K1531
$$ -85961 -89444 -143495 -174504 -105185 -140708 -143322 -103357 -89337 -86420 -117384 -113025 -66583 -45052
521d5052j02128j5066L7928L5189k791j6639m1443k8108J1349O5581Q6723j2209
$$ -45052 -147180 -162246 -124318 -89129 -91920 -108559 -150002 -178110 -166761 -101180 -14457 -26666
509b6666l1414j5823L751n620o7174M0318K5872K4812l9281r315O9368J126r3016
$$ -26666 -58080 -73903 -70152 -75772 -142946 -102628 -76756 -51944 -91225 -100540 -31172 -30046 -123062
496a23062l8364K1300o616l7514K4943K4212O1873l8659M5025J6508j4682m2953
$$ -123062 -161426 -140126 -146742 -184256 -159313 -135101 -73228 -111887 -66862 -50354 -65036 -107989
484a07989l6001l9553l3548J6943N915P0491l543o3213M5993L1567j3325J228
$$ -107989 -143990 -183543 -217091 -200148 -194233 -123742 -127285 -190498 -144505 -112938 -126263 -125035
472a25035J4763J0180J6350L2079n363j3062L706q6802P007K7955k245R4305n5510
$$ -125035 -110272 -100092 -83742 -51663 -57026 -70088 -66382 -153184 -146177 -118222 -120467 -26162 -81672
459h1672p1654O7421Q8909j0902k6222n3770Q39k1984m4879q483K2954j4835M3546
$$ -81672 -153326 -85905 3004 -7898 -34120 -87890 -87051 -109035 -153914 -162397 -139443 -154278 -110732
446a10732L3826n5188m5761k3315Q715J05127L1684j1976q334J0922K4854l4315
$$ -110732 -76906 -132094 -177855 -201170 -192455 -87328 -55644 -67620 -75954 -65032 -40178 -74493
434g4493l3239k0928j5032r091k2096j80K8975j369J7266k5325k4807N5037M1967
$$ -74493 -107732 -128660 -143692 -152783 -174879 -175059 -146084 -147453 -130187 -155512 -180319 -125282 -83315
421h3315m6381k9247k9127m623J24808L3551l9322j4038K1535J7018K2696j7849
$$ -83315 -129696 -158943 -188070 -192693 -67885 -34334 -73656 -87694 -66159 -49141 -26445 -44294
409d4294p0198J678O625n4073L429L9212K9719q771L2691n1308j972M5780k3153
$$ -44294 -114492 -112814 -106189 -160262 -156833 -117621 -87902 -96673 -63982 -115290 -117262 -71482 -94635
396i4635j2039J9622k9336l9574J462K5627j0212O9615J6020L7593l0185p5323
$$ -94635 -106674 -87052 -116388 -155962 -154500 -128873 -139085 -69470 -53450 -15857 -46042 -121365
384a21365K2354k6236j5J4660P3804m3878j6136K2837q288q728P8573L3129o8025
$$ -121365 -99011 -125247 -125262 -110602 -36798 -80676 -96812 -73975 -82263 -90991 -12418 20711 -47314
371d7314l2203m8357n432J1346j501j1428k1710j9517l015P4191O9251o8607l6263
$$ -47314 -79517 -127874 -133306 -121960 -123461 -134889 -156599 -176116 -179131 -104940 -35689 -104296 -140559
358a40559k900J2611J2368J3581M427j1523l3749l9288N8824N2718k0449l3799
$$ -140559 -143459 -130848 -118480 -104899 -100472 -111995 -145744 -185032 -126208 -73490 -93939 -127738
346a27738N6103k5687j08554q780O4826N8959O741m2196l4837J9337K8133J217
$$ -127738 -71635 -97322 -205876 -214656 -149830 -90871 -84130 -126326 -161163 -141826 -113693 -112476
334a12476Q282l8722J7383k5144k3047r489K3755k6465q297O7336L8869l5293
$$ -112476 -104194 -142916 -125533 -150677 -173724 -183213 -159458 -185923 -194220 -126884 -88015 -123308
322a23308K3270M1041j3337p7146k6498P6952P198L1349n1418R285J5925k8771
$$ -123308 -100038 -58997 -72334 -149480 -175978 -99026 -91828 -60479 -111897 -102612 -86687 -115458
310a15458k6538l1506N5816L0770J1444r3287m4330J2761L9678j5860J2295L6706
$$ -115458 -141996 -173502 -117686 -86916 -75472 -168759 -213089 -200328 -160650 -176510 -164215 -127509
298a27509N0584k7256M2226o5751l2938R7441K549j7139o550K436m2770l8944
$$ -127509 -76925 -104181 -61955 -127706 -160644 -63203 -60654 -77793 -84343 -81907 -124677 -163621
286a63621J0255J0808O60n9282J5304K9269k4686N592K9216n0373M2330N4339
$$ -163621 -153366 -142558 -141898 -201180 -185876 -156607 -181293 -175701 -146485 -196858 -154528 -100189
274a00189L6824J6775p6531N135j7570N5444n108m8224k2847j265J3931M8729
$$ -100189 -63365 -46590 -123121 -117986 -135556 -80112 -85220 -133444 -156291 -157556 -143625 -94896
262i4896l7099k9j1291j2062m0475L500j2592K1731O3944M0080m6575L6061K270
$$ -94896 -131995 -132024 -143315 -155377 -195852 -192352 -204944 -183213 -119269 -79189 -125764 -89703 -87433
249h7433l7597m4551Q7346k0019n773l377n7712m9084K2192R0825J8368j1416
$$ -87433 -125030 -169581 -82235 -102254 -108027 -111404 -169116 -218200 -196008 -105183 -86815 -98231
237i8231k3585p305n256P867k5849l1404K0308O0164l1503l630R551k181r753
$$ -98231 -121816 -129121 -134377 -126510 -152359 -183763 -163455 -103291 -134794 -138424 -128873 -131054 -140807
224a40807m470j9727K7261K9047j9011k8978k55R12P546L1679j6544p7619P5142
$$ -140807 -145277 -165004 -137743 -108696 -127707 -156685 -156940 -156028 -148482 -116803 -133347 -210966 -135824
211a35824l9908R259M8230k5539K25k7197J9144K5153k82j7643j1267j4033p9055
$$ -135824 -175732 -166473 -118243 -143782 -143557 -170754 -151610 -126457 -126739 -144382 -155649 -169682 -248737
198b48737L2977J5635j4057N01l3603P1101j6827L772L8526n9348k0454M8536
$$ -248737 -215760 -200125 -214182 -213681 -247284 -176183 -193010 -189238 -150712 -210060 -230514 -181978
186a81978K0758l0742J9688N342m9022J6934L6422N182j8410O706j9851k9262
$$ -181978 -161220 -191962 -172274 -166932 -215954 -199020 -162598 -157416 -175826 -169120 -188971 -218233
174b18233J9349M3933m8397N1495m8514J2475L4713n746j4270j02639P2682l041
$$ -218233 -198884 -154951 -203348 -151853 -200367 -187892 -153179 -158925 -173195 -275834 -203152 -206193
162b06193N3941p533m623N4879q958m2370m6610m256Q4161j4340r6741M3823l3022
$$ -206193 -152252 -159785 -164408 -109529 -118487 -160857 -207467 -211723 -127562 -141902 -238643 -194820 -227842
149b27842O084K4900L2474j8797k4785j532k177j5737J1911m4150L0586L5833
$$ -227842 -221758 -196858 -164384 -183181 -207966 -209498 -211675 -227412 -215501 -259651 -229065 -193232
137a93232J0731K9962m125j5418K5071p671k5434J8526p5106m854o8260K3154
$$ -193232 -182501 -152539 -156664 -172082 -147011 -154682 -180116 -161590 -236696 -241550 -309810 -286656
125b86656j7929j6810N2702K2410J7454n185l0082K2312J8910n0014l6720J5184
$$ -286656 -304585 -321395 -268693 -246283 -228829 -234014 -264096 -241784 -222874 -272888 -309608 -294424
113b94424K1432n405L6212J0307l8970P590J4713K1307O653o7471q493P278k1252
$$ -294424 -272992 -278397 -242185 -231878 -270848 -263258 -248545 -227238 -220585 -288056 -296549 -289271 -310523
100c10523O8553n2428K6160M9969n0091o9949k451k9193L8090M1639J1302q23
$$ -310523 -241970 -294398 -268238 -218269 -268360 -338309 -340760 -369953 -331863 -290224 -278922 -279745
88b79745l1081j9641J9580P2781m6725o6398o892j4355j8912J02079k5708n5601
$$ -279745 -310826 -330467 -310887 -238106 -284831 -351229 -358121 -372476 -391388 -289309 -315017 -370618
76c70618K2139k20Q197J900J5471k3482O879K7908j9950j5444J2914q3701q526
$$ -370618 -348479 -348699 -340502 -338602 -323131 -346613 -339734 -311826 -331776 -347220 -334306 -418007 -426533
63d26533J3437K1155k3214J8938L4687m1430O067l9735K4166M8460o1015O548
$$ -426533 -413096 -391941 -415155 -396217 -361530 -402960 -396893 -436628 -412462 -364002 -425017 -418469
51d18469L8819N958J4808l7897k8730K8860K9251m5087k3469J6860N147m5935
$$ -418469 -379650 -373692 -358884 -396781 -425511 -396651 -367400 -412487 -435956 -419096 -413949 -459884
39d59884J1004J1651J7674j7535j107n1043k3103J0174M7081k5557J0983L6566
$$ -459884 -448880 -437229 -419555 -437090 -438197 -489240 -512343 -502169 -455088 -480645 -469662 -433096
27d33096J2248k6787l987K3690J4550j3091l978M1723J2514J770l0473l3739q417
$$ -433096 -420848 -447635 -451622 -427932 -413382 -426473 -430451 -388728 -376214 -374444 -404917 -438656 -447073
14d47073j029M3647l7627m2966k1697L5523J3453j0806J7638L7596k3836j3748
$$ -447073 -448102 -404455 -442082 -485048 -506745 -471222 -457769 -468575 -450937 -413341 -437177 -450925
2d50925k048j3058
$$ -450925 -452973 -466031
0d66031
$$ -466031
$$ Imaginary data points
##PAGE= N=2
##DATA TABLE= (X++(I..I)), XYDATA
16383b368755O412N5298P1079K6714N0749J0505p476L2352M4975N3491J4474O9700
$$ -2368755 -2362343 -2307045 -2235966 -2209252 -2158503 -2147998 -2155474 -2123122 -2078147 -2024656 -2010182 -1940482
16371a940482L2098L3083O0229M7886L3525n621j2201R002N6356K8112R5674K5857
$$ -1940482 -1908384 -1875301 -1815072 -1767186 -1733661 -1739282 -1751483 -1742481 -1686125 -1658013 -1562339 -1536482
16359a536482J3532P7298J8244J2657q908J9224L2868K8522O4190L3001l240N8055
$$ -1536482 -1522950 -1445652 -1427408 -1414751 -1423659 -1404435 -1371567 -1343045 -1278855 -1245854 -1249094 -1191039
16347a191039O6632R32r195M73K6469J05187L5575j7825K9205Q0526K5445J6968
$$ -1191039 -1124407 -1123475 -1132670 -1132197 -1105728 -1000541 -964966 -982791 -953586 -873060 -847615 -830647
$$ [...]
##END NTUPLES=NMR SPECTRUM
##END=
