##TITLE=1H_DE-80H_X3
 200.13MHz, d2o
 8 sc
 
 19ns.26.2.2025
##JCAMPDX= 6.0         $$ Bruker NMR JCAMP-DX V2.0
##DATA TYPE= NMR SPECTRUM
##DATA CLASS= NTUPLES
##ORIGIN= UXNMR, Bruker Analytische Messtechnik GmbH
##OWNER= pz
$$ XWIN-NMR		Version 3.5
$$ Mon Mar 23 10:04:05 2026 Russian Standard Time (UT+4h)  Yarkov@DPX200
##.OBSERVE FREQUENCY= 200.1313
##.OBSERVE NUCLEUS= ^1H
##.ACQUISITION MODE= SIMULTANEOUS
##.ACQUISITION SCHEME= undefined
##.AVERAGES= 8
##.DIGITISER RES= 18
##SPECTROMETER/DATA SYSTEM= spect
##.PULSE SEQUENCE= zg30
##.SOLVENT NAME= DMSO
##.SHIFT REFERENCE= (INTERNAL, DMSO, 0, 15.4891)
##AUDIT TRAIL= $$ (NUMBER, WHEN, WHO, WHERE, WHAT)
$$ ##TITLE= Audit trail, XWIN-NMR		Version 3.5
$$ ##JCAMPDX= 5.01
$$ ##ORIGIN= Bruker BioSpin GmbH
$$ ##OWNER= Yarkov
$$ C:/Bruker/XWIN-NMR/data/yarkov2/nmr/H-C/1/pdata/1/auditp.txt
$$ ##AUDIT TRAIL=  $$ (NUMBER, WHEN, WHO, WHERE, WHAT)
(   1,<2026-03-23 10:02:41.90 +0400>,<Yarkov>,<DPX200>,
      <created by zg, POWCHK disabled, PULCHK disabled
       configuration hash MD5:
       00 E9 B6 7A A2 85 ED C7 34 08 36 98 17 FE 4E 26
       data hash MD5: 16K
       D4 1D 94 B5 4C 28 4D 25 0D 03 66 DB 85 AE EE B1>)
(   2,<2026-03-23 10:03:19.93 +0400>,<Yarkov>,<DPX200>,
      <Start of raw data processing
       efp BC_mod = 2 LB = 0.25 FT_mod = 6 PKNL = 1 PHC0 = -5299.148 PHC1 = 6.821927 SI = 16K 
       data hash MD5: 16K
       A8 85 41 F7 C5 0D 27 B0 97 02 24 D8 9E CD 85 F8>)
$$ ##END=
$$ 
$$ hash MD5
$$ B9 97 23 74 93 3E CB 91 70 A7 67 29 80 1A 5B B3
##$RELAX= 
##$RELAX= 
##$RELAX= 
##$RELAX= 
##$RELAX= 
##$RELAX= 
$$ Bruker specific parameters
$$ --------------------------
##$DU= <C:/Bruker/XWIN-NMR>
##$EXPNO= 1
##$NAME= <H-C>
##$PROCNO= 1
##$TYPE= <nmr>
##$USER= <yarkov2>
##$AMP= (0..31)
100 100 100 100 100 100 100 100 100 100 100 100 100 100 100 100 100 100 
100 100 100 100 100 100 100 100 100 100 100 100 100 100 
##$AQSEQ= 0
##$AQ_mod= 1
##$AUNM= <au_zg>
##$AUTOPOS= <>
##$BF1= 200.13
##$BF2= 200.13
##$BF3= 200.13
##$BF4= 200.13
##$BF5= 200.13
##$BF6= 200.13
##$BF7= 200.13
##$BF8= 200.13
##$BYTORDA= 1
##$CFDGTYP= 0
##$CFRGTYP= 5
##$CHEMSTR= <none>
##$CNST= (0..31)
1 1 145 1 1 1 1 1 1 1 1 1 1 1 1 1 1 1 1 1 1 1 1 1 1 1 1 1 1 1 1 1 
##$CPDPRG= <>
##$CPDPRG1= <>
##$CPDPRG2= <>
##$CPDPRG3= <>
##$CPDPRG4= <mlev>
##$CPDPRG5= <mlev>
##$CPDPRG6= <mlev>
##$CPDPRG7= <mlev>
##$CPDPRG8= <mlev>
##$CPDPRGB= <>
##$CPDPRGT= <>
##$D= (0..31)
0 0.7 0 0 0 0 0 0 0 0 0 0.03 0 0 0 0 0 0 0 0 0 0 0 0 0 0 0 0 0 0 0 0 
##$DATE= 1774245761
##$DBL= (0..7)
120 120 120 120 120 120 120 120 
##$DBP= (0..7)
150 150 150 150 150 150 150 150 
##$DBP07= 0
##$DBPNAM0= <>
##$DBPNAM1= <>
##$DBPNAM2= <>
##$DBPNAM3= <>
##$DBPNAM4= <>
##$DBPNAM5= <>
##$DBPNAM6= <>
##$DBPNAM7= <>
##$DBPOAL= (0..7)
0.5 0.5 0.5 0.5 0.5 0.5 0.5 0.5 
##$DBPOFFS= (0..7)
0 0 0 0 0 0 0 0 
##$DE= 6
##$DECBNUC= <off>
##$DECIM= 32
##$DECNUC= <off>
##$DECSTAT= 4
##$DIGMOD= 1
##$DIGTYP= 9
##$DL= (0..7)
0 120 120 120 120 120 120 120 
##$DP= (0..7)
$$ [...]
##$SUBNAM2= <"">
##$SUBNAM3= <"">
##$SUBNAM4= <"">
##$SUBNAM5= <"">
##$SUBNAM6= <"">
##$SUBNAM7= <"">
##$SUBNAM8= <"">
##$SUBNAM9= <"">
##$SW= 18.0517328524113
##$SWIBOX= (0..15)
0 0 2 0 0 0 0 0 0 0 0 0 0 0 0 0 
##$SW_h= 3612.71676300578
##$TD= 16384
##$TD0= 1
##$TE= 0
##$TE2= 300
##$TE3= 300
##$TEG= 300
##$TL= (0..7)
0 120 120 120 120 120 120 120 
##$TP= (0..7)
150 150 150 150 150 150 150 150 
##$TP07= 0
##$TPNAME0= <>
##$TPNAME1= <>
##$TPNAME2= <>
##$TPNAME3= <>
##$TPNAME4= <>
##$TPNAME5= <>
##$TPNAME6= <>
##$TPNAME7= <>
##$TPOAL= (0..7)
0.5 0.5 0.5 0.5 0.5 0.5 0.5 0.5 
##$TPOFFS= (0..7)
0 0 0 0 0 0 0 0 
##$TUNHIN= 0
##$TUNHOUT= 0
##$TUNXOUT= 0
##$USERA1= <user>
##$USERA2= <user>
##$USERA3= <user>
##$USERA4= <user>
##$USERA5= <user>
##$V9= 5
##$VALIST= <valist>
##$VCLIST= <CCCCCCCCCCCCCCC>
##$VD= 0
##$VDLIST= <DDDDDDDDDDDDDDD>
##$VPLIST= <PPPPPPPPPPPPPPP>
##$VTLIST= <TTTTTTTTTTTTTTT>
##$WBST= 1024
##$WBSW= 4
##$XGAIN= (0..3)
0 0 0 0 
##$XL= 0
##$YL= 0
##$YMAX_a= 111428
##$YMIN_a= -106479
##$ZGOPTNS= <>
##$ZL1= 120
##$ZL2= 120
##$ZL3= 120
##$ZL4= 120
##$ABSF1= 0
##$ABSF2= 0
##$ABSG= 0
##$ABSL= 0
##$ALPHA= 0
##$AQORDER= 0
##$ASSFAC= 0
##$ASSFACI= 0
##$ASSFACX= 0
##$ASSWID= 0
##$AUNMP= <proc_1d>
##$AZFE= 0.1
##$AZFW= 0.1
##$BCFW= 0
##$BC_mod= 2
##$BYTORDP= 0
##$COROFFS= 0
##$CY= -3
##$DATMOD= 1
##$DC= 0
##$DFILT= <>
##$DTYPP= 0
##$F1P= 0
##$F2P= 0
##$FCOR= 1
##$FTSIZE= 16384
##$FT_mod= 6
##$GAMMA= 0
##$GB= 0
##$INTBC= 1
##$INTSCL= 3.241238e-09
##$ISEN= 128
##$LB= 0.25
##$LEV0= 0
##$LPBIN= 0
##$MAXI= 10000
##$MC2= 0
##$MEAN= 0
##$ME_mod= 0
##$MI= 1.114404
##$NCOEF= 0
##$NC_proc= -9
##$NLEV= 6
##$NOISF1= 3.799351
##$NOISF2= 2.8
##$NSP= 0
##$NTH_PI= 0
##$NZP= 0
##$OFFSET= 15.48907
##$PC= 1
##$PHC0= -5299.148
##$PHC1= 6.821927
##$PH_mod= 1
##$PKNL= yes
##$PPARMOD= 0
##$PSCAL= 0
##$PSIGN= 0
##$REVERSE= no
##$SF= 200.130006531135
##$SI= 16384
##$SIGF1= 3
##$SIGF2= 2
##$SINO= 0.751879
##$SIOLD= 32768
##$SREGLST= <19F.Aceton>
##$SSB= 0
##$STSI= 16384
##$STSR= 0
##$SW_p= 3612.71676300578
##$SYMM= 0
##$S_DEV= 0
##$TDeff= 16384
##$TDoff= 0
##$TI= <>
##$TILT= no
##$TM1= 0
##$TM2= 0
##$TOPLEV= 0
##$USERP1= <user>
##$USERP2= <user>
##$USERP3= <user>
##$USERP4= <user>
##$USERP5= <user>
##$WDW= 1
##$XDIM= 16384
##$YMAX_p= 482078245
##$YMIN_p= -2837239
$$ End of Bruker specific parameters
$$ ---------------------------------
##NTUPLES= NMR SPECTRUM
##VAR_NAME=  FREQUENCY,     SPECTRUM/REAL,   SPECTRUM/IMAG
##SYMBOL=    X,             R,               I
##VAR_TYPE=  INDEPENDENT,   DEPENDENT,       DEPENDENT
##VAR_FORM=  AFFN,          ASDF,            ASDF
##VAR_DIM=   16384,         16384,           16384
##UNITS=     HZ,            ARBITRARY UNITS, ARBITRARY UNITS
##FACTOR=    0.220516191357247, 1,           1
##FIRST=     3099.82766798517, 0,            0
##LAST=      -512.889095020614, 0,           0
##MIN=       -512.889095020614, -2837239,    0
##MAX=       3099.82766798517, 482078245,    0
$$ Real data points
##PAGE= N=1
##DATA TABLE= (X++(R..R)), XYDATA
$$ [...]
$$ plain form
5000 43515639 43997895 44114449 44025301 44004729 44403627 45378203 45182389 44708817 44973904 44725722
4990 44725722 44865257 44687506 43945163 43951216 44095695 44264148 44522255 44064878 43551714 44051216
4980 44051216 43836660 44108110 44111343 44166894 44333879 44181151 44731265 44583532 44275009 44428863
4970 44428863 44830111 45129035 45197254 44457694 44249313 44717166 44488683 44729405 45299248 45409815
4960 45409815 45472322 45802907 45390893 45306428 45219139 46043542 46804212 47016808 47205451 46838934
4950 46838934 46417930 46791972 47084290 46679828 46740409 47213343 47380050 47386073 47925662 47814492
4940 47814492 47886941 47650367 47897599 47659005 47493863 47982933 48345137 49147269 49491883 49319351
4930 49319351 49865774 50469914 50188001 50760706 51271208 51907573 52677497 52739666 53271882 53827504
$$ packed form
5000D3515639M82256J16554q9148k0572L98898R74576j95814m73572K65087k48182
4990D4725722J39535j77751p42343O053J44479J68453K58107m57377n13164M99502
4980D4051216k14556K71450L233N5551J66985j52728N50114j47733l08523J53854
4970D4428863M01248K98924O8219p39560k08381M67853k28483K40722N69843J10567
4960D5409815O2507L30585m12014q4465q7289Q24403P60670K12596J88643l66517
4950D6838934m21004L74042K92318m04462O0581M72934J66707O023N39589j11170
4940D7814492P2449k36574K47232k38594j65142M89070L62204Q02132L44614j72532
4930D9319351N46423O04140k81913N72705N10502O36365P69924O2169N32216N55622
$$ plain form
4920 53827504 54924362 55873747 56431752 56881397 57421935 58847047 60031393 60713034 61617090
4911 61617090 62541012 63782809 64921086 65839788 67054805 67844046 69285149 70867614 71576458
4902 71576458 72459598 73360064 74238887 74956100 76095663 76992066 78067272 78731054 78696216
4893 78696216 78680674 79701401 79819537 80145789 80774271 80755681 80883980 80448389 80177365 80312632
4883 80312632 80306580 80344973 80168835 80408616 80119788 80035908 80072497 79448272 80029438 79893488
4873 79893488 79346956 78916513 78689085 78407840 78316420 77657722 77370781 76829488 76412410 75887516
4863 75887516 75068759 74510689 74187432 73775545 73303846 72543300 72456382 72192873 71877199 71403711
4853 71403711 71329580 71349717 71379069 71609089 72105336 72706673 73026190 73992145 75202647 76934248
$$ packed form
4920E3827504J096858R49385N58005M49645N40538J425112J184346O81641R04056
4911F1617090R23922J241797J138277R18702J215017P89241J441103J582465P08844
4902G1576458Q83140R00466Q78823P17213J139563Q96403J075206O63782l4838
4893G8696216j5542J020727J18136L26252O28482j8590J28299m35591k71024J35267
4883H0312632o052L8393j76138K39781k88828q3880L6589o24225N81166j35950
4873G9893488n46532m30443k27428k81245r1420o58698k86941n41293m17078n24894
4863G5887516q18757n58070l23257m11887m71699p60546q6918k63509l15674m73488
4853G1403711p4131K0137K9352K30020M96247O01337L19517R65955J210502J731601
$$ plain form
4843 76934248 78992651 81531139 84360006 87463146 90138408 94084768 97763728 101660041
4835 101660041 106105197 111471966 116800945 121320235 125373727 128957061 131098646 131498853
4827 131498853 131174820 130257779 127334225 122817778 116558004 109845039 103699806 97340009
4819 97340009 92848541 88293364 83585655 79145114 75365108 71609828 68803297 66250411
4811 66250411 64481947 62164067 60359188 59058577 58321128 56796176 55175379 53796920
4803 53796920 52400707 51783840 50737789 49914288 49296235 48035791 47015444 45737102 45315696
4794 45315696 44983275 44476607 44408849 44199681 43679894 42772434 42771085 42623412 42121658 41372358
4784 41372358 40786385 41227862 40955783 40501738 40393759 40083598 40786320 40960044 41068950
$$ packed form
4843G6934248K058403K538488K828867L103140K675262L946360L678960L896313
4835A01660041M445156N366769N328979M519290M053492L583334K141585M00207
4827A31498853l24033r17041k923554m516447o259774o712965o145233o359797
4819I7340009m491468m555177m707709m440541l780006l755280k806531k552886
4811F6250411j768464k317880j804879j300611p37449j524952j620797j378459
4803E3796920j396213o16867j046051q23501o18053j260444j020347j278342m21406
4794D5315696l32421n06668o7758k09168n19787r07460j349j47673n01754p49300
4784D1372358n85973M41477k72079m54045j07979l10161P02722J73724J08906
$$ plain form
4775 41068950 41480643 41586320 42208726 42758563 43442813 44228507 44088209 44779536 45963454
4766 45963454 46649877 47059182 47831974 48564448 49392433 50656566 51524429 52509088 54131214
4757 54131214 55780804 56897668 57978193 59626935 60982596 62249255 63914375 65536643
4749 65536643 66634979 68996238 70753010 72348007 74025229 75979348 78196017 80441356
4741 80441356 82564472 84552435 86137355 87852178 90603395 93060763 95048879 97425098
4733 97425098 99557298 101530132 103203562 105138095 107242060 109669089 110641314 111661281
4725 111661281 113079625 114591173 116051686 117297489 118883900 119849261 121393840 123298868
4717 123298868 124693820 126651285 128268240 129296853 130798787 132451280 134779458 136930119
$$ packed form
4775D1068950M11693J05677O22406N49837O84250P85694j40298O91327J183918
4766D5963454O86423M09305P72792P32474Q27985J264133Q67863R84659J622126
4757E4131214J649590J116864J080525J648742J355661J266659J665120J622268
4749F5536643J098336K361259J756772J594997J677222J954119K216669K245339
4741H0441356K123116J987963J584920J714823K751217K457368J988116K376219
4733I7425098K132200J972834J673430J934533K103965K427029R72225J019967
4725A11661281J418344J511548J460513J245803J586411R65361J544579J905028
4717A23298868J394952J957465J616955J028613J501934J652493K328178K150661
$$ plain form
4709 136930119 138663778 140335362 141117280 142526782 143796323 144365356 144636703 144963856 144765912
4700 144765912 144229379 143110005 141541882 140002655 137686190 135778943 133852678 131182269
4692 131182269 128489550 125905424 123075474 120014063 116763043 114005990 111279824 108456805
4684 108456805 105684022 103052192 100930867 98546995 95606443 92954362 90360068 88378995
4676 88378995 85173955 82536375 79416838 77398972 74621727 72011389 69127241 65554627
4668 65554627 63184122 60845730 58485602 55381984 52734891 50256212 47572956 45435506
4660 45435506 42966507 40689362 39006428 37463652 36015017 34030962 32621999 31743642
4652 31743642 30631025 29601760 29152056 28035296 27584322 27654023 27578110 26943197 26339305
$$ packed form
4709A36930119J733659J671584P81918J409502J269541N69033K71347L27153j97944
4700A44765912n36533j119374j568123j539227k316465j907247j926265k670409
4692A31182269k692719k584126k829950l061411l251020k757053k726166k823019
4684A08456805k772783k631830k121325k383872k940552k652081k594294j981073
4676H8378995l205040k637580l119537k017866k777245k610338k884148l572614
4668F5554627k370505k338392k360128l103618k647093k478679k683256k137450
4660D5435506k468999k277145j682934j542776j448635j984055j408963q78357
4652C1743642j112617j029265m49704j116760m50974O9701p5913o34913o03892
$$ plain form
4643 26339305 26208976 26019217 25779968 25733810 26132807 26690242 27424395 28435622 29313663
4634 29313663 30035507 30772612 31860528 33833017 34682431 35593533 36708806 37808644 39017183
4625 39017183 39246225 38921568 39235340 39324229 38993840 38910371 38920220 38279136 38372218 39221622
4615 39221622 39444272 40500154 41734427 42661439 44196409 46129575 47536500 49673631
4607 49673631 51767915 53987327 55766941 57600605 60344330 62220699 64191850 66075492
4599 66075492 67892636 70109739 71657845 72597690 73818552 74729970 75477164 75180648 74570848
4590 74570848 74466937 73483068 72027050 70986537 68876799 66708286 64768806 61793283
4582 61793283 59289988 57239476 54082722 50942088 48203618 45167068 42472076 39644642
$$ packed form
4643B6339305j30329j89759k39249m6158L98997N57435P34153J011227Q78041
4634B9313663P21844P37105J087916J972489Q49414R11102J115273J099838J208539
4625C9017183K29042l24657L13772Q8889l30389q3469R849o41084R3082Q49404
4615C9221622K22650J055882J234273R27012J534970J933166J406925K137131
4607D9673631K094284K219412J779614J833664K743725J876369J971151J883642
4599F6075492J817144K217103J548106R39845J220862R11418P47194k96516o09800
4590G4570848j03911r83869j456018j040513k109738k168513j939480k975523
4582F1793283k503295k050512l156754l140634k738470l036550k694992k827434
$$ plain form
4574 39644642 36783107 33989793 31792089 29282826 26675746 24105224 22019335 20086744
4566 20086744 18682423 17187695 15799195 14493888 13427160 12570266 11843189 11315166 10827048
4557 10827048 10161701 9399011 8936198 9006735 8650563 8111595 7752296 7707844 7713699 7153477
4547 7153477 7213249 7822316 7232784 7803966 7849937 7673596 7811368 7192731 7766769 7354153
4537 7354153 7457034 7587125 7548059 7322429 7782649 7630945 7802462 8442464 8480745 8629939
4527 8629939 8789089 8640148 8893703 8902279 9130195 8839099 8356544 8715600 8407396 8233556
4517 8233556 8537368 8820375 8835202 8884071 9038010 9145864 9528324 9564819 9202304 8903544
4507 8903544 8609600 8738720 8964508 8941362 9078085 8433146 8210811 8418770 7936678 8196421
$$ packed form
4574C9644642k861535k793314k197704k509263k607080k570522k085889j932591
4566B0086744j404321j494728j388500j305307j066728q56894p27077n28023m88118
4557A0827048o65347p62690m62813P0537l56172n38968l59299m4452N855n60222
4547G153477N9772O09067n89532N71182M5971j76341J37772o18637N74038m12616
4537G354153J02881J30091l9066k25630M60220j51704J71517O40002L8281J49194
4527H629939J59150j48941K53555Q576K27916k91096m82555L59056l08204j73840
4517H233556L03812K83007J4827M8869J53939J07854L82460L6495l62515k98760
4507H903544k93944J29120K25788k3146J36723o44939k22335K07959m82092K59743
$$ plain form
4497 8196421 7719977 7674164 8130316 7896050 8146712 8452163 8440067 8048441 7327743 7167740
4487 7167740 7153459 7071412 7863648 7965021 6846432 7035713 7235343 6994252 6805002 6645469
4477 6645469 6601069 6019863 5406918 5477635 5865600 5450471 5210314 5348667 5178992 4924436
4467 4924436 4987257 5161307 5134397 5003311 4852129 4854595 4692436 4894779 4482322 4131376
4457 4131376 3868425 4395042 4066146 4153609 4254987 4198279 4161122 4384043 4476587 4291384
4447 4291384 4325970 3806257 3681173 4021413 4392728 3861366 4260229 4347017 3943852 4320183
4437 4320183 4580057 4189251 4006936 3903009 4160898 3815438 3879609 4358842 4173724 4294972
4427 4294972 4489257 4237720 3741102 4072525 3834581 4285394 4167981 3791523 4311114 4299127
$$ packed form
4497H196421m76444m5813M56152k34266K50662L05451j2096l91626p20698j60003
4487G167740j4281q2047P92236J01373j118589J89281J99630k41091j89250j59533
4477F645469m4400n81206o12945P0717L87965m15129k40157J38353j69675k54556
4467D924436O2821J74050k6910j31086j51182K466j62159K02343m12457l50946
4457D131376k62951N26617l28896Q7463J01378n6708l7157K22921R2544j85203
4447D291384L4586n19713j25084L40240L71315n31362L98863Q6788m03165L76331
4437D320183K59874l90806j82315j03927K57889l45460O4171M79233j85118J21248
4427D294972J94285k51537m96618L31423k37944M50813j17413l76458N19591j1987
$$ plain form
4417 4299127 4703676 4701682 4179081 3843877 4308278 4497613 4451737 5070087 5011846 4245104
4407 4245104 4593242 5122601 4823045 4327522 4934842 4831837 4415954 4591767 4533397 4052794
4397 4052794 4375566 4691403 4592014 4443158 4439918 4866463 5296953 4905818 4317098 4455589
4387 4455589 4444762 4710173 5383562 5380527 5344527 4985981 4703163 4667460 5162817 5249048 4838153
4376 4838153 5233299 5521116 5852836 5731339 5901885 5454929 5210782 5773462 5678007 5516220
4366 5516220 6320357 7037954 7009264 6998811 7000338 6724507 6905123 6939464 6505504 7295593
4356 7295593 7096260 7177779 8018990 8285323 8423252 8210017 8138782 8134243 7872774 8339496
4346 8339496 9127895 9482599 9594194 9277352 9555093 8935849 8793941 9363350 8925884 8564648
$$ packed form
4417D299127M04549j994n22601l35204M64401J89335m5876O18350n8241p66742
4407D245104L48138N29359k99556m95523O07320j03005m15883J75813n8370m80603
4397D052794L22772L15837r9389j48856l240M26545M30490l91135n88720J38491
4387D455589j0827K65411O73389l035l6000l58546k82818l5703M95357Q6231m10895
4376D838153L95146K87817L31720j21497J70546m46956k44147N62680r5455j61787
4366E516220Q04137P17597k8690j0453J527k75831J80616L4341m33960P90089
4356G295593j99333Q1519Q41211K66333J37929k13235p1235m539k61469M66722
4346H339496P88399L54704J11595l16842K77741o19244j41908N69409m37466l61236
$$ plain form
4336 8564648 8979998 9663435 9940098 9728580 9620071 8975891 8686645 9194291 9289642 9732250
4326 9732250 9539257 9044210 9483650 9264113 9487121 9656826 9962877 9947158 9723122 9750370
4316 9750370 10418871 10557490 10080365 10234195 10552012 10877675 11408557 11776706 12060888 12154490
4306 12154490 12487267 12544422 12593461 13634843 14460455 13933441 13817982 13765019 13302041 13478806
4296 13478806 13579299 13778767 13828854 13754564 14084219 13953421 13386080 13736782 13052070 12890230
4286 12890230 12774090 12657820 12301243 12004462 12096346 11718460 11492237 11999412 11417488 11293377
4276 11293377 11140362 11104064 10583219 10313570 10133002 9885791 10187703 10643311 10085616 9863400
4266 9863400 9964194 9747144 9773179 10025274 10437339 10606378 10456012 10521118 10425004 10359077
$$ packed form
4336H564648M15350O83437K76663k11518j08509o44180k89246N07646R5351M42608
4326I732250j92993m95047M39440k19537K23008J69705L06051j5719k24036K7248
4316I750370O68501J38619m77125J53830L17817L25663N30882L68149K84182R3602
4306A2154490L32777N7155M9039J041382Q25612n27014j15459n2963m62978J76765
4296A3478806J00493J99468N0087p4290L29655j30798n67341L50702o84712j61840
4286A2890230j16140j16270l56577k96781R1884l77886k26223N07175n81924j24111
4276A1293377j53015l6298n20845k69649j80568k47211L01912M55608n57695k22216
4266I863400J00794k17050K6035K52095M12065J69039j50366O5106r6114o5927
$$ plain form
4256 10359077 10721289 11171548 10939146 10634608 10910897 10974424 10975976 10513446 10593602 10435431
4246 10435431 10674397 10175661 10354286 10564130 9939036 9644641 9705763 9353979 8983934 8508341
4236 8508341 8588455 8706264 9113759 8670663 8185009 8236374 8303902 7932886 7911272 7765408
4226 7765408 7157389 7175388 7388734 7579239 7680150 7792230 7835530 7518192 8019408 8134156
4216 8134156 7709345 7410533 7608686 7496138 7516666 7202372 7325792 7423414 8044341 8146782
4206 8146782 8353193 8225915 7435998 7723792 7788482 8177160 8157660 8571828 8658522 8295686
4196 8295686 8487240 8485878 8216470 8654907 8965585 8887549 9057207 8738874 9032068 9492153
4186 9492153 9042214 9644962 10801154 10062181 9799870 10593000 10786432 10920562 10978286 11532872
$$ packed form
4256A0359077L62212M50259k32402l04538K76289O3527J552m62530Q0156j58171
4246A0435431K38966m98736J78625K09844o25094k94395O1122l51784l70045m75593
4236H508341Q0114J17809M07495m43096m85654N1365O7528l71016k1614j45864
4226G765408o08019J7999K13346J90505J00911J12080M3300l17338N01216J14748
4216H134156m24811k98812J98153j12548K0528l14294J23420R7622O20927J02441
4206H146782K06411j27278p89917K87794O4690L88678j9500M14168Q6694l62836
4196H295686J91554j362k69408M38437L10678p8036J69658l18333K93194M60085
4186I492153m49939O02748J156192p38973k62311P93130J93432J34130N7724N54586
$$ plain form
4176 11532872 11139189 11640980 11541420 11218800 11393936 12240233 12966207 13663912 13606072 13527449
4166 13527449 14285766 14765800 14773713 14693824 15530459 16421784 16743020 17058087 16795936 16213695
4156 16213695 16630251 17376897 17374857 18224317 18947021 19511505 19813675 20515076 21152533 21139111
4146 21139111 21631903 21960816 22682667 23477722 24680840 25364399 25197596 25792614 26630918
4137 26630918 27352779 27707134 28713115 29600880 30173200 30651034 31602160 32686034 33453721
4128 33453721 34553542 35868812 36898835 37702119 39014440 40146055 40918625 41766834 42828795
4119 42828795 44153629 45631555 46546280 47927290 49124638 50758193 51887172 52894804
4111 52894804 54175402 55468479 56812672 58257572 59537874 61094814 62260356 63126892
$$ packed form
4176A1532872l93683N01791r9560l22620J75136Q46297P25974O97705n7840p8623
4166A3527449P58317M80034P913p9889Q36635Q91325L21236L15067k62151n82241
4156A6213695M16556P46646k040Q49460P22704N64484L02170P01401O37457j3422
4146B1139111M92792L28913P21851P95055J203118O83559j66803N95018Q38304
4137B6630918P21861L54355J005981Q87765N72320M77834R51126J083874P67687
4128C3453721J099821J315270J030023Q03284J312321J131615P72570Q48209J061961
4119D2828795J324834J477926R14725J381010J197348J633555J128979J007632
4111E2894804J280598J293077J344193J444900J280302J556940J165542Q66536
$$ plain form
4103 63126892 64198609 65685002 67916244 68988533 69857332 71191649 72887785 74714401
4095 74714401 76882792 78115373 79215675 80844977 82353259 84904809 86253728 87762716
4087 87762716 89854873 90866776 92279967 93269634 94518445 95412514 96640791 98549133
4079 98549133 100349306 102012823 102999158 104191278 105647110 107115886 107932652 109282368
4071 109282368 110359629 111730799 112875280 114615922 116379711 118034088 119713058 121983026
4063 121983026 123924967 124903972 127210559 129134862 131387422 133420268 135256059 137699486
4055 137699486 139914427 141439514 143030124 143845618 144862248 145435749 146486037 147790995
4047 147790995 148554933 149450542 150499151 151624342 152383366 152550281 153367697 154116379 154272723
$$ packed form
4103F3126892J071717J486393K231242J072289Q68799J334317J696136J826616
4095G4714401K168391J232581J100302J629302J508282K551550J348919J508988
4087H7762716K092157J011903J413191R89667J248811Q94069J228277J908342
4079I8549133J800173J663517R86335J192120J455832J468776Q16766J349716
4071A09282368J077261J371170J144481J740642J763789J654377J678970K269968
4063A21983026J941941R79005K306587J924303K252560K032846J835791K443427
4055A37699486K214941J525087J590610Q15494J016630N73501J050288J304958
4047A47790995P63938Q95609J048609J125191P59024J66915Q17416P48682J56344
$$ plain form
4038 154272723 154815385 155090182 155657358 155858319 156642293 157143258 157584721 157872333 158206468
4029 158206468 158495021 158641745 158435514 158568122 158227791 158576209 158645612 157788520 157983643
4020 157983643 158025283 156931252 156735968 156354652 155306043 154933550 154679001 153668406 152422303
4011 152422303 152026065 151386975 151185668 150713183 149952001 148244649 147441438 146277882 145283389
4002 145283389 144199262 142528144 141298348 140483477 138947374 136855291 135127149 133502832
3994 133502832 132173611 130858605 129253195 127340525 125187933 124115720 122695374 120747253
3986 120747253 118717151 116895427 116272865 115169485 113560471 111694996 110703442 109405887
3978 109405887 108093526 107082193 105866292 104811028 103896440 102673309 101431690 99850184
$$ packed form
4038A54272723N42662K74797N67176K00961P83974N00965M41463K87612L34135
4029A58206468K88553J46724k06231J32608l40331L48418O9403q57092J95123
4020A57983643M1640j094031j95284l81316j048609l72493k54549j010595j246103
4011A52422303l96238o39090k01307m72485p61182j707352q03211j163556r94493
4002A45283389j084127j671118j229796q14871j536103k092083j728142j624317
3994A33502832j329221j315006j605410j912670k152592j072213j420346j948121
3986A20747253k030102j821724o22562j103380j609014j865475r91554j297555
3978A09405887j312361j011333j215901j055264r14588j223131j241619j581506
$$ plain form
3970 99850184 98551668 98095524 97299578 96641169 96404289 95573296 94873533 94122738 94441025
3961 94441025 94082778 93901252 93506345 93377637 93278554 92398620 92365689 92098973 91395329 90201765
3951 90201765 89208673 87580921 85795937 85363607 84499431 82965425 81898258 80948603 79993430
3942 79993430 79059023 78436251 78202829 76845334 76368985 75448594 74213169 73675213 72880084
3933 72880084 71937682 71452249 70843768 69741230 69287435 68693417 67442948 65739065 64345929
3924 64345929 62496701 61304816 60086494 58238694 55949339 53889185 51839592 49767821
3916 49767821 48081035 46317738 44710093 43401700 42392824 41795927 40996995 39916918
3908 39916918 38861964 38539688 38216352 38697135 38846001 38616284 38495004 38182792 37889978
$$ packed form
3970I9850184j298516m56144p95946o58409k36880q30993o99763p50795L18287
3961I4441025l58247j81526l94907j28708r9083q79934l2931k66716p03644j193564
3951I0201765r93092j627752j784984m32330q64176j534006j067167r49655r55173
3942G9993430r34407o22772k33422j357495m76349r20391j235425n37956p95129
3933G2880084r42402m85433o08481j102538m53795n94018j250469j703883j393136
3924F4345929j849228j191885j218322j847800k289355k060154k049593k071771
3916D9767821j686786j763297j607645j308393j008876n96897p98932j080077
3908C9916918j054954l22276l23336M80783J48866k29717j21280l12212k92814
$$ plain form
3899 37889978 38270380 38956971 38822118 38228975 38219375 38729144 39094716 39188592 40096265 40703363
3889 40703363 40400758 40386996 40957766 40871786 40630192 40899043 40554871 40841612 41336462 41198504
3879 41198504 41597444 42182177 43007698 43075327 43347138 44348675 44906979 45302939 45930762
3870 45930762 46621967 47163867 48405103 49836847 50741508 52454473 53139771 54254287 56371177
3861 56371177 58376717 59828367 61808396 63539141 65025331 67671652 69804399 71160654
3853 71160654 73222071 75533435 77079616 78632742 79799681 80968787 81802548 83371332
3845 83371332 84701044 85739868 87041632 87705634 88600900 89303689 89541955 90247632 91019655
3836 91019655 91374509 91034876 91086835 90976290 90696313 90806391 89900573 88694674 87455422
$$ packed form
3899C7889978L80402O86591j34853n93143r600N09769L65572R3876R07673O07098
3889D0703363l02605j3762N70770q5980k41594K68851l44172K86741M94850j37958
3879D1198504L98940N84733Q25521O7629K71811J001537N58304L95960O27823
3870D5930762O91205N41900J241236J431744R04661J712965O85298J114516K116890
3861E6371177K005540J451650J980029J730745J486190K646321K132747J356255
3853G1160654K061417K311364J546181J553126J166939J169106Q33761J568784
3845H3371332J329712J038824J301764O64002Q95266P02789K38266P05677P72023
3836I1019655L54854l39633N1959j10545k79977J10078r05818j205899j239252
$$ plain form
3827 87455422 86774442 85937443 84633384 83400005 82765717 81882406 80331929 79604940 78367828
3818 78367828 77714125 76814385 76507443 75713309 74568112 73453865 73228993 73301889 72590268
3809 72590268 72467009 71634730 71881437 72286727 71897462 71826766 71631750 71775678 71420635 72151290
3799 72151290 72194700 72577383 72974592 73372693 74022342 74343230 75007484 75713937 75871968 76537005
3789 76537005 77305950 77264679 77905777 77887979 78137654 77782645 77266129 77041611 75895506 74551151
3779 74551151 73173367 71721152 70453733 69418136 67740928 66189185 63708736 61901050
3771 61901050 60497634 59165431 57859678 56575362 54188657 51971821 50724145 48751463
3763 48751463 47282416 45884500 44657211 43399039 42420230 41054881 39638185 38434286
$$ packed form
3827H7455422o80980q36999j304059j233379o34288q83311j550477p26989j237112
3818G8367828o53703q99740l06942p94134j145197j114247k24872P2896p11621
3809G2590268j23259q32279K46707M05290l89265p0696j95016J43928l55043P30655
3799G2151290M3410L82683L97209L98101O49649L20888O64254P06453J58031O65037
3789G6537005P68945m1271O41098j7798K49675l55009n16516k24518j146105j344355
3779G4551151j377784j452215j267419j035597j677208j551743k480449j807686
3771F1901050j403416j332203j305753j284316k386705k216836j247676j972682
3763D8751463j469047j397916j227289j258172r78809j365349j416696j203899
$$ plain form
3755 38434286 37167369 36183856 35132674 34351182 32876394 31981807 31635920 31070066 30080119
3746 30080119 29596267 29106704 29201121 28755720 27754815 27619612 26882276 26907642 26553529 26449519
3736 26449519 26781537 27085128 26821206 26320913 26017075 26515638 26182746 26356483 26136793
3727 26136793 25816040 25998366 26584950 26127713 26384658 27282306 27313229 27394502 27547384 27670800
3717 27670800 27562180 27506457 28038823 28200125 28296913 28409475 28729567 29145969 29387872 29793512
3707 29793512 29762840 29839595 30162434 29612661 29934815 30152605 30529664 31665752 31941343 31946612
3697 31946612 32578138 32448193 31938723 32141506 32201878 32476297 32537223 32675154 33438377 33886245
3687 33886245 34120142 34177917 34371192 34821879 34435131 35008984 35636775 35757401 36188835 36325121
$$ packed form
3755C8434286j266917r83513j051182p81492j474788q94587l45887n65854r89947
3746C0080119m83852m89563R4417m45401j000905j35203p37336K5366l54113j04010
3736B6449519L32018L03591k63922n00293l03838M98563l32892J73737k19690
3727B6136793l20753J82326N86584m57237K56945Q97648L0923Q1273J52882J23416
3717B7670800j08620n5723N32366J61302R6788J12562L20092M16402K41903M05640
3707B9793512l0672P6755L22839n49773L22154K17790L77059J136088K75591N269
3697C1946612O31526j29945n09470K02783O0372K74419O0926J37931P63223M47868
3687C3886245K33897N7775J93275M50687l86748N73853O27791J20626M31434J36286
$$ plain form
3677 36325121 36141921 36443458 36258729 36736234 36230730 36475279 36758645 36933338 36841640 36573312
3667 36573312 36494113 36931353 36889487 36918828 36893702 36618610 36633341 36387447 36829062 37235016
3657 37235016 37574767 37097237 36588494 36672544 36624873 36623977 37048979 36973845 36951218 36961305 36280634
3646 36280634 36039484 36354012 35471921 35785667 35707761 34986930 34519357 34949140 35133025 34509663
3636 34509663 35086809 35077109 34696072 34712216 34618397 34447674 34263001 34377692 34097034 34279065
3626 34279065 34670029 34861138 34802897 35049776 34914455 34784929 34912030 34867228 34591027 35103721
3616 35103721 35763504 36292856 36071118 35592275 35412707 35237324 34903602 35139206 35453122
3607 35453122 35202379 35398493 35094188 34960837 35046677 34595267 34326228 34304228 34500751 34600089
$$ packed form
3677C6325121j83200L01537j84729M77505n05504K44549K83366J74693r1698k68328
3667C6573312p9199M37240m1866K9341k5126k75092J4731k45894M41615M05954
3657C7235016L39751m77530n08743Q4050m7671q96M25002p5134k2627J0087o80671
3646C6280634k41150L14528q82091L13746p7906p20831m67573M29783J83885o23362
3636C4509663N77146r700l81037J6144r3819j70723j84673J14691k80658J82031
3626C4279065L90964J91109n8241K46879j35321j29526J27101m4802k76201N12694
3616C5103721O59783N29352k21738m78843j79568j75383l33722K35604L13916
3607C5453122k50743J96114l04305j33351Q5840m51410k69039k2000J96523R9338
$$ plain form
3597 34600089 33837980 33296000 33122438 32896421 32868829 32220693 31739311 32789028 32392909
3588 32392909 31973745 32122352 32030657 31827005 31600586 31956723 32431678 31942862 32108655 32140800
3578 32140800 32595395 32493238 32229365 32696470 33325258 33862145 33920899 33714864 34306763 34348747
3568 34348747 35089122 34991930 34888285 35213831 35362862 35491035 35208508 35553846 35610393 36303274
3558 36303274 36475132 36244716 36293552 36481828 36915501 36686499 36660586 37219275 38133071 38526165
3548 38526165 38389410 39026074 39161811 39501843 40138661 40851809 41099474 41341541 42046779
3539 42046779 42545796 42983774 43530811 43801412 45074787 45578407 46123187 47297980 48356969
3530 48356969 49411930 50831633 52343367 53222259 54113468 55078720 56675834 58287574 59717599
$$ packed form
3597C4600089p62109n41980j73562k26017k7592o48136m81382J049717l96119
3588C2392909m19164J48607r1695k03652k26419L56137M74955m88816J65793L2145
3578C2140800M54595j02157k63873M67105O28788N36887N8754k06035N91899M1984
3568C4348747P40375r7192j03645L25546J49031J28173k82527L45338N6547O92881
3558C6303274J71858k30416M8836J88276M33673k29002k5913N58689R13796L93094
3548C8526165j36755O36664J35737L40032O36818P13148K47665K42067P05238
3539D2046779M99017M37978N47037K70601J273375N03620N44780J174793J058989
3530D8356969J054961J419703J511734Q78892Q91209R65252J597114J611740J430025
$$ plain form
3521 59717599 61675620 63781113 65401715 66909380 69555591 71837540 73554439 75812422
3513 75812422 79007314 82219275 84683622 88073762 91201921 95532760 100113896 104869010
3505 104869010 110162506 116501045 122725499 129239087 137426797 145845179 155109567 164490325
3497 164490325 174326405 185067428 196335840 207735812 220022724 232513680 244759222
3490 244759222 256474004 268044884 279487280 289812969 299741999 308728223 317021205
3483 317021205 323802680 329828209 335003587 339660701 343046865 345943035 347702499 347504031
3475 347504031 345496179 341197260 335701857 328189424 319420101 308986824 296612475 283832313
3467 283832313 271094761 257574174 243824797 231333629 219037769 207151375 196315325
$$ packed form
3521E9717599J958021K105493J620602J507665K646211K281949J716899K257983
3513G5812422L194892L211961K464347L390140L128159M330839M581136M755114
3505A04869010N293496O338539O224454O513588Q187710Q418382R264388R380758
3497A64490325R836080J0741023J1268412J1399972J2286912J2490956J2245542
3490B44759222J1714782J1570880J1442396J0325689R929030Q986224Q292982
3483C17021205O781475O025529N175378M657114L386164K896170J759464j98468
3475C47504031k007852m298919n495403p512433q769323j0433277j2374349j2780162
3467B83832313j2737552j3520587j3749377j2491168j2295860j1886394j0836050
$$ plain form
3460 196315325 186017362 177477897 169440372 163151487 157173010 151426220 147232575 144346714
3452 144346714 141515249 140731600 140269995 139684016 139470114 140931087 143386240 146089580 149621256
3443 149621256 153492004 157818893 161903549 167005593 172657275 177639258 183325126 189288542
3435 189288542 194820192 199568303 203444659 206307073 209142651 210849400 211299851 210494082
3427 210494082 208458151 205836786 202016786 197718746 193106846 187343593 181524219 175395030
3419 175395030 168930400 162607081 156723483 150776983 145089742 139904485 134932939 130261051
3411 130261051 126575007 123603663 120157272 117758582 115176304 112700077 111335655 110361000
3403 110361000 108844604 107873765 106943165 105551474 104960030 104937699 104988901 105010774 104654554
$$ packed form
3460A96315325j0297963q539465q037525o288885n978477n746790m193645k885861
3452A44346714k831465p83649m61605n85979k13902J460973K455153K703340L531676
3443A49621256L870748M326889M084656N102044N651682M981983N685868N963416
3435A89288542N531650M748111L876356K862414K835578J706749M50451q05769
3427B10494082k035931k621365l820000m298040m611900n763253n819374o129189
3419A75395030o464630o323319n883598n946500n687241n185257m971546m671888
3411A30261051l686044k971344l446391k398690k582278k476227j364422r74655
3403A10361000j516396r70839r30600j391691n91444k2331N1202K1873l56220
$$ plain form
3394 104654554 104670881 104865820 104812751 104613399 105080207 105848386 106223424 106571918 106073763 105548993
3384 105548993 105821416 105246786 104768520 104593828 103856780 102834677 101460559 100395425 99590342
3375 99590342 98308996 96896098 95892507 94682947 93456896 93056592 92523885 91861640 91653469
3366 91653469 91982140 92064688 92110203 92742884 93923993 95108840 97049047 98040985 99630312
3357 99630312 100520478 102123066 104433223 106969184 108356006 110279752 112559086 115205560
3349 115205560 117682419 120420340 122965806 126489492 130114140 133806454 137880911 141792735
3341 141792735 146699011 152089116 157492678 163177136 168682653 174559567 180046683 185123457
3333 185123457 190049202 194287058 198004852 200198264 201773580 201648391 200716309 198037362
$$ packed form
3394A04654554J6327J94939n3069j99352M66808P68179L75038L48494m98155n24770
3384A05548993K72423n74630m78266j74692p37048j022103j374118j065134q05083
3375I9590342j281346j412898j003591j209560j226051m00304n32707o62245k08171
3366I1653469L28671Q2548M5515O32681J181109J184847J940207R91938J589327
3357I9630312Q90166J602588K310157K535961J386822J923746K279334K646474
3349A15205560K476859K737921K545466L523686L624648L692314M074457L911824
3341A41792735M906276N390105N403562N684458N505517N876914N487116N076774
3333A85123457M925745M237856L717794K193412J575316j25189r32082k678947
$$ plain form
3325 198037362 194021340 188296546 181988441 174619453 166757096 159253999 151640421 143714166
3317 143714166 135945676 128744143 122440469 116034060 109897862 105052535 100800835 96629601
3309 96629601 93231649 90215464 87566249 84546962 82469186 81125918 79585053 77657800
3301 77657800 76441579 75902737 75356563 74692032 73738999 73411202 73150483 73366324 74625021
3292 74625021 74981150 75340852 76185575 77343863 79403681 81631290 83998135 86400011 89280082
3283 89280082 92470472 95861415 100045907 104358394 108727138 113634332 118932317 124346461
3275 124346461 130817002 136679312 142190830 148090007 153836436 159524906 164715990 169102241
3267 169102241 172825614 176747582 179921464 181955992 183820182 184423490 184183368 183782559
$$ packed form
3325A98037362m016022n724794o308105p368988p862357p503097p613578p926255
3317A43714166p768490p201533o303674o406409o136198m845327m251700m171234
3309I6629601l397952l016185k649215l019287k077776j343268j540865j927253
3301G7657800j216221n38842n46174o64531r53033l27797k60719K15841J258697
3292G4625021L56129L59702Q44723J158288K059818K227609K366845K401876K880071
3283H9280082L190390L390943M184492M312487M368744M907194N297985N414144
3275A24346461O470541N862310N511518N899177N746429N688470N191084M386251
3267A69102241L723373L921968L173882K034528J864190O03308k40122m00809
$$ plain form
3259 183782559 182781981 181458875 180523279 179878433 179285785 178665042 178463970 178085193 177629639
3250 177629639 177680644 177785269 178055523 177173283 175009875 172943211 169955398 166085932 161177999
3241 161177999 155447310 149299721 142721585 135162595 127467470 120295645 112756118 105617152
3233 105617152 99206597 92616133 86764592 80785162 75238250 71181276 66902500 62650531
3225 62650531 59441245 56345401 53811656 50647915 48316170 46276531 43968757 41998856
3217 41998856 40631776 38892102 36923748 35801513 34953804 33673416 32400609 31467024
3209 31467024 29835774 28829988 27896257 27026906 26581243 25753574 24632987 23687356 23447171
3200 23447171 23367580 22564435 21967128 21464085 20964112 20446626 20262340 20012242 19938105 19456137
$$ packed form
3259A83782559j000578j323106r35596o44846n92648o20743k01072l78777m55554
3250A77629639N1005J04625K70254q82240k163408k066664k987813l869466m907933
3241A61177999n730689o147589o578136p558990p695125p171825p539527p138966
3233A05617152o410555o590464n851541n979430n546912m056974m278776m251969
3225F2650531l209286l095844k533745l163741k331745k039639k307774j969901
3217D1998856j367080j739674j968354j122235q47709j280388j272807r33585
3209C1467024j631250j005786r33731q69351m45663q27669j120587r45631k40185
3200B3447171p9591q03145n97307n03043m99973n17486j84286k50098p4137m81968
$$ plain form
3190 19456137 19152578 19049639 19497377 19176437 18595835 18677142 19113061 19081558 19053818 19185452
3180 19185452 19306427 19520109 20018459 20321580 20967235 21678733 21963946 22498823 23038362
3171 23038362 23995334 24714307 25044231 26257502 27120127 28937649 29792242 31066349 31668845
3162 31668845 32644396 33471263 34254025 35026434 35588291 36324961 36653002 37002649 37265367
3153 37265367 37383312 37590381 36803221 37426930 38260411 38319756 38758275 39260319 39823866 40377741
3143 40377741 41221816 41887016 42999748 44170730 45737779 46967760 48559545 49811803
3135 49811803 51780848 53093066 54204919 54737340 55030235 54297479 53322174 52853898 51034682
3126 51034682 48644001 45924427 43450382 41001121 38675919 36577541 34221421 32483097
$$ packed form
3190A9456137l03559j02939M47738l20940n80602Q1307M35919l1503k7740J31634
3180A9185452J20975K13682M98350L03121O45655P11498K85213N34877N39539
3171B3038362R56972P18973L29924J213271Q62625J817522Q54593J274107O02496
3162C1668845R75551Q26867P82762P72409N61857P36670L28041L49647K62718
3153C7265367J17945K07069p87160O23709Q33481N9345M38519N02044N63547N53875
3143D0377741Q44075O65200J112732J170982J567049J229981J591785J252258
3135D9811803J969045J312218J111853N32421K92895p32756r75305m68276j819216
3126E1034682k390681k719574k474045k449261k325202k098378k356120j738324
$$ plain form
3118 32483097 30637921 29809004 28877301 27453180 26597273 26199383 25636093 25364654 25762125
3109 25762125 25709224 25412256 25867638 25521841 25608929 25941288 25704539 25343712 25482776 25389421
3099 25389421 24539145 24317020 23596073 23111104 22331354 20976668 19540812 18101686 17313378
3090 17313378 16024323 14712387 13853978 12716068 11770981 11408305 11269790 10914475 10138344
3081 10138344 9923856 9230197 8751597 8451678 8457393 8029657 7604897 7247976 6795024 6852694
3071 6852694 6963686 7116258 6967559 6790729 6729006 6381497 6025539 6053553 6136095 6120045
3061 6120045 6235919 5770808 5470128 5185799 5387020 5343735 5969088 5990309 5132287 5598896
3051 5598896 4794490 4346511 4627850 4805612 4631379 5018837 4823339 4201008 4324320 4407217
$$ packed form
3118C2483097j845176q28917r31703j424121q55907l97890n63290k71439L97471
3109B5762125n2901k96968M55382l45797Q7088L32359k36749l60827J39064r3355
3099B5389421q50276k22125p20947m84969p79750j354686j435856j439126p88308
3090A7313378j289055j311936q58409j137910r45087l62676j38515l55315p76131
3081A0138344k14488o93659m78600k99919N715m27736m24760l56921m52952N7670
3071F852694J10992J52572j48699j76830o1723l47509l55958K8014Q2542j6050
3061F120045J15874m65111l00680k84329K01221m3285O25353K1221q58022M66609
3051E598896q04406m47979K81339J77762j74233L87458j95498o22331J23312Q2897
$$ plain form
3041 4407217 4271956 4172631 3872657 3558901 3440458 3180625 3309127 3379534 3133602 3392699
3031 3392699 3227676 3280584 3296274 3324530 3149526 2624561 3010525 3167081 2287303 2248286
3021 2248286 2291950 2411886 2399947 2293125 2590729 3063792 3618422 3516318 3707930 3891277
3011 3891277 4211920 3617287 2652752 2689964 3079213 3498682 3678850 3465854 3765390 4476752
3001 4476752 3990123 4074315 4103189 3985808 3852055 3057788 2797207 2658887 2741819 2628440
2991 2628440 2898022 3447160 2927976 2938379 3086277 2640282 2517457 2455170 2267117 2567628
2981 2567628 2852016 2990800 3042057 3389858 3288616 3850074 3788136 3532256 4060552 3873052
2971 3873052 3552839 3300988 3066462 2459516 2499037 2739151 2738452 2370729 2437530 1929794
$$ packed form
3041D407217j35261r9325k99974l13756j18443k59833J28502P0407k45932K59097
3031C392699j65023N2908J5690K8256j75004n24965L85964J56556q79778l9017
3021B248286M3664J19936j1939j06822K97604M73063N54630j02104J91612J83347
3011C891277L20643n94633r64535L7212L89249M19469J80168k12996K99536P11362
3001D476752m86629Q4192K8874j17381j33753p94267k60581j38320Q2932j13379
2991B628440K69582N49138n19184J0403J47898m45995j22825o2287j88053L00511
2981B567628K84388J38784N1257L47801j01242N61458o1938k55880N28296j87500
2971C873052l20213k51851k34526o06946L9521K40114o99l67723O6801n07736
$$ plain form
2961 1929794 2234648 2411626 1924461 2189376 1720106 691926 717032 1408043 1695432 1503320
2951 1503320 1471078 1062555 1112412 756377 709667 641710 952219 850738 670404 964458
2941 964458 1398860 1316925 592182 720835 919223 861322 759375 627435 351848 962829
2931 962829 1122024 873909 445434 296832 113386 610430 946819 791804 334960 363199
2921 363199 259487 633436 682542 162200 65581 553846 636500 131609 281062 626329
2911 626329 214439 106884 517400 393055 449910 198954 110235 411681 276740 264780
2901 264780 25764 149529 248112 369395 91484 -259963 -20308 229408 -111447 -333264
2891 -333264 283232 565757 453845 116833 66696 -157410 88144 421521 378473 498701
$$ packed form
2961A929794L04854J76978m87165K64915m69270j028180K5106O91011K87389j92112
2951A503320l2242m08523M9857l56035m6710o7957L10509j01481j80334K94054
2941I64458M34402q1935p24743J28653J98388n7901j01947j31940k75587O10981
2931I62829J59195k48115m28475j48602j83446M97044L36389j55015m56844K8239
2921C63199j03712L73949M9106n20342r6619M88265Q2654n04891J49453L45267
2911F26329m11890j07555M10516j24345N6855k50956q8719L01446j34941j1960
2901B64780k39016J23765R8583J21283k77911l51447K39655K49716l40855k21817
2891c33264O16496K82525j11912l37012n0137k24106K45554L33377m3048J20228
$$ plain form
2881 498701 -26637 -527832 202883 430059 309234 209306 155584 -88236 -10631 -118857
2871 -118857 -252411 12184 -296964 -618775 -962661 -354160 243128 135670 196243 302004
2861 302004 88966 313192 48969 379555 132568 400226 515919 518546 925812 607774
2851 607774 494933 229560 -39724 -20554 458974 299613 423250 690685 746346 139508
2841 139508 348137 524475 269509 -448890 -973012 -887605 -705746 -77620 156278 -71627
2831 -71627 -284386 306254 363604 935661 604059 65167 448126 162947 599649 241428
2821 241428 -199245 6478 778801 562970 374842 302057 226823 -27852 -155036 -410319
2811 -410319 43886 -295732 -13466 -309146 -2270 343961 -40400 -202995 -132444 142916
$$ packed form
2881D98701n25338n01195P30715K27176j20825r9928n3722k43820P7605j08226
2871a18857j33554K64595l09148l21811l43886O08501N97288j07458O0573J05761
2861C02004k13038K24226k64223L30586k46987K67658J15693K627M07266l18038
2851F07774j12841k65373k69284J9170M79528j59361J23637K67435N5661o06838
2841A39508K08629J76338k54966p18399n24122Q5407J81859O28126K33898k27905
2831g1627k12759N90640N7350N72057l31602n38892L82959k85179M36702l58221
2821B41428m40673K05723P72323k15831j88128p2785p5234k54675j27184k55283
2811d10319M54205l39618K82266k95680L06876L46231l84361j62595P0551K75360
$$ plain form
2801 142916 276978 1870 -98921 416317 -49012 75016 366921 490957 40401 -471900
2791 -471900 -791896 -375594 254883 212207 -844712 -77042 -115021 124727 559905 -482840
2781 -482840 -750238 -1107541 -687603 -852050 -239499 159952 -517610 -386248 -343592 -1067823
2771 -1067823 -1001880 -846273 -228860 139862 -96746 -143677 650675 829424 -295228 -357280
2761 -357280 -305208 -285060 -284716 -391429 -388155 131172 355922 464008 -192468 -334534 -756526
2750 -756526 -171835 124298 -45719 -76132 414008 358134 239104 672407 335633 230685
2740 230685 593181 485300 88306 -290422 -150838 -96450 -580442 -52791 683633 -1432
2730 -1432 -5747 -30122 -431022 -237170 443753 -146186 31370 317835 171387 119013 413436
$$ packed form
2801A42916J34062k75108j00791N15238m65329J24028K91905J24036m50556n12301
2791d71900l19996M16302O30477m2676j056919P67670l7979K39748M35178j042745
2781d82840k67398l57303M19938j64447O12551L99451o77562J31362M2656p24231
2771a067823O5943J55607O17413L68722k36608m6931P94352J78749j124652o2052
2761c57280N2072K0148L44j06713L274N19327K24750J08086o56476j42066m21992
2750g56526N84691K96133j70017l0413M90140n5874j19030M33303l36774j04948
2740B30685L62496j07881l96994l78728J39584N4388m83992N27651P36424o85065
2730a432m315k4375m00900J93852O80923n89939J77556K86465j46448n2374K94423
$$ plain form
2719 413436 82920 -481480 160492 411893 588497 244067 281269 -308806 -371327 620795
2709 620795 339640 -115078 325603 468737 108404 -162996 -373226 49602 213183 146469
2699 146469 -63631 -490429 -453030 -864683 -998966 -767890 -527753 62192 407787 -15124
2689 -15124 -392744 -458828 259181 325223 -222118 -186883 163213 -64373 -662700 -645165 -424140
2678 -424140 -467743 22948 523164 258179 -427833 -644796 -822814 -369260 -190291 198772
2668 198772 -235542 -699657 -1129456 -652621 -826754 -406444 226952 204558 -613950 -289578
2658 -289578 -141744 -417426 -459629 -561975 102267 8179 -464324 -621455 -219299 -426994
2648 -426994 -191056 -197247 -41001 4960 281817 -360816 -567083 -633228 -642137 -479215 -283760
$$ packed form
2719D13436l30516n64400O41972K51401J76604l44430L7202n90075o2521R92122
2709F20795k81155m54718M40681J43134l60333k71400k10230M22828J63581o6714
2699A46469k10100m26798L7399m11653j34283K31076K40137N89945L45595m22911
2689a5124l77620o6084P18009O6042n47341L5235L50096k27586n98327J7535K21025
2678d24140m3603M90691N00216k64985o86012k16963j78018M53554J78969L89063
2668A98772m34314m64115m29799M76835j74133M20310O33396k2394q18508L24372
2658b89578J47834k75682m2203j02346O64242r4088m72503j57131M02156k07695
2648d26994K35938o191J56246M5961K76857o42633k06267o6145q909J62922J95455
$$ plain form
2637 -283760 -176049 -245266 87192 -6560 53425 -135803 319863 454735 -2372 -299256
2627 -299256 -588397 -537758 -26751 -278051 112 4564 49340 240458 -397540 -630267
2617 -630267 -754149 -268301 -83049 224671 309465 67480 -461890 443512 845288 977891
2607 977891 517815 673123 640538 525216 1354455 1798355 1861526 1530641 1410768 1256004
2597 1256004 1561651 1985242 2478699 2892446 3278581 2678005 2377406 2622508 2619354 2179536
2587 2179536 1879923 1715874 1881526 1672769 1652826 1140595 631751 627233 239899 237877
2577 237877 128838 344814 430307 288098 -30932 342376 643225 714068 821452 716809
2567 716809 510145 616273 709457 257441 -369526 -158714 244290 451540 715785 464171
$$ packed form
2637b83760J07711o9217L32458r3752N9985j89228M55666J34872m57107k96884
2627b99256k89141N0639N11007k51300K78163M452M4776J91118o37998k32727
2617f30267j23882M85848J85252L07720Q4794k41985n29370R05402M01776J32603
2607I77891m60076J55308l2585j15322Q29239M43900O3171l30885j19873j54764
2597A256004L05647M23591M93457M13747L86135o00576l00599K45102l154m39818
2587B179536k99613j64049J65652k08757j9943n12231n08844m518l87334k022
2577B37877j09039K15976Q5493j42209l19030L73308L00849P0843J07384j04643
2567G16809k06664J06128R3184m52016o26967K10812M03004K07250K64245k51614
$$ plain form
2557 464171 247984 566808 499304 255647 -172613 168104 62436 -260584 -149010 -45246
2547 -45246 262779 480267 690457 529156 298467 330650 272847 -44953 342950 347991 -158258
2536 -158258 374565 598856 156518 149603 166588 -89568 236119 282190 -23260 -173799
2526 -173799 -189365 46514 -110899 -141952 -118430 -98192 -227291 -30679 662919 577527 111907
2515 111907 79271 -393036 -41016 20854 179805 -170678 56599 -275333 81711 865601
2505 865601 418343 -96765 382469 519108 720540 672098 463397 327219 115453 482341
2495 482341 532176 -176914 202753 201329 -172345 638831 394192 231369 327172 481525
2485 481525 651489 820608 646757 998289 849604 819277 595003 950666 704414 256055
$$ packed form
2557D64171k16187L18824o7504k43657m28260L40717j05668l23020J11574J03764
2547d5246L08025K17488K10190j61301k30689L2183n7803l17800L87903N041n06249
2536a58258N32823K24291m42338o915J6985k56156L25687M6071l05450j50539
2526a73799j5566K35879j57413l1053K3522K0238j29099J96612O93598q5392m65620
2515A11907l2636m72307L52020O1870J58951l50483K27277l31932L57044P83890
2505H65601m47258n15108M79234J36639K01432m8442k08701j36178k11766L66888
2495D82341M9835p09090L79667j424l73674Q11176k44639j62823R5803J54353
2485D81525J69964J69119j73851L51532j48685l0327k24274L55663k46252m48359
$$ plain form
2475 256055 422774 225256 559456 279274 443945 732357 795491 476035 238259 267207
2465 267207 696566 798967 1046296 1526878 1664799 1589972 1454275 1785717 1681656 1922852
2455 1922852 1990260 1688957 1252955 1288456 1533805 2359896 2145696 1991216 2159756 1798141
2445 1798141 2027063 2100588 1509955 2109400 1864341 2248967 2581013 2238539 1700920 2603764
2435 2603764 3102727 3125925 3109496 2718178 2463744 3156659 3626223 3384207 3709826 3786462
2425 3786462 3305379 3115702 2730911 3403401 3958869 4109236 4067757 3386517 3670736 3766966
2415 3766966 4256425 4564293 4594164 5334620 5465369 4912268 4807581 5251198 5915603 6109820
2405 6109820 5878835 5336508 5998817 6202718 7165325 7385177 7520381 7610504 7915806 7789012
$$ packed form
2475B56055J66719j97518L34200k80182J64671K88412O3134l19456k37776K8948
2465B67207M29359J02401K47329M80582J37921p4827j35697L31442j04061K41196
2455A922852O7408l01303m36002L5501K45349Q26091k14200j54480J68540l61615
2445A798141K28922P3525n90633N99445k45059L84626L32046l42474n37619R02844
2435B603764M98963K3198j6429l91318k54434O92915M69564k42016L25619P6636
2425C786462m81083j89677l84791O72490N55468J50367m1479o81240K84219R6230
2415C766966M89459L07868K9871P40456J30749n53101j04687M43617O64405J94217
2405F109820k30985n42327O62309K03901R62607K19852J35204R0123L05302j26794
$$ plain form
2395 7789012 7903197 7763328 8027889 8561199 8932749 8828187 9390064 9152677 9626698 9998183
2385 9998183 10177234 10190925 10991083 12020748 12304407 12605907 12710292 13306934 13804327 14321882
2375 14321882 14792686 15200626 15360806 15502453 15835582 16859439 17692576 18453262 19227987
2366 19227987 20085336 20154470 20298517 21703871 23169182 24029935 24818159 26260599 28046764
2357 28046764 29763936 31983505 33614442 35602971 38800985 42624584 46252238 50323349
2349 50323349 55287460 60912701 66976706 73956441 82411334 91874050 102992895 114140365
2341 114140365 126359577 142053580 160837476 182953571 208022549 232359408 256160641
2334 256160641 281917714 310836629 344803178 379107117 411747364 441174433 465811547
$$ packed form
2395G789012J14185j39869K64561N33310L71550j04562N61877k37387M74021L71485
2385I998183J79051J3691Q00158J029665K83659L01500J04385N96642M97393N17555
2375A4321882M70804M07940J60180J41647L33129J023857Q33137P60686P74725
2366A9227987Q57349O9134J44047J405354J465311Q60753P88224J442440J786165
2357B8046764J717172K219569J630937J988529L198014L823599L627654M071111
2349E0323349M964111N625241O064005O979735Q454893R462716J1118845J1147470
2341A14140365J2219212J5694003J8783896K2116095K5068978K4336859K3801233
2334B56160641K5757073K8918915L3966549L4303939L2640247K9427069K4637114
$$ plain form
2327 465811547 478958433 482078245 479766877 473489198 457775756 425928537 383479444
2320 383479444 337909650 297250650 263930038 232576015 202107021 173520150 147473497
2313 147473497 124421368 104065726 87529511 74536594 64725473 55953100 48103134
2306 48103134 41518587 36544114 32163277 28224967 25173617 22370095 19817807 18351668
2298 18351668 16923519 15252114 13610930 12454133 11191441 10700369 9911079 9142343 8322778
2289 8322778 7155918 6425324 5713599 5644715 5425439 4658052 4699992 4396869 4306451 3976490
2279 3976490 3439869 3093282 2550813 2975526 3166227 2910935 2241335 2407290 2208954 2699701
2269 2699701 2581639 2126887 1726515 1292432 1859365 1845929 1371688 1305994 1026944 1038174
$$ packed form
2327D65811547J3146886L119812k311368o277679j5713442l1847219m2449093
2320C83479444m5569794m0659000l3320612l1354023l0468994k8586871k6046653
2313A47473497k3052129k0355642j6536215j2992917r811121q772373p849966
2306D8103134o584547m974473m380837l938310l051350k803522k552288j466139
2298A8351668j428149j671405j641184j156797j262692m91072p89290p68736q19565
2289H322778j166860p30594p11725o8884k19276p67387M1940l03123r0418l29961
2279C976490n36621l46587n42469M24713J90701k55292o69600J65955j98336M90747
2269B699701j18062m54752m00372m34083N66933j3436m74241o5694k79050J1230
$$ plain form
2259 1038174 1151507 1601600 880518 790677 568154 519657 495506 673038 390736 614435
2249 614435 265458 280170 -272317 -177055 198144 885621 1614062 831911 1021085 663205
2239 663205 983949 763836 715404 1309675 1117819 714603 518758 172690 351509 -52970
2229 -52970 485093 814949 917334 474456 223130 305203 229447 145581 141495 222184 165957
2218 165957 602448 168382 386191 184574 -648087 -362894 -418404 25300 76678 67100
2208 67100 -265845 -220300 -224331 -44990 -66948 521882 873230 397964 203447 -45635 -143296
2197 -143296 -132241 -91607 -357414 -582095 -265402 -782874 -617871 -407710 -263923 -102065
2187 -102065 -393263 -664835 -839809 -237141 -232308 -267086 -196366 -272246 -765442 -767162 -406910
$$ packed form
2259A038174J13333M50093p21082q9841k22523m8497k4151J77532k82302K23699
2249F14435l48977J4712n52487R5262L75199O87477P28441p82151J89174l57880
2239F63205L20744k20113m8432N94271j91856m03216j95845l46068J78819m04479
2229e2970N38063L29856J02385m42878k51326Q2073p5756q3866m086Q0689n6227
2218A65957M36491m34066K17809k01617q32661K85193n5510M43704N1378r578
2208F7100l32945M5545m031J79341k1958N88830L51348m75266j94517k49082r7661
2197a43296J1055M0634k65807k24681L16693n17472J65003K10161J43787J61858
2187a02065k91198k71572j74974O02668M833l4778P0720p5880m93196j720L60252
$$ plain form
2176 -406910 -278262 8661 -235863 -414328 -653637 -320994 -662594 -876994 -975311 -1257323
2166 -1257323 -1397092 -750090 -595960 -80128 -277283 -192941 270104 -100352 -225920 -770597
2156 -770597 -260577 -243987 -643317 -869591 -842105 -272749 -732636 -640809 -432194 -868161
2146 -868161 -279300 -282533 -524376 -987011 -665247 -210041 -192579 36987 263394 184933
2136 184933 -236081 -497053 126825 -229871 -13236 374411 -479060 -203640 -104707 -400034
2126 -400034 -699442 -406157 40593 -354046 -577327 -918258 -968092 -1283081 -1200602 -1042880
2116 -1042880 -908714 -790344 -352136 -548060 -985659 -740116 -559001 -793200 -189965 -704310
2106 -704310 -910551 -1258619 -1480854 -851051 -436523 -492557 -279937 105918 -130728 -429119
$$ packed form
2176d06910J28648K86923k44524j78465k39309L32643l41600k14400r8317k82012
2166a257323j39769O47002J54130N15832j97155Q4342M63045l70456j25568n44677
2156g70597N10020J6590l99330k26274K7486N69356m59887R1827K08615m35967
2146h68161N88861l233k41843m62635L21764M55206J7462K29566K26407p8461
2136A84933m21014k60972O23878l56696K16635L87647q53471K75420R8933k95327
2126d00034k99408K93285M46750l94639k23281l40931m9834l14989Q2479J57722
2116a042880J34166J18370M38208j95924m37599K45543J81115k34199O03235n14345
2106g04310k06241l48068k22235O29803M14528n6034K12620L85855k36646k98391
$$ plain form
2096 -429119 -634648 -507431 -585972 -543770 -356603 -105521 -542564 -603987 -755906 -845952
2086 -845952 -694376 -691127 -364162 -155934 -500183 -564356 -676831 -720602 -940992 -1514273
2076 -1514273 -911157 -445788 -530640 -626086 -521964 20802 116351 323979 689809 521024
2066 521024 589883 852068 1353840 1234682 1829538 1802687 1754207 1626040 1475548 2136298
2056 2136298 2202839 1784333 1608228 1837804 1723187 1219225 714109 1039588 903612 734479
2046 734479 1149477 1012256 238327 348489 -105311 -49177 36764 260431 177056 -398783
2036 -398783 -211544 -183167 -572119 -780068 -1033617 -775208 -659278 -726391 -553960 -953504
2026 -953504 -870652 -1317161 -758550 371409 289712 -339235 -323769 -190483 -504350 -742826
$$ packed form
2096d29119k05529J27217p8541M2202J87167K51082m37043o1423j51919r0046
2086h45952J51576L249L26965K08228l44249o4173j12475m3771k20390n73281
2076a514273O03116M65369q4852r5446J04122N42766R5549K07628L65830j68785
2066E21024O8859K62185N01772j19158N94856k6851m8480j28167j50492O60750
2056B136298O6541m18506j76105K29576j14617n03962n05116L25479j35976j69133
2046G34479M14998j37221p73929J10162m53800N6134Q5941K23667q3375n75839
2036c98783J87239K8377l88952k07949k53549K58409J15930o7113J72431l99544
2026i53504Q2852m46509N58611J129959q1697o28947J5466J33286l13867k38476
$$ plain form
2016 -742826 -712758 -689663 -614585 -442956 -958300 -837651 -688208 -570154 -532303 -662294
2006 -662294 -808710 -715738 -1124036 -880572 -1033849 -1135353 -660392 -234229 -296982 -717701
1996 -717701 -638541 -517037 -618782 -498323 -162488 -119934 -104086 -196144 -544594 -840605
1986 -840605 -807238 -699985 -620756 -421959 -397766 -230529 -109630 -268601 -868688 -940700
1976 -940700 22287 -158486 -899090 -940310 -1029835 -1189206 -1592142 -1389825 -1087793 -1256878
1966 -1256878 -1036106 -1198757 -1467270 -1171894 -721295 -1147071 -1417283 -1481867 -1120754 -1096312
1956 -1096312 -873383 -1069006 -1243363 -1251412 -1118748 -993205 -986846 -977082 -960780 -752495 -1042391
1945 -1042391 -1173469 -1209851 -1021926 -1158730 -1497435 -1457319 -1469550 -1325292 -1697248 -961478
$$ packed form
2016g42826L0068K3095P5078J71629n15344J20649J49443J18054L7851j29991
2006f62294j46416R2972m08298K43464j53277j01504M74961M26163o2753m20719
1996g17701P9160J21504j01745J20459L35835M2554J5848r2058l48450k96011
1986h40605L3367J07253P9229J98797K4193J67237J20899j58971o00087p2012
1976i40700R62987j80773p40604m1220q9525j59371m02936K02317L02032j69085
1966a256878K20772j62651k68513K95376M50599m25776k70212o4584L61113K4442
1956a096312K22929j95623j74357q049J32664J25543O359R764J6302K08285k89896
1945a042391j31078l6382J87925j36804l38705M0116j2231J44258l71956P35770
$$ plain form
1935 -961478 -484114 -672689 -527996 -550468 -743981 -1170657 -1026309 -1535095 -1452442 -1292947
1925 -1292947 -1301466 -1292461 -931454 -876672 -886501 -796347 -618192 -910249 -266322 -119784 -408092
1914 -408092 -472591 -609774 -508051 -653478 -1260922 -868297 -525426 -773688 -745604 -784065
1904 -784065 -563095 -354856 -590249 -781581 -546086 105204 72112 -438521 -291815 -15526
1894 -15526 -121635 -509451 -647988 -1063065 -447835 -613171 -741040 -496613 -648329 -324651
1884 -324651 -474180 -652874 -662838 -769259 -1002586 -908403 -578652 -420132 -556498 -933089
1874 -933089 -733561 -643607 -227109 -181249 -289348 -515852 -137862 -450527 -433991 -157434
1864 -157434 -99011 -536629 -721851 -778143 -757345 -782249 -846633 -826062 -846345 -1546565 -1573453
$$ packed form
1935i61478M77364j88575J44693k2472j93513m26676J44348n08786Q2653J59495
1925a292947q519R005L61007N4782r829R0154J78155k92057O43927J46538k88308
1914d08092o4499j37183J01723j45427o07444L92625L42871k48262K8084l8461
1904g84065K20970K08239k35393j91332K35495O51290l3092n10633J46706K76289
1894a5526j06109l87816j38537m15077O15230j65336j27869K44427j51716L23678
1884c24651j49529j78694r964j06421k33327R4183L29751J58520j36366l76591
1874i33089J99528Q9954M16498M5860j08099k26504L77990l12665J6536K76557
1864a57434N8423m37618j85222n6292K0798k4904o4384K0571k0283p00220k6888
$$ plain form
1853 -1573453 -1494689 -1357717 -913543 -637214 -783647 -1170197 -1122632 -755129 -1125862 -960617
1843 -960617 -424509 -876061 -1018421 -1121924 -1008534 -1373633 -1581627 -1084971 -940702 -617386
1833 -617386 -603277 -566518 -431240 -636173 -883268 -1339102 -1392355 -1651196 -1569426 -1350029
1823 -1350029 -1341829 -619532 -797024 -568359 -701838 -569869 -827068 -825071 -824618 -905461 -1323888
1812 -1323888 -1370759 -994464 -966209 -395065 -898202 -1037595 -387419 -323141 -825676 -548345
1802 -548345 -1372630 -1303209 -1570701 -572662 -6852 -430853 -1128305 -643567 -903464 -737473
1792 -737473 -539167 -685579 -931517 -888426 -877923 -671332 -683789 -818540 -813256 -768983 -597863
1781 -597863 -568482 -275297 -55268 308371 13630 -355285 -333616 -292496 -554801 -411581
$$ packed form
1853a573453P8764J36972M44174K76329j46433l86550M7565L67503l70733J65245
1843i60617N36108m51552j42360j03503J13390l65099k07994M96656J44269L23316
1833f17386J4109L6759J35278k04933k47095m55834n3253k58841Q1770K19397
1823a350029Q200P22297j77492K28665j33479J31969k57199J997M53q0843m18427
1812a323888m6871L76295K8255N71144n03137j39393O50176O4278n02535K77331
1802e48345q24285O9421k67492R98039N65810m24001o97452M84738k59897J65991
1792g37473J98306j46412k45938M3091J0503K06591j2457j34751N284M4273J71120
1781e97863K9381K93185K20029L63639k94741l68915K1669M1120k62305J43220
$$ plain form
1771 -411581 -381165 -718574 -820076 -690155 -811333 -629991 -327010 104248 157850 -105086
1761 -105086 -785325 -435488 46758 -597489 -968500 -1205655 -627906 -454987 -454794 -195657
1751 -195657 78622 -121583 -280427 -1089220 -1774151 -1681338 -1163635 -1040103 -1189993 -1351881
1741 -1351881 -1205909 -1000927 -917842 -554020 -857505 -1101138 -1144472 -929210 -538466 -156324
1731 -156324 -564997 -638331 -406507 -450425 -164959 -444286 -290341 -296219 -868613 -941663 -1075213
1720 -1075213 -1234574 -496002 -126888 -430543 -628252 -726743 -59664 105046 -607484 -800037
1710 -800037 -764448 -1257171 -955864 -941442 -1297648 -1113537 -832551 -435678 -544899 -753109
1700 -753109 -86747 51944 104890 -158206 -421630 -955699 -452256 -580313 -875997 -223517
$$ packed form
1771d11581L0416l37409j01502J29921j21178J81342L02981M31258N3602k62936
1761a05086o80239L49837M82246o44247l71011k37155N77749J72919J93K59137
1751a95657K74279k00205j58844q08793o84931R2813N17703J23532j49890j61888
1741a351881J45972K04982Q3085L63822l03485k43633m3334K15262L90744L82142
1731a56324m08673p3334K31824m3918K85466k79327J53945n878n72394p3050j33550
1720a075213j59361P38572L69114l03655j97709r8491O67079J64710p12530j92553
1710h00037L5589m92723L01307J4422l56206J84111K80986L96873j09221k08210
1700g53109O66362J38691N2946k63096k63424n34069N03443j28057k95684O52480
$$ plain form
1690 -223517 -285205 -549565 -504092 -612498 -585388 -738431 -618178 -857927 -1114038 -863513
1680 -863513 -886646 -1102568 -1152049 -1489232 -1087802 -803575 -799766 -887544 -647498 -644764 -439696
1669 -439696 -463195 -665336 -1004715 -1146663 -1138646 -840804 -632348 -251183 -532837 -708101
1659 -708101 -522523 -679517 -529698 -318460 -688506 -826611 -135764 31599 -185090 -73604
1649 -73604 35643 -1078727 -864721 -1044539 -1253373 -432324 -904900 -859416 -620403 -731444
1639 -731444 -282442 -513717 -836550 -465045 -592193 -853045 -431882 -807184 -611064 -673842
1629 -673842 -638638 -552109 -672793 -639483 -867520 -708031 -529479 -858213 -981895 -1224276
1619 -1224276 -965665 -946759 -673296 -758262 -1121139 -562021 -856933 -583256 -370751 -892352
$$ packed form
1690b23517o1688k64360M5473j08406K7110j53043J20253k39749k56111K50525
1680h63513k3133k15922m9481l37183M01430K84227L809q7778K40046K734K05068
1669d39696k3499k02141l39379j41948Q017K97842K08456L81165k81654j75264
1659g08101J85578j56994J49819K11238l70046j38105O90847J67363k16689J11486
1649g3604J09247j114370K14006j79818k08834Q21049m72576M5484K39013j11041
1639g31444M49002k31275l22833L71505j27148k60852M21163l75302J96120o2778
1629f73842L5204Q6529j20684L3310k28037J59489J78552l28734j23682k42381
1619a224276K58611J8906K73463q4966l62877N59118k94912K73677K12505n21601
$$ plain form
1609 -892352 -514270 -811813 -1183462 -1071272 -1053553 -421633 -186518 -427172 -939223 -554647
1599 -554647 -1080198 -1251258 -929329 -642455 -339959 -875544 -334312 -476904 -525536 -286816
1589 -286816 28658 -46811 -488896 -721787 -607723 -528680 -478953 -1099264 -952501 -1041235
1579 -1041235 -447923 -450317 -708431 -127961 -347539 -385980 -549892 -782033 -1064948 -1149306
1569 -1149306 -547824 -430938 -743092 -785200 -501839 -653239 -763732 -516125 -764976 -650813
1559 -650813 -365324 -770252 -510341 -46933 -313567 -2167 -130340 -757075 -740846 -615479
1549 -615479 -905871 -1127981 -842017 -932596 -976576 -1558758 -1372814 -303123 -287599 -1280078
1539 -1280078 -1532770 -607947 -791895 -1033159 -815137 -612584 -907738 -888620 -461936 -673174
$$ packed form
1609h92352L78082k97543l71649J12190J7719O31920K35115k40654n12051L84576
1599e54647n25551j71060L21929K86874L02496n35585N41232j42592m8632K38720
1589b86816L15474p5469m42085k32891J14064P9043M9727o20311J46763q8734
1579a041235N93312k394k58114N80470k19578l8441j63912k32141k82915q4358
1569a149306O01482J16886l12154m2108K83361j51400j10493K47607k48851J14163
1559f50813K85489m04928K59911M63408k66634L11400j28173o26735J6229J25367
1549f15479k90392k22110K85964r0579m3980n82182J85944J069691J5524r92479
1539a280078k52692R24823j83948k41264K18022K02553k95154J9118M26684k11238
$$ plain form
1529 -673174 -199738 53510 -37248 -449646 -1042290 -1006721 -967744 -796991 -811041 -77812
1519 -77812 -484401 -762645 -279435 -543286 -154086 -316339 -567555 -551018 -26184 -483629
1509 -483629 -249409 -581374 -948598 -431235 -194199 -229442 -857433 -1176385 -594495 -240274
1499 -240274 -754027 -399978 -614143 -866201 -1286873 -1020002 -1001369 -980302 -820084 -1058403
1489 -1058403 -1004548 -669513 -368302 -1169859 -1020557 -267372 -781704 -809164 -1636247 -851391
1479 -851391 -528167 -699544 -605157 -807066 -975778 -1123981 -477469 -668670 -928670 -979474
1469 -979474 -1275826 -745976 -645274 -971221 -1110983 -623197 -852146 -1379979 -890349 -808801
1459 -808801 -1386452 -809408 -543172 -325244 -954882 -698008 -784131 -1284465 -1048261 -489722
$$ packed form
1529f73174M73436K53248r0758m12398n92644L5569L8977J70753j4050P33229
1519g7812m06589k78244M83210k63851L89200j62253k51216J6537N24834m57445
1509d83629K34220l31965l67224N17363K37036l5243o27991l18952N81890L54221
1499b40274n13753L54049k14165k52058m20672K66871J8633K1067J60218k38319
1489a058403N3855L35035L01211q01557J49302P53185n14332k7460q27083P84856
1479h51391L23224j71377R4387k01909j68712j48203O46512j91201k60000n0804
1469i79474k96352N29850J00702l25947j39762M87786k28949n27833M89630Q1548
1459h08801n77651N77044K66236K17928o29638K56874q6123n00334K36204N58539
$$ plain form
1449 -489722 348666 472770 -98033 -555527 -904342 -1085092 -852075 -660862 -926371 -995580
1439 -995580 -763757 -1252109 -995961 -928899 -1201325 -847426 -597955 -798080 -927542 -1522794
1429 -1522794 -1428829 -1238772 -909434 -960283 -990316 -1146246 -1264338 -1456898 -1312987 -713035
1419 -713035 -329959 -264122 -688271 -899507 -1215164 -1101505 -496945 -422894 -303105 -87456
1409 -87456 -104484 -580465 -777212 -1142145 -928366 -579398 -919157 -773666 -415317 -434211
1399 -434211 -1140632 -1030328 -544121 -546425 -944051 -811012 -534015 -607202 -321624 -638765
1389 -638765 -286126 -588990 -1055160 -1003179 -674455 -687283 -1227678 -960575 -427219 -154007
1379 -154007 -384988 -670238 -1022305 -674483 -309184 -975481 -961071 -103051 -387429 -695809
$$ packed form
1449d89722Q38388J24104n70803m57494l48815j80750K33017J91213k65509o9209
1439i95580K31823m88352K56148O7062k72426L53899K49471k00125j29462n95252
1429a522794R3965J90057L29338n0849l0033j55930j18092j92560J43911N99952
1419g13035L83076O5837m24149k11236l15657J13659O04560P4051J19789K15649
1409h7456j7028m75981j96747l64933K13779L48968l39759J45491L58349j8894
1399d34211p06421J10304M86207k304l97626J33039K76997p3187K85578l17141
1389f38765L52639l02864m66170N1981L28724j2828n40395K67103N33356K73212
1379a54007k30981k85250l52067L47822L65299o66297J4410Q58020k84378l08380
$$ plain form
1369 -695809 -126318 -350822 -231469 -320443 -321735 -718087 -735173 -947983 -479175 -741069
1359 -741069 -646748 -869851 -985369 -710254 -429245 -367665 -375807 -240060 -185580 -297467 -561379
1348 -561379 -458683 -573673 -737929 -845898 -831716 -219282 -334731 -729687 -829163 -693684
1338 -693684 -223743 -312320 -565721 -850090 -885056 -539034 -605955 -952700 -391170 -225513
1328 -225513 -391428 -806091 -599443 -469033 -873096 -1194225 -659664 -605579 -629192 -547283
1318 -547283 -882756 -986261 -981764 -1000371 -1106450 -674437 -713480 -808494 -965524 -776862 -272844
1307 -272844 -667394 -760986 -427340 -876703 -1282911 -838797 -573662 -361538 -658031 -606534
1297 -606534 -500877 -616583 -777147 -564456 -838187 -446794 -698363 -1026004 -893995 -957507
$$ packed form
1369f95809N69491k24504J19353q8974j292l96352j7086k12810M68808k61894
1359g41069R4321k23103j15518K75115K81009O1580q142J35747N4480j11887k63912
1348e61379J02696j14990j64256j07969J4182O12434j15449l94956r9476J35479
1338f93684M69941q8577k53401k84369l4966L46022o6921l46745N61530J65657
1328b25513j65915m14663K06648J30410m04063l21129N34561N4085k3613Q1909
1318e47283l35473j03505M497j8607j06079M32013l9043r5014j57030J88662N04018
1307b72844l94550r3592L33646m49363m06208M44114K65135K12124k96493N1497
1297f06534J05657j15706j60564K12691k73731L91393k51569l27641J32009o3512
$$ plain form
1287 -957507 -1003493 -137671 -161041 -747014 -1006243 -235597 -639070 -674071 -375513 -395951
1277 -395951 -198457 -311183 -699262 -505915 -613335 -557070 -241060 -385197 303310 123808
1267 123808 -247654 -385856 -430659 -595961 -370790 -870293 -1403334 -637411 -337293 -589981
1257 -589981 -229365 -271526 -932461 -1133574 -872718 -164323 -205007 -969027 -1107359 -401695
1247 -401695 -423520 -672625 -464718 -302092 -950116 -1435316 -735266 -793911 -551854 -558847
1237 -558847 -523267 -409847 -535655 -918786 -631221 -283536 -344782 -163476 -245204 -403762
1227 -403762 -432395 -388432 -692065 -1000989 -977750 -1283099 -704202 -107683 -488868 -869220
1217 -869220 -941777 -746689 -368558 -858471 -620493 -558745 -1027027 -850571 -1163872 -781125
$$ packed form
1287i57507m5986Q65822k3370n85973k59229P70646m03473l5001K98558k0438
1277c95951J97494j12726l88079J93347j07420N6265L16010j44137O88507j79502
1267A23808l71462j38202m4803j65302K25171m99503n33041P65923L00118k52688
1257e89981L60616m2161o60935k01113K60856P08395m0684p64020j38332P05664
1247d01695k1825k49105K07907J62626o48024m85200P00050n8645K42057o993
1237e58847L5580J13420j25808l83131K87565L47685o1246J81306q1728j58558
1227d03762k8633M3963l03633l08924K3239l05349N78897N96519l81185l80352
1217h69220p2557J95088L78131m89913K37978O1748m68282J76456l13301L82747
$$ plain form
1207 -781125 -489997 -714033 -730304 -540390 -511995 -903271 -518528 -418664 -1058511 -1074795
1197 -1074795 -638387 -649384 -221634 -397042 -1110885 -853954 -477311 -776048 -721109 -762021
1187 -762021 -259131 -213030 -251430 -75401 -677532 -662687 -750435 -506822 -438389 -749003 -971878
1176 -971878 -1336100 -1309788 -810652 -785086 -1040758 -1141404 -1239510 -1197053 -1072198 -1013346 -733243
1165 -733243 -409175 -206262 -930122 -606609 -326743 -699800 -576167 -706019 48093 278436
1155 278436 -120157 -390050 -627649 -909252 -879245 -1041390 -706301 -156442 -187828 -1163359
1145 -1163359 -1392936 -1278361 -865770 -471561 -410985 -548549 -140292 -200325 -139886 -263753
1135 -263753 -1245609 -1349038 -1130971 -857792 -277161 -113292 -403405 -423249 -354803 -248626
$$ packed form
1207g81125K91128k24036j6271J89914K8395l91276L84743R9864o39847j6284
1197a074795M36408j0997M27750j75408p13843K56931L76643k98737N4939m0912
1187g62021N02890M6101l8400J76029o02131J4845q7748K43613O8433l10614k22875
1176i71878l64222K6312M99136K5566k55672j00646r8106M2457J24855N8852K80103
1165g33243L24068K02913p23860L23513K79866l73057J23633j29852P54112K30343
1155B78436l98593k69893k37599k81603L0007j62145L35089N49859l1386r75531
1145a163359k29577J14575M12591L94209O0576j37564M08257o0033O0439j23867
1135b63753r81856j03429K18067K73179N80631J63869k90113j9844O8446J06177
$$ plain form
1125 -248626 -534982 -380837 -770480 -1035725 -738592 -349319 -388222 -262768 -510172 -653915
1115 -653915 -710919 -921467 -489668 -1356501 -1414128 -546773 -464279 -661284 -653786 -491119 -882823
1104 -882823 -619938 -345513 -485453 -538486 -377573 -778884 -417195 -318368 -507739 -161558
1094 -161558 -275787 -489870 -899356 -1218173 -1039900 -681468 66951 -139756 -955230 -29
1084 -29 -398676 -359454 -127500 -764822 -409978 -737352 -756287 -331436 -225258 -789246 -634377
1073 -634377 -77020 -306814 -1105737 -1421120 -958943 -731243 -291670 -9837 -536220 -581238
1063 -581238 -134993 -25981 -166903 -68258 -611561 -642862 -595908 -930854 -764334 -478926
1053 -478926 -752026 -819826 -1282198 -1367786 -1133856 -1236349 -842858 -235270 -165288 -329278
$$ packed form
1125b48626k86356J54145l89643k65245K97133L89273l8903J25454k47404j43743
1115f53915n7004k10548M31799q66833n7627Q67355Q2494j97005P498J62667l91704
1104h82823K62885K74425j39940n3033J60913m01311L61689R8827j89371L46181
1094a61558j14229k14083m09486l18817J78273L58432P48419k06707q15474R55201
1084b9l98647L9222K31954o37322L54844l27374j8935M24851J06178n63988J54869
1073f34377N57357k29794p98923l15383M62177K27700M39573K81833n26383m5018
1063e81238M46245J09012j40922R8645n43303l1301M6954l34946J66520K85408
1053d78926k73100o7800m62372q5588K33930j02493L93491O07588O9982j63990
$$ plain form
1043 -329278 -944687 -883894 -974061 -884914 -309368 -48337 -252679 -489259 -347985 -501575
1033 -501575 -213393 160689 -37560 -222317 -15766 -468258 -128747 112890 -402237 -478736
1023 -478736 -511343 -709491 -336515 -334080 -453812 -973115 -922781 -748609 -837072 -361651 -669285
1012 -669285 -582178 -316542 -507637 -580215 -638675 -984817 -1078765 -880548 -540302 -266247
1002 -266247 -634234 -334611 -413667 -775715 -920316 -962432 -746747 -662896 -559857 -184940
992 -184940 -743445 -803614 -259224 -385103 -576245 -483994 -969032 -1082368 -241714 -294300
982 -294300 -88125 -115644 -693356 -549538 7852 38358 -149347 -774253 -1099024 -443345
972 -443345 -340146 -228797 -358224 -643941 -269247 249717 -454063 -416409 -370231 -844921
$$ packed form
1043c29278o15409O0793r0167Q9147N75546K61031k04342k36580J41274j53590
1033e01575K88182L74082j98249j84757K06551m52492L39511K41637n15127p6499
1023d78736l2607j98148L72976K435j19732n19303N0334J74172q8463M75421l07634
1012f69285Q7107K65636j91095p2578n8460l46142r3948J98217L40246K74055
1002b66247l67987K99623p9056l62048j44601m2116K15685Q3851J03039L74917
992a84940n58505o0169N44390j25879j91142R2251m85038j13336Q40654n2586
982b94300K06175k7519n77712J43818N57390L0506j87705o24906l24771O55679
972d43345J03199J11349j29427k85717L74694N18964p03780L7654M6178m74690
$$ plain form
962 -844921 -1139749 -685659 -425079 -421095 -460224 -303629 -427194 -1106226 -733529 -705289 -1046671
951 -1046671 -884341 -515125 -440114 -234418 -159768 -51653 -176024 -303561 -597098 -777812
941 -777812 -711741 13297 295836 -354993 -476501 -342047 -963468 -1066717 92324 -424872
931 -424872 -1229163 -985602 -621207 -779105 -459649 -31586 139837 -207836 -560835 199038
921 199038 -139291 -312563 -445907 -806176 -938529 -761781 -502546 -370410 -215030 174318
911 174318 60796 -592462 -944945 -1203596 -1074231 -139110 132299 14297 -145094 -686389
901 -686389 -1320267 -947032 -1007804 -1159428 -943829 -1042955 -478358 -256205 173073 57525
891 57525 -356383 -678327 -1117841 -1249844 -728793 -292374 -661406 -662619 -653198 -915946 -523384
$$ packed form
962h44921k94828M54090K60580L984l9129J56595j23565o79032L72697K8240l41382
951a046671J62330L69216P5011K05696P4650J08115j24371j27537k93537j80714
941g77812O6071P25038K82539o50829j21508J34454o21421j03249J159041n17196
931d24872q04291K43561L64395j57898L19456M28063J71423l47673l52999P59873
921A99038l38329j73272j33344l60269j32353J76748K59235J32136J55380L89348
911A74318j13522o53258l52483k58651J29365R35121K71409j18002j59391n41295
901f86389o33878L73235o0772j51624K15599r9126N64597K22153M29278j15548
891E7525m13908l21944m39514j32003N21051M36419l69032j213R421k62748L92562
$$ plain form
880 -523384 -342370 -998255 -1140312 -756894 -475853 -993892 -953902 -830389 -624875 -588483
870 -588483 -817016 -736508 -317973 -360144 -442453 -636488 -1305166 -438512 -345659 -226633 -228328
859 -228328 -622302 -822543 -380982 -117204 110424 -179462 46553 -4752 -149776 102857
849 102857 -291758 -484081 -29377 -676042 -642867 -655284 -193420 110989 -302106 -836880
839 -836880 -994222 -277176 -412280 -693554 -794493 -79951 -265884 -587764 -640207 -950175
829 -950175 -1206695 -1041295 -992240 -158683 -283636 -245590 -604204 -949682 -703898 -393110
819 -393110 -799163 -707986 -407369 -411392 -293199 -288353 -456190 -320701 -7407 -655383 -565869
808 -565869 -267630 -1054149 -577980 -983469 -764682 -395599 -992286 -387452 -644790 -601498
$$ packed form
880e23384J81014o55885j42057L83418K81041n18039L9990J23513K05514L6392
870e88483k28533Q0508M18535m2171q2309j94035o68678Q66654R2853J19026j695
859b28328l93974k00241M41561K63778K27628k89886K26015n1305j45024K52633
849A02857l94615j92323M54704o46665L3175j2417M61864L04409m13095n34774
839h36880j57342P17046j35104k81274j00939P14542j85933l21880n2443l09968
829i50175k56520J65400M9055Q33557j24953L8046l58614l45478K45784L10788
819c93110m06053R1177L00617m023J18193M846j67837J35489L13294o47976Q9514
808e65869K98239p86519M76169m05489K18787L69083n96687O04834k57338M3292
$$ plain form
798 -601498 -536132 -830399 -923564 -571684 -375627 -658642 -653165 -821861 -440122 -88875 -74008
787 -74008 49900 -342173 -1133338 -316898 -174486 -75932 -151473 -614685 -541945 -705161 -682199
776 -682199 -442098 -177247 -423280 -575073 -390995 -715020 -1014917 -310304 -593009 -535001
766 -535001 -315333 -163496 -379274 -909166 -797661 -529055 -405405 -493815 -271975 -544932
756 -544932 -638541 -959815 -1159345 -734516 -651073 -772016 -1057950 -287455 -592071 -629862
746 -629862 -1091161 -620042 -457608 -582265 -344980 -584118 -762988 -676714 -342540 -746312
736 -746312 -684965 -575352 -72765 26912 157291 306998 41990 -651525 -1074170 -631385
726 -631385 -997712 -1167740 -1417132 -1326120 -1097688 -1047812 -1147355 -513755 -809514 -1172361
$$ packed form
798f01498O5366k94267r3165L51880J96057k83015N477j68696L81739L51247J4867
787g4008J23908l92073p91165Q16440J42412R8554p5541m63212P2740j63216K2962
776f82199K40101K64851k46033j51793J84078l24025k99897P04613k82705N8008
766e35001K19668J51837k15778n29892J11505K68606J23650q8410K21840k72957
756e44932r3609l21274j99530M24829Q3443j20943k85934P70495l04616l7791
746f29862m61299M71119J62434j24657K37285k39138j78870Q6274L34174m03772
736g46312O1347J09613N02587R9677J30379J49707k65008o93515m22645M42785
726f31385l66327j70028k49392R1012K28432M9876r9543O33600k95759l62847
$$ plain form
716 -1172361 -1048981 -884209 -1087162 -1349994 -692737 -727800 -1415462 -1222778 -1239844 -570411
706 -570411 -258232 -620120 -864276 -554658 -273108 -661783 -1013405 -1690324 -1575653 -729772
696 -729772 -767855 -1295726 -1077169 -524750 -624110 -702878 -475679 -277339 -770461 -806994 -495545
685 -495545 -835062 -175941 -631441 -701897 -1141588 -1324074 -778415 -910257 -487637 -511310
675 -511310 -852355 -967667 -721655 -960148 -1026131 -378984 -523464 -8746 -395552 -20104
665 -20104 -47705 -526536 -790937 -690822 -769766 -792482 -464922 -618566 -663450 -1318142 -797532
654 -797532 -548778 -999401 -529968 -447170 -148636 -86832 -588274 -970134 -1026081 -1017688 -715532
643 -715532 -720413 -966455 -583719 -93538 -492137 -523655 -482863 -818819 -916226 -424143 -118693
$$ packed form
716a172361J23380J64772k02953k62832O57257l5063o87662J92684j7066O69433
706e70411L12179l61888k44156L09618K81550l88675l51622o76919J14671Q45881
696g29772l8083n27871K18557N52419r9360p8768K27199J98340m93122l6533L11449
685d95545l39517O59121m55500p0456m39691j82486N45659j31842M22620k3673
675e11310l41045j15312K46012k38493o5983O47147j44480N14718l86806L75448
665b0104k7601m78831k64401J00115p8944k2716L27560j53644m4884o54692N20610
654g97532K48754m50623M69433Q2798K98534O1804n01442l81860n5947Q393L02156
643g15532m881k46042L82736M90181l98599l1518M0792l35956r7407M92083L05450
$$ plain form
632 -118693 -227759 -709619 -361462 -498363 -284026 -628511 -812104 -885960 -818456 -903610
622 -903610 -990576 -551008 -235966 -247086 -607048 -452330 -120332 -126173 -22343 -291322 -841628
611 -841628 -1268110 -828587 -77318 -494793 -518911 -389936 153758 -331337 -677472 -600253
601 -600253 -865269 -693517 -841313 -922359 -910115 -1189845 -717016 -789591 -699783 -765940 -460077
590 -460077 -751857 -463039 -365583 -303906 -253831 -362145 -507077 -742672 -454836 284601
580 284601 -91362 -816705 -966500 -926485 -1348842 -1088539 -399082 -385680 -517513 -907321
570 -907321 -968280 -672380 -640638 -669261 -910023 -886083 -542948 -688247 -974331 -1241688 -866920
559 -866920 -878792 -959349 -576261 -798113 -248340 -246967 -454686 -702045 -680967 -887465 -645109
$$ packed form
632a18693j09066m81860L48157j36901K14337l44485j83593p3856O7504q5154
622i03610q6966M39568L15042j1120l59962J54718L31998n841J03830k68979n50306
611h41628m26482M39523P51269m17475k4118J28975N43694m85095l46135P7219
601f00253k65016J71752j47796q1046J2244k79730M72829p2575Q9808o6157L05863
590d60077k91780K88818R7456O1677N0075j08314j44932k35595K87836P39437
580B84601l75963p25343j49795M0015m22357K60303O89457J3402j31833l89808
570i07321o0959K95900L1742k8623k40762K3940L43135j45299k86084k67357L74768
559h66920j1872q0557L83088k21852N49773J373k07719k47359K1078k06498K42356
$$ plain form
548 -645109 -777630 -1188728 -1248433 -1408778 -634158 -224235 -477413 -687866 -718634 -553879
538 -553879 -570531 -737005 -930536 -945021 -1172869 -763753 -196263 -890387 -669170 -672053 -275184
527 -275184 -1018829 -1228165 -1002898 -889347 -256197 -487313 -565141 -365451 -492295 -437797
517 -437797 -432833 -763795 -846794 -367810 -756276 -956292 -668927 -527472 -750934 -623142
507 -623142 -306020 -422785 -249221 -317457 -226685 -44942 -670786 -485471 -491546 -1058402 -542490
496 -542490 67637 -488033 -659977 -661853 -1032818 -18400 -136709 -627421 -671409 -638239
486 -638239 -241366 -327739 -650074 -819048 -1350745 -1245821 -1121395 -1053082 -665081 -749673
476 -749673 -781915 -599952 -244548 -167540 -167003 -524092 -490049 375970 -129705 -319917 -221905
$$ packed form
548f45109j32521m11098n9705j60345P74620M09923k53178k10453l0768J64755
538e53879j6652j66474j93531j4485k27848M09116N67490o94124K21217k883L96869
527b75184p43645k09336K25267J13551O33150k31116p7828J99690j26844N4498
517d37797M964l30962q2999M78984l88466k00016K87365J41455k23462J27792
507f23142L17122j16765J73564o8236R0772J81743o25844J85315o075n66856N15912
496e42490O10127n55670j71944j876l70965J014418j18309m90712m3988L3170
486f38239L96873q6373l22335j68974n31697J04924J24426O8313L88001q4592
476g49673l2242J81963L55404P7008N37l57089L4043Q66019n05675j90212R8012
$$ plain form
465 -221905 -624671 -908618 -932585 -970723 -898022 -574242 -362550 -417413 -820006 -547429 -789026
454 -789026 -267345 -453395 -195403 -195247 -290336 -728696 -259024 -727395 -694134 -654461 -876852
443 -876852 -107308 -88635 -349508 115363 -72794 -823341 -475416 -766001 -413438 -628748
433 -628748 -329678 -613907 -1078577 -1285847 -807009 -633169 -708000 -683927 -385559 -254960
423 -254960 -538980 -1231116 -1340493 -1354019 -756879 -311135 -645476 -861214 -660224 -789819
413 -789819 -788128 -646576 -977415 -594798 -599087 -482772 -235990 -166716 -531490 -505053 -403700
402 -403700 -639810 -1025180 -623004 -250954 -946869 -928844 -776858 -608383 -322819 -829611
392 -829611 -905554 -658906 -819781 -788795 -631829 -404856 -98140 -456494 -765267 -356827
$$ packed form
465b21905m02766k83947k3967l8138P2701L23780K11692n4863m02593K72577k41597
454g89026N21681j86050K57992J56r5089m38360M69672m68371L3261L9673k22391
443h76852P69544J8673k60873M64871j88157p50547L47925k90585L52563k15310
433f28748K99070k84229m64670k07270M78838J73840p4831K4073K98368J30599
423b54960k84020o92136j09377j3526N97140M45744l34341k15738K00990j29595
413g89819J691J41552l30839L82617m289J16315K46782O9274l64774K6437J01353
402d03700k36110l85370M02176L72050o95915J8025J51986J68475K85564n06792
392h29611p5943K46648j60875L0986J56966K26973L06716l58354l08773M08440
$$ plain form
382 -356827 -300122 -85706 -469371 -463959 -577487 -660652 -938590 -1033664 -823552 -537849 -167486
371 -167486 -226376 -330700 -679650 -819670 -724129 -564514 -111480 -745078 -903074 -83052
361 -83052 -96834 305537 -205977 -356724 -295158 -413068 -673121 -1168732 -885594 -571182
351 -571182 -644319 -642161 -475275 -523074 -312908 -282810 -787787 -973979 -1044116 -922075 -933613
340 -933613 -378696 426533 146451 -210625 -919000 -1091988 -865378 -431570 -277562 -890553
330 -890553 -442297 -608048 -521305 -482267 -423094 -462755 -520803 -685854 -740818 -503571 82274
319 82274 492445 -498120 -1118380 -966356 -1303966 -1048039 -1144399 -1124070 -744337 -453594
309 -453594 -653141 -674538 -67060 -402110 -517171 -644815 -1015302 -1131123 -1096711 -898535
$$ packed form
382c56827N6705K14416l83665N412j13528q3165k77938r5074K10112K85703L70363
371a67486n8890j04324l48950j40020R5541J59615M53034o33598j57996Q20022
361h3052j3782M02371n11514j50747O1566j17910k60053m95611K83138L14412
351e71182p3137K158J66886m7799K10166L0098n04977j86192p0137J22041j1538
340i33613N54917Q05229k80082l57076p08375j72988K26610M33808J54008o12991
330h90553M48256j65751Q6743L9038N9173l9661n8048j65051n4964K37247N85845
319H2274M10171r90565o20260J52024l37610K55927r6360K0329L79733K90743
309d53594j99547k1397O07478l35050j15061j27644l70487j15821L4412J98176
$$ plain form
299 -898535 -599811 -1183433 -1009308 -1157340 -769648 -384726 -278134 -178644 -239122 72606
289 72606 -89102 -561712 -413996 -133039 -384519 78770 -163532 -18420 -146868 -863407
279 -863407 -671453 -354438 -507808 -669169 -834166 -836569 -397787 -140427 -169736 -612913
269 -612913 -751851 -912434 -950216 -959419 -1095675 -1215570 -962992 -692150 -800816 -768111 -578823
258 -578823 -836294 -676693 -970323 -903043 -734204 -139559 -209996 -342485 -540171 -729480
248 -729480 -870832 -951529 -418830 27113 215673 -12048 -287763 150074 -577088 -617678
238 -617678 -455847 -672947 -362936 -702331 -1079904 -886502 -866418 -968831 -296766 -511668
228 -511668 -624927 -636011 16436 -86913 -456935 -710995 -433745 -869883 -174976 -77402
$$ packed form
299h98535K98724n83622J74125j48032L87692L84922J06592R9490o0478L11728
289G2606j61708m72610J47716K80957k51480M63289k42302J45112j28448p16539
279h63407J91954L17015j53370j61361j64997k403M38782K57360k9309m43177
269f12913j38938j60583l7782r203j36256j19895K52578K70842j08666L2705J89288
258e78823k57471J59601k93630O7280J68839N94645p0437j32489j97686j89309
248g29480j41352q0697N32699M45943J88560k27721k75715M37837p27162m0590
238f17678J61831k17100L10011l39395l77573J93402K0084j02413O72065k14902
228e11668j13259j1084O52447j03349l70022k54060K77250m36138O94907R7574
$$ plain form
218 -77402 9030 -203993 -369560 -358907 -515505 -1299457 -1096719 -609310 -919196 -895707 -252513
207 -252513 -190282 -499264 -877540 -913315 -1003403 -779752 -488849 -416447 71449 167718 -385556
196 -385556 -625836 -370534 -802868 -573131 -570013 -483015 -805269 -898644 -817826 -950592 -788792
185 -788792 -553165 -133602 133500 -667774 -757714 -365010 -434626 -909201 -546140 -482027
175 -482027 -610379 -958384 -1006820 -989422 -453482 -411356 -374816 -666560 -853076 -686076 -470255
164 -470255 -687985 -858530 -684065 -645824 -460733 -707368 -918511 -782991 -518105 -811629
154 -811629 -483548 -491805 -875309 -727623 -581826 -377754 -553605 -617487 -234654 51640
144 51640 251972 -77600 -529484 -595423 -417504 -717203 -941753 -700119 -478910 -604536
$$ packed form
218g7402Q6432k13023j65567J0653j56598p83952K02738M87409l09886K3489O43194
207b52513O2231l08982l78276l5775r0088K23651K90903P2402M87896R6269n53274
196c85556k40280K55302m32334K29737L118Q6998l22254r3375Q0818j32766J61800
185g88792K35627M19563K67102q01274q9940L92704o9616m74575L63061O4113
175d82027j28352l48005m8436J7398N35940M2126L6540k91744j86516J67000K15821
164d70255k17730j70545J74465L8241J85091k46635k11143J35520K64886k93524
154h11629L28081q257l83504J47686J45797K04072j75851o3882L82833K86294
144E1640K00332l29572m51884o5939J77919k99699k24550K41634K21209j25626
$$ plain form
134 -604536 -577439 -785075 -856325 -919302 -999661 -762936 -795863 -699674 -475745 -296136 -580989
123 -580989 -319319 -337378 -501529 -272027 -379266 -487597 -880920 -753546 -359069 -166019
113 -166019 -777173 -1097085 -519663 -330215 -510395 -922318 -1109323 -887657 -882018 -1118171
103 -1118171 -932203 -591072 -454807 -838178 -1180427 -1402360 -1028221 -771937 -440977 -481564
93 -481564 -953631 -860911 -689919 -702495 -741063 -958868 -1335518 -1582609 -1329974 -538454 -598054
82 -598054 -520609 -513446 -794695 -950544 -835235 -859060 -619620 -333853 -314966 -498907 -954628
71 -954628 -939675 -727463 -692516 -670899 -363513 -654704 -698088 -797873 -1182644 -1270134 -1088132
60 -1088132 -772633 -644716 -551070 -773650 -815714 -991954 -741074 -938399 -981999 -870563
$$ packed form
134f04536K7097k07636p1250o2977q0359K36725l2927R6189K23929J79609k84853
123e80989K61670j8059j64151K29502j07239j08331l93323J27374L94477J93050
113a66019o11154l19912N77422J89448j80180m11923j87005K21666N639k36153
103a118171J85968L41131J36265l83371l42249k21933L74139K56284L30960m0587
93d81564m72067R2720J70992j2576l8568k17805l76650k47091K52635P91520n9600
82e98054P7445P163k81249j55849J15309k3825K39440K85767J8887j83941m55721
71i54628J4953K12212L4947K1617L07386k91191m3384r9785l84771q7490J82002
60a088132L15499J27917R3646k22580m2064j76240K50880j97325m3600J11436
$$ plain form
50 -870563 -834685 -693846 -577425 -382705 -881375 -1199319 -1222696 -1227595 -999684 -874539 -1046260
39 -1046260 -769140 -770480 -895230 -994865 -1105638 -950580 -1226997 -962693 -681384 -198190
29 -198190 -743421 -977206 -1222345 -1285142 -933572 -1112759 -962107 -1099454 -1063436 -1494823
19 -1494823 -1317612 -1117564 -1426493 -839963 -841626 -859986 -1029163 -965857 -894835 -936113 -759654
8 -759654 -606717 -842249 -1031492 -801814 -1148152 -1114569 -1214328 -1153627
0 -1153627
$$ packed form
50h70563L5878J40839J16421J94720m98670l17944k3377m899K27911J25145j71721
39a046260K77120j340j24750r9635j10773J55058k76417K64304K81309M83194
29a98190n45231k33785k45139o2797L51570j79187J50652j37347L6018m31387
19a494823J77211K00048l08929N86530j663j8360j69177O3306P1022m1278J76459
8g59654J52937k35532j89243K29678l46338L3583r9759O0701
0a153627
$$ Imaginary data points
##PAGE= N=2
##DATA TABLE= (X++(I..I)), XYDATA
$$ plain form
16383 -4568463 -4472315 -4204185 -4131778 -4223506 -4435453 -4461803 -4470719 -4162112 -3884235 -3388631
16373 -3388631 -3260710 -3878770 -3555653 -3240283 -3369327 -3335185 -3213953 -3635498 -3294454 -3290545
16363 -3290545 -3214332 -3046655 -3067910 -3056000 -3015249 -2795097 -2770915 -2557384 -2827077 -2732011
16353 -2732011 -2605805 -2414858 -2152885 -2423729 -2197575 -1967465 -1971041 -2294840 -2505177 -2159164
16343 -2159164 -2387877 -2171887 -2013321 -1756827 -1665988 -1243322 -1409010 -1280927 -1254448 -1231022
16333 -1231022 -992505 -1152822 -1173706 -1191098 -985680 -935002 -967369 -865468 -486859 -405906
16323 -405906 -227233 -674516 -613068 -694486 -479137 -269189 -150434 -116598 165463 243955
16313 243955 456066 191394 -106391 -259371 -134498 -284339 -556887 -325807 -114141 321743
$$ packed form
16383d568463R6148K68130P2407r1728k11947k6350q916L08607K77877M95604
16373c388631J27921o18060L23117L15370j29044L4142J21232m21545L41044L909
16363c290545P6213J67677k1255J1910M0751K20152K4182K13531k69693R5066
16353b732011J26206J90947K61973k70844K26154K30110l576l23799k10337L46013
16343b159164k28713K15990J58566K56494R0839M22666j65688J28083K6479K3426
16333a231022K38517j60317k0884j7392K05418N0678l2367J01901L78609Q0953
16323d05906J78673m47283O1448q1418K15349K09948J18755L3836K82061P8492
16313B43955K12111k64672k97785j52980J24873j49841k72548K31080K11666M35884
$$ plain form
16303 321743 344199 165136 362580 558297 784059 892701 465558 765113 812715 752816
16293 752816 1067198 999695 919644 1110032 1203127 870653 886380 1247490 1299268 1259758 1028545
16282 1028545 695784 1161256 1327221 1325045 1611094 1857042 2509238 1972409 1552375 1528368
16272 1528368 1884900 2105727 2218941 2622937 2722940 2893487 2432187 1845349 2101383
16263 2101383 2302962 2523384 2677901 2368467 2449619 2623723 3114518 2810760 2767839 2722478
16253 2722478 3050643 2900772 2928477 3004535 2898495 3010492 2971779 2808081 2641803 3129234
16243 3129234 2937784 3340038 3537774 3692003 3595672 3031955 3124170 3536171 3788789 3535370
16233 3535370 3330216 3518513 3526705 3699808 3431983 3334631 3232061 2936338 3501540 3708214
$$ packed form
16303C21743K2456j79063J97444J95717K25762J08642m27143K99555M7602n9899
16293G52816L14382o7503q0051J90388R3095l32474J5727L61110N1778l9510k31213
16282A028545l32761M65472J65965k176K86049K45948O52196n36829m20034k4007
16272A528368L56532K20827J13214M03996J00003J70547m61300n86838K56034
16263B101383K01579K20422J54517l09434Q1152J74104M90795l03758m2921m5361
16253B722478L28165j49871K7705P6058j06040J11997l8713j63698j66278M87431
16243C129234j91450M02254J97736J54229r6331n63717R2215M12001K52618k53419
16233C535370k05154J88297Q192J73103k67825r7352j02570k95723N65202K06674
$$ plain form
16223 3708214 3892256 3999379 4080694 4272360 4262559 4126443 4310047 4448845 4143616 4265214
16213 4265214 4471304 4453562 4295251 4234932 3859503 4329818 4541337 4100975 4172420 3982691
16203 3982691 3994430 4615181 4587101 4275576 4065521 4010539 3990373 4630790 4608960 4181138
16193 4181138 4599366 4658065 4649350 4405106 4637204 4785037 4668670 4352646 4006070 4500780
16183 4500780 4913284 5085639 4693678 4244618 4214834 4910474 4968758 4708601 4556112 4771213
16173 4771213 4617593 4645611 4442063 4446076 4642117 4723516 4402690 4336777 5067143 5301490
16163 5301490 5028937 5054134 5351262 5002505 5049385 5030387 5127519 4759790 4678614 5034768
16153 5034768 4733103 4679321 4978928 5225208 5185675 4959271 5635071 5685209 5336971 5089501
$$ packed form
16223C708214J84042J07123Q1315J91666r801j36116J83604J38798l05229J21598
16213D265214K06090j7742j58311o0319l75429M70315K11519m40362P1445j89729
16203C982691J1739O20751k8080l11525k10055n4982k0166O40417k1830m27822
16193D181138M18228N8699q715k44244K32098J47833j16367l16024l46576M94710
16183D500780M12504J72355l91961m49060k9784O95640N8284k60157j52489K15101
16173D771213j53620K8018k03548M013J96041Q1399l20826o5913P30366K34347
16163E301490k72553K5197K97128l48757M6880j8998R7132l67729q1176L56154
16153E034768l01665n3782K99607K46280l9533k26404O75800N0138l48238k47470
$$ plain form
16143 5089501 4933896 5324449 5369234 5502383 5576008 5259278 5406442 5347709 5849457 5689743
16133 5689743 5345513 5390688 5816695 5349872 5150669 4982219 4728464 4770934 4663939 5578721
16123 5578721 5486464 5087911 5591615 5404354 5246393 5545022 5421538 5939437 5648680 5496865
16113 5496865 5091146 4589297 4675043 4761157 4421325 4332507 4660018 5087971 5390611 5490979
16103 5490979 5568828 5473419 5556230 5928764 5928070 5451935 5644496 5595665 5353568 5494951 5962175
16092 5962175 5918762 5945381 5882063 5998743 5773071 5996844 5393050 5399673 5508587 5472542
16082 5472542 5732558 5824917 5621476 5894571 6568450 6527471 6219000 6017369 6096449 5776105
16072 5776105 5510307 5617682 6088748 6250628 5728447 5324379 5246242 5397022 5551232 5830878
$$ packed form
16143E089501j55605L90553M4785J33149P3625l16730J47164n8733N01748j59714
16133E689743l44230M5175M26007m66823j99203j68450k53755M2470j06995R14782
16123E578721r2257l98553N03704j87261j57961K98629j23484N17899k90757j51815
16113E496865m05719n01849Q5746Q6114l39832q8818L27511M27953L02640J00368
16103E490979P7849r5409Q2811L72534o94m76135J92561m8831k42097J41383M67224
16092E962175m3413K6619o3318J16680k25672K23773o03794O623J08914l6045
16082E472542K60016R2359k03441K73095O73879m0979l08471k01631P9080l20344
16072E776105k65798J07375M71066J61880n22181m04068p8137J50780J54210K79646
$$ plain form
16062 5830878 5914062 5693632 5850799 5429655 5289096 5150183 4968298 5219411 5653061 6348619
16052 6348619 6099589 5979003 5525487 5608069 5820616 6240067 6185119 5939324 6032392 5071544
16042 5071544 4921752 4864975 5223205 5488436 5891551 5688002 5637052 5759054 5717241 4966882
16032 4966882 4998271 5135876 5241773 5180523 5425403 5766068 5835207 5365844 5330043 5337000
16022 5337000 5940325 5569562 6017547 6453598 5827875 6052620 5786509 5826661 6739293 6673429
16012 6673429 6140059 5524867 5404312 6016606 6316074 5586451 5533639 5384608 5331432 5334412
16002 5334412 5301338 5350664 5364514 5794620 5681086 5939374 5600724 5416050 5597507 5915362
15992 5915362 5345087 5498185 5722564 5970832 6377377 6604667 6200427 5444833 5664321
$$ packed form
16062E830878Q3184k20430J57167m21144j40559j38913j81885K51113M33650O95558
16052F348619k49030j20586m53516Q2582K12547M19451n4948k45795R3068r60848
16042E071544j49792n6777L58230K65231M03115k03549n0950J22002m1813p50359
16032D966882L1389J37605J05897o1250K44880L40665O9139m69363l5801O957
16022E337000O03325l70763M47985M36051o25723K24745k66111M0152R12632o5864
16012F673429n33370o15192j20555O12294K99468p29623n2812j49031n3176K980
16002E334412l3074M9326J3850M30106j13534K58288l38650j84674J81457L17855
15992E915362n70275J53098K24379K48268M06545K27290m04240p55594K19488
$$ plain form
15983 5664321 6466445 6719685 6184132 6289653 6157764 5849295 5600909 5532916 5424271 5495317
15973 5495317 5852611 5891022 6169993 5997761 6461802 5857070 5694375 5424956 5226675 5661522
15963 5661522 5439744 5320896 5411667 5757848 5968138 5279022 5472957 6131300 5869815 5355531
15953 5355531 5836421 5602720 5696771 5374336 5046302 5216612 5552339 5425645 5707056 5477658
15943 5477658 5201294 6009896 6265481 5874865 6217953 6214437 6305469 6458221 6005557 5792981
15933 5792981 5261460 5789059 6050071 5480783 5497653 5844254 5913318 5986246 5774245 5702570
15923 5702570 5579905 5750527 6002251 5864660 5788325 5949885 6039478 5847034 5946830 6329464
15913 6329464 6031630 5829001 6378105 5956246 5303631 5506547 5479936 5588513 6009447 5773366
$$ packed form
15983E664321Q02124K53240n35553J05521j31889l08469k48386o7993j08645P1046
15973E495317L57294L8411K78971j72232M64041o04732j62695k69419j98281M34847
15963E661522k21778j18848R0771L46181K10290o89116J93935O58343k61485n14284
15953E355531M80890k33701R4051l22435l28034J70310L35727j26694K81411k29398
15943E477658k76364Q08602K55585l90616L43088l516R1032J52752m52664k12576
15933E792981n31521N27599K61012n69288J6870L46601O9064P2928k12001p1675
15923E702570j22665J70622K51724j37591p6335J61560Q9593j92444R9796L82634
15913F329464k97834k02629N49104m21859o52615K02916k6611J08577M20934k36081
$$ plain form
15903 5773366 5332102 5532005 5158009 5260410 5741002 5822582 5633772 5522242 5456799 5702067
15893 5702067 5651894 6154059 6274149 5764132 5812664 6050293 5388332 5090259 5741158 5153328
15883 5153328 5162904 5429957 5590270 5738663 5362252 5409001 5749678 6207695 6362322 5930625
15873 5930625 5088210 5309453 5855391 6026076 5915145 6134360 5914032 5722184 5437692
15864 5437692 5803744 5766516 5495441 5804676 5788498 5390624 5663621 5745469 6087216 6214171
15854 6214171 5802588 5679319 5417040 5480921 5981081 5600789 6009443 5951649 5522976 5656909
15844 5656909 5522649 5535555 5505803 5459328 5280963 5133124 5474865 5674928 5135218 5201796
15834 5201796 5232073 5117273 5723333 6125091 6061168 5893326 5852427 5833122 5471260 5511985
$$ packed form
15903E773366m41264J99903l73996J02401M80592Q1580j88810j11530o5443K45268
15893E702067n0173N02165J20090n10017M8532K37629o61961k98073O50899n87830
15883E153328R576K67053J60313J48393l76411M6749L40677M58017J54627m31697
15873E930625q42415K21243N45938J70685j10931K19215k20328j91848k84492
15864E437692L66052l7228k71075L09235j6178l97874K72997Q1848L41747J26955
15854F214171m11583j23269k62279O3881N00160l80292M08654n7794m28673J33933
15844E656909j34260J2906k9752m6475j78365j47839L41741K00063n39710O6578
15834E201796L0277j14800O06060M01758o3923j67842m0899j9305l61862M0725
$$ plain form
15824 5511985 6218156 6299511 6473755 6215141 6237916 6199581 5809894 6070915 5697604 6451334
$$ packed form
15824E511985P06171Q1355J74244k58614K2775l8335l89687K61021l73311P53730
$$ [...]
##END NTUPLES=NMR SPECTRUM
##END=
