##TITLE=1H_DE-80H_X3
 200.13MHz, d2o
 8 sc
 
 19ns.26.2.2025
##JCAMPDX= 6.0         $$ Bruker NMR JCAMP-DX V2.0
##DATA TYPE= NMR SPECTRUM
##DATA CLASS= NTUPLES
##ORIGIN= UXNMR, Bruker Analytische Messtechnik GmbH
##OWNER= pz
$$ XWIN-NMR		Version 3.5
$$ Wed Mar 25 11:56:18 2026 Russian Standard Time (UT+4h)  Yarkov@DPX200
##.OBSERVE FREQUENCY= 200.1313
##.OBSERVE NUCLEUS= ^1H
##.ACQUISITION MODE= SIMULTANEOUS
##.ACQUISITION SCHEME= undefined
##.AVERAGES= 8
##.DIGITISER RES= 18
##SPECTROMETER/DATA SYSTEM= spect
##.PULSE SEQUENCE= zg30
##.SOLVENT NAME= DMSO
##.SHIFT REFERENCE= (INTERNAL, DMSO, 0, 15.4692)
##AUDIT TRAIL= $$ (NUMBER, WHEN, WHO, WHERE, WHAT)
$$ ##TITLE= Audit trail, XWIN-NMR		Version 3.5
$$ ##JCAMPDX= 5.01
$$ ##ORIGIN= Bruker BioSpin GmbH
$$ ##OWNER= Yarkov
$$ C:/Bruker/XWIN-NMR/data/yarkov2/nmr/H-C/1/pdata/1/auditp.txt
$$ ##AUDIT TRAIL=  $$ (NUMBER, WHEN, WHO, WHERE, WHAT)
(   1,<2026-03-25 11:55:22.93 +0400>,<Yarkov>,<DPX200>,
      <created by zg, POWCHK disabled, PULCHK disabled
       configuration hash MD5:
       00 E9 B6 7A A2 85 ED C7 34 08 36 98 17 FE 4E 26
       data hash MD5: 16K
       F7 9D EE AD 22 46 7E 1B A3 8A 85 06 83 3E C8 FF>)
(   2,<2026-03-25 11:55:27.26 +0400>,<Yarkov>,<DPX200>,
      <Start of raw data processing
       efp BC_mod = 2 LB = 0.25 FT_mod = 6 PKNL = 1 PHC0 = -5299.148 PHC1 = 6.821927 SI = 16K 
       data hash MD5: 16K
       03 2A 04 FB 91 01 B3 8F 37 E1 5E 42 C3 C6 F4 03>)
(   3,<2026-03-25 11:55:41.67 +0400>,<Yarkov>,<DPX200>,
      <abs ABSG = 5 
       data hash MD5: 16K
       53 EE 35 2A C0 D4 EA 81 C8 0D 7E 35 AA F1 67 99>)
$$ ##END=
$$ 
$$ hash MD5
$$ D3 DF 9D 10 AA F5 D8 EC CD 76 C4 E1 2B C1 43 3E
##$RELAX= 
##$RELAX= 
##$RELAX= 
##$RELAX= 
##$RELAX= 
##$RELAX= 
$$ Bruker specific parameters
$$ --------------------------
##$DU= <C:/Bruker/XWIN-NMR>
##$EXPNO= 1
##$NAME= <H-C>
##$PROCNO= 1
##$TYPE= <nmr>
##$USER= <yarkov2>
##$AMP= (0..31)
100 100 100 100 100 100 100 100 100 100 100 100 100 100 100 100 100 100 
100 100 100 100 100 100 100 100 100 100 100 100 100 100 
##$AQSEQ= 0
##$AQ_mod= 1
##$AUNM= <au_zg>
##$AUTOPOS= <>
##$BF1= 200.13
##$BF2= 200.13
##$BF3= 200.13
##$BF4= 200.13
##$BF5= 200.13
##$BF6= 200.13
##$BF7= 200.13
##$BF8= 200.13
##$BYTORDA= 1
##$CFDGTYP= 0
##$CFRGTYP= 5
##$CHEMSTR= <none>
##$CNST= (0..31)
1 1 145 1 1 1 1 1 1 1 1 1 1 1 1 1 1 1 1 1 1 1 1 1 1 1 1 1 1 1 1 1 
##$CPDPRG= <>
##$CPDPRG1= <>
##$CPDPRG2= <>
##$CPDPRG3= <>
##$CPDPRG4= <mlev>
##$CPDPRG5= <mlev>
##$CPDPRG6= <mlev>
##$CPDPRG7= <mlev>
##$CPDPRG8= <mlev>
##$CPDPRGB= <>
##$CPDPRGT= <>
##$D= (0..31)
0 0.7 0 0 0 0 0 0 0 0 0 0.03 0 0 0 0 0 0 0 0 0 0 0 0 0 0 0 0 0 0 0 0 
##$DATE= 1774425322
##$DBL= (0..7)
120 120 120 120 120 120 120 120 
##$DBP= (0..7)
150 150 150 150 150 150 150 150 
##$DBP07= 0
##$DBPNAM0= <>
##$DBPNAM1= <>
##$DBPNAM2= <>
##$DBPNAM3= <>
##$DBPNAM4= <>
##$DBPNAM5= <>
##$DBPNAM6= <>
##$DBPNAM7= <>
##$DBPOAL= (0..7)
0.5 0.5 0.5 0.5 0.5 0.5 0.5 0.5 
##$DBPOFFS= (0..7)
0 0 0 0 0 0 0 0 
##$DE= 6
$$ [...]
##$SUBNAM3= <"">
##$SUBNAM4= <"">
##$SUBNAM5= <"">
##$SUBNAM6= <"">
##$SUBNAM7= <"">
##$SUBNAM8= <"">
##$SUBNAM9= <"">
##$SW= 18.0517328524113
##$SWIBOX= (0..15)
0 0 2 0 0 0 0 0 0 0 0 0 0 0 0 0 
##$SW_h= 3612.71676300578
##$TD= 16384
##$TD0= 1
##$TE= 0
##$TE2= 300
##$TE3= 300
##$TEG= 300
##$TL= (0..7)
0 120 120 120 120 120 120 120 
##$TP= (0..7)
150 150 150 150 150 150 150 150 
##$TP07= 0
##$TPNAME0= <>
##$TPNAME1= <>
##$TPNAME2= <>
##$TPNAME3= <>
##$TPNAME4= <>
##$TPNAME5= <>
##$TPNAME6= <>
##$TPNAME7= <>
##$TPOAL= (0..7)
0.5 0.5 0.5 0.5 0.5 0.5 0.5 0.5 
##$TPOFFS= (0..7)
0 0 0 0 0 0 0 0 
##$TUNHIN= 0
##$TUNHOUT= 0
##$TUNXOUT= 0
##$USERA1= <user>
##$USERA2= <user>
##$USERA3= <user>
##$USERA4= <user>
##$USERA5= <user>
##$V9= 5
##$VALIST= <valist>
##$VCLIST= <CCCCCCCCCCCCCCC>
##$VD= 0
##$VDLIST= <DDDDDDDDDDDDDDD>
##$VPLIST= <PPPPPPPPPPPPPPP>
##$VTLIST= <TTTTTTTTTTTTTTT>
##$WBST= 1024
##$WBSW= 4
##$XGAIN= (0..3)
0 0 0 0 
##$XL= 0
##$YL= 0
##$YMAX_a= 356196
##$YMIN_a= -294319
##$ZGOPTNS= <>
##$ZL1= 120
##$ZL2= 120
##$ZL3= 120
##$ZL4= 120
##$ABSF1= 15.47144
##$ABSF2= -2.580409
##$ABSG= 5
##$ABSL= 3
##$ALPHA= 0
##$AQORDER= 0
##$ASSFAC= 0
##$ASSFACI= 0
##$ASSFACX= 0
##$ASSWID= 0
##$AUNMP= <proc_1d>
##$AZFE= 0.1
##$AZFW= 0.1
##$BCFW= 0
##$BC_mod= 2
##$BYTORDP= 0
##$COROFFS= 0
##$CY= -3
##$DATMOD= 1
##$DC= 0
##$DFILT= <>
##$DTYPP= 0
##$F1P= 0
##$F2P= 0
##$FCOR= 1
##$FTSIZE= 16384
##$FT_mod= 6
##$GAMMA= 0
##$GB= 0
##$INTBC= 1
##$INTSCL= 3.241238e-09
##$ISEN= 128
##$LB= 0.25
##$LEV0= 0
##$LPBIN= 0
##$MAXI= 10000
##$MC2= 0
##$MEAN= 0
##$ME_mod= 0
##$MI= 1.114404
##$NCOEF= 0
##$NC_proc= -6
##$NLEV= 6
##$NOISF1= 3.799351
##$NOISF2= 2.8
##$NSP= 0
##$NTH_PI= 0
##$NZP= 0
##$OFFSET= 15.46924
##$PC= 1
##$PHC0= -5299.148
##$PHC1= 6.821927
##$PH_mod= 1
##$PKNL= yes
##$PPARMOD= 0
##$PSCAL= 0
##$PSIGN= 0
##$REVERSE= no
##$SF= 200.130010500713
##$SI= 16384
##$SIGF1= 3
##$SIGF2= 2
##$SINO= 0.751879
##$SIOLD= 32768
##$SREGLST= <19F.Aceton>
##$SSB= 0
##$STSI= 16384
##$STSR= 0
##$SW_p= 3612.71676300578
##$SYMM= 0
##$S_DEV= 0
##$TDeff= 16384
##$TDoff= 0
##$TI= <>
##$TILT= no
##$TM1= 0
##$TM2= 0
##$TOPLEV= 0
##$USERP1= <user>
##$USERP2= <user>
##$USERP3= <user>
##$USERP4= <user>
##$USERP5= <user>
##$WDW= 1
##$XDIM= 16384
##$YMAX_p= 268650551
##$YMIN_p= -368897
$$ End of Bruker specific parameters
$$ ---------------------------------
##NTUPLES= NMR SPECTRUM
##VAR_NAME=  FREQUENCY,     SPECTRUM/REAL,   SPECTRUM/IMAG
##SYMBOL=    X,             R,               I
##VAR_TYPE=  INDEPENDENT,   DEPENDENT,       DEPENDENT
##VAR_FORM=  AFFN,          ASDF,            ASDF
##VAR_DIM=   16384,         16384,           16384
##UNITS=     HZ,            ARBITRARY UNITS, ARBITRARY UNITS
##FACTOR=    0.220516191357247, 1,           1
##FIRST=     3095.8592013823, 0,             0
##LAST=      -516.857561623484, 0,           0
##MIN=       -516.857561623484, -368897,     0
##MAX=       3095.8592013823, 268650551,     0
$$ Real data points
##PAGE= N=1
##DATA TABLE= (X++(R..R)), XYDATA
$$ [...]
7223C58969M3463J3447o489L9511P251j1150Q5102L7767K1930k1506J7657m293
7211E81659k0540L7952L1674O4068M8022O045K0091N8099L0195O7604J28446O3027
7199A116342M3976Q2338J00711O9592P4193L4785j6176L3598L1575J29902L0593
7188A731429l6969J10486J43904j4973O9037K0246N8026Q4010j4603L475J1530
7177B165598L9752l9866l6573Q873p3575j54425J4139l9431m2669j9905J4525
7166A836443r1770j13692K5602K3996n7052n8071j2788k6117m475m8060o4308
7155A409708j25763n9956L0947r152j18189q1961K8470L0552j3024n1080k7151
7144A013401l6212R920L8260k5104q222p0472n8859o8829l8534J16683K9691o7327
$$ plain form
7223 358969 402432 415879 409390 448901 456152 445002 530104 567871 589801 568295 585952 581659
7211 581659 561119 599071 630745 694813 742835 748880 768971 827070 857265 924869 1053315 1116342
7199 1116342 1160318 1242656 1343367 1412959 1487152 1521937 1505761 1539359 1570934 1700836 1731429
7188 1731429 1694460 1804946 1948850 1933877 2002914 2023160 2081186 2165196 2150593 2154068 2165598
7177 2165598 2205350 2165484 2128911 2137784 2064209 1909784 1923923 1884492 1841823 1821918 1836443
7166 1836443 1744673 1630981 1656583 1680579 1623527 1565456 1552668 1526551 1522076 1474016 1409708
7155 1409708 1283945 1223989 1254936 1245784 1127595 1045634 1074104 1104656 1091632 1040552 1013401
7144 1013401 977189 987109 1025369 1000265 992043 921571 862712 793883 755349 872032 901723 834396
7132H34396N6616j418K1249N8480M090L1339P5629k038m9140j1738n0371j8758
7120I48336P1036P4200L8055l1525J45K544N1359N6946l4226l7036l7683M5848
7108A147999L1937O4460O0422J550p1689P5479L9910P1485K6677l0780M2630O090
7096A466170M4775n0009L4116O0731N983Q458L0912K0742J0018O171k9407l9834
7084A568826J07400J13247P2450P382K4566K8473J03789L1040L9856O9704N6435
7073B223168P7913p602j8407N9834P9121R5991K126k2518n8217l4608M5534O5380
7061B507715L2551L7567o469Q5516K86k2663N2059J3915j1523o055P2973P9741
7049B835613L6897J4245L5559N9474N6047Q5412L6069L5987J14647J09477J40075
$$ plain form
7132 834396 891012 889594 910843 969323 973413 1004752 1080381 1078343 1029203 1017465 967094 948336
7120 948336 1019372 1093572 1131627 1100102 1100247 1102791 1154150 1211096 1176870 1139834 1102151 1147999
7108 1147999 1179936 1244396 1304818 1306368 1234679 1310158 1350068 1421553 1448230 1417450 1460080 1466170
7096 1466170 1510945 1460936 1495052 1555783 1561766 1570224 1601136 1621878 1631896 1638067 1608660 1568826
7084 1568826 1676226 1789473 1861923 1869305 1893871 1922344 2026133 2057173 2097029 2166733 2223168
7073 2223168 2301081 2293479 2275072 2334906 2414027 2510018 2512144 2489626 2431409 2396801 2442335 2507715
7061 2507715 2540266 2577833 2571364 2656880 2657166 2634503 2686562 2700477 2688954 2682899 2755872 2835613
7049 2835613 2872510 2886755 2922314 2981788 3037835 3123247 3159316 3195303 3309950 3419427 3559502
7038C559502p719N8920J2059L2707N4593M3948J2406P8921J46652K7493n6046
7027C963436L00P3680J06858k4003j8754Q2197Q8107N102O6767M2113K6927M3829
7015D456559O4408L0755q8500n7180Q3736J28271Q4850Q0129M5597N7711J46846
7004E033182M4080K9595J05023J40000Q9305J06424J27889J75317J48907J37636
6994F137358J63833O7340J46499J37733P7090K07108J51601N3895K6698k5466
6984G143689n2196j9808j11391r2906j51725j12438k3028j60485o7249o6737O8973
6973F354699j2831p7111K1458J48975J04269r11J60073K21991J68356J34207J40255
6962G363430K40558K45425O6532J05917K22602K55342K40241K39459R5579J5763
$$ plain form
7038 3559502 3551783 3610703 3622762 3655469 3710062 3754010 3766416 3845337 3991989 4019482 3963436
7027 3963436 3963736 4037416 4144274 4120271 4101517 4183714 4271821 4276923 4343690 4385803 4412730 4456559
7015 4456559 4520967 4551722 4463222 4406042 4489778 4618049 4702899 4783028 4828625 4886336 5033182
7004 5033182 5077262 5106857 5211880 5351880 5441185 5547609 5675498 5850815 5999722 6137358
6994 6137358 6301191 6368531 6515030 6652763 6729853 6936961 7088562 7142457 7169155 7143689
6984 7143689 7091493 7071685 6960294 6867388 6715663 6603225 6580197 6419712 6352463 6285726 6354699
6973 6354699 6341868 6264757 6286215 6435190 6539459 6538548 6698621 6920612 7088968 7223175 7363430
6962 7363430 7603988 7849413 7915945 8021862 8244464 8499806 8740047 8979506 9075085 9090848
6952I090848K4241j03774j51371j77960k54757l33753l41606l01577j60333j09645
6942G180313k19160j53118j31860j32349m8420q0840M986j7320l7020L6315P2324
6931F473851J15088J78028Q6701P1647J00834J62479J82687K12634J86540K01683
6921G972172J70595P8640J6925j39165k10826j80822k54055k56395k55908k46263
6911F694898l21618k32815j84041k29239j40070j67152l7471k3587j14679n9468
6901E184758k7769L1844J17343k2847K0257m045J3578Q301M009K9442L3767M4260
6889E432898L5763R9873J1270M9666L7677j3863p9741r8629j78371j78767j43754
6878D974022r1758r8994j20201p4771p0681k4710l6440M517k1191J15552R540
$$ plain form
6952 9090848 9115089 9011315 8859944 8681984 8427227 8093474 7751868 7450291 7289958 7180313
6942 7180313 6961153 6808035 6676175 6543826 6495406 6414566 6419552 6402232 6365212 6401527 6473851
6931 6473851 6588939 6766967 6853668 6925315 7026149 7188628 7371315 7583949 7770489 7972172
6921 7972172 8142767 8221407 8238332 8099167 7888341 7707519 7453464 7197069 6941161 6694898
6911 6694898 6373280 6140465 5956424 5727185 5587115 5419963 5382492 5358905 5244226 5184758
6901 5184758 5156989 5188833 5306176 5283329 5303586 5299541 5313119 5321420 5325429 5354871 5388638 5432898
6889 5432898 5468661 5568534 5579804 5629470 5667147 5653284 5573543 5474914 5296543 5117776 4974022
6878 4974022 4882264 4783270 4663069 4588298 4517617 4492907 4456467 4460984 4439793 4555345 4564885
6867D564885m2960m783M1505p0005k4939J20392M7880K740k4312N7666p832n3597
6855D606640p9319o2451M9326m0757L6068m1307q8372o563m5747l7241j4219o2431
6843D213627n6189N5704p6616j33777n55M3097o330L9531L296J0348M1781J34892
6831D268809L6068n0447r3188l5124L00o1166K7984j2776p1890k3413k0454l5431
6819C929272o3983M755o3530n2292p4273j01414m6903J8047j8856j4254o8006
6808C448563m8296Q259j28494j24434K1929Q3010j7113k6314n7159n1376l3935
6797C074640J1530l3527j3709Q6008k7483l1873o3349l6269j05601j8339l487
6786B838541o2707q0354n5167L0326q0046j9609n452l8436l0259J6802l1892m4996
$$ plain form
6867 4564885 4521925 4517142 4558647 4488642 4463703 4584095 4631975 4634715 4610403 4668069 4660237 4606640
6855 4606640 4527321 4464870 4514196 4473439 4509507 4468200 4379828 4373265 4327518 4290277 4276058 4213627
6843 4213627 4157438 4213142 4136526 4002749 4002194 4045291 4038961 4078492 4081788 4092136 4133917 4268809
6831 4268809 4304877 4254430 4161242 4126118 4126418 4065252 4093236 4080460 4008570 3985157 3964703 3929272
6819 3929272 3865289 3870044 3806514 3754222 3679949 3578535 3531632 3549679 3530823 3516569 3448563
6808 3448563 3400267 3408526 3280032 3155598 3177527 3260537 3243424 3217110 3159951 3108575 3074640
6797 3074640 3086170 3052643 3038934 3124942 3097459 3065586 3002237 2965968 2860367 2842028 2838541
6786 2838541 2775834 2695480 2640313 2670639 2590593 2570984 2565532 2527096 2496837 2513639 2481747 2436751
6774B436751n6280L2680q8677m7489N0088k1453j06130j9528k2270J5839K0363
6763B193894J2144K1483l9391l2263k3925J552k6241p7571n5704p4652J2812q39
6751A911299r8170l4893j6970k2478n2667o0442o6732J3735L946L1593o6420m9626
6739A492175N0634o5516j3514n7161p5804P2244l4546l9875O296l7939M2326m8414
6727A290906M1945k3650p5301J2885j0719m7900J0807O2850j5696o1787l2872
6716A151468j8652m0400j471k1228J9297l344o5576o2218q4452N230K1295K3575
6704I23524J7578J3201o2948J2737K4063j0147K7373J991R160m1363J1242j1432
6692I14979M3599M8213o2766j6783L130k1791o1645k4321N1393o9932L0295L9669
$$ plain form
6774 2436751 2380471 2413151 2324474 2276985 2327073 2305620 2199490 2179962 2157692 2173531 2193894
6763 2193894 2206038 2227521 2188130 2155867 2131942 2133494 2107253 2029682 1973978 1899326 1912138 1911299
6751 1911299 1813129 1778236 1761266 1738788 1686121 1625679 1558947 1572682 1576628 1608221 1541801 1492175
6739 1492175 1542809 1477293 1463779 1406618 1330814 1403058 1368512 1328637 1334933 1296994 1339320 1290906
6727 1290906 1332851 1309201 1233900 1246785 1236066 1188166 1198973 1261823 1246127 1184340 1151468
6716 1151468 1132816 1092416 1090945 1069717 1089014 1085670 1020094 957876 873424 878654 899949 923524
6704 923524 941102 954303 891355 904092 928155 918008 945381 947372 956532 915169 926411 914979
6692 914979 958578 1006791 944025 927242 930372 908581 846936 822615 874008 804076 834371 874040
6680H74040M0575j2534n6913l8763k4044j6215N6508K0603r524k0105l9423k9140
6668G45065J1809N6109R46L057q0456M586J314K640M3167J6322K2823l6341l4672
6655G56369N4608k1637m4511L8776j00271k9094J7391M5723j9170N003j556J3660
6643G15291l8698j3759K8561o936J0950O3798N279n853Q846j361M4233K2302m2514
6630G90139L2930J6396n8679L0601L2668K6459o6536l6095R334K0220l3421K2250
6618G86266J9966J02218k6165k869k2018n818J2290J5917J58644J3220Q8857O2838
6606A203346Q3586O3034R2962K14266N2920M972J06223J7835l6590o8744r6183
6595A637627q5649j10050n6979l8777J2995n7166K0295O583j2353O2963P3158
$$ plain form
6680 874040 914615 902081 845168 806405 782361 766146 822654 843257 833733 813628 774205 745065
6668 745065 756874 812983 813929 816986 736530 741116 742430 745070 788237 804559 827382 791041 756369
6655 756369 810977 789340 744829 783605 683334 654240 671631 717354 698184 703187 701631 715291
6643 715291 676593 662834 691395 684459 695409 759207 764486 758633 767479 766118 810351 832653 790139
6630 790139 823069 839465 780786 811387 844055 870514 803978 767883 777217 797437 764016 786266
6618 786266 806232 908450 882285 879416 857398 851580 863870 879787 1038431 1051651 1140508 1203346
6606 1203346 1286932 1349966 1442928 1657194 1710114 1715086 1821309 1839144 1802554 1733810 1637627
6595 1637627 1551978 1441928 1384949 1346172 1359167 1302001 1322296 1328879 1316526 1379489 1452647
6584A452647K0579L7779R9880J13819P8198o4115p021r4024l9470m1778j93016
6573A363478j37196k6671m7229r6914l2542j8092j2654m4170L2714m4015o8546
6562H68163m1915L0988K9351m9379m9332j2901N2169M82m0213k9378q307M6877
6550G96605O435k2191J016N2598K2243j4275k0963M879n7069m1551j012m2874
6538F83841K522N831L3Q755o6072j6407K5471k9137N4851k9105O2472k7696o86
6525F74673n4736K232O9138r285r183l9867K5229k1887J7875K2580p82k7477N8086
6512G06596k4032j2888M2622K7055L3377l3702K4040l034L2385k3913r0181q044
6500F70281M9743l5900m1159l9544k1939L6696J7630J0443j671O3142K5144j2051
$$ plain form
6584 1452647 1473226 1511005 1610885 1724704 1802902 1738787 1731766 1637742 1598272 1556494 1363478
6573 1363478 1226282 1199611 1152382 1055468 1022926 1004834 992180 948010 980724 936709 868163
6562 868163 826248 857236 886587 837208 787876 774975 827144 827626 787413 758035 749728 796605
6550 796605 803040 780849 781865 834463 856706 842431 821468 826347 769278 727727 726715 683841
6538 683841 686363 692194 692227 700982 634910 618503 643974 614837 669688 640583 703055 675359 674673
6525 674673 619937 622169 691307 682022 672839 632972 658201 636314 654189 676769 675987 648510 706596
6512 706596 682564 669676 712298 739353 772730 739028 763068 760034 792419 768506 678325 670281
6500 670281 720024 684124 642965 603421 581482 618178 635808 646251 644580 707722 732866 720815
6488G20815j1809j9780M1268N148K2666n561l3538J2178L158J3805r7218Q908
6476F60040N9410J0470l5386L0494M0858K718J7779j5113l143r072l9357n3294
6464F66404J110K9037P4804m3340K7534P1766m9870k9206N562q138k7760L3465
6452G51368K3401P7696m6104j0063O4104K6075k506o971L942L0107l1202k1018
6440H58829l3934N3982M1476k0621O4762M9755n4525M5043O0550m3720j7464n5129
6428I49004Q3461M979o945J2436K205L1596O432M7664M0836J2245k3731j8611
6416A141571O918M8686j7995l608M7435q836l2271j8119O8914J2685k7457l504
6404A214419J6519M6959P8143R612P102k7095j7598J1350j8196k416K4357K1665
$$ plain form
6488 720815 709006 689226 730494 735642 758308 752747 719209 731387 734545 748350 651132 660040
6476 660040 719450 729920 694534 725028 765886 768604 786383 771270 768127 759055 719698 666404
6464 666404 667514 696551 771355 728015 755549 827315 777445 748239 753801 745663 717903 751368
6452 751368 774769 852465 806361 796298 860402 886477 883971 877000 880942 911049 879847 858829
6440 858829 824895 878877 920353 899732 964494 1014249 959724 1004767 1065317 1021597 1004133 949004
6428 949004 1032465 1037444 1030499 1042935 1045140 1076736 1083168 1130832 1171668 1183913 1160182 1141571
6416 1141571 1148489 1197175 1179180 1175572 1223007 1214171 1181900 1163781 1232695 1245380 1217923 1214419
6404 1214419 1230938 1277897 1356040 1365652 1372754 1345659 1328061 1339411 1321215 1318799 1343156 1364821
6392A364821j9804n2946N0631J914j6205o9050j8770j3977L924L3364K4809l2456
6380A256255J2396R8666k7838j15680M5092N9657R7O4315l0760j1265K6108p9008
6368A298035N516J7389L693P4650n4398k3313N0829p0309n1110M8000M8275j0076
6356A337181M614o3769r7865N4015K4726l169P2539O7029K3596n8110l596n8377
6344A298814p1580N463M3607n3807l9786K2413K5319J7442j1420J6956P490o953
6332A253958j8072P8336j688J3843J9359k4776K1885K0408M986m817O18K4065
6320A388105M4568Q97Q885P54l5982k8294o0400Q5070O8896M4658J3573j1065
6308A519665j7461K4874p0746l5228O6977Q367l631j2838p3011O4108l4005j40515
$$ plain form
6392 1364821 1345017 1292071 1342702 1344616 1328411 1259361 1240591 1226614 1230538 1263902 1288711 1256255
6380 1256255 1268651 1367317 1339479 1223799 1268891 1328548 1328645 1392960 1362200 1350935 1377043 1298035
6368 1298035 1303551 1320940 1324633 1399283 1344885 1321572 1372401 1302092 1250982 1298982 1347257 1337181
6356 1337181 1341795 1278026 1180161 1234176 1258902 1255733 1328272 1395301 1418897 1360787 1357191 1298814
6344 1298814 1227234 1232697 1276304 1222497 1182711 1205124 1230443 1247885 1236465 1253421 1260911 1253958
6332 1253958 1235886 1314222 1312534 1326377 1345736 1320960 1342845 1363253 1368239 1363422 1364040 1388105
6320 1388105 1432673 1433570 1442455 1443209 1407227 1378933 1318533 1403603 1472499 1517157 1530730 1519665
6308 1519665 1502204 1527078 1456332 1421104 1488081 1496448 1492817 1479979 1406968 1471076 1437071 1296556
6296A296556n1447Q6137M0006O1425j7806p3795l2792K0383L6226l9944m3966
6285A280983Q7983j4890l8570K1238j9754M3086N64l1068O1241j7178o9783O3448
6273A367300J9686j8069M25L1766P748N3250K8767m8473l7375l3795N6932K743
6261A430905o539n1744k7125P4873k1466O117l2490L7334L2548M1458o5430k081
6249A416360N6713J6016j388J1418q484R762j2523k5602L2624Q467k4578K7011
6237A505796m2323l4974j6479n9894P8326Q1854j8602j7258J1504k6651L3430
6226A494729o9705L2236M1513m9433P461j9389L63L3457j0333m0939p832j3305
6214A398823N5937k4610k1635K9795J6434O433L7978O8048l4599M118P4525R644
$$ plain form
6296 1296556 1245109 1331246 1371252 1432677 1414871 1341076 1308284 1328667 1364893 1324949 1280983
6285 1280983 1368966 1354076 1315506 1336744 1316990 1360076 1360640 1329572 1390813 1373635 1303852 1367300
6273 1367300 1386986 1368917 1369342 1401108 1408856 1462106 1490873 1442400 1405025 1371230 1428162 1430905
6261 1430905 1424366 1372622 1345497 1420370 1398904 1405021 1372531 1409865 1442413 1483871 1418441 1416360
6249 1416360 1473073 1489089 1487701 1499119 1490635 1500397 1487874 1462272 1494896 1503363 1478785 1505796
6237 1505796 1463473 1428499 1412020 1352126 1430452 1512306 1493704 1476446 1487950 1461299 1494729
6226 1494729 1425024 1457260 1498773 1449340 1456801 1437412 1437775 1471232 1460899 1419960 1412128 1398823
6214 1398823 1454760 1430150 1408515 1438310 1454744 1461177 1499155 1567203 1532604 1536722 1611247 1620891
6202A620891M662Q560L2290M7664m0505n940Q2225O585J291P3114R2641K3728
6190A947206M5026L8714J04879K0758L6789L9506N0768R5764J2818J663O1765
6179B455656Q2232L465k5502l7564P2159K2875J1321O9886P0854Q0349J4705N0568
6167B871004J6254L585N2840N4580Q4918M7050p5019K9311o581J9358j4672q272
6155C074356k8600m1312N305P1674P173k8158P6522J02254m1289o9M4383q6487
6143C155752K8789r983J0415M858J2185j4939j14188l0220M360m9497l915j5725
6131B977892n7464O7935k301r5047Q1483O3743J7137o4867M546N1753j4204k6855
6119C003751n6829n2615P6855P6686K7896K9035o0788P1132P3963l9730q4926
$$ plain form
6202 1620891 1625553 1634113 1666403 1714067 1673562 1667622 1749847 1756432 1757723 1830837 1923478 1947206
6190 1947206 1992232 2030946 2135825 2156583 2193372 2232878 2283646 2379410 2392228 2393891 2455656
6179 2455656 2537888 2541353 2515851 2478287 2550446 2573321 2584642 2654528 2725382 2805731 2820436 2871004
6167 2871004 2887258 2890843 2943683 2998263 3083181 3130231 3055212 3084523 3077942 3097300 3082628 3074356
6155 3074356 3045756 3004444 3009749 3081423 3088596 3060438 3136960 3239214 3197925 3197856 3242239 3155752
6143 3155752 3184541 3174558 3184973 3189831 3202016 3187077 3072889 3042669 3047029 2997532 2993617 2977892
6131 2977892 2920428 2988363 2986062 2891015 2972498 3036241 3053378 2988511 2993057 3044810 3030606 3003751
6119 3003751 2946922 2894307 2971162 3047848 3075744 3104779 3043991 3115123 3189086 3149356 3064430
6108C064430j3727P9283m2107L4428K2607M9767L5145J23117N0659J23287R4295
6097C621184N5978M0460J21712J62501J77583Q3222O2939N5806J05754L2365L6264
6086D555768J21444m705J57588J53340J18030J73161K77854K97052L18437L81201
6076F549170M08079N25983O48700O48229O64580O25536N31946L24579j3473j43609
6066A0769720k86405l12588k91600k27785j28529o2862J12473J92043J82704K38822
6056A0185993K95724L60138N64752P00053P00202O78491O57741M60796K52263
6047A4856153L4592k01293l11080m37374m44940l38403l90714m99120m90313m18559
6037A1358949m73444l58073k07989r8824q992M7925Q2837J95698L33155N12297
$$ plain form
6108 3064430 3050703 3129986 3087879 3122307 3144914 3194681 3229826 3352943 3403602 3526889 3621184
6097 3621184 3677162 3717622 3839334 4001835 4179418 4262640 4325579 4381385 4487139 4519504 4555768
6086 4555768 4677212 4672507 4830095 4983435 5101465 5274626 5552480 5849532 6167969 6549170
6076 6549170 6957249 7483232 8131932 8780161 9444741 10070277 10602223 10926802 10913329 10769720
6066 10769720 10483315 10170727 9879127 9651342 9522813 9459951 9572424 9764467 9947171 10185993
6056 10185993 10481717 10841855 11406607 12106660 12806862 13485353 14143094 14603890 14856153
6047 14856153 14890745 14689452 14378372 13940998 13496058 13157655 12766941 12267821 11777508 11358949
6037 11358949 10885505 10527432 10319443 10220619 10211627 10259552 10342389 10538087 10871242 11383539
6027A1383539M82208M69949K18980j7065l84771o87270q14619q08757p73364p51461
6017H317369o27103n17785m08166l44441l25106l21210k33861k03252k49745j11387
6007D975313p2462j20133j38016q1382q6859p4632n5963rJ3945j7886m6309l8290
5995D257317j7399n6326M1811p9580j06337j6769m3690n8868k1452j313l2403
5984C864991l4090M6170M2245M5842l866j3615n992P6143Q308m6333l6816M182
5972C947169J241L9274q404o997n7593n02J22385J6262K7968j6687n776J2609
5960D070949L5527L9190M1189O0298j6123J6188L8856Q41K2727J7903j4525J8021
5948D331041m0997L5869L9336j01924k9256L2437L8798q065J07076L2339l848
$$ plain form
6027 11383539 11865747 12335696 12554676 12537611 12152840 11465570 10650951 9842194 9068830 8317369
6017 8317369 7690266 7172481 6764315 6419874 6094768 5773558 5539697 5336445 5086700 4975313
6007 4975313 4902851 4782718 4644702 4563320 4476461 4401829 4345866 4345857 4359802 4341916 4295607 4257317
5995 4257317 4239918 4183592 4225403 4145823 4039486 4022717 3979027 3920159 3898707 3897394 3864991
5984 3864991 3830901 3877071 3919316 3965158 3961292 3947677 3941685 4017828 4026136 3979803 3942987 3947169
5972 3947169 3948410 3987684 3979280 3972283 3914690 3914188 4036573 4052835 4080803 4064116 4058340 4070949
5960 4070949 4106476 4145666 4186855 4247153 4231030 4247218 4286074 4286915 4309642 4327545 4313020 4331041
5948 4331041 4290044 4325913 4365249 4263325 4234069 4266506 4305304 4297239 4404315 4436654 4432806
5937D432806Q0516K7037N2996N8501O649m5446Q2363K6148j1083r837L9234J9810
5925D759694J3354K3742O2678K3513l9290J19525K0146Q2409j5044j1467j8271
5914E020989J3637Q7250R2061J7012J5646M5176L0557N0709Q15P4406Q5976O7134
5902E601368l03l087k5974M4381O7131L59K5766N899n6747L0770r614m0521L4962
5889E674390R5599l4855M3228j3831L5482R1491k5475N3599O7033L3093Q1669
5878F101423M4110O0452J3553J4946J04248J0571L1494L5303K218l7120J9146
5867F400344j01417N2013j9877J2271J08355k8661j7615j23246J9384J02773P000
5856F411324o7194r827N4887L5823J3649N4576R1743M5727J01590J03963O6911
$$ plain form
5937 4432806 4513322 4540359 4593355 4651856 4658505 4613059 4695422 4721570 4710487 4700650 4739884 4759694
5925 4759694 4773048 4796790 4859468 4882981 4843691 4963216 4983362 5065771 5050727 5039260 5020989
5914 5020989 5034626 5121876 5213937 5230949 5246595 5291771 5322328 5373037 5373852 5448258 5534234 5601368
5902 5601368 5601065 5597978 5572004 5616385 5683516 5683875 5709641 5715540 5658793 5689563 5679949 5639428 5674390
5889 5674390 5769989 5735134 5778362 5764531 5800013 5891504 5866029 5919628 5986661 6019754 6101423
5878 6101423 6145533 6205985 6219538 6234484 6338732 6349303 6380797 6416100 6418318 6381198 6400344
5867 6400344 6298927 6350940 6331063 6343334 6451689 6423028 6405413 6282167 6301551 6404324 6411324
5856 6411324 6344130 6334303 6389190 6425013 6438662 6493238 6584981 6630708 6732298 6836261 6903172
5845F903172P8252J34326P4286O7007J05921J46750R0333Q0752J07648P3371O0711
5834G922529O7748j1233N4925O1047J37625R6428R2787Q2791J17156P1537M6356
5823H739696P0304R3992J17819L572O8636j3061M1752O7770J00658R2736J8699
5812I402573N4345J37053J30839J20164R5580J13387N7898N9773J64494K08401
5802A0544507J13517J45139J77738J24447K41430K50263J91601J67236K35598
5793A2191476L08546K42242L37750K72021M03027L27164L30600L48340K46534
5784A5007700L01581L94848M24570M52863M33971M36125O13850O14087O62553
5775A9342148Q00638Q00298J016040J093619J208175J275492J097305R09285O87370
$$ plain form
5845 6903172 6981424 7115750 7190036 7257043 7362964 7509714 7600047 7680799 7788447 7861818 7922529
5834 7922529 7990277 7979044 8033969 8095016 8232641 8329069 8421856 8504647 8621803 8693340 8739696
5823 8739696 8810000 8903992 9021811 9025383 9094019 9080958 9122710 9190480 9291138 9383874 9402573
5812 9402573 9456918 9593971 9724810 9844974 9940554 10053941 10111839 10171612 10336106 10544507
5802 10544507 10658024 10803163 10980901 11105348 11346778 11597041 11788642 11955878 12191476
5793 12191476 12500022 12742264 13080014 13352035 13755062 14082226 14412826 14761166 15007700
5784 15007700 15309281 15704129 16128699 16581562 17015533 17451658 18065508 18679595 19342148
5775 19342148 20142786 20943084 21959124 23052743 24260918 25536410 26633715 27543000 28230370
5766B8230370O19096Q32367J083041J496692J767035J543759N60562q63513j708058
5757C3561351j826694j616995j250604p51503m56198k37824j17447l0588N479
5748B7278977J59495J94249K18175J3954j42034l21211n51227o44892o65555o31742
5738B4908189n30755n34894l82628l20928k50614j96060j73581p3504M6239J09427
5728B2600891J97550L76314L72987L24842O9281o3564l06255n15225m94615n41420
5718B2020786m49591l39740k84441k70716j80556j90191j87533j47355n5403l320
5708A9911940k837Q2464L9038L9521J18095M0762J36889M2364R740N3297J17238
5697B0588511K17073K33094J45706K37241M20595K49096J56161K11402K30354
$$ plain form
5766 28230370 28849466 29681833 30764874 32261566 34028601 35572360 36132922 35269409 33561351
5757 33561351 31734657 30117662 28867058 28115555 27659357 27421533 27304086 27273498 27278977
5748 27278977 27438472 27632721 27850896 27864850 27722816 27401605 26850378 26205486 25539931 24908189
5738 24908189 24377434 23842540 23459912 23138984 22888370 22692310 22518729 22445225 22491464 22600891
5728 22600891 22798441 23174755 23547742 23872584 23941865 23878301 23572046 23056821 22562206 22020786
5718 22020786 21571195 21231455 20947014 20676298 20495742 20305551 20118018 19970663 19915260 19911940
5708 19911940 19909103 19991567 20030605 20070126 20188221 20228983 20365872 20408236 20417976 20471273 20588511
5697 20588511 20805584 21038678 21184384 21421625 21842220 22091316 22247477 22458879 22689233
5688B2689233J95275J53188J66593L26608L17366L68638L87721N11945N61435
5679B5678002O61251P58103Q18292Q57752R07902R27956R47307R91576P73818
5670C3321959P19734O53183N83063O69935P79111Q69825J050689J332742J492735
5661D1472976J617142J598662J331487J017706P10071K93578R9033N6411j4449
5652D8182617O3093J68728J04931k2556j31907m45370p46054j012993j152624
5643D5007865j229384j266093j129246r71501q17320p23821p37294p18689n07040
5634C6907477n39890n81074n12184n05187n50153n54143o95738q72426q65907
5625C1230775q24513o75425n98185n37091m32984m22875l31685k95144k72924
$$ plain form
5688 22689233 22884508 23037696 23204289 23530897 23848263 24216901 24604622 25116567 25678002
5679 25678002 26339253 27097356 27915648 28773400 29681302 30609258 31556565 32548141 33321959
5670 33321959 34041693 34694876 35277939 35947874 36726985 37596810 38647499 39980241 41472976
5661 41472976 43090118 44688780 46020267 47037973 47748044 48041622 48140655 48197066 48182617
5652 48182617 48245710 48414438 48519369 48496813 48364906 47919536 47173482 46160489 45007865
5643 45007865 43778481 42512388 41383142 40411641 39594321 38870500 38133206 37414517 36907477
5634 36907477 36367587 35786513 35274329 34769142 34218989 33664846 32969108 32096682 31230775
5625 31230775 30406262 29730837 29132652 28595561 28162577 27739702 27408017 27112873 26839949
5616B6839949k38972m02479l94279m70711m27202m78798m71341m43651l63134
5607B3149382k56678k92839k26472k18660j61258k39983j68173k13428l12343
5598B1059548k08690k65427l15233k08800k26203j97488j56442r4843j9234p5502
5588A9291686k0000j5263j1574j1613J03208Q471J8153J3973j23144j38129j22910
5577A8992858j55870j93181j31388j70716m5405p0939q4479o7489o2231l9100
5567A7972060J9717j6704j9168P920K6134M5951p4135o928K5810p0163l9972o9765
5555A7800757j35974o5959r6218k05139j01522p5388n1700K4636k5449j06212
5545A6961832r73n088m1046o3966o1440l8983n8480q2042m2966j70260j27968
$$ plain form
5616 26839949 26600977 26198498 25804219 25333508 24906306 24427508 23956167 23512516 23149382
5607 23149382 22892704 22599865 22373393 22154733 21993475 21753492 21585319 21371891 21059548
5598 21059548 20850858 20585431 20270198 20061398 19835195 19637707 19481265 19386422 19367188 19291686
5588 19291686 19271686 19256423 19244849 19233236 19336444 19344915 19363068 19377041 19253897 19115768 18992858
5577 18992858 18836988 18643807 18512419 18341703 18296298 18225359 18140880 18073391 18011160 17972060
5567 17972060 17991777 17975073 17955905 17963825 17989959 18035910 17961775 17954847 17980657 17910494 17870522 17800757
5555 17800757 17664783 17598824 17502606 17297467 17195945 17120557 17068857 17093493 17068044 16961832
5545 16961832 16960859 16955771 16914725 16850759 16789319 16750336 16691856 16609814 16566848 16396588 16268620
5534A6268620l25051j30037j60086j77105j62543j44627j70233j81937k29717
5525A4587284j66631j50595k49939j97694j79165j44007j82940m8211j31154r6719
5515A3040229k9589n055m9460q3013k7944n3539q0120j4557r3420k1055r6963
5504A2485514l5135l845o0203r1777l9926p2097p1626j18994m375k348L5168R457
5492A2029813K4738k9996L5144J5472o2231J3199j0056N771L7340o5129L1414
5481A2025479n356M0342L8125N2867m2778m4798M0265J065M3403M1343o5870j2742
5469A2111345n4603o3694j37177j41429o6275j79654j96569j32222j35137j01523
5459A0903062o6504n2421r4587K0753p564L9217O4536k3350J4672K0422Q7677
$$ plain form
5534 16268620 15943569 15813532 15653446 15476341 15313798 15169171 14998938 14817001 14587284
5525 14587284 14420653 14270058 14020119 13822425 13643260 13499253 13316313 13268102 13136948 13040229
5515 13040229 13010640 13005585 12956125 12873112 12845168 12791629 12711509 12696952 12603532 12582477 12485514
5504 12485514 12450379 12446534 12386331 12294554 12254628 12182531 12110905 11991911 11987536 11985188 12020356 12029813
5492 12029813 12054551 12024555 12059699 12075171 12012940 12026139 12016083 12021854 12059194 11994065 12025479
5481 12025479 12020123 12060465 12098590 12151457 12108679 12063881 12104146 12105211 12148614 12189957 12124087 12111345
5469 12111345 12056742 11993048 11855871 11714442 11648167 11468513 11271944 11139722 11004585 10903062
5459 10903062 10836558 10784137 10689550 10710303 10702739 10741956 10806492 10783142 10797814 10818236 10905913
5448A0905913P6317k854K3502j6958o1110n1079o6014j34457j29703j9612k6227
5437A0497718j36531p4633M267j59067k3866j8261N1520l4148N5642K7946R6751
5426A0287338J6834J780N2126J7416o5260j5783k0979M555P4810j7739j4956N9311
5414A0379453l946k7651n7349l7735k8820k0608J90M39n7943q883K2635K5082
5402A0184864J6132K4306L2478K487P5365P695m5979k4674M2735m8230q9250p3199
5390A0104730l0525p981r4193r8117j18217m6626q8004p4104m1473n4817r1276
5379I359397l982M1395j7955m7002j7147N9737J3993L0418K0854j6661K8855o6454
5367I385448Q4890m6033k6527l4819M6076Q4793O3898J43168Q6237Q2170R3224
$$ plain form
5448 10905913 10982230 10979376 11002878 10985920 10924810 10873731 10807717 10673260 10543557 10523945 10497718
5437 10497718 10361187 10286554 10290821 10131754 10107888 10089627 10141147 10106999 10162641 10190587 10287338
5426 10287338 10304172 10305952 10358078 10375494 10310234 10294451 10273472 10278027 10352837 10335098 10320142 10379453
5414 10379453 10375507 10347856 10290507 10252772 10223952 10203344 10203534 10203973 10146030 10137147 10159782 10184864
5402 10184864 10200996 10225302 10257780 10260267 10335632 10343327 10297348 10272674 10315409 10267179 10177929 10104730
5390 10104730 10074205 10066224 9972031 9873914 9755697 9709071 9621067 9546963 9505490 9450673 9359397
5379 9359397 9355415 9396810 9378855 9331853 9314706 9374443 9388436 9418854 9439708 9423047 9451902 9385448
5367 9385448 9470338 9424305 9397778 9362959 9409035 9493828 9557726 9700894 9787131 9869301 9962525
5356I962525J13838J53091K29754K31944L44594M60802N03783O34286P81472R90849
5346A4406938J237939J472974J486962J282802R60053K42850l96125j076223j545238
5337A8072932j646875j541972j357731j034697q67226p55070o64288n20031m31879
5328I253163l31830k47652k51204k58847j57301j54628j78737p1640j00043q2234
5318G419047r3763j06300n4689q5679M9462R596J9472M7946N8638K3359L2546
5307G319635K7364j8958p1166r2558j13241r3426k05743j64304n9773m8087j31427
5296F348316j65947n0160j7312k8769n827j1582m488p0587r7617r355j7504L5311
5284E904479K1804n0493j8490m0714L1233j1918K5859k7797j10872J6387J8354
$$ plain form
5356 9962525 10076363 10229454 10459208 10691152 11035746 11496548 12000331 12634617 13416089 14406938
5346 14406938 15644877 17117851 18604813 19887615 20847668 21090518 20694393 19618170 18072932
5337 18072932 16426057 14884085 13526354 12491657 11624431 10869361 10205073 9685042 9253163
5328 9253163 8921333 8673681 8422477 8163630 8006329 7851701 7672964 7601324 7501281 7419047
5318 7419047 7325284 7218984 7164295 7078616 7128078 7137674 7157146 7205092 7263730 7287089 7319635
5307 7319635 7346999 7328041 7256875 7164317 7051076 6957650 6751907 6587603 6527830 6479743 6348316
5296 6348316 6182369 6132209 6114897 6086128 6080301 6068719 6064231 5993644 5896027 5886672 5869168 5904479
5284 5904479 5926283 5875790 5857300 5816586 5847819 5835901 5861760 5833963 5723091 5739478 5757832
5273E757832m8069j1832P176q778p1851j8014Q5538Q433j03089n5500L9712l0952
5261E550606j6224N4363p6884j23227O0502P3390J911l8675P660p0063n5056K6248
5249E394551J6153o1123M0007O2546N1025m9498M2466R6526M153l056K4602o75
5237E617677m6890R6691J00786K6115R1597r812l0577Q6175J5230K5604M7996
5226F020592J52421j7491k3533L4539K9656J5593M1788M1810k2386k0434K1557
5215F274112r276m7632j3540m06N7867l936j5452N8228m5615J4950J05059J8938
5203F393297j2595K7790q011n5091M979l5691p044N4521j6244L289M5901M548
5191F399649m2601k2879N1616l7142N2156P9282Q404M993P8351R146N419K3946
$$ plain form
5273 5757832 5709763 5697931 5705107 5696329 5624478 5606464 5692002 5700435 5597346 5541846 5581558 5550606
5261 5550606 5534382 5588745 5511861 5388634 5449136 5522526 5524437 5485762 5493422 5423359 5368303 5394551
5249 5394551 5410704 5349581 5389588 5452134 5503159 5453661 5496127 5592653 5596806 5593750 5618352 5617677
5237 5617677 5570787 5667478 5768264 5794379 5885976 5876164 5845587 5931762 5946992 5972596 6020592
5226 6020592 6173013 6155522 6131989 6166528 6196184 6211777 6253565 6295375 6272989 6252555 6274112
5215 6274112 6264836 6217204 6203664 6203258 6261125 6257189 6241737 6299965 6254350 6269300 6374359 6393297
5203 6393297 6380702 6408492 6400481 6345390 6350369 6314678 6307634 6362155 6345911 6349200 6395101 6399649
5191 6399649 6357048 6334169 6385785 6348643 6400799 6480081 6488485 6493478 6571829 6580975 6586394 6610340
5179F610340N5818J6285P7685l1730j064Q8385L7478J3962L7892K6259j8454j3544
5167F899312J4056K5691K9195L3603R1849K7653j2850l8091M0300R4043J00665
5156G305426j3459q229J03768L139J5898N3570k6152l8072O2748M0088L3085J5621
5144G547431L9555L1880m2953O7821l5017R7165m878k4426L1463p9305K599J4345
5132G645680j1977m2981k3817j3243m6580p691r412k566Q9146P118m7071o3639
5120G472967L3936N5780l5415r9163R556K1134l0296J7071K7481J2200l2890n2117
5108G400244Q6983j43993j8753L88p3397n6269j04020j9359n672K0273L2761p3020
5096G046166K1502p811J871l8519J3355P5767J9136J7118l4203m0292l7379l7719
$$ plain form
5179 6610340 6666158 6682443 6760128 6728398 6727334 6815719 6853197 6867159 6905051 6931310 6912856 6899312
5167 6899312 6913368 6939059 6968254 7001857 7093706 7121359 7108509 7070418 7110718 7204761 7305426
5156 7305426 7291967 7283738 7387506 7390645 7406543 7460113 7433961 7395889 7458637 7498725 7531810 7547431
5144 7547431 7586986 7618866 7575913 7643734 7608717 7705882 7701004 7676578 7708041 7628736 7631335 7645680
5132 7645680 7633703 7590722 7566905 7553662 7507082 7499391 7489979 7487413 7576559 7583677 7536606 7472967
5120 7472967 7506903 7562683 7527268 7428105 7437661 7458795 7428499 7445570 7473051 7485251 7452361 7400244
5108 7400244 7487227 7343234 7324481 7324869 7251472 7195203 7091183 7071824 7066152 7086425 7119186 7046166
5096 7046166 7067668 7059857 7061728 7023209 7036564 7112331 7131467 7148585 7114382 7074090 7036711 6998992
5084F998992l5071m2109q4116r2705n9397o8118j63309j15182J9024n3684q2361
5073F221964o5236o4095l059j1994k2789n5029p9444O011L9782r3953l9637l4297
5061E798224p4945R994j1653K3291r813r389K223N0148j9970j5460l646J4714
5049E753718R6154L9495J7260p681M4729N4314L3656L5911o795K809J0383M4963
5037F118916m2373N386L3633K3745n3828m0708j9754O595P1425L4405M226J5347
5025F157015N29K6654Q807K0991k1440K8926O8436j0165N7920J06382M6627l1855
5013F458827L9919n611k7045o477R151J9774j3769n3501K7033J7565P1202J5655
5001F552723L1652K4452M0636Q0978q973L5686M8878m2928n2098j5292k1733l4851
$$ plain form
5084 6998992 6963921 6921812 6837696 6744991 6685594 6617476 6454167 6338985 6358009 6304325 6221964
5073 6221964 6156728 6092633 6089574 6077580 6054791 5999762 5920318 5926329 5966111 5872158 5832521 5798224
5061 5798224 5723279 5733273 5721620 5744911 5735098 5725709 5727932 5778080 5758110 5742650 5739004 5753718
5049 5753718 5849872 5889367 5906627 5898946 5943675 5997989 6031645 6067556 6060761 6063570 6073953 6118916
5037 6118916 6076543 6081929 6115562 6139307 6085479 6044771 6025017 6031612 6103037 6137442 6141668 6157015
5025 6157015 6157544 6184198 6193005 6213996 6192556 6221482 6289918 6279753 6337673 6444055 6490682 6458827
5013 6458827 6498746 6493135 6466090 6459613 6468764 6488538 6474769 6421268 6448301 6465866 6537068 6552723
5001 6552723 6584375 6608827 6649463 6730441 6721468 6757154 6806032 6763104 6711006 6695714 6673981 6639130
4989F639130j2103j26142L206R873k5038m6084L1322J8316J5429q6699l7536R918
4977F393592J6586L3139J1010M8208N892j0104j8148j3073Q3950L4391L5195N051
4965F625689P2999L6783P3320N8965M6421M6559J5543J07258O585K3441M9606
4954G163169Q1609K8122Q098J4588K1599K467N0340L0567j8082L2245M3425R4176
4942G552323M6309K7623Q784N0964M4544O9364J39422J9076R6707J1824O2099
4931H129039N0855N2749P0426J0909k2983O0183K0149j210m198M0013J31273N5292
4919H592497l9116l526J13976J8291P5782L8049L4375P4497M3339J09983N8749
4908I116896P5768J02398q560J31110J09612L4405J13662O0389N8132J21086J18416
$$ plain form
4989 6639130 6627027 6500885 6504091 6513964 6488926 6442842 6474164 6492480 6507909 6421210 6383674 6393592
4977 6393592 6410178 6443317 6454327 6502535 6508427 6498323 6480175 6467102 6551052 6585443 6620638 6625689
4965 6625689 6698688 6735471 6808791 6867756 6914177 6960736 6976279 7083537 7090122 7113563 7163169
4954 7163169 7244778 7272900 7280998 7295586 7317185 7319652 7369992 7400559 7382477 7414722 7458147 7552323
4942 7552323 7598632 7626255 7635039 7686003 7730547 7799911 7939333 7958409 8055116 8066940 8129039
4931 8129039 8179894 8232643 8303069 8313978 8290995 8351178 8371327 8370117 8365919 8405932 8537205 8592497
4919 8592497 8553381 8549855 8663831 8682122 8757904 8795953 8830328 8904825 8948164 9058147 9116896
4908 9116896 9192664 9295062 9286502 9417612 9527224 9561629 9675291 9735680 9793812 9914898 10033314
4897A0033314K4292O9382R5260R4360J04417J24626J15489J02600O6508M4350
4887A0874598J40823J72818O5765J48322J25659J76136J07483Q0257K8765N3241
4877A1973867M8292p292R6688Q8654J03739N4038P3623K19678J76345J35279K11173
4866A3174084K50030K82948K39303J59594J79699K19841J56523J19935J35560
4857A4917517J31067J40428K60197J87352K00433J49775K11235L07531L58218
4848A6863753L96783L48208M66726N90889P10116Q10350J076881J342164J574318
4839B4180188J883573J929439J466653M40980r80323j609079j682930j375384
4831B4253117j101599q14632n36146l92749j78874j42444l9909k5746o0567M8708
$$ plain form
4897 10033314 10057606 10126988 10222248 10316608 10421025 10545651 10661140 10763740 10830248 10874598
4887 10874598 11015421 11188239 11254004 11402326 11527985 11704121 11811604 11891861 11920626 11973867
4877 11973867 12022159 12014867 12111555 12200209 12303948 12357986 12431609 12651287 12827632 12962911 13174084
4866 13174084 13424114 13707062 13946365 14105959 14285658 14505499 14662022 14781957 14917517
4857 14917517 15048584 15189012 15449209 15636561 15836994 15986769 16198004 16505535 16863753
4848 16863753 17260536 17608744 18075470 18666359 19376475 20186825 21263706 22605870 24180188
4839 24180188 26063761 27993200 29459853 29900833 28920510 27311431 25628501 24253117
4831 24253117 23151518 22336886 21800740 21407991 21229117 21086673 21046764 21021018 20960451 21009159
4821B1009159P9043L4386Q1513J02470J38570L9278J0390k4037j28912j77614
4811B1164246j91783j43763j28683j2137L5240p4031k31254k44431l10358j75071
4801A9687975r4897j17687p7448M0711J37564P8266M8358n9878j15407j97793
4791A9329764l06068l20083j73699j48790j67383j31837j34514r6141m5157n0711
4781A7755381O3538R2288P9995M3102J9876Q7528J51085J19440J56310P0642J15976
4770A8755161J30585K04341J95722J65196J97046K49434K18192K43381J84354
4761B0543412K58656K55293K71914K36082L11628K91700L04730K77473J56566
4752B2907454J99774J85292J78620J73252P5397J29583J09334J4025N9376P0392
$$ plain form
4821 21009159 21088202 21122588 21204101 21306571 21445141 21484419 21494809 21470772 21341860 21164246
4811 21164246 20972463 20828700 20700017 20687880 20723120 20649089 20417835 20173404 19863046 19687975
4801 19687975 19593078 19475391 19397943 19438654 19576218 19654484 19702842 19642964 19527557 19329764
4791 19329764 19023696 18703613 18529914 18381124 18213741 18081904 17947390 17851249 17806092 17755381
4781 17755381 17818919 17911207 17991202 18034304 18054180 18141708 18292793 18412233 18568543 18639185 18755161
4770 18755161 18885746 19090087 19285809 19451005 19648051 19897485 20115677 20359058 20543412
4761 20543412 20802068 21057361 21329275 21565357 21876985 22168685 22473415 22750888 22907454
4752 22907454 23107228 23292520 23471140 23644392 23719789 23849372 23958706 23972731 24032107 24102499
4742B4102499m4623p383L6507L5325K9154r4707P044J6085N2688o0330o1929q828
4730B4001502r8847l9686q1793k6540l2305j03700p4499n3306j13514j41407j46401
4719B3089504j93288r7400k30554j38054j49328j86155k45045j66390j14700j15337
4709B1453253j22582j47526r1774q724r6904K3907j7735k4082q1433r8655n1505
4698B0736240n8055j1025l2497l9583n3891m7572O7374P6669J9588L4258P6920
4687B0768426P9772K3477N0128J64573J68810J23879R6336J80267J92068J66400
4677B2014136K02014J75960J70488J66096J11010J94913J78710P1331K7358K4346
4667B3336362k8164q0845n7270O7847Q3135M9591P9497P6233R6828J13507J88182
$$ plain form
4742 24102499 24057876 24050493 24087000 24122325 24151479 24056772 24063816 24079901 24132589 24072259 24010330 24001502
4730 24001502 23902655 23862969 23781176 23754636 23722331 23618631 23544132 23490826 23377312 23235905 23089504
4719 23089504 22896216 22798816 22568262 22430208 22280880 22094725 21849680 21683290 21568590 21453253
4709 21453253 21330671 21183145 21091371 21082647 20985743 21009650 20991915 20967833 20886400 20787745 20736240
4698 20736240 20678185 20667160 20634663 20595080 20541189 20493617 20560991 20637660 20657248 20691506 20768426
4687 20768426 20848198 20871675 20921803 21086376 21255186 21379065 21475401 21655668 21847736 22014136
4677 22014136 22216150 22392110 22562598 22728694 22839704 23034617 23213327 23284658 23312016 23336362
4667 23336362 23308198 23227353 23170083 23237930 23321065 23370656 23450153 23526386 23623214 23736721 23924903
4656B3924903J69758K52503K59667L48217L86681N37190P16100R10534J110067
4647B8615620J337167J603705J671501J553502J098443L32558l69410j099939
4639C4743147j515976j724209j530989j299988r71955o85061n66773l56748k46802
4630B5844646j81369q3766l4507Q556K191k12539k51285j57415k15463j55318
4620B4563731j13683l6032J04143N9229J32005K47693K84542K95083K97646L36775
4610B6171132M07546L73507L08851L51817L58030L76759M14582M09610M91060
4601B9662894K85009J98437K39178J46854J78981J65537K79086L20815L22024
4592C1798815K33615J58428Q5818Q2646J17085J13036K42119L87349L49977L25246
$$ plain form
4656 23924903 24094661 24347164 24606831 24955048 25341729 25878919 26595019 27505553 28615620
4647 28615620 29952787 31556492 33227993 34781495 35879938 36212496 35843086 34743147
4639 34743147 33227171 31502962 29971973 28671985 27700030 27014969 26448196 26091448 25844646
4630 25844646 25663277 25579511 25545004 25553560 25555751 25343212 25091927 24934512 24719049 24563731
4620 24563731 24450048 24414016 24518159 24577388 24709393 24957086 25241628 25536711 25834357 26171132
4610 26171132 26578678 26952185 27261036 27612853 27970883 28347642 28762224 29171834 29662894
4601 29662894 29947903 30146340 30385518 30532372 30711353 30876890 31155976 31476791 31798815
4592 31798815 32032430 32190858 32276676 32359322 32476407 32589443 32831562 33218911 33568888 33894134
4582C3894134K24056L48841N81196P65797J177325J594508K108317K670744L475126
4573D6840044M394953N243737N762015N260243K951312j169049n071054o786504
4565E7425697o699856n981749m817067l791476l083658k451352k005576j714640
4557B6880323j449056j148493j030797p71120p07052o55126n61642n11236m94557
4548A9551244m23503l42692l27927m55047k52033k37823j57437q9374q4144k8790
4538A7152474p4687K2815L8077J5216R2078J38642R3267J01699N1894P1999J14372
4527A7817846J53237P9129R6703P1380j771m9364j11066j03669n4596m7785K3579
4516A7873623J33035J81488K09438K40109K39887K22364J29190K8059j8439j12284
$$ plain form
4582 33894134 34118190 34467031 35048227 35814024 36991349 38585857 40694174 43364918 46840044
4573 46840044 51234997 56478734 62240749 67500992 70452304 69283255 64212201 57425697
4565 57425697 50725841 44744092 39927025 36135549 33051891 30600539 28594963 26880323
4557 26880323 25431267 24282774 23251977 22480857 21773805 21118679 20557037 20045801 19551244
4548 19551244 19127741 18785049 18457122 18002075 17750042 17512219 17354782 17265408 17181264 17152474
4538 17152474 17077787 17100602 17138679 17153895 17245973 17384615 17477882 17579581 17631475 17703474 17817846
4527 17817846 17971083 18050212 18146915 18218295 18216524 18167160 18056094 17952425 17897829 17850044 17873623
4516 17873623 18006658 18188146 18397584 18637693 18877580 19099944 19229134 19257193 19238754 19126470
4506A9126470r8020q1511n1780j32714k26385j98765k22168k81902k49489k03793
4496A7379943j34695j07297j57734r6119n6620n1579Q5302J60931K04176K55863
4486A7482171J83527K11978K61500L22238L24745L76852L29785J04915l11926
4477A9285785n78423o26575o86184n27417n23073m39121l31614k80005k59169
4468A5034204n8428p4222r4401J6615J6753L6919P6507P7006R4623K49286K03433
4457A5578295K14451K63079J04553J83753K75052J62325O8439L5681p0336j99376
4447A6615916j81205l20602k50539k80190j86051j98316k11373j21340r3055o4676
4437A4708569P4487N2284J08717L6147O5444N6257J1780O5833J74967O6370J15895
$$ plain form
4506 19126470 19028450 18946939 18895159 18762445 18536060 18337295 18115127 17833225 17583736 17379943
4496 17379943 17245248 17137951 16980217 16884098 16827478 16775899 16861201 17022132 17226308 17482171
4486 17482171 17665698 17877676 18139176 18461414 18786159 19163011 19492796 19597711 19285785
4477 19285785 18707362 18080787 17394603 16867186 16344113 15904992 15573378 15293373 15034204
4468 15034204 14975776 14901554 14807153 14823768 14840521 14877440 14953947 15030953 15125576 15374862 15578295
4457 15578295 15792746 16055825 16160378 16344131 16619183 16781508 16849947 16885628 16815292 16615916
4447 16615916 16434711 16114109 15863570 15583380 15397329 15199013 14987640 14866300 14773245 14708569
4437 14708569 14783056 14835340 14944057 14980204 15045648 15101905 15113685 15179518 15354485 15420855 15536750
4426A5536750K20803J89535K80777K83189L63047L80525M64902N30136O10502
4417A8860166O99424O91511P67108P77760O80428N56656M05137K57149Q1503k5712
4407B3751130j27696k09637k22387j58510j47454j04560j07456Q3240J01370P7854
4397B2935894K78813L59236M39983N11116N68057P60807R20015R33190R59177
4388B8666288J010861R69488Q27085O11593L49736R0895p2336l07997m18526n61179
4378C1165908o44089p03569o64091o83787n67449n69196n75083n19983l64549
4369B5874112k37224k15635j08134r8205m0987N9510N5766J07685K28700M78656
4359B6104244N69546O12219P33958O66081N12041K87052J93046p7895l59403n47014
$$ plain form
4426 15536750 15757553 15947088 16227865 16511054 16874101 17254626 17719528 18249664 18860166
4417 18860166 19559590 20251101 21018209 21795969 22476397 23033053 23438190 23695339 23776842 23751130
4407 23751130 23623434 23413797 23191410 23032900 22885446 22780886 22673430 22756670 22858040 22935894
4397 22935894 23214707 23573943 24013926 24525042 25093099 25853906 26773921 27707111 28666288
4388 28666288 29677149 30646637 31473722 32085315 32435051 32525946 32453610 32145613 31727087 31165908
4378 31165908 30521819 29818250 29154159 28470372 27902923 27333727 26758644 26238661 25874112
4369 25874112 25636888 25421253 25313119 25214914 25173927 25233437 25289203 25396888 25625588 26104244
4359 26104244 26673790 27286009 28019967 28686048 29198089 29485141 29678187 29600292 29240889 28693875
4349B8693875q39315q48399j004984r90328q20617q03534o03442m83314m43610
4340B1856332m20102l36333k73204k36930j67880o3457k5973n114k2811q3288
4330B0221240k15997r7556k16530k29865j91568j43513q5855k7870l9632O6753
4320A9039607J46132P2473J34891K62476J83750J87891K16352L58122N00823L05920
4310B1408437K02505J0693j35733k53321j28485j07060o4573J25381J85044J86580
4300B1429468K70786L08570M04325L12911L35389K73362K36551J13334Q6092J97461
4290B3968249J91819L10797M07830N43929M89319O19815P43160Q48443R63940
4281B9087301J033796J078602J258876J299857J548823J952872K322135K732659
$$ plain form
4349 28693875 27854560 27006161 26001177 25010849 24190232 23386698 22783256 22299942 21856332
4340 21856332 21436230 21099897 20826693 20589763 20421883 20358426 20332453 20327339 20304528 20221240
4330 20221240 20005243 19907687 19691157 19461292 19269724 19126211 19040356 19012486 18972854 19039607
4320 19039607 19185739 19258212 19393103 19655579 19839329 20027220 20243572 20601694 21102517 21408437
4310 21408437 21610942 21621635 21485902 21232581 21104096 20997036 20932463 21057844 21242888 21429468
4300 21429468 21700254 22008824 22413149 22726060 23061449 23334811 23571362 23684696 23770788 23968249
4290 23968249 24160068 24470865 24878695 25422624 25911943 26531758 27274918 28123361 29087301
4281 29087301 30121097 31199699 32458575 33758432 35307255 37260127 39582262 42314921
4273D2314921L067616L021601K520867J594370M32081n82145j447395j638116
4265D9283800j570810j234652p89778k16565P2688M11952O32115R85479J265704
4256D8839933J495987J606187J949987K130393K573747L068315L614874M344073
4248F9623496N561161P014449Q793012J0817495J3497814J6849518K1089883K6068609
4240A79315437L0422242L1996384K4439190K477298k2620060l2695003l1782559
4233A81552929k5678788j8104737j2222711q492648o918837o899446p654869q062610
4225H7518283p422244o454689n360707m720961m473644m225136m083968l804648
4217D6972286l389465k946525k533209k195381j936913j512308j300672r35005
$$ plain form
4273 42314921 45382537 48404138 50925005 52519375 52951456 52369311 50921916 49283800
4265 49283800 47712990 46478338 45688560 45471995 45544683 45956635 46588750 47574229 48839933
4256 48839933 50335920 51942107 53892094 56022487 58596234 61664549 65279423 69623496
4248 69623496 75184657 82199106 90992118 101809613 115307427 132156945 153246828 179315437
4240 179315437 209737679 241734063 266173253 268650551 246030491 213335488 181552929
4233 181552929 155874141 137769404 125546693 117054045 110135208 103235762 95580893 87518283
4225 87518283 80096039 73641350 68280643 63559682 59086038 54860902 50776934 46972286
4217 46972286 43582821 40636296 38103087 35907706 33970793 32458485 31157813 30222808
4209C0222808o63606n17395l67656m22661k75419k31638k27470l17402k75380
4200B6924181k98844k88862m80888m59695l88274m26345l68193k56421r4671k04702
4190B3657286j81025j29540q6976j12131j35705j28645o1555p6550k7894n5154
4180B2662111O264J27060K39959K54195L72932N00470P43523Q38071Q10635O29894
4170B7185114K60252k12137n29515p00223p17501n70876l91651l61608n12897
4161B3448958n29866m27461m44014k79059j65377k11213k75386j81967j97281
4152B0737334j71151j86057o3211q1470m1789j31331j68354p5726j37725m7858
4142A9632662O2157J49234J57365K06879K37167J77060K60949J12857j85299l24786
$$ plain form
4209 30222808 29559202 29041807 28674151 28251490 27976071 27744433 27516963 27199561 26924181
4200 26924181 26625337 26336475 25855587 25395892 25007618 24581273 24213080 23956659 23861988 23657286
4190 23657286 23476261 23346721 23259745 23147614 23011909 22883264 22821709 22745159 22717265 22662111
4180 22662111 22668375 22795435 23035394 23289589 23662521 24162991 24906514 25744585 26555220 27185114
4170 27185114 27445366 27233229 26703714 26003491 25285990 24715114 24323463 23961855 23448958
4161 23448958 22919092 22491631 22047617 21768558 21603181 21391968 21116582 20934615 20737334
4152 20737334 20566183 20380126 20316915 20235445 20193656 20062325 19893971 19818245 19680520 19632662
4142 19632662 19694819 19844053 20001418 20208297 20445464 20622524 20883473 20996330 20811031 20486245
4132B0486245l44035l60956l27525k89432k26640j87449j91899j66986m8915j82474
4122A8159934j40774j58097j68776j45367k11015j47626k24004j14868j9548l5396
4112A6794463p1945P4493O6179M284N3948J56939J89285J61564P9098J14200J58565
4101A7781073J5617M7986K9640O1080N0413L6583M7505J2997R4634O9646J35638
4090A8382812Q7417L9520N8429J62981Q2785J08324K35434K60466K21058K99603
4080A9938829L62136L93233L87995M52396M43077M69389P14323P87250Q46177
4071B4794805R39228R63806O60811P7915m31923o57948n95186n29938k83899k05216
4061B4732455L1832J73545K71207L21286K77940L86860L90911L98109M18995M13349
$$ plain form
4132 20486245 20142210 19781254 19453729 19164297 18937657 18750208 18558309 18391323 18342408 18159934
4122 18159934 18019160 17861063 17692287 17546920 17335905 17188279 16964275 16849407 16829859 16794463
4112 16794463 16722518 16797011 16863190 16867474 16921422 17078361 17267646 17429210 17508308 17622508 17781073
4101 17781073 17796690 17844676 17874316 17935396 17985809 18022392 18069897 18082894 18177528 18247174 18382812
4090 18382812 18470229 18509749 18568178 18731159 18813944 18922268 19157702 19418168 19639226 19938829
4080 19938829 20300965 20694198 21082193 21534589 21977666 22447055 23161378 23948628 24794805
4071 24794805 25734033 26697839 27358650 27436565 27004642 26346694 25751508 25221570 24937671 24732455
4061 24732455 24764287 24937832 25209039 25530325 25808265 26195125 26586036 26984145 27403140 27816489
4051B7816489M94518N42612O07787O58119Q44387J027561J302709J627065J797857
4042C6719104J978913K021325J783625J204607O85728M29818L69251K08433m490
4033D5396314m68754r20346j333771j468441j428659j191884q71890o77170n36111
4024C6499288l10115l20782k54147r0565l1887J9621j0703J43219J18003J37708
4014C5899640J00905J88005K92515K30488K17324L33415L94499M55209M30092
4005C8542092L86681M20650L60612L55155K66604K66299K35608J32506J89979
3996D1156186J49525R2951J51465J07069L6631J56626K35105K60384L20317K80178
3986D2946437M02151L77802M51214M16222L88876M93068M32606M65475L52420
$$ plain form
4051 27816489 28311007 28853619 29461406 30119525 30963912 31991473 33294182 34921247 36719104
4042 36719104 38698017 40719342 42502967 43707574 44393302 44823120 45192371 45400804 45396314
4033 45396314 44927560 44007214 42673443 41205002 39776343 38584459 37712569 37035399 36499288
4024 36499288 36189173 35868391 35614244 35523679 35491792 35511413 35500710 35643929 35761932 35899640
4014 35899640 36000545 36188550 36481065 36711553 36928877 37262292 37656791 38112000 38542092
4005 38542092 38928773 39349423 39710035 40065190 40331794 40598093 40833701 40966207 41156186
3996 41156186 41305711 41398662 41550127 41657196 41693827 41850453 42085558 42345942 42666259 42946437
3986 42946437 43348588 43726390 44177604 44593826 44982702 45475770 45908376 46373851 46726271
3977D6726271L25533L59565L39431L68058L70911M05453L83545M18455M55425
3968E0152647L50448M40956N21355M25022K52504J10190k6733j51746j00026L0780
3958E2005397Q5046O7904J13225J53175K92934L47462K55732L13378M00669L52994
3948E4387916K24729J82850K6836k455r4328k79431l81082l29428k81719l69589
3938E3084299l27751k05615k85349k28154j27127k10128l76064m95265n76163
3929E0252683o67010p16398o55722n51156n71149p17463o54113o27690o82677
3920D4409305o87044o86320o10918m95470m28569m63698l76808k79993k21084
3911D0159401k88205k90211k05571k41548k42541j74473k24789j66531j26360
$$ plain form
3977 46726271 47051804 47411369 47750800 48118858 48489769 48895222 49278767 49697222 50152647
3968 50152647 50503095 50944051 51465406 51890428 52142932 52253122 52226389 52074643 51974617 52005397
3958 52005397 52090443 52158347 52271572 52424747 52717681 53065143 53320875 53634253 54034922 54387916
3948 54387916 54612645 54795495 54822331 54819876 54725548 54446117 54065035 53735607 53453888 53084299
3938 53084299 52756548 52550933 52265584 52037430 51910303 51700175 51324111 50828846 50252683
3929 50252683 49585673 48869275 48213553 47662397 47091248 46373785 45719672 45091982 44409305
3920 44409305 43722261 43035941 42425023 41929553 41500984 41037286 40660478 40380485 40159401
3911 40159401 39871196 39580985 39375414 39133866 38891325 38716852 38492063 38325532 38199172
3902C8199172j42341j75830k34155l49245k42884j59578k03101r2359J996M029
3892C6605704R161K4693n9815j9821M9783L3759N689j04401j34518q9329k42924
3881C6077981k92331l41943m31327m39536n96274l92667m46256m31446l55952
3872C2350249l54855l15013k22528k46320l02854k81155j49006j55938j65189
3863C0157391j27084r7983j51153p8462j01044K2101l4564j9326R6794K9504l5835
3852B9660339r6160m2087q2249j40761j15155j10723j42864q3354j5170j2332
3842B8819484N2253J03041J78732J59071O2049J4787p3227m5287j12004j99181
3832B8959718n0234K5545k2287R2839L5643Q0812j100P1260L7943J38794J38705
$$ plain form
3902 38199172 38056831 37881001 37646846 37297601 37054717 36895139 36692038 36599679 36601675 36605704
3892 36605704 36614865 36639558 36579743 36559922 36609705 36643464 36649153 36544752 36410234 36320905 36077981
3881 36077981 35785650 35443707 35012380 34572844 33976570 33583903 33137647 32706201 32350249
3872 32350249 31995394 31680381 31457853 31211533 30908679 30627524 30478518 30322580 30157391
3863 30157391 30030307 29932324 29781171 29702709 29601665 29623766 29589202 29569876 29666670 29696174 29660339
3852 29660339 29564179 29522092 29439843 29299082 29183927 29073204 28930340 28846986 28831816 28819484
3842 28819484 28871737 28974778 29153510 29312581 29374630 29389417 29316190 29270903 29158899 28959718
3832 28959718 28909484 28935029 28912742 29005581 29041224 29122036 29120936 29192196 29230139 29368933 29507638
3821B9507638J63626K02070J99626K46192J91953K73511L11898J99631J31550
3812C1427695K57481J80493R0660J42889J09672K19761J69774J07562J15993J71204
3802C2993184J44742Q1772p3515j9638q5746k27993k38275k59762k94409k88251
3792C1732109l27454l12553k89199k90195k12473j15616q3963j1690O8156J81803
3782C0338925Q2003N6227L9337q743o1013o1302M7198r3167p0503K3333l0911
3771C0261384n2357k1703m9456r7244j32776j50093j21107r3378q5923j64941
3761B9292406j08962j28364r8625j05672j22482j48659j31019j35373j11963o5560
3751B8135727O71N0080n4955N2628P5398R6868J77278J65946J72834K29469K31245
$$ plain form
3821 29507638 29671264 29873334 30072960 30319152 30511105 30784616 31096514 31296145 31427695
3812 31427695 31685176 31865669 31956329 32099218 32208890 32428651 32598425 32705987 32821980 32993184
3802 32993184 33137926 33219698 33146183 33126545 33040799 32812806 32574531 32314769 32020360 31732109
3792 31732109 31404655 31092102 30802903 30512708 30300235 30184619 30100656 30088966 30157122 30338925
3782 30338925 30420928 30477155 30516492 30507749 30446736 30385434 30432632 30339465 30268962 30292295 30261384
3771 30261384 30209027 30187324 30137868 30040624 29907848 29757755 29636648 29543270 29457347 29292406
3761 29292406 29183444 29055080 28956455 28850783 28728301 28579642 28448623 28313250 28201287 28135727
3751 28135727 28136398 28186478 28131523 28184151 28259549 28356417 28533695 28699641 28872475 29101944 29333189
3740B9333189K74587K90854L06568M08801L63854L11098M17150M14015M86574
3731C2606690M56323M26340M79576N02785N76660M69236M44680N44109M57175
3722C6963574M78998N54299M32912N10064N89877O22551O11503O45838P13003
3713D2122619P43551Q81417Q91162J029704J241377J327983J469955J863003K132521
3704E3703292K465219K978998L776469M689764N873138P038570P754732P230070
3696I5510252M752608K86851l914133o175598o434886n728979m638709l567198
3688G0090208k647183k085681j619896j463539j239975j079483j035769r98103
3680E7920579q80257q08738p67404p76069p83004q17811p38583p55928p50036
$$ plain form
3740 29333189 29607776 29898630 30205198 30613999 30977853 31288951 31706101 32120116 32606690
3731 32606690 33063013 33489353 33968929 34471714 35048374 35517610 35962290 36506399 36963574
3722 36963574 37442572 37996871 38429783 38939847 39529724 40152275 40763778 41409616 42122619
3713 42122619 42866170 43747587 44638749 45668453 46909830 48237813 49707768 51570771 53703292
3704 53703292 56168511 59147509 62923978 67613742 73486880 80525450 88280182 95510252
3696 95510252 100262860 100549711 96635578 90459980 84025094 78296115 73657406 70090208
3688 70090208 67443025 65357344 63737448 62273909 61033934 59954451 58918682 57920579
3680 57920579 57040322 56231584 55464180 54688111 53905107 53087296 52348713 51592785 50842749
3671E0842749m92867l31641j38421J56695N10393O90609O84652P27259N86782
3662E3236210K43449J3910p0507j87014n10001r35900j460085j711295j721925
3653D6896842j619481j508161j225913r47385p64724p27493n36488o13548q00923
3644C8152726q51536r74177r81120r84924r39708q97423r16647q48577q84258
3635B9874356p85349q42041p58762p11588o05539p02233n93123n31974m95147
3626B3848600l79185m47545m61399l20852l48149k93511k28529l03014k76182
3617B0790234k17274j79037j99920j90539j93987j95586j12464n2551m7481o6517
3607A9334878r131n2919o8600j24748k26136j96001k64574l08763k60509l37999
$$ plain form
3671 50842749 50349882 50018241 49879820 50036515 50546908 51237517 51922169 52649428 53236210
3662 53236210 53479659 53493569 53423062 53236048 52726047 51790147 50330062 48618767 46896842
3653 46896842 45277361 43769200 42543287 41595902 40831178 40103685 39567197 38953649 38152726
3644 38152726 37301190 36327013 35345893 34360969 33421261 32523838 31607191 30758614 29874356
3635 29874356 29089007 28246966 27488204 26776616 26171077 25468844 24875721 24343747 23848600
3626 23848600 23469415 23021870 22560471 22239619 21891470 21597959 21369430 21066416 20790234
3617 20790234 20572960 20393923 20194003 20003464 19809477 19613891 19501427 19448876 19401395 19334878
3607 19334878 19325747 19272828 19204228 19079480 18853344 18657343 18392769 18084006 17823497 17485498
3597A7485498k84905k24388k37151k13866j93348j58664j41988j97434j80875
3588A5652879j47649j33632j04993j35786j04760r3858j68226k09240k30681k08821
3578A4115233j94670j76454j77619j38820j48802j65999j24608j23504p2819q9677
3568A2702261j75551j41421l1497m8225j45148j26532o1980j01257j40922p2106
3558A1657622j22477q684j11847j60399j1723p6561k6113o4240q7835q5175l7282
3547A0865286K8448q845j8727k0192l4077R698L3608n0582q3530j13753q5943
3536A0521391J9268j72081j49110n6768j2955j5626r4202p4856n0997j51390K3020
3525I785694k3366L8316L5107o6888K2782o9997l1873N6001j352R2921R728N0119
$$ plain form
3597 17485498 17200593 16976205 16739054 16525188 16331840 16173176 16031188 15833754 15652879
3588 15652879 15505230 15371598 15266605 15130819 15026059 14932201 14763975 14554735 14324054 14115233
3578 14115233 13920563 13744109 13566490 13427670 13278868 13112869 12988261 12864757 12791938 12702261
3568 12702261 12526710 12385289 12353792 12305567 12160419 12033887 11971907 11870650 11729728 11657622
3558 11657622 11535145 11526461 11414614 11254215 11242492 11165931 11139818 11075578 10987743 10902568 10865286
3547 10865286 10893734 10884889 10866162 10845970 10811893 10821591 10855199 10804617 10721087 10607334 10521391
3536 10521391 10540659 10368578 10219468 10162700 10149745 10134119 10039917 9965061 9914064 9762674 9785694
3525 9785694 9762328 9800644 9835751 9768863 9791645 9721648 9689775 9745776 9744424 9837345 9847073 9897192
3513I897192p129k2657Q2524k2377n6117R2114l8658j83310m9162r5752m8262
3502I548406p9937j60231q0282K7188q4630k7904l2029N4756k1296l8478K2934
3491I128497N237J1847p0211j6814j9179M4446L4593N5852k5771L4763k5506K7706
3479I185460J5694O0105O2758O2551P100r1619o6586m4865o6771m3556j29172
3468H951099j14740p9980j25015J2832n0085j03574j13147q0358r5708m7918n7714
3457H095692j02458j12977r5339q1237n6715n2345p1392j9024k0105k483p5261
3446G406356l9358P433j8630k2706K4140O4546m0546N7368J04564J25107Q1260
3435G749534M3515K9006p994n1008j17496o4106j17115j08748j15151n3321K4176
$$ plain form
3513 9897192 9890063 9867406 9949930 9927553 9871436 9963550 9924892 9741582 9692420 9596668 9548406
3502 9548406 9468469 9308238 9227956 9255144 9170514 9142610 9110581 9165337 9144041 9105563 9128497
3491 9128497 9133734 9145581 9075370 9058556 9039377 9083823 9118416 9174268 9148497 9183260 9157754 9185460
3479 9185460 9201154 9261259 9324017 9386568 9393668 9302049 9235463 9190598 9123827 9080271 8951099
3468 8951099 8836359 8756379 8631364 8644196 8594111 8490537 8377390 8297032 8201324 8153406 8095692
3457 8095692 7993234 7880257 7784918 7703681 7646966 7594621 7523229 7504205 7484100 7481617 7406356
3446 7406356 7366998 7374431 7355801 7333095 7357235 7421781 7381235 7438603 7543167 7668274 7749534
3435 7749534 7793049 7822055 7814061 7763053 7645557 7581451 7464336 7355588 7240437 7187116 7211292
3424G211292N739l3742M6246N7131j4655P7977J12413N998m2152J6454k7215L4677
3412G450163m0894k3962R790K0479M1265J19916N0828J00657J01242J22631J57905
3401H110020P2810J77966J86762K91017L59363M26143P54378Q87767R93455J159231
3391A3418912J102764N87476k00409q70658j210685j362486j164881q80184p60409
3382H659440o21340n80895m59552l26309l01383k04923j56110j39180k01491j66546
3372E501711p0548p2972j89686r8395k8618r2600j03628k2608k1634o5952l8016
3361D697054k7919K6030k7699k6529K9269p7570j9376P5847K6806J9683M198k5954
3349D673840L5363N137j05680l7024J5466j4591J8320J14210N8337J14857J14541
$$ plain form
3424 7211292 7217031 7183289 7229535 7286666 7272011 7349988 7462401 7468399 7426247 7442701 7415486 7450163
3412 7450163 7409269 7385307 7395097 7415576 7456841 7576757 7627585 7728242 7829484 7952115 8110020
3401 8110020 8182830 8360796 8547558 8838575 9197938 9624081 10378459 11266226 12259681 13418912
3391 13418912 14521676 15109152 14908743 14038085 12827400 11464914 10300033 9419849 8659440
3382 8659440 8038100 7457205 6997653 6671344 6369961 6165038 6008928 5869748 5668257 5501711
3372 5501711 5431163 5358191 5168505 5070110 5041492 4948892 4845264 4822656 4801022 4735070 4697054
3361 4697054 4669135 4695165 4667466 4640937 4670206 4592636 4573260 4649107 4675913 4695596 4699794 4673840
3349 4673840 4709203 4714340 4608660 4571636 4587102 4572511 4590831 4705041 4763378 4878235 4992776
3338D992776N4442R6864k378P4070J9458l4016m4753q3610q7588j65362j45145
3327D674758n1633j36253r5894j24961r3679o4388r3320l4369j28131j5073p709
3316C829348k6987r694r0598o7873m5439j25302o0746o9780P144n0897l1571l1907
3304C225698j1823N316j6956r6419N6340O488J7025M8635J6585l9277j4176O300
3292C203736q5532Q18J6829M1238j10037p5238m8833q2129O811l7087p0470n7451
3280B702655k935p642M819j2195j8671j19077o4589k7104L0397r398n3481N250
3268B428029j2858o141L1245K6375J0987J4139K3267n4962J2016N8303l0010m8352
3256B452038k8923K5909q9005k1449O353L4088n9797n5877O7334r5117k4841N0934
$$ plain form
3338 4992776 5047218 5144082 5141704 5215774 5235232 5201216 5156463 5072853 4985265 4819903 4674758
3327 4674758 4623125 4486872 4390978 4266017 4172338 4107950 4014630 3980261 3852130 3837057 3829348
3316 3829348 3802361 3792667 3702069 3634196 3588757 3463455 3402709 3332929 3340073 3289176 3257605 3225698
3304 3225698 3213875 3219191 3202235 3105816 3162156 3168644 3185669 3234304 3250889 3211612 3197436 3203736
3292 3203736 3118204 3119022 3135851 3177089 3067052 2991814 2942981 2860852 2867663 2830576 2760106 2702655
3280 2702655 2699720 2692078 2696897 2684702 2666031 2546954 2482365 2455261 2485658 2476260 2422779 2428029
3268 2428029 2415171 2409030 2440275 2466650 2477637 2491776 2515043 2460081 2472097 2530400 2500390 2452038
3256 2452038 2423115 2449024 2360019 2338570 2344923 2379011 2319214 2263337 2330671 2235554 2210713 2261647
3244B261647p4944N3698Q7418k6556k4807j4817m999j5454K7773j5299Q011K9887
3232B291558O9770L922K3018k5535m604M9162o0830L4902L077k9367o9132J360
3220B287301o7121o8627k9681l540j7551J037m6038m0528N6962N7222o3497M960
3208B070899N4726Q6717K8954P5608Q6481M6090M1388N6960P6039j462N3403p772
3196B668031N5459k2190m3975q3462n3054j5304n7314q8696m5587L9338l7259
3185B315987n2124J5949k0123q2538j3663J3499M233q2474K3528J43962J0090
3174B276326q9836O9636j6465k0649p3566k2380O900Q463N6527J2419M2516L1566
3162B281457J1098L5575j1271o1373l0800k3570l2745m6176n6152J6397J787K7159
$$ plain form
3244 2261647 2186703 2240401 2327819 2301263 2276456 2261639 2256640 2241186 2268959 2253660 2261671 2291558
3232 2291558 2361328 2365250 2388268 2362733 2358129 2407291 2346461 2381363 2384440 2355073 2285941 2287301
3220 2287301 2220180 2151553 2121872 2118332 2100781 2101818 2055780 2015252 2072214 2129436 2065939 2070899
3208 2070899 2125625 2212342 2241296 2316904 2403385 2449475 2490863 2547823 2623862 2622400 2675803 2668031
3196 2668031 2723490 2701300 2657325 2573863 2520809 2505505 2448191 2359495 2313908 2353246 2315987
3185 2315987 2263863 2279812 2259689 2177151 2163488 2176987 2181220 2098746 2122274 2266236 2276326
3174 2276326 2186490 2256126 2239661 2219012 2145446 2123066 2129966 2138429 2194956 2207375 2249891 2281457
3162 2281457 2292555 2328130 2316859 2255486 2224686 2201116 2168371 2122195 2066043 2082440 2084227 2111386
3150B111386l0158n7579L3914P341P45k5630m926K8205l9010j15674m8799O7578
3138A927393m3799j9742l7067p4065p153n8188K5531n2164o8273l3047l5958J6121
3126A539589l1578n8096N776K8581M0047j832j6962k0832j6939o493k9799J3766
3114A445228k6571k9063k2037m4664k8547K4314P393n7280n2201M5072K9615p3684
3102A217575J4753m4866N9493m6767k1122L623k0076k2476J1171r345j1980m0126
3090A089857o3894k1083J4072J9068L9020n5413n9795M9904k9550n851N885j09046
3078H73174n4282m3229L053L6960j5147L4654o8815p8013K89M6863K5649n4352
3066G06804k8054O7691j7230o9201M8250k3442j624L1811L8289k2270q0411m0909
$$ plain form
3150 2111386 2081228 2023649 2057563 2064904 2065649 2040019 2035093 2063298 2024288 1908614 1859815 1927393
3138 1927393 1883594 1863852 1826785 1752720 1745567 1687379 1712910 1660746 1592473 1559426 1523468 1539589
3126 1539589 1508011 1449915 1455691 1484272 1524319 1522487 1505525 1484693 1467754 1461261 1431462 1445228
3114 1445228 1418657 1389594 1367557 1322893 1294346 1318660 1326053 1268773 1216572 1261644 1291259 1217575
3102 1217575 1232328 1187462 1246955 1200188 1179066 1182689 1162613 1140137 1151308 1141963 1129983 1089857
3090 1089857 1025963 1004880 1018952 1038020 1077040 1021627 961832 1011736 982186 976335 982220 873174
3078 873174 818892 775663 778716 815676 800529 835183 766368 688355 688644 735507 761156 706804
3066 706804 678750 746441 729211 660010 708260 684818 683194 715005 753294 731024 650613 609704
3054F09704p689N8892L0775m3915l7827J1166k1790M0000r719l9410N5683l0356
3042F15514m2015K4498L6473o1415o2169q9311l450L827J358L9577J0202J7257
3030D90346l200m366m4000M4075R891l4451Q63K4454j1313o0695j9593K001L0432
3017D24444q757L2818j1627N5010N4190j03064m849l6586P2292J897J3023k8999
3005D59792j1893J45k4011j3925K5205P911J4621k6604l1744K158J9885k8422
2993C93118L7806j7376j568K1447j8940o373o455r196j7696P1018j7227o5979
2981C62579k419M3575m2078N513j2572J9637j7004J8262k5805j7554P8575p9709
2969C31000l2029K3404L9997j4232n5496K3461N9795k2861n8390M6966M6496p7665
$$ plain form
3054 609704 602015 660907 691682 647767 609940 621106 599316 639316 629597 590187 645870 615514
3042 615514 573499 597997 634470 573055 510886 421575 418125 421952 423310 462887 473089 490346
3030 490346 487146 482780 438780 482855 492746 458295 459158 483612 472299 411604 392011 394012 424444
3017 424444 415687 448505 436878 491888 546078 443014 438165 401579 473871 475768 488791 459792
3005 459792 447899 448044 424033 410108 435313 443224 457845 431241 399497 401655 421540 393118
2993 393118 430924 413548 411980 433427 414487 408114 401659 392463 374767 445785 428558 362579
2981 362579 360160 403735 361657 367170 354598 374235 357231 375493 349688 332134 410709 331000
2969 331000 298971 322375 362372 348140 292644 316105 375900 353039 294649 341615 388111 310446
2957C10446K4236j6278J5875o7782P277K267M5295K8418o4750j9235k9812L9240
2945B75197k0458J64R0221l9538n4890M1225K0598l2344K622j571m7861m6247
2933A87118N8871P1582j0109P0089p9726n8194L3372N6100l0519m4008R975O73
2921B65224m1439M1175J1700o7258n1272Q6311J9798n6099q524K6409o0483N1078
2909B16620O561J5099j7102K9360O142n1512M5761j8145o2394J966N4922J3559
2897B40837L510l710j1172m6162k228P1393M5711M8339n6332o1112j131p151K405
2884B23197j5936k12J10065p6865k796n911M031k3719n4323L2409l815N0892k2869
2871B14148o959M5947O0397m9617l2699K4279N2238k4800l4723m1563j911M1546
$$ plain form
2957 310446 334682 318404 334279 266497 273774 276041 321336 349754 285004 265769 235957 275197
2945 275197 254739 254903 345124 305586 250696 291921 312519 280175 282797 281226 233365 187118
2933 187118 245989 317571 307462 377551 297825 239631 273003 329103 298584 254576 264551 265224
2921 265224 223785 264960 276660 209402 158130 244441 264239 208140 199616 226025 165542 216620
2909 216620 223181 238280 221178 250538 256680 205168 250929 232784 170390 172356 227278 240837
2897 240837 244347 240637 229465 183303 181075 252468 298179 346518 290186 229074 227943 220792 223197
2884 223197 207261 207049 317114 240249 237453 231542 235573 211854 157531 189940 186125 237017 214148
2871 214148 207189 253136 313533 263916 231217 255496 307734 282934 248211 206648 204737 246283
2859B46283M7770k5236k8125M8954Q137l0577J5391L1015l4798M0025o752J0323
2847C22410O2944K3253L6552j8583O39L7475k4203l8827N1162o1272J8317j7818
2835C92049n1851k3485N643P2182j7377k0468L4662q2966j955L3078N7197j9676
2823C77033k1996o732l1514J6581N1716J9754L6223J3565m1074k1705m8842J2217
2811C55226K0667o668O6371K0914K8196j4748l0446Q137N6828j5626l6895j11728
2799C40228n1364j7532j1351L0413J08Q919l9330K2564J3237j9057o4844j846
2787B10145N5048K2326l8402k7895l4555N561M5283O0149o2519L8939K1555o1417
2775B34218M5962M6061n7908n3193p5242N9065N1073l1516J2425k9940l8453P0562
$$ plain form
2859 246283 294053 268817 240692 289646 297783 267206 282597 313612 278814 318839 312087 322410
2847 322410 385354 408607 445159 426576 427215 464690 440487 401660 452822 391550 409867 392049
2835 392049 340198 316713 322356 394538 377161 356693 391355 308389 306434 339512 396709 377033
2823 377033 355037 348305 316791 333372 385088 404842 441065 454630 413556 391851 343009 355226
2811 355226 375893 369225 435596 456510 484706 469958 439512 447649 504477 488851 451956 340228
2799 340228 288864 271332 259981 290394 290502 299421 260091 282655 295892 276835 211991 210145
2787 210145 265193 287519 249117 221222 186667 192228 237511 297660 235141 274080 295635 234218
2775 234218 280180 326241 268333 215140 139898 198963 250036 218520 230945 201005 162552 233114
2763B33114l471n8918l9327N6077j4247n2975l3584O8800Q6369j4255m0752n7591
2751A29240m3062J2170K1890k3961l479l89O5144K532P7214j5294M0654K3693
2739B86352q8738k0977J1031m713k2489n1380K1245k6802N7401j2098j2194o52
2727A35986p1249m9037J09032Q6222j4777L6118q6964Q807l8967m2395l0310R391
2715E1857j9398q00p871N6527N9812N0611l4425o2662J7905L0216k3479M1365
2703A59658J8188n7810k1702q2517K5749J9088J737L914k2641k5639O1006J1000
2691I0031k6307m404j5403m3053k0312R20N6173L2146j7736K6695K6007J687l4998
2678G1446L5594J8713k6770p6122k3543m1140J1441J8940J4914l0952O1810N7931
$$ plain form
2763 233114 229643 170725 131398 187475 173228 120253 86669 155469 241838 227583 186831 129240
2751 129240 86178 98348 120238 96277 92798 92409 157553 160085 237299 222005 262659 286352
2739 286352 197614 176637 187668 182955 160466 109086 130331 103529 160930 148832 136638 135986
2727 135986 64737 15700 124732 210954 196177 232295 145331 154138 115171 72776 42466 51857
2715 51857 32459 31659 23788 80315 140127 190738 156313 93651 111556 141772 118293 159658
2703 159658 177846 120036 98334 15817 41566 60654 62391 66305 43664 18025 79031 90031
2691 90031 63724 59320 43917 864 -19448 -18528 37645 69791 52055 78750 104757 106444 71446
2678 71446 107040 125753 98983 22861 -682 -41822 -30381 -11441 3473 -27479 34331 92262
2666I2262M592K4905q07p5064r2103L3350O1958K5889l3221k1051N2351m0488
2654C2573J7912L5942k4974L1640n4826J8067n7190K9457K8235N4996l6223j5193
2642F0416l853l011N5961n3560j8575j07l426L3371p723K0291j92l4094K1312
2629F6810o2327Q9118L822K0888p2953j9226J7013K1004J01841J3983l0705p493
2617A41775J3991J0200N3333R916O2555O7733N6267J5921l6107r3988l7340l6682
2605B27574J7689m7936o7275J0024l1856m5191O1429q733j4326N3633m1277l4949
2593G8806K7493k9287k444p4708j1747M2276J531j2038J4917M4706L1836n9340
2581E2001m2135K5948j7296K0308m8352L3421O1036r6971K0476O3687k4213l9541
$$ plain form
2666 92262 96854 121759 120952 45888 -46215 -12865 49093 74982 41761 20710 73061 32573
2654 32573 50485 86427 61453 93093 38267 56334 -856 28601 56836 111832 75609 60416
2642 60416 56563 53552 109513 55953 37378 37271 33845 67216 59493 79784 79592 45498 66810
2629 66810 4483 93601 97423 118311 45358 26132 43145 64149 165990 179973 149268 141775
2617 141775 155766 165966 219299 229215 291770 359503 415770 431691 395584 301596 264256 227574
2605 227574 245263 197327 130052 140076 108220 63029 124458 115725 101399 155032 113755 78806
2593 78806 106299 77012 74568 -140 -11887 30389 31920 19882 34799 79505 111341 52001
2581 52001 9866 35814 18518 38826 -9526 23895 84931 -12040 8436 72123 47910 8369
2569H369O4784L2428j18074L1769R2706m125L0772o4097j7496K355L212R10J0651
2556G4164O4511j16523k1137J1107p654N4766M1787m0280L1653n3802k0354N4146
2544G2384J6883P429L0168q1260K1124L0700r0015J9637J4659j0775L5424l984
2532F2374j080P7762o1177N9560j0763n2829K4109J0587j0075L040O3245K9855
2520A94608k5832Q072j3209j6117j5946m1389P218J2453M8031p565l6166J7206
2508A31364o65j2734M5686J6116N8315l3417p4369K844L445M7370J9342l943l1058
2495A68296J3386j8295o3838K8201O624o502R721L0359N1907n241L3046N0221
2483B97885l5460K0696J0927n9442m3942J00919l4173j5714Q4132L3214n1642
$$ plain form
2569 8369 73153 105581 -12493 19276 111982 107857 138629 74532 57036 59391 62603 63513 74164
2556 74164 138675 22152 1015 12122 4468 59234 101021 60741 92394 38592 18238 72384
2544 72384 89267 96696 126864 45604 66728 97428 7413 27050 41709 30934 66358 62374
2532 62374 61294 139056 77879 137439 126676 73847 97956 108543 98468 101508 164753 194608
2520 194608 168776 176848 163639 147522 131576 90187 97405 109858 157889 150324 114158 131364
2508 131364 130699 117965 163651 179767 238082 204665 130296 133140 136585 183955 203297 199354 168296
2495 168296 181682 163387 99549 127750 134374 127872 137593 167952 219859 214618 247664 297885
2483 297885 262425 283121 294048 234606 190664 291583 257410 241696 325828 359042 307400
2472C07400J3792J3137j3776l1446L2367k8565m3129L8617Q1566j2378J4265m3390
2460C28460n8416n05K5152j7167M3843K2488P666j8518N0686L7654o8877O094
2448C58560k5855J3595l6218k8004K1488L7414J9306Q0989R087k0189j08323J5320
2436C37170O6963N5379o375L1597l4544j8008l6086M1682N2017j1712o453K7922
2424D99552o1922J18941K0603M6906N3935p4659Q1828M9087L0062P7336O6208
2413I07877J6563M3628K7673K746P2381N502k2070j9381P6155P6561J1197j9765
2401A179067k6274M0249N7912L5822M3476K3406n3525O5845J16018L2155K8058
2390A542209O6417P5356M0587K8888R6113N9309P0703J2751J07559Q0318J23830
$$ plain form
2472 307400 321192 334329 320553 289107 321474 292909 249780 288397 369963 357585 371850 328460
2460 328460 270044 269539 294691 277524 321367 343855 351521 333003 383689 421343 352466 358560
2448 358560 332705 346300 310082 282078 303566 340980 360286 441275 450362 430173 321850 337170
2436 337170 404133 459512 453137 484734 450190 432182 396096 437778 489795 478083 471630 499552
2424 499552 437630 556571 577174 624080 678015 603356 685184 734271 764333 841669 907877
2413 907877 924440 968068 995741 998487 1070868 1076370 1054300 1034919 1111074 1187635 1198832 1179067
2401 1179067 1152793 1193042 1250954 1286776 1330252 1353658 1300133 1365978 1481996 1514151 1542209
2390 1542209 1608626 1683982 1724569 1753457 1849570 1908879 1979582 1992333 2099892 2180210 2304040
2379B304040K37907K53404J72833J20594J53982K67616K92850L21704L70099K74257
2369D769286J87018L75138M89554M52354N46415N98594O14352O45103P86523P11670
2359A0176007O79586N15768N91368P50167J054462J512577J960411K417597L229893
2350B2887836M323567N815329P372339Q758593R423243P662758J416740o428287
2342F1232118r790087r649876q009034o133218m573419l513265k849244k251082
2334A4462893j836174j522659j036561p99202n79455o21330p78307p34252o75075
2325E879878m86592m67255m56848l31929k60953k31697k40144j97055r7784p6266
2315C033355q6318K352q649j00066r6721j3281j413o8475j23651n3790o1720j41516
$$ plain form
2379 2304040 2541947 2795351 2968184 3088778 3242760 3510376 3803226 4124930 4495029 4769286
2369 4769286 4956304 5331442 5820996 6273350 6819765 7418359 8032711 8677814 9464337 10176007
2359 10176007 10855593 11371361 11962729 12712896 13767358 15279935 17240346 19657943 22887836
2350 22887836 27211403 33026732 40399071 49157664 58580907 66243665 67660405 61232118
2342 61232118 51442031 41792155 33783121 27649903 23076484 19563219 16713975 14462893
2334 14462893 12626719 11104060 10067499 9268297 8688842 8067512 7289205 6554953 5879878
2325 5879878 5393286 4926031 4469183 4137254 3876301 3644604 3404460 3207405 3109621 3033355
2315 3033355 2947037 2949389 2940740 2840674 2743953 2730672 2729259 2660784 2537133 2483343 2421623 2280107
2303B280107j56888j58398j07679n4643j06136J5555J3843o6181m2036k3987n6332
2292A537225p9859n0075q1289q4472n4778j05634K0139L80q6142k8082r1208l0831
2280H65374M4714o3294l5887J3094P721j5472k6764J0625j1250k0707P1614L6102
2268H75870o5948j9300j3554k114K826N2428j2058r686p3816l7467m1748j0392
2256F45041k3679m896k3877n8066n3510N0924q6609k2546K6706L5652M2254m8825
2244D78569l2638O5697o979j5577k8396n241J7420k5914m6505n9284m0708J9400
2232C19844j531n1313M2541J1134k2556k7912M2509n0484j5378K3344o0895J8467
2220B27770j0587o1949j5110M0815k7122k8251k7157K2403j1952j6550M3391N2283
$$ plain form
2303 2280107 2123219 1964821 1857142 1802499 1696363 1711918 1725761 1659580 1617544 1593557 1537225
2292 1537225 1457366 1407291 1326002 1241530 1186752 1081118 1101257 1101637 1015495 987413 896205 865374
2280 865374 910088 846794 810907 824001 831722 816250 789486 800111 788861 768154 839768 875870
2268 875870 809922 790622 777068 774954 777780 830208 818150 808464 734648 697181 655433 645041
2256 645041 621362 616466 592589 534523 481013 531937 445328 422782 449488 485140 527394 478569
2244 478569 445931 511628 504649 489072 460676 455435 472855 446941 400436 341152 300444 319844
2232 319844 318313 267000 309541 320675 298119 270207 312716 262232 246854 270198 209303 227770
2220 227770 217183 155234 140124 180939 153817 125566 98409 120812 108860 92310 135701 187984
2208A87984l210m6699N2234q730J3770j7698n466J633j705J3264m185j9350J7519
2195A79361l9676l6218L2339R021M3729o7587l1920L4917j2549M6781n1109j3752
2183I3337P4575p950q3816N4332J7050K7984J7960L8848j8776n8813o2618p3304
2171A8809L6128N9419j4424l4303M3M8084N9435n1394l7352J4461J4267R036J8417
2158A40626J186M5048q4926j0154M2147m7699K9642P21m6571k8753K2099R3446
2146A56812k8454r4502j3382K8190M6086J9894k9475o2157K4737j3459M1804m0422
2134C5672j4908n0846O8324l3283p587N0171J6442o2757p6498O6200N1849J4820
2122E7599m1558L7837L3257l9999j5194K8479o8142O3933m7231O814j5798L475
$$ plain form
2208 187984 184774 138075 190309 181579 195349 177651 172185 173818 172113 185377 181192 161842 179361
2195 179361 139685 103467 135806 144827 188556 120969 89049 123966 111417 158198 107089 93337
2183 93337 167912 159962 76146 130478 147528 175512 193472 232320 213544 154731 92113 18809
2171 18809 54937 114356 99932 65629 65672 113756 173191 121797 84445 98906 113173 122209 140626
2158 140626 141812 186860 101934 91780 133927 86228 115870 116591 70020 41267 63366 156812
2146 156812 128358 33856 20474 48664 94750 114644 85169 23012 47749 34290 76094 35672
2134 35672 20764 -30082 38242 4959 -2628 47543 63985 1228 -75270 -9070 42779 57599
2122 57599 16041 53878 87135 47136 31942 60421 -7721 56212 8981 15795 -3 3472
2110C472L3195q155n1897Q644j409J8253M8821K394L6796K1466n5468k4735k0904
2097A0473l9757K7281P5151l7942k5031O34J9921L9790o1734J7286n7613K259
2085b9282J07971p107m1055O4388L1995K9162J9499J5878M7669N1437M6319k5113
2073C11761n2569L5887n1904m3994o7252j2226k893r890K222o0622p67K1280K5285
2060I4318n0131M5313P8470j7001l1066n3184j7378k379n1176k0341K1539N5947
2048E2931p3051M6008P3351o4659k4032L0769o3322O6174j4529m3797J4269k5607
2036b5495Q829J7061J4742M5736J0587q7899K4089n4608l5677K8530M1685Q262
2024d158Q721n3035n4269P9837K094q2008K078N2807K3779j9042n14j3262L5848
$$ plain form
2110 3472 36667 28512 -23385 -14741 -16150 2103 50924 53318 90114 111580 56112 31377 10473
2097 10473 -29284 -2003 73148 35206 10175 10809 30730 70520 8786 26072 -31541 -29282
2085 -29282 78689 71582 30527 94915 126910 156072 175571 191449 239118 290555 336874 311761
2073 311761 259192 295079 243175 199181 131929 119703 116810 106920 109142 48520 47753 69033 94318
2060 94318 44187 89500 167970 150969 119903 66719 49341 46962 -4214 -24555 -3016 52931
2048 52931 -20120 25888 99239 34580 10548 41317 -22005 44169 29640 -14157 112 -25495
2036 -25495 -16666 395 15137 60873 71460 -16439 7650 -46958 -82635 -54105 -12420 -4158
2024 -4158 4563 -48472 -102741 -22904 -20810 -102818 -100740 -47933 -24154 -43196 -43710 -56972 -21124
2011b1124L8405o2918K874N3157o3998J3586Q3706M6661r0464L8343l8942M1941
1999D1227L6213k5340o8559m6831Q4493n1518J6703J8927j8527j2736J0390n9132
1987g4690r621N3583R113p1411O950M0095n3473M9732L6439r322L2212L767k7742
1974a4368K655J9137M918l9569m1950j3413j035K5865R01K804k4656k0215j5001
1961a13927M6033J03293M4689q2285n3987m7943M7375l7870k9598Q9908K2912
1950a1400n1761o345J3182j4596q366O096k635L1264N4838j8076N290J8755k1031
1937d785J17J2543o935m0023M4793N3517J5209r542k566K4990L6969k5262k8460
1924G0565k1280k2011n8367K4037j1837q1692Q068J3617O471q4658Q5382P5248
$$ plain form
2011 -21124 17281 -45637 -42763 10394 -53604 -40018 43688 90349 -115 38228 -714 41227
1999 41227 77440 52100 -16459 -63290 21203 -30315 -13612 5315 -13212 -25948 -15558 -74690
1987 -74690 -84311 -30728 -21615 -93026 -86076 -45981 -99454 -49722 -13283 -22605 9607 13374 -14368
1974 -14368 -11713 7424 12342 -27227 -69177 -82590 -83625 -57760 -56859 -54055 -78711 -98926 -113927
1961 -113927 -67894 35399 80088 -2197 -56184 -104127 -56752 -94622 -124220 -34312 -11400
1950 -11400 -63161 -69506 -56324 -70920 -79286 -73190 -75825 -44561 10277 -7799 -2509 16246 -4785
1937 -4785 -4668 7875 940 -39083 5710 59227 74436 64894 62328 87318 124287 99025 70565
1924 70565 49285 27274 -31093 -7056 -18893 -100585 -92517 -78900 -72429 -157087 -71705 3543
1912C543j3084k4003K0932K054j1155N9269J8734R530k7492n3617m3146j6281
1900g4716K4868l0692J9327L0333P1838n7451m5480l1008L3452M8497j2895M1468
1888A7541q38J8620n0731o3126k9510M0193Q529L6386J5446Q847k2110l3867n4593
1875a09213n256O1025L3308J8385o8715O0699K5754K4673J7804m2810M1846m8258
1863I242k0957o1878k2982J1485j834N0432o6029N8054l3726j3301P3675k6159
1851d3978k6126k3354m1247N1974j2224N5280j556N4794j7901l3929K0873m4613
1839f2007J9834l7362k0711j7319N7697L3584k8779q654m7344L1043L2766n9801
1827a07053M5351L7600l1879l342k9544P6046L2652q9131l3549L3232M0721r5854
$$ plain form
1912 3543 -9541 -33544 -12612 -10558 -21713 37556 56290 65820 38328 -15289 -58435 -74716
1900 -74716 -49848 -80540 -61213 -30880 40958 -16493 -61973 -92981 -59529 -11032 -23927 17541
1888 17541 16703 35323 -15408 -78534 -108044 -67851 -59322 -22936 -7490 1357 -20753 -54620 -109213
1875 -109213 -114469 -53444 -20136 -1751 -70466 -9767 15987 40660 58464 15654 57500 9242
1863 9242 -11715 -73593 -96575 -85090 -86924 -36492 -102521 -44467 -78193 -91494 -17819 -43978
1851 -43978 -70104 -93458 -134705 -82731 -94955 -39675 -41231 13563 -4338 -38267 -17394 -62007
1839 -62007 -42173 -79535 -100246 -117565 -59868 -26284 -55063 -63717 -111061 -80018 -47252 -107053
1827 -107053 -61702 -24102 -55981 -59323 -88867 -12821 19831 -69300 -102849 -69617 -28896 -124750
1815a24750O2183L7300O4209L0469n4194l1149L7134j1829l1445j6632k7097L9654
1803b6147J5140J5877N3016j7050l8341m0306L7079l8379k7159J0151l50J9454
1791c7015k8792K6180J8476n1763J5851M3927O5873n0155K1041m1609N1040N0435
1779H3489n8451J0285K1379n4592j13585L2113L1219N1078L670m4151J8978J5075
1767c493j1457M1224l6877l5473k7283k5006J2934m4776l975P0365J5058q3142
1755a31901L4170M6381K1856M5064K5717l9428n7548L0816j008N8068M2389j7016
1743E7560p482L489K758k8933p9975k7496k2922K1002K909K2685l2946k2052L8492
1730g2911K6973l2501K4542k0177M0352j8123q698K951k8392k4418J16264l6178
$$ plain form
1815 -124750 -62567 -25267 38942 69411 15217 -15932 21202 9373 -22072 -38704 -65801 -26147
1803 -26147 -11007 4870 57886 40836 2495 -37811 -732 -39111 -66270 -56119 -56469 -37015
1791 -37015 -65807 -39627 -21151 -72914 -57063 -13136 52737 2582 23623 -17986 33054 83489
1779 83489 25038 35323 56702 2110 -111475 -79362 -48143 2935 6605 -37546 -18568 -3493
1767 -3493 -14950 26274 -10603 -46076 -73359 -98365 -85431 -130207 -134182 -63817 -48759 -131901
1755 -131901 -97731 -51350 -29494 15570 41287 1859 -55689 -24873 -25881 32187 74576 57560
1743 57560 50078 53567 56325 27392 -52583 -80079 -103001 -81999 -79090 -56405 -89351 -111403 -72911
1730 -72911 -45938 -78439 -53897 -74074 -33722 -51845 -60543 -57592 -85984 -110402 5862 -30316
1718c0316j3284M2991J1796M924k3273k1110m3750j6512J0785l1162K0606L043
1706h5262R987M7886j9623K3523k9239K6767p10m4011n9849M0883K0530L759k8968
1693i4327M9165p471l4203K1839l2828Q1056j3555j01564O5653O9500j7044q4074
1681i7853L8285N1961l0279l2065r56K2030L2061m0389q100m0048p532O7137L736
1668d2012j4807j3075O5445l938J8559j7619K1073m4449o8271R5978k1013J5171
1656h958Q01n0653j0773j5266N1210K1382j8664L4410l4192O4531j9776j7808
1644c756o6677N8215o0318m7457M4950O188k8766n3164K9682P9517n8910k2974
1632a23470K8377j1263L8242j7330O3173L7105m2350m3103q704r122J1067p944
$$ plain form
1718 -30316 -43600 -609 11187 16111 -7162 -28272 -72022 -88534 -77749 -108911 -88305 -85262
1706 -85262 -75275 -27389 -47012 -23489 -52728 -25961 -26671 -70682 -130531 -89648 -69118 -65359 -94327
1693 -94327 -45162 -52633 -86836 -64997 -97825 -16769 -30324 -131888 -66235 3265 -13779 -97853
1681 -97853 -59568 -7607 -37886 -69951 -70907 -48877 -16816 -57205 -65305 -105353 -112885 -45748 -42012
1668 -42012 -56819 -69894 -4449 -8387 10172 -7447 13626 -30823 -99094 -3116 -24129 -8958
1656 -8958 -8157 -58810 -69583 -84849 -33639 -12257 -30921 3489 -30703 33828 14052 -3756
1644 -3756 -70433 -12218 -72536 -119993 -75043 -68855 -97621 -150785 -121103 -41586 -100496 -123470
1632 -123470 -95093 -106356 -68114 -85444 -22271 14834 -27516 -70619 -79323 -88445 -77378 -85322
1620h5322j5612n1720M0878r89N858J7144k3088k5049K0650K2974K0370k9973
1608a03879J4794j9126K2732K3435M628J3846K3721j871j4759m6114m412L8685
1596d8320P3812m1952l1945M617n4774M6435k8090L4092L8371Q779o389j9020
1584b4384q6293k1616M4484O4158j4671j74n087K017N720j4229L7431j0984j2511
1571c6139O8828M1469j37230K9758N1585k6526r814K902P3956M138k3859l0931
1559H137l4176M571l9614j2825M7573M5663j07792m4346L2231j0155K0702l7001
1547a27032M2447J0341q493K4091M3068p079J7631j6451k9943L9644p0306m3449
1535a25531K0966J1397j5105O5304n169o0292j3949Q3543k0582M6238n1590j6232
$$ plain form
1620 -85322 -100934 -152654 -111776 -112765 -106907 -89763 -112851 -137900 -117250 -94276 -73906 -103879
1608 -103879 -89085 -108211 -85479 -62044 -57416 -43570 -19849 -21720 -36479 -82593 -87005 -48320
1596 -48320 25492 -16460 -48405 -43788 -98562 -52127 -80217 -46125 -7754 1025 -5364 -24384
1584 -24384 -110677 -132293 -87809 -23651 -38322 -38496 -43583 -41566 -35846 -50075 -12644 -23628 -36139
1571 -36139 32689 74158 -63072 -33314 18271 -8255 -18069 -15167 58789 62927 39068 8137
1559 8137 -26039 -21468 -61082 -73907 -26334 19329 -88463 -132809 -100578 -110733 -90031 -127032
1547 -127032 -84585 -74244 -82737 -58646 -15578 -22657 -5026 -21477 -51420 -11776 -82082 -125531
1535 -125531 -104565 -93168 -108273 -42969 -48138 -108430 -122379 -38836 -59418 -13180 -64770 -81002
1523h1002j6401J3333k0135N2537n741m7699J4036j3792M591o7361P5617k4538
1511a16555K018M692j1352O3081P5264l8356j2762n6427J3090M6433R7497p9968
1499a3345k7424Q3513q970K2502m9400J5229l2085j8584m3244m1546p575J0977
1487a09952L2603k7485M530P7638J4474m0579K2859q299L9994l6142k4007L4241
1475b0125j650K8778O906k1937J4556m889p3382m6017L8204P510m4605j0182O5400
1462f1433R011m0037K4853O3659j2157l6700j5683j3775L7856m4750k6816K9131
1450h6841m2856L8995O2456L7489p411n9092M0486J3814k5737k6525o2502O5103
1438e2621k4961j7641N9273L8753J6872j846m1801j5153j519q4852j3470P3352
$$ plain form
1523 -81002 -97403 -84070 -104205 -51668 -57409 -105108 -91072 -104864 -100273 -167634 -92017 -116555
1511 -116555 -114537 -109845 -121197 -58116 17148 -21208 -33970 -90397 -77307 -30874 66623 -13345
1499 -13345 -40769 42744 33774 56276 6876 22105 -9980 -28564 -71808 -113354 -120929 -109952
1487 -109952 -77349 -104834 -100304 -22666 -8192 -48771 -25912 -34211 5783 -30359 -54366 -20125
1475 -20125 -21775 7003 13909 -8028 6528 1639 -71743 -117760 -79556 -72046 -116651 -126833 -61433
1462 -61433 -52422 -92459 -67606 -3947 -16104 -52804 -68487 -82262 -44406 -89156 -115972 -86841
1450 -86841 -129697 -90702 -28246 9243 1832 -57260 -16774 -2960 -28697 -55222 -117724 -52621
1438 -52621 -77582 -95223 -35950 2803 19675 17829 -23972 -39125 -40644 -125496 -138966 -65614
1426f5614k9183M9627O1980k1665m2134P243l8861k62J0919o3023K6052M9805
1414e5116R034L586L5672j1759m6239Q2610l3304m7943J1868q340l3241j1238
1402a04410O1050o6497l0352K6927Q8206P7884K3123q0128j4008p0578l8396K0257
1390a06922K3012K5044L7119j1746l676j9746k613n4728o247O5305L6520p706
1378b6384P272J7474L6615K7682m2716m8904M1838o3859j8676M1668p7585m3086
1366a48661L324q650L9975K8954j3079K2461M2331J2807N080L467q4818Q455R4090
1353E736l1748j936K4854Q586o408j1026k2180O482R973l5975p8998N870R5927
1340c0843j5538m2801j6470J8377O2595M7693l796l1876L1078j13161l7128R8904
$$ plain form
1426 -65614 -94797 -45170 16810 -4855 -46989 -39746 -78607 -78869 -67950 -130973 -104921 -55116
1414 -55116 -46082 -42496 -6824 -18583 -64822 17788 -15516 -63459 -51591 -59931 -93172 -104410
1402 -104410 -43360 -109857 -140209 -113282 -25076 52808 75931 -4197 -18205 -88783 -127179 -106922
1390 -106922 -83910 -58866 -21747 -33493 -37169 -56915 -59528 -114256 -120503 -55198 -18678 -26384
1378 -26384 -19112 -1638 34977 62659 19943 -28961 12877 -50982 -69658 -27990 -105575 -148661
1366 -148661 -145337 -153987 -114012 -85058 -98137 -75676 -33345 -20538 -15458 -11991 -96809 -88354 5736
1353 5736 -26012 -27948 -3094 5492 -916 -11942 -34122 -27640 -17667 -53642 -132640 -126770 -30843
1340 -30843 -46381 -89182 -105652 -87275 -24680 23013 19217 -12659 18419 -94742 -131870 -32966
1328c2966M177P047N384l4275k9152L4431R473j367l6423N5700l495k2148j3155
1315e6769q617O8265o2537p93L8940q3824J2085N6263l6115l6835L7735L4769
1303c7433P8428o6907p3470n582M902N272N922J7835Q8521r8857N376K4135l101
1290e4959n4060J5298N2222O828M9682k9845r6353R8330p0871m3518M6011K6183
1278e5052K3620o8773j1179J6568N8396M8553k740J6026M2602o4325p470M973
1266A199L0032j7285q3107k5303J21484L8893m3766n1855o254K5876L005m802
1254a1883L7186n7672m5077J5302O5419j8660P0411k9118m0170n024j4572l3520
1242f7378j2140p1055K4459K4162R221o238K0660L5506o5241j2268M671N9377
$$ plain form
1328 -32966 -28789 -21742 -16358 -50633 -79785 -45354 -35881 -37248 -73671 -17971 -21466 -43614 -56769
1315 -56769 -65386 2879 -59658 -60451 -21511 -105335 -93250 -36987 -73102 -109937 -72202 -37433
1303 -37433 40995 -25912 -99382 -104964 -100062 -94790 -88868 -71033 17488 -81369 -75993 -51858 -54959
1290 -54959 -109019 -93721 -41499 -34671 15011 -14834 -111187 -12857 -83728 -127246 -81235 -55052
1278 -55052 -31432 -100205 -111384 -94816 -36420 12133 9393 25419 68021 3696 -3774 1199
1266 1199 31231 13946 -69161 -94464 27020 65913 22147 -29708 -35962 -10086 -7081 -11883
1254 -11883 25303 -32369 -77446 -62144 3275 -15385 55026 25908 -14262 -19286 -33858 -67378
1242 -67378 -79518 -150573 -126114 -101952 -92731 -98969 -78309 -42803 -108044 -120312 -115641 -56264
1230e6264l764M353k5934p4812L3095O3202K4062K171q0429J2653M1035m923q9
1217f5644L3274p8782P0710q141j875J2154p4083j8484Q3349N7484m5496j205
1205c6739j1452j338N00K6844m3677j3452L2276K6192l5082k7024K3330j5408
1193g5030M5392L2913k2056p394J5625k5500l1558j3894K7357O4484r5806j2182
1181i7649r269O9778O2365o1846m2707L2667J1320j719J1550k6208M8658n305
1169h365J7688j4791r689j8315m4791N3146L7622J8963J0995l5665p6992K0247
1157d9947k6375J5510M9769j985K3960P235p3278k2716L0746j9753Q7795j4736
1145F225M4570O534n6979q0314m9855M3026N9846O1147p3571n1361O5695K9442
$$ plain form
1230 -56264 -60028 -55675 -81609 -156421 -123326 -60124 -36062 -33891 -114320 -101667 -60632 -65555 -65644
1217 -65644 -32370 -111152 -40442 -48583 -50458 -38304 -112387 -130871 -47522 9962 -35534 -36739
1205 -36739 -48191 -49529 -49029 -22185 -65862 -79314 -47038 -20846 -55928 -82952 -59622 -75030
1193 -75030 -29638 3275 -18781 -26175 -10550 -36050 -67608 -81502 -54145 10339 -85467 -97649
1181 -97649 -106918 -37140 25225 -36621 -79328 -46661 -35341 -37060 -25510 -51718 -3060 -8365
1169 -8365 9323 -5468 -15157 -33472 -78263 -25117 12505 31468 42463 6798 -70194 -49947
1157 -49947 -76322 -60812 -11043 -13028 10932 18167 -55111 -77827 -47081 -66834 20961 6225
1145 6225 50795 57329 350 -79964 -129819 -86793 -26947 34200 -39371 -90732 -25037 4405
1133D405K160J5127m8593K7149j0708J7704m0532m9586K5349m1517J2932m0558
1121a26668J273M2851q335N1998N6421k6824n8247j0016P630n6393j161J08286
1109a9185M7630o2471m5850J50015J7598j01887o1832L9643M0823j9961L9020
1098B3543l9819j5418m01K1000o0279K1611J745M526N0051J6610l6141m458l6152
$$ plain form
1133 4405 6565 21692 -26901 248 -10460 7244 -33288 -82874 -57525 -99042 -86110 -126668
1121 -126668 -125395 -82544 -90879 -38881 17540 -9284 -67531 -77547 -69917 -126310 -127471 -19185
1109 -19185 28445 -34026 -79876 70139 87737 -14150 -75982 -36339 4484 -15477 23543
1098 23543 -16276 -31694 -32095 -11095 -71374 -49763 -48018 -43492 6559 23169 -12972 -17430 -53582
$$ [...]
##END NTUPLES=NMR SPECTRUM
##END=
