##TITLE=1H_DE-80H_X3
 200.13MHz, d2o
 8 sc
 
 19ns.26.2.2025
##JCAMPDX= 6.0         $$ Bruker NMR JCAMP-DX V2.0
##DATA TYPE= NMR SPECTRUM
##DATA CLASS= NTUPLES
##ORIGIN= UXNMR, Bruker Analytische Messtechnik GmbH
##OWNER= pz
$$ XWIN-NMR		Version 3.5
$$ Fri Mar  6 11:10:28 2026 Russian Standard Time (UT+4h)  Yarkov@DPX200
##.OBSERVE FREQUENCY= 200.1313
##.OBSERVE NUCLEUS= ^1H
##.ACQUISITION MODE= SIMULTANEOUS
##.ACQUISITION SCHEME= undefined
##.AVERAGES= 8
##.DIGITISER RES= 18
##SPECTROMETER/DATA SYSTEM= spect
##.PULSE SEQUENCE= zg30
##.SOLVENT NAME= CDCl3
##.SHIFT REFERENCE= (INTERNAL, CDCl3, 0, 15.3502)
##AUDIT TRAIL= $$ (NUMBER, WHEN, WHO, WHERE, WHAT)
$$ ##TITLE= Audit trail, XWIN-NMR		Version 3.5
$$ ##JCAMPDX= 5.01
$$ ##ORIGIN= Bruker BioSpin GmbH
$$ ##OWNER= Yarkov
$$ C:/Bruker/XWIN-NMR/data/yarkov2/nmr/H-C/1/pdata/1/auditp.txt
$$ ##AUDIT TRAIL=  $$ (NUMBER, WHEN, WHO, WHERE, WHAT)
(   1,<2026-03-06 11:09:23.21 +0400>,<Yarkov>,<DPX200>,
      <created by zg, POWCHK disabled, PULCHK disabled
       configuration hash MD5:
       00 E9 B6 7A A2 85 ED C7 34 08 36 98 17 FE 4E 26
       data hash MD5: 16K
       CF 84 A8 E8 7E D9 3C FB 6B 64 F6 29 DD 58 5A 95>)
(   2,<2026-03-06 11:09:47.34 +0400>,<Yarkov>,<DPX200>,
      <Start of raw data processing
       efp BC_mod = 2 LB = 0.25 FT_mod = 6 PKNL = 1 PHC0 = -5299.148 PHC1 = 6.821927 SI = 16K 
       data hash MD5: 16K
       D8 20 97 37 AB 2D 00 34 65 33 6A 26 CA 78 51 05>)
$$ ##END=
$$ 
$$ hash MD5
$$ 33 E2 03 B0 4F C1 37 4E C8 BF 1C 3C A0 60 8D 36
##$RELAX= 
##$RELAX= 
##$RELAX= 
##$RELAX= 
##$RELAX= 
##$RELAX= 
$$ Bruker specific parameters
$$ --------------------------
##$DU= <C:/Bruker/XWIN-NMR>
##$EXPNO= 1
##$NAME= <H-C>
##$PROCNO= 1
##$TYPE= <nmr>
##$USER= <yarkov2>
##$AMP= (0..31)
100 100 100 100 100 100 100 100 100 100 100 100 100 100 100 100 100 100 
100 100 100 100 100 100 100 100 100 100 100 100 100 100 
##$AQSEQ= 0
##$AQ_mod= 1
##$AUNM= <au_zg>
##$AUTOPOS= <>
##$BF1= 200.13
##$BF2= 200.13
##$BF3= 200.13
##$BF4= 200.13
##$BF5= 200.13
##$BF6= 200.13
##$BF7= 200.13
##$BF8= 200.13
##$BYTORDA= 1
##$CFDGTYP= 0
##$CFRGTYP= 5
##$CHEMSTR= <none>
##$CNST= (0..31)
1 1 145 1 1 1 1 1 1 1 1 1 1 1 1 1 1 1 1 1 1 1 1 1 1 1 1 1 1 1 1 1 
##$CPDPRG= <>
##$CPDPRG1= <>
##$CPDPRG2= <>
##$CPDPRG3= <>
##$CPDPRG4= <mlev>
##$CPDPRG5= <mlev>
##$CPDPRG6= <mlev>
##$CPDPRG7= <mlev>
##$CPDPRG8= <mlev>
##$CPDPRGB= <>
##$CPDPRGT= <>
##$D= (0..31)
0 0.7 0 0 0 0 0 0 0 0 0 0.03 0 0 0 0 0 0 0 0 0 0 0 0 0 0 0 0 0 0 0 0 
##$DATE= 1772780962
##$DBL= (0..7)
120 120 120 120 120 120 120 120 
##$DBP= (0..7)
150 150 150 150 150 150 150 150 
##$DBP07= 0
##$DBPNAM0= <>
##$DBPNAM1= <>
##$DBPNAM2= <>
##$DBPNAM3= <>
##$DBPNAM4= <>
##$DBPNAM5= <>
##$DBPNAM6= <>
##$DBPNAM7= <>
##$DBPOAL= (0..7)
0.5 0.5 0.5 0.5 0.5 0.5 0.5 0.5 
##$DBPOFFS= (0..7)
0 0 0 0 0 0 0 0 
##$DE= 6
##$DECBNUC= <off>
##$DECIM= 32
##$DECNUC= <off>
##$DECSTAT= 4
##$DIGMOD= 1
##$DIGTYP= 9
##$DL= (0..7)
0 120 120 120 120 120 120 120 
##$DP= (0..7)
$$ [...]
##$SUBNAM2= <"">
##$SUBNAM3= <"">
##$SUBNAM4= <"">
##$SUBNAM5= <"">
##$SUBNAM6= <"">
##$SUBNAM7= <"">
##$SUBNAM8= <"">
##$SUBNAM9= <"">
##$SW= 18.0517328524113
##$SWIBOX= (0..15)
0 0 2 0 0 0 0 0 0 0 0 0 0 0 0 0 
##$SW_h= 3612.71676300578
##$TD= 16384
##$TD0= 1
##$TE= 0
##$TE2= 300
##$TE3= 300
##$TEG= 300
##$TL= (0..7)
0 120 120 120 120 120 120 120 
##$TP= (0..7)
150 150 150 150 150 150 150 150 
##$TP07= 0
##$TPNAME0= <>
##$TPNAME1= <>
##$TPNAME2= <>
##$TPNAME3= <>
##$TPNAME4= <>
##$TPNAME5= <>
##$TPNAME6= <>
##$TPNAME7= <>
##$TPOAL= (0..7)
0.5 0.5 0.5 0.5 0.5 0.5 0.5 0.5 
##$TPOFFS= (0..7)
0 0 0 0 0 0 0 0 
##$TUNHIN= 0
##$TUNHOUT= 0
##$TUNXOUT= 0
##$USERA1= <user>
##$USERA2= <user>
##$USERA3= <user>
##$USERA4= <user>
##$USERA5= <user>
##$V9= 5
##$VALIST= <valist>
##$VCLIST= <CCCCCCCCCCCCCCC>
##$VD= 0
##$VDLIST= <DDDDDDDDDDDDDDD>
##$VPLIST= <PPPPPPPPPPPPPPP>
##$VTLIST= <TTTTTTTTTTTTTTT>
##$WBST= 1024
##$WBSW= 4
##$XGAIN= (0..3)
0 0 0 0 
##$XL= 0
##$YL= 0
##$YMAX_a= 766228
##$YMIN_a= -597558
##$ZGOPTNS= <>
##$ZL1= 120
##$ZL2= 120
##$ZL3= 120
##$ZL4= 120
##$ABSF1= 0
##$ABSF2= 0
##$ABSG= 0
##$ABSL= 0
##$ALPHA= 0
##$AQORDER= 0
##$ASSFAC= 0
##$ASSFACI= 0
##$ASSFACX= 0
##$ASSWID= 0
##$AUNMP= <proc_1d>
##$AZFE= 0.1
##$AZFW= 0.1
##$BCFW= 0
##$BC_mod= 2
##$BYTORDP= 0
##$COROFFS= 0
##$CY= -3
##$DATMOD= 1
##$DC= 0
##$DFILT= <>
##$DTYPP= 0
##$F1P= 0
##$F2P= 0
##$FCOR= 1
##$FTSIZE= 16384
##$FT_mod= 6
##$GAMMA= 0
##$GB= 0
##$INTBC= 1
##$INTSCL= 3.241238e-09
##$ISEN= 128
##$LB= 0.25
##$LEV0= 0
##$LPBIN= 0
##$MAXI= 10000
##$MC2= 0
##$MEAN= 0
##$ME_mod= 0
##$MI= 1.114404
##$NCOEF= 0
##$NC_proc= -6
##$NLEV= 6
##$NOISF1= 3.799351
##$NOISF2= 2.8
##$NSP= 0
##$NTH_PI= 0
##$NZP= 0
##$OFFSET= 15.35024
##$PC= 1
##$PHC0= -5299.148
##$PHC1= 6.821927
##$PH_mod= 1
##$PKNL= yes
##$PPARMOD= 0
##$PSCAL= 0
##$PSIGN= 0
##$REVERSE= no
##$SF= 200.130034314044
##$SI= 16384
##$SIGF1= 3
##$SIGF2= 2
##$SINO= 0.751879
##$SIOLD= 32768
##$SREGLST= <19F.Aceton>
##$SSB= 0
##$STSI= 16384
##$STSR= 0
##$SW_p= 3612.71676300578
##$SYMM= 0
##$S_DEV= 0
##$TDeff= 16384
##$TDoff= 0
##$TI= <>
##$TILT= no
##$TM1= 0
##$TM2= 0
##$TOPLEV= 0
##$USERP1= <user>
##$USERP2= <user>
##$USERP3= <user>
##$USERP4= <user>
##$USERP5= <user>
##$WDW= 1
##$XDIM= 16384
##$YMAX_p= 365851380
##$YMIN_p= -1716131
$$ End of Bruker specific parameters
$$ ---------------------------------
##NTUPLES= NMR SPECTRUM
##VAR_NAME=  FREQUENCY,     SPECTRUM/REAL,   SPECTRUM/IMAG
##SYMBOL=    X,             R,               I
##VAR_TYPE=  INDEPENDENT,   DEPENDENT,       DEPENDENT
##VAR_FORM=  AFFN,          ASDF,            ASDF
##VAR_DIM=   16384,         16384,           16384
##UNITS=     HZ,            ARBITRARY UNITS, ARBITRARY UNITS
##FACTOR=    0.220516191357247, 1,           1
##FIRST=     3072.04400864142, 0,            0
##LAST=      -540.672754364365, 0,           0
##MIN=       -540.672754364365, -1716131,    0
##MAX=       3072.04400864142, 365851380,    0
$$ Real data points
##PAGE= N=1
##DATA TABLE= (X++(R..R)), XYDATA
$$ [...]
9721 -472813 -548664 -548516 -570176 -558670 -566027 -593283 -588628 -545331 -498396 -487965 -546036 -577796
9709 -577796 -517113 -531688 -532515 -483168 -493118 -532600 -547434 -570783 -530111 -482657 -531052 -570716
9697 -570716 -545705 -576231 -566428 -537388 -528789 -499253 -503619 -489122 -460452 -504004 -526982 -503545
9685 -503545 -513645 -479267 -439859 -370552 -309936 -313876 -312264 -336018 -376158 -296650 -350500 -319071
9673 -319071 -297549 -352316 -354287 -255269 -185090 -95806 -42245 55467 142966 241892 437618 635579
9661 635579 829451 1046284 1198427 1329205 1445259 1537470 1515300 1396422 1388243 1228559
9651 1228559 1042325 869528 703179 562924 415720 364364 293158 181091 104237 15982
9641 15982 36645 53995 5833 -24855 -66181 -81513 -68796 28548 144540 122717 184237 260754
9629 260754 441216 673077 883647 1054793 1235964 1425517 1676224 1788069 1751684 1726527
9619 1726527 1620122 1537816 1451073 1308763 1132479 931605 739148 546012 369852 274079
9609 274079 160678 83435 18689 -12212 -85295 -191626 -268835 -300944 -331168 -282302 -257327
9598 -257327 -291261 -356794 -390876 -425101 -468340 -387978 -376707 -419784 -368390 -381078 -372352 -389709
9586 -389709 -447794 -488410 -389603 -390702 -474251 -367061 -396483 -420021 -437139 -459991 -478718 -513202
9574 -513202 -467421 -445699 -401738 -477508 -509828 -485111 -572907 -581755 -587721 -618402 -581633 -505876
9562 -505876 -506752 -488444 -487912 -550991 -557314 -460972 -538055 -537658 -527686 -527599 -476102 -512456 -587788 -546451
9548 -546451 -567441 -636348 -551608 -547817 -538750 -489200 -491616 -550016 -534980 -542528 -519330 -562473
9536 -562473 -633376 -636372 -554209 -570548 -577451 -509535 -475105 -458363 -507701 -523653 -559881 -533347
9524 -533347 -521137 -538437 -479350 -485810 -519117 -521554 -518528 -491371 -456794 -381326 -463524 -551939
9512 -551939 -541894 -452371 -414845 -456810 -510810 -503756 -553573 -529070 -490524 -498862 -483043 -474906
9500 -474906 -542465 -585953 -575084 -515706 -455177 -435386 -399699 -423248 -454815 -484873 -582283 -579479
9488 -579479 -501391 -528192 -541460 -480662 -426267 -407646 -429307 -406621 -449744 -458995 -551919 -591472
9476 -591472 -475073 -447082 -502191 -477933 -459679 -467364 -433766 -511456 -514735 -525974 -549028 -524068
9464 -524068 -491001 -477616 -494003 -499119 -522134 -560145 -474728 -497737 -445595 -474573 -521096 -573930
9452 -573930 -536167 -486381 -437428 -483000 -512564 -508808 -496709 -482928 -440070 -394990 -432394 -397912
9440 -397912 -374980 -377958 -367916 -381978 -382650 -383725 -379395 -312446 -328445 -342904 -393021 -310385 -263402
9427 -263402 -333074 -364079 -327593 -276725 -299219 -299077 -217093 -201925 -236230 -130890 -108743 -79797
9415 -79797 -42350 -5818 42058 72612 131595 180421 281453 430250 634715 912117 1115948
9404 1115948 1278654 1398138 1451268 1369659 1190714 1152826 1230330 1262495 1345242 1527183 1645406
9393 1645406 1675992 1683345 1527864 1292123 1049036 851203 654851 540240 437394 370909
9383 370909 255273 213429 176174 140133 108984 89384 123371 88468 170945 142086 220519
9372 220519 253525 270707 281979 392320 549789 786139 1060745 1242507 1428634 1513701
9362 1513701 1410624 1275117 1093048 947503 930864 901971 1030781 1249097 1419256 1499031
9352 1499031 1521697 1449866 1253911 970835 769214 650970 467809 366566 197020 68260
9342 68260 -6916 -30164 -105481 -93338 -84551 -116658 -177317 -213951 -127449 -95504 -167422 -230823
9330 -230823 -169940 -161489 -165385 -187337 -117334 -63332 -89458 -100774 -127543 -173351 -245438 -217986
9318 -217986 -253306 -246081 -238008 -182652 -239909 -244194 -227222 -209256 -228793 -276028 -223115 -222738 -262395
9305 -262395 -235552 -188081 -131568 -169549 -168975 -146804 -176870 -173369 -134079 -167245 -129751 -77024
9293 -77024 -97228 -71449 -21517 -126366 -187928 -159519 -186134 -128487 -131668 -156687 -95497 -26045
9281 -26045 -29703 -74732 -135162 -107755 -133575 -92395 -58887 11110 -9625 24630 120109 125798
9269 125798 120236 165220 181707 190936 170655 145406 145410 79576 53883 29640 36616 93007 79041
9256 79041 161009 170232 192915 234800 283017 326271 443827 399461 432202 424679 401934 422542
9244 422542 393162 413221 423068 397787 395330 392766 521263 564254 598110 699686 804628 878028
9232 878028 918968 1031722 1154301 1136516 1150001 1167762 1161968 1249716 1320670 1425084 1560425
9221 1560425 1674458 1676056 1588336 1572604 1561977 1617448 1663842 1618213 1497886 1441000 1400581
9210 1400581 1395526 1307604 1159317 1093090 983784 963667 963649 907233 908493 916192 858527 912615
9198 912615 965979 1006315 988195 1013742 1079423 1203185 1343156 1569454 1692193 1914408 2054849
9187 2054849 2152945 2284724 2495690 2636846 2738742 2667374 2526545 2408849 2503622 2551941
9177 2551941 2488169 2338474 2173725 1968904 1782314 1629494 1495963 1498136 1423129 1399303
9167 1399303 1333383 1296271 1290908 1217843 1240443 1289960 1279702 1292134 1411959 1540270 1614313
9156 1614313 1720765 1823230 2092084 2306254 2496336 2562415 2531472 2479491 2465679 2489111
9146 2489111 2395193 2179626 1941238 1694235 1487977 1393472 1283015 1236966 1181044 1138677
9136 1138677 1169536 1172619 1110076 1093837 1065901 1121971 1153269 1071513 1102551 1238017 1251951
9125 1251951 1411014 1583517 1754647 1961652 2083184 2247006 2521703 2839883 3112653 3329806
9115 3329806 3490502 3604951 3754408 3784439 3720837 3659366 3516370 3273154 3012477 2691366
9105 2691366 2441560 2216814 2021681 1928532 1846260 1720342 1628871 1646916 1585756 1578757 1548673
9094 1548673 1544489 1557536 1543902 1503034 1547326 1536255 1605213 1586034 1658638 1706382 1824511
9083 1824511 1872212 2020747 2237909 2452347 2504125 2540877 2628291 2673846 2666439 2620941 2608574
9072 2608574 2571584 2534370 2478349 2380493 2279042 2204146 2136301 2204256 2229705 2309178 2367733
9061 2367733 2532395 2611972 2650119 2583641 2517221 2394945 2262430 2162652 2107801 2129781 2089587
9050 2089587 2061907 2031849 2120962 2166759 2263930 2299541 2444029 2613051 2742361 2885333 2922048
9039 2922048 2959605 2995213 2865803 2752156 2660617 2556256 2526857 2586615 2636261 2653423 2698301
9028 2698301 2675104 2777711 2940160 3093228 3197380 3384211 3579905 3908703 4211394 4329132
9018 4329132 4393151 4366406 4201784 3975565 3872150 3737727 3629610 3604953 3604142 3604561 3568184
9007 3568184 3664129 3741760 3866600 4040179 4351789 4780389 5145049 5424709 5639879 5865205
8997 5865205 5971719 5816784 5581061 5401304 5324525 5259499 5287092 5350169 5240797 5131139
8987 5131139 5140601 5139088 5006183 4974542 5091912 5185843 5268315 5251224 5346822 5436351 5469808
8976 5469808 5625535 5695508 5755764 5806936 5884403 5948975 6109714 6241270 6435425 6708659
8966 6708659 7053882 7320254 7535369 7834762 8182938 8564870 8886822 9169255 9408800 9691281
8956 9691281 9984099 10042072 9870133 9731598 9617102 9601943 9662690 9779475 10159797 10566490
8946 10566490 10886847 11370264 11734925 11886363 12044513 12214216 12447005 12779204 13269304
8937 13269304 13906636 14653899 15692096 16944014 18478741 20349548 22670318 25691014
8929 25691014 29856193 36200820 46498875 63710182 81582362 86334960 79096216 66257638
8921 66257638 53095590 44009014 38225085 34921587 33259438 33178534 34365245 37120140
8913 37120140 41652062 47673726 53544456 57690686 58725524 56054389 51019412 45387007
8905 45387007 40467944 36584806 33625676 31433312 29985979 29369829 29446764 30164175 31617045
8896 31617045 33894285 37181040 41903594 48439028 55791355 61958865 65421332 65240863
8888 65240863 61556923 56232846 50947738 46754313 43957449 42337433 41827515 42241554
8880 42241554 43608421 45773711 48734329 52444348 57121854 63102492 71307761 82736197
8872 82736197 97435304 114179659 130971979 143820774 149048521 147128755 140467867 132872020
8864 132872020 128107713 128393613 133952861 143078980 153574755 163545961 170469853 172195018
8856 172195018 169510767 164902571 161440142 162006815 167616932 175765510 182349010 182574704
8848 182574704 174093901 158312195 138712567 119376994 103080109 90436294 80996827
8841 80996827 74045084 68720380 64684861 61449882 58966459 57239187 56067925 55543312
8833 55543312 55450238 55793960 56983974 59357411 63508424 69960394 78987659 89305057
8825 89305057 98415618 104578757 107047487 106843640 107025064 110539302 118337530 128714163
8817 128714163 139214698 147719186 152435338 152226571 147674917 140389107 131862799 124266565
8809 124266565 119918164 119674609 121949251 123200886 120579413 113147223 101790070 89336662
8801 89336662 78170708 69197501 62200558 56591371 51821842 47598020 43853240 40413561
8793 40413561 37415778 34945500 32947512 31290897 30017212 29078688 28442533 28007905 27743974
8784 27743974 27639675 27771998 28148649 28812022 29608736 30326020 30775648 30976769 30817015
8775 30817015 30419144 30071584 30066013 30308959 30902029 32103261 33872598 36467942 40311289
8766 40311289 45548502 51960804 58434453 63556693 66442342 66417698 63768600 59498467
8758 59498467 54657851 50001607 45950134 42764353 40363422 38732884 38134876 38232376 39080367
8749 39080367 40962464 43875772 48089653 53958888 61248747 68450006 73730757 75947644
8741 75947644 74767700 70787288 65392001 59833854 55045737 51241414 48272884 46338566
8733 46338566 45469918 45652098 47031039 49686621 53744903 59721413 67822645 78410841
8725 78410841 90875524 103127538 112252062 116437856 114753597 107752732 97697198 86994814
8717 86994814 77413386 69494239 63332151 58850935 55900582 54503660 54499200 56075608 59243389
8708 59243389 64291863 71376914 80613612 91506533 101895938 108909847 110509277 106382188
8700 106382188 97505067 86153868 74697441 64565745 56361168 49952186 45005696 41500738
8692 41500738 39016459 37348472 36494472 36154941 36205131 36657377 37570407 39060979 41456167
8683 41456167 45185513 50215878 55221196 57499823 55851514 51702745 47184715 43590942
8675 43590942 41350296 40433118 40935320 42967536 46566116 51499886 55856578 57478903
8667 57478903 56020343 53263828 50979238 49960846 50292661 51813587 54505770 58559972
8659 58559972 64159932 71114709 78633529 84579511 86573587 84379014 80187487 76184767
8651 76184767 73652265 72995160 74435988 77826300 82890155 88993242 94661053 97968842
8643 97968842 98652919 98445359 98695463 98932044 98729294 96630536 91447521 83899532 76248799
8634 76248799 70330536 66810848 66046311 67985340 72168855 77223253 81524478 84137463
8626 84137463 84133810 81618475 78250162 75330875 73872317 73997028 75616750 79016124 84838834
8617 84838834 93067150 102533098 110856243 115010183 113624100 108170604 101501156 95856917
8609 95856917 92228068 90967376 92265125 95786103 100579047 104517277 105529977 102636823
8601 102636823 97013816 91118835 86278039 81619506 75476155 68096511 60756917 54512918
8593 54512918 49626360 46247172 44171384 43523698 44415049 46486741 48810716 49668500 48273386
8584 48273386 45814517 43471988 41880710 40948130 40346427 40272425 41063468 42742075 45524105
8575 45524105 48856359 51017328 50701980 48334120 45308157 42620314 40606695 39312568
8567 39312568 38851185 39187044 40417654 42056207 43001104 42086996 38982903 34742877 30676134
8558 30676134 27208010 24374421 22023580 20156246 18608668 17341834 16290517 15316608
8550 15316608 14529120 13926105 13400016 12903855 12595251 12400136 12399134 12513676 12528741 12375130
8540 12375130 11930782 11382122 10896497 10489435 10127284 9909527 9895739 10035569 10236799 10521749
8530 10521749 10735694 10684365 10443007 9919073 9312728 8948938 8579817 8258184 8059662 7943424
8520 7943424 7853807 7683936 7548085 7324118 6999774 6768475 6666246 6713998 6757702 6848383
8510 6848383 7057409 7149336 7123675 6990687 6800561 6505645 6259872 5941364 5650914 5312097
8500 5312097 4945155 4717067 4560929 4314341 4175175 4072783 3991622 4000099 3991990 4013581 3991982
8489 3991982 3969876 3851587 3759290 3660132 3469936 3353763 3296966 3240747 3201128 3143430 3071730
8478 3071730 2954683 2884620 2824083 2713544 2611172 2503543 2447187 2415254 2388052 2367957 2325372
8467 2325372 2294721 2316158 2351793 2273652 2166880 2199341 2235981 2219212 2286699 2303774 2326550
8456 2326550 2384005 2393079 2405998 2559431 2770837 2965363 3092452 3144011 3126652 3109606 2973358
8445 2973358 2742972 2543570 2389340 2269442 2240590 2196005 2224736 2222893 2155264 2145209 2180692
8434 2180692 2196405 2171388 2170752 2266052 2331393 2300308 2197428 2054651 1947560 1785506 1705484
8423 1705484 1687622 1743575 1762524 1683436 1732489 1761152 1866630 1941616 2095324 2223739 2270512
8412 2270512 2424125 2571602 2771155 3049714 3369984 3802630 4294490 4847628 5360645 5679404
8402 5679404 5745612 5566036 5277016 4858346 4464799 4141901 3925389 3760998 3602735 3638138
8392 3638138 3773585 3958638 4181604 4385331 4676789 5065807 5538502 5900188 6096879 6028019
8382 6028019 5656050 5163186 4658232 4181731 3791621 3441528 3282211 3155785 2986453 2957187
8372 2957187 3004854 3048826 3127823 3343514 3671078 3946827 4294803 4560557 4665329 4618754
8362 4618754 4401452 4047381 3667335 3416793 3160082 3032993 2997674 2925307 2883241 2846937
8352 2846937 2874089 3034630 3205184 3430209 3776497 4098891 4339063 4374484 4212480 3797418
8342 3797418 3421408 3053977 2657683 2398615 2140422 1989831 1954092 1824805 1771910 1718372
8332 1718372 1687531 1685629 1590811 1502262 1426078 1410072 1305673 1161601 1168357 1050921 944058
8321 944058 841945 811922 804362 712869 624517 592140 582507 545731 536130 593161 536341 536549
8309 536549 512585 424157 473644 498166 507880 479281 494276 555667 605033 581999 487090 491998
8297 491998 534677 551132 575242 584896 639818 624130 726612 801211 812069 811503 733208 752310
8285 752310 831875 762595 820583 867663 882667 833378 885058 882860 883648 905818 921639 905509
8273 905509 972892 947586 900854 935494 817460 798721 777980 826339 861439 913319 1078761
8262 1078761 1143491 1159164 1191669 1217291 1246885 1175997 1127401 1045441 940831 940472 1010790 1095525
8250 1095525 1220002 1215885 1175439 1280468 1385400 1468395 1640183 1723187 1804928 1909226 1789878
8239 1789878 1632962 1593800 1542180 1427885 1333232 1163433 1049251 1017339 1015313 942280 900222
8228 900222 857113 803858 804622 830279 841733 819937 895492 927571 847708 737614 674940 603898
8216 603898 547805 472452 435555 435925 448600 506562 528895 517793 540092 597014 742423 743711
8204 743711 727363 712480 690173 710251 710818 686566 591296 472492 420246 458599 426849 392820
8192 392820 -238587 -220360 -41153 -133267 -28340 -104236 -82261 -83786 -74307 -259111 -222399
8181 -222399 -195919 -136502 -100767 -151825 -165468 -136780 -177689 -220610 -141028 -155963 -166417 -155258
8169 -155258 -302782 -329848 -303698 -325375 -321735 -338511 -395130 -432726 -373970 -258299 -235149
8158 -235149 -279217 -315318 -350342 -379674 -420016 -388853 -397949 -408368 -362607 -375264 -427087 -455035
8146 -455035 -374412 -385828 -442287 -366092 -376023 -376029 -385201 -320101 -274157 -325830 -361491 -417860 -469908
8133 -469908 -404301 -387374 -430142 -412490 -379586 -382288 -410131 -444390 -446887 -433954 -387662 -425146
8121 -425146 -519221 -494895 -456649 -379214 -329001 -438163 -418674 -395064 -428203 -471904 -475366 -438658
8109 -438658 -434380 -418734 -477322 -402601 -447048 -442565 -423253 -424011 -380270 -422081 -450922 -445278 -460127
8096 -460127 -486577 -533449 -528715 -569948 -557151 -491618 -489168 -488325 -469177 -505286 -503459 -427377 -386314
8083 -386314 -416512 -445518 -490283 -491613 -434535 -454182 -505528 -476645 -442904 -412471 -428088 -473706
8071 -473706 -512156 -520345 -486866 -509454 -467556 -460820 -472844 -409228 -403173 -483775 -503322 -506796
8059 -506796 -528090 -468080 -461840 -502154 -522237 -513534 -446822 -481830 -510053 -532601 -496765 -559440
8047 -559440 -591194 -513194 -550897 -589004 -541654 -531666 -558168 -557370 -559467 -549587 -562795 -568327 -513302
8034 -513302 -520015 -529124 -572071 -583142 -582400 -577047 -551437 -527965 -507480 -484401 -489942 -540508 -573399
8021 -573399 -549965 -458493 -432652 -450246 -372651 -380199 -408005 -391181 -419918 -413741 -401090 -414354
8009 -414354 -456208 -428127 -392883 -410390 -417796 -444388 -430954 -441854 -429904 -372337 -357704 -361669
7997 -361669 -333281 -358689 -298985 -245860 -266338 -235156 -214509 -110034 -96703 -32409 67881
7986 67881 86272 22172 31389 45381 98269 145502 174094 177775 191417 254109 267299 316674
7974 316674 304456 265871 233294 141776 73630 73617 73329 54636 9607 2583 -45570 -81528 -173368
7961 -173368 -207153 -193456 -216585 -254368 -263882 -345531 -311159 -224429 -192338 -189313 -191581 -245869
7949 -245869 -172351 -127332 -176148 -74052 20977 53949 131468 151208 183728 224511 263318
7938 263318 259443 253337 366220 351184 410277 398199 331678 289623 264393 198151 191594 162054
7926 162054 131027 181953 268606 128714 39576 -53388 -140609 -133374 -171726 -209278 -266824 -241088
7914 -241088 -269399 -305368 -276453 -231621 -218096 -296642 -284864 -218522 -257115 -209878 -245606 -233965
7902 -233965 -247263 -249754 -226050 -223688 -192754 -189681 -212645 -263068 -311578 -272458 -175782 -208872
7890 -208872 -251417 -239013 -241154 -197406 -196463 -210605 -151587 -229006 -240158 -240957 -265019 -233332 -177704
7877 -177704 -203347 -263156 -232228 -208443 -195492 -174769 -207408 -183972 -272533 -255055 -183385 -171149
7865 -171149 -235853 -220176 -144798 -167368 -209366 -239018 -288943 -317403 -262169 -254288 -274192 -268496
7853 -268496 -354350 -335650 -307667 -355860 -335664 -332735 -324207 -264123 -263412 -291965 -343644 -341586 -364102
7840 -364102 -321082 -305227 -237310 -332723 -350996 -309552 -296941 -336721 -371792 -367836 -357494 -323353
7828 -323353 -385163 -339056 -355718 -330349 -290274 -277182 -407369 -401058 -326947 -302071 -337140 -367507
7816 -367507 -434888 -445992 -392155 -356905 -471186 -474355 -487896 -513138 -613538 -332384 -336692
7805 -336692 -424163 -462048 -485343 -513436 -481935 -501747 -538230 -522419 -577007 -576226 -580945 -486216
7793 -486216 -484502 -431914 -465850 -516979 -556566 -557635 -517643 -424742 -524572 -623283 -544400 -528442
7781 -528442 -504084 -491429 -479637 -464206 -499669 -494713 -462935 -463739 -409926 -411597 -392622 -475894
7769 -475894 -457871 -404466 -424875 -445493 -476047 -439350 -472810 -443059 -380139 -397529 -356828 -326416
7757 -326416 -376194 -441934 -417259 -352542 -315904 -304935 -366170 -398975 -406687 -374422 -360061 -324102
7745 -324102 -317644 -342232 -325809 -289960 -344814 -383393 -387873 -381462 -344819 -305841 -305087 -267458 -295636
7732 -295636 -287343 -261979 -260523 -265871 -229698 -233781 -298236 -293778 -257501 -289379 -288818 -300319 -285639
7719 -285639 -281674 -248519 -327653 -279248 -284351 -235901 -255838 -327395 -325170 -351821 -335414 -372576
7707 -372576 -359516 -255661 -260601 -319164 -398620 -382803 -452231 -427006 -380199 -359684 -366918 -360741
7695 -360741 -355006 -336224 -306144 -342357 -316562 -398928 -313856 -245208 -346772 -441549 -424918 -389524
7683 -389524 -366681 -354919 -383893 -359309 -320907 -350787 -373805 -455445 -407743 -419479 -427291 -447551
7671 -447551 -506732 -504235 -495462 -485541 -481757 -489830 -468416 -499341 -492076 -436208 -457549 -398733 -369317
7658 -369317 -416048 -473880 -450261 -491477 -542949 -516794 -514781 -442189 -445089 -513805 -545964 -559352
7646 -559352 -523132 -492962 -544432 -582301 -559518 -543776 -512134 -500124 -522957 -608123 -552671 -515915
7634 -515915 -544246 -555886 -585076 -459189 -434978 -512135 -495424 -497204 -531535 -508499 -555781 -604950
7622 -604950 -637603 -577708 -620288 -566703 -536468 -595129 -562148 -471011 -493229 -518282 -540916 -454188
7610 -454188 -473918 -513812 -526125 -572961 -578018 -586229 -576895 -567653 -558027 -524907 -444899 -471659 -527939
7597 -527939 -496965 -562557 -560814 -531042 -601181 -577071 -563622 -506926 -494643 -522779 -485976 -504470
7585 -504470 -559662 -598387 -597999 -616686 -634371 -567251 -602000 -608744 -609590 -558227 -505263 -520166 -523970
7572 -523970 -529408 -555226 -608116 -502681 -526348 -571563 -525555 -565296 -579481 -532209 -526251 -514137
7560 -514137 -457156 -492278 -549403 -491901 -492761 -566009 -529525 -483611 -456673 -375332 -391825 -409930
7548 -409930 -366256 -388213 -461393 -440002 -407914 -448520 -476643 -442966 -432449 -439545 -423080 -381354
7536 -381354 -378411 -455137 -386830 -355579 -433370 -354238 -357970 -337372 -298145 -305873 -272033 -295742
7524 -295742 -211546 -194460 -116928 -181270 -173808 -117028 -103395 -132725 -112676 -77239 -77992 -86819
7512 -86819 -102363 -138990 -44652 9446 -48749 -131467 -148893 -105256 -64531 -116801 -39428 -19993
7500 -19993 -26339 -17791 8953 -2720 -5537 8773 -4990 40801 62225 105688 157910 165683 77158
7487 77158 90166 213468 185520 163428 149034 144451 136495 106815 77786 95048 59162 86002
7475 86002 122538 145927 119823 17361 12940 35977 -468 -53206 -28288 28264 95305 91156
7463 91156 28366 56138 17939 3799 23328 -8809 -27164 -26651 -36764 -130406 -68747 -121528
7451 -121528 -86154 -45535 24032 -25397 -43331 -97085 -66953 -116167 -164646 -259639 -198734 -154450
7439 -154450 -215144 -256822 -242303 -216682 -257041 -236801 -279501 -295845 -335285 -331465 -292745 -342076
7427 -342076 -396634 -408145 -487220 -439753 -363195 -437486 -434425 -418776 -386944 -367977 -456360 -471091
7415 -471091 -434557 -447690 -409452 -447996 -436791 -431361 -365622 -381330 -421591 -470188 -452041 -423861
7403 -423861 -442720 -403207 -429294 -448941 -465015 -494986 -472746 -447563 -509586 -488983 -464497 -460962
7391 -460962 -475959 -435071 -414656 -443836 -409614 -438188 -432752 -433187 -477881 -541656 -583314 -535270
7379 -535270 -497830 -490081 -494107 -522357 -458785 -516223 -545173 -471281 -498236 -480568 -503269 -497995
7367 -497995 -502269 -500566 -495451 -520120 -531379 -535446 -480087 -414176 -462955 -437382 -510676 -515624 -545165
7354 -545165 -520395 -488531 -481968 -508622 -528567 -483429 -444116 -428857 -456454 -453874 -434219 -438813
7342 -438813 -482869 -547397 -556530 -494986 -478984 -515162 -500042 -466772 -465638 -492239 -474310 -471019
7330 -471019 -453482 -495717 -514695 -448098 -412865 -469079 -419554 -452184 -467568 -452123 -454320 -489205
7318 -489205 -442860 -450690 -498473 -495237 -447857 -445278 -471825 -461652 -424552 -457374 -483373 -491764
7306 -491764 -529239 -519271 -430132 -413047 -452249 -455121 -504455 -530599 -512929 -508067 -527850 -511176
7294 -511176 -516449 -520860 -518438 -513763 -481991 -496640 -578660 -510703 -539970 -509861 -522521 -570584
7282 -570584 -586479 -578199 -518170 -514798 -464128 -445989 -440467 -445036 -467820 -444480 -500423 -470803
7270 -470803 -513310 -462953 -380804 -402307 -473637 -483325 -517196 -543825 -481535 -441827 -445169 -389659
7258 -389659 -466231 -537514 -573058 -525901 -479274 -472651 -465001 -509907 -492350 -469965 -447690 -509469
7246 -509469 -509693 -468130 -425808 -444303 -494341 -442510 -499719 -555851 -561202 -519648 -472339 -475825
7234 -475825 -444156 -457495 -477194 -426529 -471286 -515108 -556461 -494632 -477712 -486142 -447511 -474300
7222 -474300 -457379 -474251 -428699 -450787 -466728 -510565 -577320 -533217 -480742 -462374 -462693 -504414
7210 -504414 -526187 -493050 -535510 -542285 -549764 -564200 -564803 -580663 -563191 -498843 -489663 -448604 -431270
7197 -431270 -488511 -411963 -342173 -403156 -409234 -405225 -459926 -396619 -394113 -513807 -448303 -427353
7185 -427353 -463396 -390893 -383786 -383209 -387293 -413218 -446994 -502266 -540373 -507278 -534526 -564929
7173 -564929 -481367 -452686 -459460 -455348 -470809 -492824 -542438 -482628 -500530 -528009 -483046 -478589
7161 -478589 -470843 -409563 -501796 -513307 -452462 -440421 -432028 -447055 -454869 -486611 -477114 -407925
7149 -407925 -420117 -421409 -450955 -441529 -481939 -527326 -530434 -461244 -458000 -441631 -407750 -444338
7137 -444338 -448911 -429337 -393062 -377894 -365348 -410952 -403849 -472821 -450786 -417649 -466941 -480358
7125 -480358 -498805 -457509 -388466 -447674 -534412 -408314 -440425 -529542 -509681 -455689 -440121
7114 -440121 -388880 -471954 -486693 -449730 -482948 -458663 -487681 -543168 -499352 -466916 -464079 -425918
7102 -425918 -429560 -428034 -431296 -392816 -445402 -482787 -496920 -441525 -462257 -443980 -439180 -475803
7090 -475803 -514275 -440778 -462354 -471677 -389091 -416016 -450536 -489233 -520629 -458558 -389840 -439260
7078 -439260 -476725 -517965 -495110 -514054 -542019 -528917 -496028 -473155 -436808 -423146 -464672 -489206
7066 -489206 -485947 -489077 -494249 -543169 -524454 -507207 -477111 -446909 -485278 -394848 -425652 -446273
7054 -446273 -428821 -446864 -500816 -490936 -482706 -495209 -468559 -407158 -352327 -351516 -341291 -410560
7042 -410560 -422172 -437831 -400744 -436817 -493957 -430240 -414594 -447592 -540527 -566826 -496155 -504181
7030 -504181 -559583 -534388 -480273 -404359 -414911 -365468 -424874 -404140 -521232 -403946 -376845
7019 -376845 -417842 -456920 -495331 -418406 -424551 -435070 -391787 -236624 -359107 -380680 -415941
7008 -415941 -452401 -389907 -396620 -449930 -495421 -469845 -521810 -510267 -440434 -355081 -380156 -444196
6996 -444196 -418637 -447313 -452861 -438441 -444475 -389271 -345669 -371365 -401226 -421635 -413735 -482635
6984 -482635 -521767 -519579 -462278 -417952 -414377 -509087 -487693 -476982 -465380 -436411 -408535 -382987
6972 -382987 -381173 -364073 -360657 -400285 -433862 -397950 -445135 -491201 -416658 -441774 -481558 -461291
6960 -461291 -513683 -526727 -474533 -521177 -444367 -418065 -371544 -413035 -392840 -310561 -375919 -449395
6948 -449395 -403141 -374275 -397005 -423247 -450356 -379522 -367195 -358512 -368652 -306588 -289736 -320818
6936 -320818 -278967 -272365 -274410 -292369 -336425 -355102 -453450 -420206 -394279 -396993 -402128 -423004
6924 -423004 -477424 -470180 -393815 -426010 -398599 -333961 -310621 -370827 -381201 -343404 -370542 -397895
6912 -397895 -366915 -380345 -331928 -320859 -346552 -361997 -356829 -338970 -418211 -475253 -438244 -499490
6900 -499490 -525544 -504967 -463071 -414583 -420228 -447208 -438610 -423568 -383426 -436373 -442490 -346889
6888 -346889 -370734 -396000 -373527 -348196 -349460 -399890 -383195 -312291 -303355 -353457 -354727 -318473
6876 -318473 -342668 -338600 -375538 -368924 -397390 -400508 -438524 -445712 -464182 -453788 -432956 -424517 -409400
6863 -409400 -367341 -301281 -325337 -357534 -355551 -320679 -322979 -426954 -406964 -343669 -364931 -378658
6851 -378658 -370542 -405326 -413816 -352434 -352795 -424349 -345022 -447991 -416273 -408415 -425778 -383482
6839 -383482 -387707 -343497 -302503 -369473 -419250 -382140 -388309 -386347 -381603 -358033 -352116 -334107 -304549
6826 -304549 -343037 -312077 -335496 -418394 -461282 -489691 -444647 -365893 -312826 -323761 -308005 -334191
6814 -334191 -270193 -294146 -341244 -352216 -404017 -404144 -390387 -406319 -403445 -406297 -335734 -380533
6802 -380533 -330362 -260775 -373504 -412536 -386038 -416652 -397111 -330061 -271447 -293220 -335980
6791 -335980 -358850 -365600 -358111 -350717 -369511 -310460 -297582 -293946 -222999 -346086 -410530 -405008
6779 -405008 -416522 -470147 -354973 -298194 -374703 -328713 -274903 -234522 -284924 -289552 -331828 -346412
6767 -346412 -344157 -313931 -307781 -294770 -349230 -337106 -293433 -343903 -378402 -377919 -325394 -313903
6755 -313903 -325544 -291333 -246778 -240518 -286041 -318661 -334290 -279328 -249544 -312489 -283633 -239734
6743 -239734 -269363 -282363 -330377 -395970 -360025 -321924 -367346 -351425 -295019 -278203 -285015 -324599
6731 -324599 -323702 -318645 -342975 -383190 -306635 -303968 -312790 -249538 -240093 -253897 -299550 -285338 -217034
6718 -217034 -227898 -248220 -242127 -226936 -272690 -327487 -293029 -231437 -245338 -295415 -279091 -342832
6706 -342832 -334558 -297028 -242135 -193411 -205041 -240594 -292249 -283427 -226429 -158664 -109395 -72120
6694 -72120 -109005 -140074 -101651 -154706 -218344 -210335 -183659 -167207 -191430 -225175 -241732 -235435
6682 -235435 -252517 -196743 -225424 -204172 -147760 -107143 -149017 -127492 -143937 -175220 -243046 -248535
6670 -248535 -221473 -247177 -251911 -242355 -255462 -239058 -206146 -257608 -300891 -267475 -296245 -314083
6658 -314083 -290816 -333720 -232758 -177239 -203665 -224414 -238914 -261652 -263279 -223714 -235924 -319226
6646 -319226 -286988 -210198 -147308 -171084 -193823 -160610 -189444 -196023 -210430 -205964 -226064 -182442
6634 -182442 -208599 -229122 -114060 -98881 -184033 -190086 -129859 -192186 -196845 -172446 -108149 -116846
6622 -116846 -110200 -141936 -158542 -163375 -126172 -109061 -122764 -94608 -69139 -83871 -127747 -116351
6610 -116351 -82556 -58664 3138 6815 -19337 -20508 -38235 -85539 -102912 -75017 -68721 -9110
6598 -9110 46835 -17175 -8344 -21621 -40398 -33306 44264 70427 78169 42164 87694 122891 28469
6585 28469 45063 47711 95271 56934 47228 21271 51716 110960 93229 129020 107601 126626
6573 126626 147479 71819 72017 80710 119578 109149 77795 81692 122527 101434 146112 123482
6561 123482 156907 136527 220855 271125 260611 292773 292378 323460 382246 390982 331744 408448
6549 408448 465394 457837 563423 673539 744374 763338 857584 953440 946631 986437 1073934 1197466
6537 1197466 1330399 1382738 1405094 1320353 1260392 1195605 1134743 1023419 915746 930183 936188
6526 936188 957121 1017599 1162732 1296836 1427367 1389250 1370652 1271777 1192671 1040829 916159
6515 916159 864970 816505 720625 621684 570682 637397 542261 526394 636012 601406 577311
6504 577311 594019 630421 649828 601755 549239 531960 530267 508798 517308 459305 414457 519948
6492 519948 463242 476599 485497 486216 479683 511952 492658 519819 536180 550166 512724 495740
6480 495740 505115 529414 568763 595800 656714 698679 739824 736751 829281 883412 1017726 1124042
6468 1124042 1209520 1361172 1605273 1810118 1903042 2029694 2105628 2091812 2076863 2012414 1909783
6457 1909783 1873401 1855009 1861646 1949714 2035591 2217490 2397839 2485264 2539202 2495875 2366945
6446 2366945 2210282 2011817 1924198 1720774 1567164 1478885 1403349 1356434 1331639 1378272 1391358
6435 1391358 1342878 1272761 1192191 1196999 1229334 1132106 1053279 1101891 1083830 1027571 1017261 925858
6423 925858 962875 962289 899638 910705 898333 822925 878568 918471 928528 944147 842981 861501
6411 861501 850574 866264 867513 843462 777774 739528 781405 733754 730532 749525 767369 805920
6399 805920 837699 836198 901433 887585 916192 998413 989728 960602 966040 994063 1039293 1110531
6387 1110531 1209708 1261197 1363988 1440409 1428551 1479722 1523253 1504784 1585132 1690950 1806481
6376 1806481 1930929 2009560 1975617 2082689 2141914 2189056 2196171 2240759 2238281 2222564 2304145
6365 2304145 2327819 2347871 2322929 2346895 2406001 2407654 2415329 2457092 2480061 2459767 2489163 2543915
6353 2543915 2512588 2475253 2468494 2394345 2343930 2433731 2395822 2280345 2328359 2422253 2416701 2413364
6341 2413364 2402068 2505786 2568176 2558726 2513386 2512118 2590126 2599943 2701046 2811330 2859765
6330 2859765 2918355 3002453 3075946 3063431 3107172 3131301 3116653 3192621 3249462 3261894 3273921
6319 3273921 3340688 3403043 3422642 3492369 3568389 3625108 3696190 3744738 3784939 3890556 4044110
6308 4044110 4194225 4419003 4592272 4783838 4961547 5078856 5312709 5579672 5854445 6152581
6298 6152581 6375564 6596597 6856465 7160752 7565546 8048250 8710758 9526300 10428074 11499222
6288 11499222 12933892 14644819 16786200 19626837 23456578 28015604 32637297 36277295
6280 36277295 37958236 37180376 34594239 31268659 28157298 25767538 24208829 23656006
6272 23656006 24041701 25520142 28254895 31978541 35991410 39126217 40198960 38631353
6264 38631353 35052693 30520300 26029805 22171007 19125571 16894671 15183923 13784633
6256 13784633 12643995 11705823 11037613 10514481 10068175 9670901 9296968 8974131 8783136
6247 8783136 8622893 8508206 8425977 8389214 8396087 8452731 8580719 8679237 8914724 9170067 9436734
6236 9436734 9685838 10020691 10391093 10793119 11194061 11735255 12265419 12770561 13339021 13796264
6226 13796264 14228713 14711613 15226860 15880466 16718050 17759334 19022028 20577232 22448786
6217 22448786 24642903 27475733 31075296 35864411 42251823 50143090 58803255 66412637
6209 66412637 71132250 71683880 68677842 63637503 58185217 53642805 50509734 49047563
6201 49047563 49343803 51422797 55516465 61352574 67973111 73756350 76543439 75340892
6193 75340892 70467379 63322169 55709334 48680833 42889789 38381491 34887431 32164495
6185 32164495 30186922 28742014 27718893 27029204 26428029 26054278 25865931 25677939 25623996
6176 25623996 25504248 25416408 25454350 25453635 25508056 25603436 25761712 26051446 26518404 27014402 27526468
6165 27526468 27863161 28185273 28351587 28362247 28263869 28237225 28197248 28237511 28323783 28333410 28261738
6154 28261738 28138331 28048633 27983292 28103181 28407551 28883014 29387791 29865018 30299871 30596248
6144 30596248 30801424 30821131 30718673 30598189 30451820 30322625 30089748 29970661 29799223 29592746
6134 29592746 29323481 28984023 28696514 28367185 28004398 27835181 27572046 27315543 27224856 27189149
6124 27189149 27186919 27138525 27281501 27443836 27478714 27575509 27532850 27408458 27179792 26784348
6114 26784348 26457966 26138870 25712378 25276672 24792806 24249548 23646672 23073273 22440913
6105 22440913 21720112 21083802 20317104 19673384 19058351 18598791 18214325 17859380 17681291
6096 17681291 17552429 17553710 17641115 17731180 17740058 17747479 17709578 17628987 17466686 17263994 17036603
6085 17036603 16792699 16632297 16510221 16453908 16394855 16347163 16357761 16251815 16168865 16159892 16127847
6074 16127847 16171376 16249967 16335651 16512292 16698892 16909178 17213184 17580628 17909238 18316434
6064 18316434 18770466 19273322 19890108 20609119 21464494 22389858 23571648 24879320 26375687
6055 26375687 28177703 30398912 32968805 35762784 38982601 42752566 47122423 52392238
6047 52392238 59057049 67516005 77242082 86825956 94164235 97420906 96005142 90625906
6039 90625906 83042522 74994343 67604411 61339623 56326711 52294286 49241686 47055241
6031 47055241 45593178 44779408 44635562 45283198 46682557 49202434 53103607 58608675 65670851
6022 65670851 73276822 79284302 81759679 80146481 74996707 67969709 60814920 54661554
6014 54661554 49905617 46345498 43845215 42033495 40805518 39888838 39108973 38400375 37784501
6005 37784501 37208956 36668365 36275165 36102662 35973912 35948328 36196129 36470205 36800455 37452903
5995 37452903 38173684 38996200 40102978 41331133 42842157 44550542 46531908 48869903
5987 48869903 51602827 54782305 58473677 62786906 67801645 73723411 80545007 88112858
5979 88112858 96656302 106029458 115687117 125080826 133443917 139965044 143898728 144485124
5971 144485124 141313002 134754996 126034330 116583297 107671641 100079750 94107855 89603223
5963 89603223 86405915 84368004 83492826 83673055 84840216 87015647 90301305 94736224
5955 94736224 100486633 107842738 117176442 128424047 141120837 154047326 165324029 173543155
5947 173543155 178056046 179283132 178067242 175023023 170581186 165107150 158614720 151233542
5939 151233542 143284140 135123535 127096484 119743488 113384747 108121061 104055589 101133905
5931 101133905 99251837 98356955 98308448 98788358 99485671 100132447 100195534 99373221 97396414
5922 97396414 94053181 89609537 84216428 78171050 71986539 66029759 60407264 55278451
5914 55278451 50770646 46858875 43433003 40383927 37778913 35408714 33240941 31313688
5906 31313688 29535174 27960952 26554138 25252137 24084885 23133978 22245748 21451874 20765121
5897 20765121 20275784 19846383 19449360 19208609 19049910 18949299 19030106 19305224 19700648 20355713
5887 20355713 21017639 21929833 23169416 24452523 25787277 27001009 27917709 28246779 27836059
5878 27836059 26827463 25486194 23891688 22260490 20782926 19376435 18223476 17330433
5870 17330433 16588232 15953396 15434574 15093040 14872663 14858069 14818609 14930454 15174093 15473067
5860 15473067 15829027 16188552 16313997 16202632 15804483 15203085 14351787 13246362 12145626
5851 12145626 11249832 10381718 9535118 8881858 8280300 7829068 7307994 6963556 6635452
5842 6635452 6310843 6060209 5779102 5518658 5260026 5109239 4974565 4801916 4671911 4491928
5832 4491928 4444055 4322430 4197102 4099053 4001498 3932266 3912697 3884698 3859422 3726882 3630046
5821 3630046 3663366 3599587 3515186 3481297 3439029 3405961 3428338 3436197 3405319 3411438 3492139 3530825
5809 3530825 3503422 3437296 3469106 3535149 3588117 3571987 3435966 3405627 3366859 3287197 3237572
5798 3237572 3232388 3161390 3155309 3143005 3154000 3214334 3256627 3254213 3323468 3311027 3313735 3408092
5786 3408092 3525930 3516637 3467389 3560511 3600873 3596260 3634091 3721093 3653480 3543927 3525124
5775 3525124 3462831 3413214 3357504 3329503 3357711 3425225 3545446 3561521 3692645 3763515 3869473
5764 3869473 3952090 4148870 4165924 4129474 4130601 4090302 4082463 4115410 4143080 4135513 4154103 4105716
5752 4105716 3980572 3804059 3739495 3660471 3658657 3743749 3656820 3703831 3825462 3934782 4010934
5741 4010934 4129330 4261936 4367522 4447171 4470767 4547792 4483329 4514177 4453647 4360590 4371826
5730 4371826 4384259 4420820 4466433 4564327 4675366 4824490 5041557 5265607 5475518 5762334
5720 5762334 6102230 6385525 6724134 7149371 7449324 7541131 7581013 7492602 7306706 7067978
5710 7067978 6743126 6517174 6186890 5940392 5621638 5297161 4944992 4624855 4337166 4026430
5700 4026430 3802520 3634951 3475667 3351247 3307578 3209792 3210304 3142793 3173557 3206643 3172519
5689 3172519 3153738 3096878 3085857 3098232 3108011 3075431 3079509 3033190 2975232 2923540 2960663 2951034
5677 2951034 2949808 2995294 2926805 3009442 3080488 3159985 3444526 3781284 4026012 4283216 4651567
5666 4651567 5011865 5303424 5661921 5867171 5999702 5897292 5671718 5457713 5149559 4774012
5656 4774012 4335275 4021034 3740835 3551503 3424922 3254610 3151852 3172745 3189174 3191896
5646 3191896 3259358 3293901 3457069 3540537 3709974 3943926 4151563 4360674 4572955 4747911
5636 4747911 4810458 4801380 4711634 4598662 4415402 4344874 4291608 4136886 4094837 4034815 3981026
5625 3981026 3913112 3754532 3625126 3459544 3430830 3372204 3276463 3113851 3035336 2973044 2815611
5614 2815611 2781117 2758026 2636952 2576717 2558833 2642631 2656922 2585129 2631090 2712536 2758197
5603 2758197 2741835 2739472 2770496 2766340 2822951 2838068 2809093 2780398 2731840 2697798 2756592 2795754
5591 2795754 2868217 2964534 2999447 3072081 3141390 3108903 3132634 3111385 2977065 2783849 2600427
5580 2600427 2484474 2287914 2164737 2077353 1930533 1837718 1830106 1750864 1739005 1784918 1762232
5569 1762232 1775064 1852427 1861939 1793564 1862418 2019272 2109857 2251967 2375365 2482920 2570363
5558 2570363 2687686 2725341 2728319 2648613 2495965 2368471 2322731 2172071 2055912 2033572 1935350
5547 1935350 1804789 1733583 1744907 1762200 1744157 1732703 1738342 1826524 1902950 1960929 1983731
5536 1983731 2067331 2099674 2223274 2161230 2099198 2137040 2121948 2151910 2125678 2141102 2112051
5525 2112051 2054490 2015978 1956091 1902845 1909589 1825801 1912062 1951787 1944482 2003284 2134856 2219521
5513 2219521 2326447 2371116 2513014 2651635 2646077 2681156 2702824 2760574 2802115 2769837 2882040
5502 2882040 2969894 2997662 3071667 3161092 3158251 3083228 3103217 3082613 3057862 3017885 2975176 2870564
5490 2870564 2808841 2765881 2650434 2596454 2572366 2507873 2497834 2533307 2369971 2319001 2278120
5479 2278120 2215050 2138366 2128084 2123586 2132680 2097211 2094500 2141040 2141274 2144904 2182587 2209760 2177782
5466 2177782 2172236 2080448 2079122 2025377 2037229 1984268 1919699 1793307 1753821 1756945 1760575 1784544
5454 1784544 1727939 1695961 1615492 1579729 1529843 1550567 1541870 1502231 1426551 1375341 1371012 1378217
5442 1378217 1351734 1307670 1269430 1286545 1288648 1316273 1245235 1275925 1250751 1254022 1244995 1263498
5430 1263498 1327525 1312824 1207927 1127769 1106146 967448 982147 913818 930208 987824 936071
5419 936071 886926 863895 806592 748400 784069 838042 815178 736470 632168 666653 660531 723627
5407 723627 666035 645933 703004 714581 762972 717036 721236 706459 728246 737175 760308 783992
5395 783992 748714 729908 741177 840096 940111 966687 898280 924066 902867 875814 873273 855374
5383 855374 862783 911309 923047 928579 923468 981451 930214 944808 1000153 1000934 1018266 999915 1045381
5370 1045381 1059781 1095060 1148094 1154796 1158343 1161627 1124272 1145903 1211485 1310980 1382480 1447723
5358 1447723 1481174 1531867 1584533 1674156 1646578 1641944 1706839 1702753 1730228 1828649 1903249 1984058
5346 1984058 2104490 2236218 2427452 2477530 2498774 2585890 2616205 2655494 2685129 2686757 2720216
5335 2720216 2810685 2881714 2959630 3050052 3110588 3172929 3261340 3350706 3441578 3529540 3662996
5324 3662996 3749614 3755199 3802493 3829772 3880563 3847335 3884718 3914685 3986370 4028351 4038145 4090950
5312 4090950 4085475 4038388 4030438 4019359 4000884 4054783 4095696 4126599 4196225 4266541 4252130 4260292
5300 4260292 4099791 4035589 4001072 3924515 3931145 3877241 3836727 3896929 3940416 3969689 3963691 4000919
5288 4000919 4064764 4071509 4072519 4036089 4031456 4044319 4072129 4185279 4179225 4187449 4229518 4315260
5276 4315260 4446780 4497406 4547188 4710455 4870641 4952172 5123247 5359885 5507961 5731128
5266 5731128 6040488 6356185 6532637 6799801 7207191 7661833 8182684 8837220 9541284 10376154
5256 10376154 11632410 13107417 14924663 17017828 18972822 20128111 20438804 20158675
5248 20158675 19750541 19438999 19580736 20329242 21655502 23748313 26656207 30215629 33974824
5239 33974824 37374360 39848908 41177393 41842851 42404053 42751736 42819638 42737321 43066034
5230 43066034 43742802 44516046 45274393 46114971 47013026 47708188 48495641 49593650 51128230
5221 51128230 53036126 54883214 56097167 56455314 55738133 54091209 51993168 50149678
5213 50149678 48996986 48551271 48111823 47298680 46408215 45348005 44056079 42785076 41777588
5204 41777588 41307603 41127811 41089676 41559103 42097879 42203948 41340327 39150984 35881571
5195 35881571 32199470 28696310 25704002 23433956 21881484 20940857 20693919 21066523 21864844
5186 21864844 22603588 22654444 21688504 19931266 17865971 15831739 13994253 12427351 11157757
5177 11157757 10132825 9221162 8484462 7928010 7495998 7075864 6813340 6606122 6357682
5168 6357682 6148925 5942805 5785880 5658747 5554510 5495620 5475715 5405701 5420175 5410012
5158 5410012 5394266 5382446 5455533 5456004 5498165 5664430 5808663 5921260 6005399 6199251 6363471
5147 6363471 6539371 6868378 7168013 7568072 7944291 8332135 8855904 9581486 10484722 11612501
5137 11612501 12787355 13739893 14253213 14239112 13913995 13542065 13275243 13309184 13625948 14224429
5127 14224429 15078916 15811961 15964758 15254596 13939807 12544312 11226681 10089763 9229667
5118 9229667 8536085 8045511 7731323 7518810 7507408 7585378 7754841 8030741 8201719 8248023
5108 8248023 8117282 7845111 7389439 6969838 6656764 6392882 6136041 6005689 5872261 5730341
5098 5730341 5791556 5858149 5767058 5770703 5809438 5886619 5909107 5927247 6012404 6048463 6109580 6218347
5086 6218347 6318376 6386216 6509111 6698501 6836004 6972224 7132425 7351330 7593451 7894967
5076 7894967 8369104 8968837 9594319 10049284 10234386 10074933 9724390 9284566 8833965 8496367
5066 8496367 8265884 8186509 8166225 8271489 8472162 8800102 9247905 9810582 10394629 10666832
5056 10666832 10650186 10337805 9740338 9051942 8480695 8021182 7690833 7451010 7196778 7004078
5046 7004078 6871046 6836137 6710746 6639364 6649432 6615267 6568874 6484360 6444323 6423477 6452204
5035 6452204 6408992 6386806 6404448 6369067 6420133 6502842 6473183 6490086 6557218 6613311 6632563
5024 6632563 6688026 6753020 6814814 6825033 6792237 6890823 6987177 6971927 7014189 7062665 7139468
5013 7139468 7134369 7136685 7191516 7236572 7273018 7265785 7294714 7384535 7455835 7433895 7449541 7508313
5001 7508313 7485512 7514686 7583615 7683473 7788006 7818332 7839331 7878001 7892927 7906528 7992904
4990 7992904 8081604 8109517 8136663 8213907 8240568 8296904 8388260 8493073 8615428 8707113 8766869
4979 8766869 8942513 9091478 9304478 9490241 9706139 9942230 10384277 10927323 11549324 12247653
4969 12247653 12776168 13116191 13193667 12948366 12605074 12277733 11894474 11667455 11508572 11443933
4959 11443933 11449464 11491210 11572411 11622273 11769182 11951278 12166334 12404423 12644548 12979014
4949 12979014 13344462 13784725 14336941 15055308 15790415 16608013 17329175 17689174 17745726 17526702
4939 17526702 17215499 16937896 16646786 16550050 16589070 16603683 16637829 16752023 16867095 16968020
4929 16968020 17041936 17112607 17216948 17391866 17563308 17772846 18035578 18440210 18895667 19468763
4919 19468763 20063889 20728788 21386197 21918959 22345570 22587342 22714781 22787905 22938540 23208953
4909 23208953 23529792 23863354 24257056 24756854 25323946 25883853 26433718 27161673 27912311
4900 27912311 28788702 29764301 30745185 31924642 33146904 34526141 35974285 37584333 39190174
4891 39190174 40703029 41963740 43023756 43878623 44501492 45053292 45480428 45859236 46213568
4882 46213568 46793402 47561382 48420564 49357092 50503235 51647117 52902268 54435610 56032159
4873 56032159 57964455 60163273 62680723 65517682 68743261 72217635 75892404 79985023
4865 79985023 84687839 90180090 97246124 106405564 117492000 127816911 133446341 133415495
4857 133415495 129842447 125460641 122455204 121475579 122278544 124505621 127671695 131472247
4849 131472247 135910752 141004071 146827991 153808464 162341815 172944631 185628781 198385408
4841 198385408 208629734 216499383 222659761 225760838 224322952 219166274 212792373 207887743
4833 207887743 206057060 207688299 212694102 220809748 231484302 244092822 257682598 271074059
4825 271074059 283342976 294216550 304115790 313878479 322859296 327965435 326720124 319797607
4817 319797607 309891799 299810007 291192958 284552583 279918599 277184534 276384421 277353078
4809 277353078 279989015 284071783 289365124 295482551 302189571 309619849 317786340 326845318
4801 326845318 336635388 346451622 355170034 361772503 365323158 365851380 363897288 360437845
4793 360437845 356498865 352831774 349656054 346870975 344251083 341522304 338492233 335207549
4785 335207549 331603101 327633681 323457208 318962528 314158278 309066609 303613957 297825354
4777 297825354 291833963 285810932 279720710 273483570 267050946 260355940 253489027 246754679
4769 246754679 240436966 234613487 229529138 225058198 221023505 217231482 213446264 209536635
4761 209536635 205384973 200972770 196157549 191017251 185539549 179878988 173924640 167798969
4753 167798969 161792810 155858464 150073482 144600014 139524688 134779501 130472708 126471451
4745 126471451 122948110 119926071 117261999 114940264 113060437 111505044 110332881 109377667
4737 109377667 108532675 107718889 106768620 105628358 104191191 102512339 100669454 98461850
4729 98461850 96146549 93736665 91119355 88451341 85764682 83118942 80599700 78118891
4721 78118891 75779959 73598561 71626517 69972779 68521917 67235918 66154628 65273489
4713 65273489 64513717 63740548 62897215 62008510 61032924 59883634 58563829 57189327 55698938
4704 55698938 54192663 52663634 51085795 49580486 48106693 46740087 45418831 44315746
4696 44315746 43341956 42464980 41523195 40683964 39915107 39169846 38604661 38002803 37355004
4687 37355004 36619996 35945333 35180496 34447792 33771330 33128876 32504388 32007163 31640720
4678 31640720 31332826 31014166 30637750 30177236 29860447 29616131 29454010 29507287 29624937 29985781
4668 29985781 30506849 31031895 31533312 31918175 32281286 32428594 32409095 32043874 31559000 30938230
4658 30938230 30136836 29289847 28421646 27435738 26566577 25813794 25128826 24671421 24320039
4649 24320039 23984186 23605668 23267819 22846777 22340105 21844995 21342151 20956469 20650200
4640 20650200 20379902 20256336 20150958 20218810 20393866 20465027 20289669 19940228 19461243 18877734
4630 18877734 18306768 17764613 17388072 17068188 16773024 16424734 15915869 15308324 14805097
4621 14805097 14413912 13972772 13760288 13709670 13753526 13832757 14182871 14808409 15403043 15788642
4611 15788642 15705135 15169280 14391201 13557457 12842240 12304313 11926007 11725890 11563151 11460809
4601 11460809 11512218 11624137 11928462 12400751 12912344 13545808 14422604 15380891 16275974 17077447
4591 17077447 17862483 18488227 18804948 18755425 18367418 17986121 17692142 17673175 17958848 18534517
4581 18534517 19423667 20687321 22356096 24576903 27554599 31556150 37039852 44593046
4573 44593046 54659595 65469283 73310850 75052997 71124190 64219545 57348719 52195977
4565 52195977 49301094 48782496 50807705 55672275 63119500 71251596 76400764 76073225
4557 76073225 71074133 64243434 58150120 54473201 53855678 56518323 61940496 67793491
4549 67793491 70550370 68398406 62583517 55587368 49495553 45216755 42778615 42383335
4541 42383335 44241654 48524443 54663740 60305500 62136829 58879186 52035701 44102078
4533 44102078 36978716 31244721 26778616 23346135 20706341 18672197 17011391 15701602
4525 15701602 14717578 13931968 13253602 12713027 12229160 11859763 11518001 11218311 10891278
4516 10891278 10581158 10351468 10166195 10044458 9918202 9915287 9938990 9909922 9893061 9839210
4506 9839210 9804999 9793919 9752890 9673580 9633600 9559439 9525090 9498178 9429952 9269311 9222516
4495 9222516 9167800 9076454 9057166 8992233 8885402 8799292 8715718 8710573 8647001 8601697 8643096
4484 8643096 8716467 8709592 8611499 8580063 8558918 8569364 8546435 8633834 8621550 8627835 8631489 8648703
4472 8648703 8625943 8664276 8713255 8735145 8720874 8781450 8868214 9063932 9225557 9464963 9885139
4461 9885139 10476368 11388620 12872335 15008641 17094845 17703663 16585698 14713652 12931586
4452 12931586 11631177 10699912 10094399 9700825 9346439 9070758 8867303 8657191 8582940
4443 8582940 8479480 8456332 8406568 8305547 8257659 8289032 8286358 8146553 8041002 7961702 7807489
4432 7807489 7642975 7614179 7506869 7394917 7447093 7409001 7454076 7518345 7553319 7687225 7810541
4421 7810541 7874457 7944350 8016855 8092517 8118873 8155480 8223484 8163738 8068997 7959716 7944671
4410 7944671 7973959 7965264 7973696 8022688 7957816 7888014 7828116 7867015 7922356 7871879 7920882 7968521
4398 7968521 8017899 8031869 8117588 8249565 8283923 8336411 8436396 8550808 8592441 8661482 8729797
4387 8729797 8810678 8962671 9130436 9242347 9320572 9496355 9672665 9861882 9985907 10180062
4377 10180062 10371495 10576597 10731661 11004422 11288442 11515337 11833946 12140977 12449075
4368 12449075 12796874 13133431 13606703 14101235 14700370 15412627 16272559 17284522 18504585
4359 18504585 20043665 22009269 24526606 27594816 31497786 36442034 42736087 50370286
4351 50370286 58857894 67066405 72930321 74815627 72538206 67586607 61715603 55982922
4343 55982922 51175263 47463963 44967207 43657545 43451044 44337227 46558410 50152884
4335 50152884 55094279 61390058 68388351 74686112 78073198 77288865 72763978 66279567
4327 66279567 59122229 52091258 45690632 40186446 35784876 32319105 29619700 27608023
4319 27608023 26164872 25143925 24568744 24117677 23424327 22499565 21375671 20169639 19122367
4310 19122367 18331774 17786132 17530758 17545342 17620974 17638182 17302548 16650924 15994290 15373747
4300 15373747 14725991 14301009 14086091 14065421 14096658 14287801 14675935 14931370 14775484 14316432
4290 14316432 13644883 13020628 12517162 12092621 11745900 11590109 11432361 11324646 11202178
4281 11202178 11121201 11105431 11175377 11221431 11278591 11455128 11633408 11733617 11789110 11843309 12016059
4270 12016059 12146208 12320094 12516715 12735404 12936485 13099063 13374632 13622732 13737039
4261 13737039 13858417 14054144 14252084 14417612 14611456 14833147 14945812 15082962 15186006
4252 15186006 15352779 15468231 15547375 15576752 15582058 15696834 15757155 15712234 15738111 15801198 15866985
4241 15866985 15818495 15856810 15946284 16137502 16234288 16300848 16384693 16547598 16707309 16889695
4231 16889695 17111380 17283009 17532927 17837101 18141960 18475437 18856004 19272265 19688104
4222 19688104 20263693 20890969 21492745 22180976 22905847 23683793 24543711 25491262 26516764
4213 26516764 27519132 28532851 29477152 30366394 31256447 32152002 33179002 34221789 35341283
4204 35341283 36366854 37462447 38595059 39715631 40902509 42327824 43909615 45607934
4196 45607934 47510969 49674554 51843429 53863216 55778292 57433271 58972952 60567916
4188 60567916 62181000 63795896 65636830 67504276 69347307 71182806 73123063 75108515
4180 75108515 77091921 79245571 81438299 83603840 85794849 87933676 90061393 92314610
4172 92314610 94747346 97624059 101086851 104930649 109122775 113164705 116655856 119229050
4164 119229050 121072597 122521925 123967382 125567764 127561097 129800136 132172096 134528130
4156 134528130 136971598 139465114 141815917 144117761 146236456 148271476 150161618 151980945
4148 151980945 153878501 156042947 158479029 161342581 164613846 168525028 172942458 177941300
4140 177941300 183467951 188989083 193939257 198180911 201887109 205363986 209051546 212995644
4132 212995644 216907327 220561410 223893938 226918764 229879048 232596713 234890180 236769054
4124 236769054 238212090 239596194 241160302 243281226 246084249 249700366 254226521 259320346
4116 259320346 264571841 269889538 274861542 279269951 283204276 286536595 289455569 292022135
4108 292022135 294428054 296877517 299321097 301693137 303753293 305203823 305893832 305589391
4100 305589391 304512216 303149471 301924719 300784773 299631526 298064094 295986373 293557601
4092 293557601 291234575 289371670 287655792 285401526 282377986 278910428 275232976 271825247
4084 271825247 269012698 266653435 264531936 262689606 260803472 258667600 256100269 253036577
4076 253036577 249411821 245265586 240531026 235224557 229446103 223286723 217022197 211060052
4068 211060052 205477734 200492465 196206335 192681723 189946090 187802608 185778224 183400477
4060 183400477 180216469 176284889 171894895 167518246 163538680 160011212 156873506 154121996
4052 154121996 151648194 149310285 146957818 144613291 142217380 139667924 136817525 133682208
4044 133682208 130404105 126956628 123421576 120086386 116949767 113919402 111196069 108527610
4036 108527610 105923225 103421246 100717288 97816171 94911987 91934096 89021384 86185871
4028 86185871 83517287 81044813 78648527 76422328 74339224 72271149 70164814 68018908
4020 68018908 66016019 64001694 62012559 60063649 58043773 56082953 54091259 52086686
4012 52086686 50050705 48105939 46277222 44505154 42756536 41094736 39527642 38002730
4004 38002730 36539206 35160011 33882079 32572617 31404379 30233457 28997209 27816027
3996 27816027 26741484 25721357 24653671 23697014 22740305 21927092 21197328 20414519 19745502
3987 19745502 19043187 18464792 17968337 17485653 16952212 16452030 15981968 15555125 15101157
3978 15101157 14751746 14406298 14113342 13701302 13411510 13156300 12717093 12433575 12196119
3969 12196119 11956875 11691407 11430917 11151635 10948584 10750090 10482867 10318022 10168837
3960 10168837 9982865 9766077 9519350 9359630 9178917 9038439 8935906 8844065 8706478 8607243
3950 8607243 8582351 8461518 8412112 8246328 8223861 8191874 8061865 8001863 7928255 7770822 7544794
3939 7544794 7448955 7330114 7280018 7221592 7148536 7056093 7003427 6898812 6823700 6873594 6813535
3928 6813535 6791965 6836815 6838297 6827081 6764909 6705357 6725334 6719145 6827788 6832211 6774862 6828082
3916 6828082 6918982 6961689 7003550 7138438 7206569 7273080 7323745 7476033 7596658 7704049 7871776
3905 7871776 7971992 8039043 8041895 8067167 8108474 8187199 8214603 8201505 8261735 8295607 8349627
3894 8349627 8311270 8237044 8165316 8138412 8130055 8123989 8171442 8174274 8138642 8190022 8266945 8312808
3882 8312808 8422720 8563705 8558229 8640650 8666179 8632234 8635049 8571603 8444665 8350261 8262382
3871 8262382 8238135 8139183 8119214 8188852 8198413 8207575 8301352 8375223 8511685 8656784 8738166
3860 8738166 8890157 9055867 9278775 9475708 9672688 9866740 10165958 10463789 10770809 11074274
3850 11074274 11401831 11733177 12097684 12493992 12922684 13400857 13741466 14059200 14426790
3841 14426790 14788891 15100792 15145887 15175066 15094139 14850379 14609530 14358827 14104961 13884684
3831 13884684 13624696 13364568 13146753 12924568 12789916 12607808 12427465 12220865 12168292 12052720
3821 12052720 11952806 11797842 11590397 11274645 10943794 10478594 9915094 9359141 8881275 8375791
3811 8375791 7931563 7601789 7242443 6997645 6705172 6575477 6425325 6270803 6108250 5964573
3801 5964573 5903748 5865733 5843951 5817612 5862734 5868883 5927686 5926836 5951623 6076279 6160525 6305996
3789 6305996 6459318 6569400 6723143 6900592 7218352 7623073 7974503 8529983 9161419 10016753
3779 10016753 11092803 12663827 14891526 17685334 20905597 23546125 24003562 22216836
3771 22216836 19420638 16614873 14179443 12321856 10892480 9761073 8867643 8166272
3763 8166272 7592639 7029945 6621695 6315366 6042721 5795336 5566959 5285912 5072668 4943884
3753 4943884 4789762 4628530 4556066 4500936 4410839 4309850 4221770 4174402 4131596 4089092 4037111
3742 4037111 4057654 4009899 4016082 4028360 4067272 4052680 4234304 4378490 4404722 4400843 4431819
3731 4431819 4369523 4334616 4396395 4432539 4485912 4528801 4656932 4689689 4757594 4833663 4845911
3720 4845911 4883012 4981060 5074965 5142500 5176986 5106410 5116388 5067940 5092801 5149649 5097533 5075860
3708 5075860 5076415 5118201 5178805 5212243 5189897 5094385 5127589 5100179 5036116 5018836 5014154 5094854
3696 5094854 5174861 5242688 5286255 5343897 5437978 5602767 5736116 5872743 6032133 6189493
3686 6189493 6314723 6494752 6571648 6741786 6968361 7160630 7324043 7555873 7681691 7907073
3676 7907073 8162411 8449998 8686916 8965181 9161494 9454087 9619094 9871857 10118839 10295878
3666 10295878 10528143 10771944 10976205 11125146 11264609 11303251 11331132 11281092 11233536 11246173
3656 11246173 11275763 11199063 11117928 11125532 11195938 11242926 11289597 11447359 11653165 11870202 12145428
3645 12145428 12395125 12633585 12882469 13226856 13508795 13683262 13892362 14069415 14290770
3636 14290770 14442851 14618558 14893026 15072535 15241749 15472686 15697833 15816149 15987085
3627 15987085 16212727 16337908 16389242 16542464 16706518 16967098 17205549 17584151 17986267 18496138
3617 18496138 19110827 19758862 20475464 21258452 21991001 22604979 23211026 23772459 24310872
3608 24310872 24839198 25470803 26238001 27122906 28153249 29404895 30950845 32876920 35213326
3599 35213326 37877526 40966804 44403884 47895373 51365561 54713525 57829440 60615610
3591 60615610 62666417 63700396 63623602 62557694 60644656 58099567 54936721 51554329
3583 51554329 48438653 45686643 43293447 41247746 39410902 37474295 35675570 33917268
3575 33917268 32174843 30386186 28724052 27076719 25391202 23791711 22308830 20840461
3567 20840461 19532445 18320397 17135566 16073272 15090480 14173535 13363722 12615891 11972558
3558 11972558 11436544 10942182 10548424 10199062 9916353 9607093 9229949 8875400 8569136
3549 8569136 8278014 8104708 7764390 7473841 7184223 6956535 6717240 6602257 6372170 6179903
3539 6179903 6022312 5827770 5710333 5556472 5388305 5265255 5120827 5025093 4965896 4845508
3529 4845508 4762570 4675292 4556047 4487134 4496967 4346873 4278456 4185374 4040478 3967738 3879129
3518 3879129 3784690 3802112 3690864 3679113 3730513 3675955 3528923 3512688 3506766 3458822 3488676
3507 3488676 3471041 3381262 3315549 3344293 3363544 3357856 3382987 3484739 3513901 3467303 3474240 3479660
3495 3479660 3398573 3314297 3199570 3166161 3102352 3056296 2990650 2951195 2961901 2950711 2895513
3484 2895513 2882427 2902127 2882680 2891473 2832781 2852442 2842596 2749713 2713348 2668132 2648728 2617821
3472 2617821 2599466 2572733 2513483 2498854 2501515 2497199 2485537 2481962 2496101 2518302 2554185 2555156
3460 2555156 2609507 2613017 2659715 2740682 2849930 2923519 2992225 3077389 3156568 3264952 3325081
3449 3325081 3370724 3406057 3454757 3490762 3533024 3501795 3548248 3553427 3493260 3437145 3463155 3472529
3437 3472529 3419620 3333498 3344029 3306255 3325343 3337936 3295339 3301171 3224697 3105786 2989336
3426 2989336 2932958 2894989 2887340 2854139 2842135 2750516 2663606 2662182 2612802 2575622 2496352 2388847
3414 2388847 2274376 2174078 2177677 2111612 2106250 2070695 1992276 1988279 1975621 1995328 1921816 1933631
3402 1933631 1963641 2010310 1979703 1980861 2015829 2122369 2148385 2214256 2248074 2351883 2424567
3391 2424567 2501685 2572276 2609028 2708454 2785302 2846829 2930431 3042260 3081521 3093546 3054669
3380 3054669 3073068 3042087 2977101 2957724 3007946 3005525 3007175 3042948 3085804 3008310 2897407 2878882
3368 2878882 2850233 2827109 2823464 2789114 2738200 2691677 2705377 2646205 2607758 2618920 2569521 2509703
3356 2509703 2375176 2303351 2284811 2194859 2137664 2071649 2061727 1947847 1923730 1850333 1776599
3345 1776599 1799604 1805851 1804581 1780411 1820192 1827072 1859315 1916788 1997128 2109055 2236086 2326058
3333 2326058 2363589 2433256 2467285 2480079 2449835 2480185 2431910 2493406 2530378 2538285 2577238 2613373
3321 2613373 2655641 2747169 2816311 2917427 3062765 3071363 3111683 3177798 3145061 3191407 3245984
3310 3245984 3273594 3401957 3541745 3698432 3813081 3928456 4064161 4177249 4319843 4344619
3300 4344619 4443009 4626554 4759698 4918807 5040018 5182828 5392066 5661445 5951613 6335534
3290 6335534 6612272 6989072 7422331 7920311 8490851 9125600 9823498 10710844 11789411
3281 11789411 12956618 14158681 15476563 16860942 18208162 19401364 20155449 20456701
3273 20456701 20441295 20275019 20107258 20013927 19867856 19718436 19643521 19558002 19478925 19398482
3263 19398482 19314872 19181891 19292885 19477542 19628491 19888681 20220291 20670416 21290421 22155222
3253 22155222 23532809 25418173 28145374 32020986 37451749 44382505 50032695 51018311
3245 51018311 47209908 41533553 36061646 31430632 27616988 24521939 22040304 20222158
3237 20222158 18839114 17768286 16810671 15977665 15259551 14663043 14148406 13726993 13496855
3228 13496855 13401271 13358158 13336774 13383020 13516265 13766380 14275227 14929928 15731520 16773225
3218 16773225 17748104 18434612 18619710 18164008 17244548 15902976 14321456 12936471 11664981
3209 11664981 10522544 9500512 8582265 7851597 7182241 6666748 6221388 5727889 5299171
3200 5299171 4871531 4469664 4100063 3787492 3578529 3301033 3047372 2937806 2711458 2483569
3190 2483569 2356164 2233605 2081773 2023821 1836497 1701309 1572316 1459052 1356694 1238861
3180 1238861 1126788 1091440 1075973 964308 819678 786935 750465 723057 633205 560222 566024
3169 566024 541313 497819 453985 387878 316132 259631 247903 154223 131077 105813 64320 121445
3157 121445 55803 57786 6605 -22803 -40463 -38365 -97026 -171617 -203946 -134086 -117656 -224675
3145 -224675 -242187 -214712 -178174 -176842 -221038 -228576 -267412 -353703 -395314 -394090 -373167 -393449
3133 -393449 -413147 -398414 -394993 -372259 -408117 -392679 -396708 -452907 -556939 -574571 -530752 -554872
3121 -554872 -572701 -546468 -598258 -547343 -525185 -569463 -590495 -621365 -619958 -654304 -623034 -613830
3109 -613830 -614964 -604384 -596857 -643153 -622170 -654195 -694520 -702117 -675406 -651276 -635676 -687821
3097 -687821 -696939 -672138 -696443 -712265 -671145 -646249 -680115 -723374 -732302 -727332 -779574 -735939
3085 -735939 -773463 -775762 -715954 -741922 -743116 -724107 -813199 -759979 -723631 -708633 -778507 -820380
3073 -820380 -817893 -773283 -714011 -763205 -760686 -768030 -790578 -740676 -763117 -809995 -875616 -865923
3061 -865923 -828659 -880922 -866425 -872076 -911004 -857289 -924584 -961073 -968068 -982554 -946515 -916671
3049 -916671 -877922 -858512 -843210 -926526 -962635 -983155 -939452 -958613 -927758 -889072 -928029 -910982
3037 -910982 -919285 -869870 -881511 -931965 -988677 -985990 -980637 -997933 -882170 -878577 -941073 -892845
3025 -892845 -868325 -932380 -945884 -914719 -917616 -861873 -799030 -806236 -820423 -875507 -841795 -886506
3013 -886506 -909096 -897461 -916902 -860722 -873674 -880927 -895855 -914186 -882684 -941163 -927156 -817169
3001 -817169 -857498 -936408 -905900 -893056 -884652 -922358 -879299 -865653 -851607 -766664 -836323 -843948
2989 -843948 -834346 -805046 -809123 -889132 -924624 -905880 -861584 -855070 -836821 -772327 -759312 -828777
2977 -828777 -879538 -860940 -799321 -831026 -837045 -837912 -803470 -899039 -892494 -821188 -865576 -798947
2965 -798947 -753420 -687846 -675593 -724676 -774597 -752951 -721725 -717193 -695061 -756571 -869991 -915074
2953 -915074 -861828 -822002 -748907 -759404 -868545 -933131 -861403 -816021 -862950 -918264 -907937
2942 -907937 -916143 -869107 -854641 -827853 -865411 -886730 -863553 -812666 -771595 -818340 -804568 -784159
2930 -784159 -836945 -889557 -916902 -897909 -840095 -842983 -818280 -855372 -892076 -889044 -869037 -943975
2918 -943975 -968060 -891440 -822877 -875050 -908888 -883522 -916344 -1012364 -982610 -903701 -928152 -913331
2906 -913331 -1006512 -987128 -971891 -1023978 -975389 -922606 -848995 -916985 -990167 -972605 -921756 -992600
2894 -992600 -1002155 -1002849 -950873 -957726 -991441 -992911 -1011328 -1008752 -1001502 -988060 -945031 -917341 -913499
2881 -913499 -933379 -946316 -837720 -849030 -927467 -959223 -977100 -993205 -1032753 -1000158 -912056
2870 -912056 -840199 -841524 -915136 -911733 -917645 -949719 -1018057 -1024043 -919862 -888290 -955507 -988365
2858 -988365 -983340 -952083 -912362 -981580 -995274 -1015256 -967735 -945576 -899070 -890760 -909210 -936788
2846 -936788 -938604 -987060 -950635 -884703 -911566 -874670 -916903 -970925 -1001682 -976146 -941453 -1014717
2834 -1014717 -956526 -954410 -1047699 -977853 -965649 -904302 -891167 -927170 -941501 -931245 -974607 -988478
2822 -988478 -936128 -916518 -994829 -958885 -878885 -855796 -900428 -962149 -1008188 -1030261 -983367 -986170
2810 -986170 -939556 -872521 -863029 -872107 -868494 -910273 -917683 -935510 -935299 -953273 -939528 -952733 -960888
2797 -960888 -906601 -968063 -993431 -998295 -959416 -863987 -886256 -907674 -964387 -972134 -898917 -908444
2785 -908444 -903244 -862976 -880316 -893374 -841589 -890562 -907188 -936033 -1002727 -1021837 -954957 -925275
2773 -925275 -954894 -925807 -935738 -956154 -952553 -899253 -890371 -923069 -904815 -924772 -861359 -865326
2761 -865326 -888798 -843013 -864311 -920041 -950273 -982864 -902637 -891173 -954491 -954451 -921485 -944933
2749 -944933 -876536 -896918 -933785 -969734 -939783 -917611 -952876 -935543 -958406 -953531 -939739 -922057
2737 -922057 -969707 -993537 -991539 -943628 -940647 -1029228 -1007222 -986198 -979919 -999104 -983584 -919451
2725 -919451 -937431 -864836 -865940 -829747 -801031 -788173 -771677 -768764 -759282 -704884 -743630 -763492
2713 -763492 -832727 -882911 -889343 -940424 -935320 -914739 -947304 -951797 -893559 -889684 -832771 -872200
2701 -872200 -924983 -918581 -885637 -872726 -867023 -862081 -875217 -936694 -972166 -944378 -925419 -943417
2689 -943417 -953553 -918808 -874202 -865598 -900088 -909040 -953509 -972822 -964691 -937558 -913809 -828970
2677 -828970 -804676 -846218 -925588 -969633 -983457 -960856 -919519 -929420 -928755 -878943 -879602 -856355 -823723
2664 -823723 -865044 -904685 -930796 -940299 -952866 -919685 -881638 -905479 -890101 -852826 -910719 -927232
2652 -927232 -924835 -913716 -906406 -891029 -890897 -951336 -939496 -894839 -898582 -861326 -905421 -945596 -894548
2639 -894548 -829543 -805283 -825342 -908962 -978672 -979158 -977665 -989367 -974756 -946805 -947563 -923610 -875149
2626 -875149 -806895 -828470 -869390 -854372 -776335 -803274 -834162 -819126 -820394 -842882 -880858 -858794
2614 -858794 -892963 -851739 -843318 -862931 -864930 -831115 -796513 -855315 -879459 -849840 -852086 -840577
2602 -840577 -867587 -945921 -933798 -952012 -993441 -978900 -918892 -907889 -890735 -906875 -928830 -931796
2590 -931796 -914140 -943140 -947121 -839116 -814718 -883731 -906205 -878901 -900942 -819152 -782364 -865948
2578 -865948 -892523 -861712 -772931 -751613 -835384 -842913 -787760 -882275 -837914 -820947 -806640 -810124
2566 -810124 -793034 -787369 -780621 -708880 -725845 -764580 -793063 -795424 -798404 -839259 -810421 -775655
2554 -775655 -771360 -784309 -794588 -785348 -789337 -799072 -835651 -786664 -746051 -704082 -739433 -736515 -737770
2541 -737770 -718671 -734432 -719129 -678949 -707782 -680662 -627615 -630630 -701788 -728847 -704475 -684561
2529 -684561 -662151 -752349 -687669 -648300 -639282 -677145 -595332 -577993 -617054 -654190 -639265 -662644
2517 -662644 -643627 -571783 -593528 -654070 -688368 -604706 -554685 -574120 -592284 -621871 -571453 -518443
2505 -518443 -499406 -447688 -476383 -470829 -487790 -471529 -476512 -450404 -411984 -466693 -436031 -456546
2493 -456546 -406324 -347018 -316225 -240105 -224034 -191872 -134346 -78819 -39917 1548 -89789 -39212
2481 -39212 37458 115324 186606 272154 365482 536016 642597 699331 771723 887856 1028101
2470 1028101 1237704 1511824 1811441 2103382 2210398 2221173 2362330 2523835 2936363 3543767
2460 3543767 4288292 5275318 6688984 8633684 11479084 16326801 24530061 34442693 38717887
2451 38717887 33277606 24446464 17803644 13420474 10338030 7895385 6066276 4663984
2443 4663984 3889500 3345903 2932611 2590368 2494941 2530929 2341862 1959780 1615889 1295987
2433 1295987 1037252 799199 607840 422667 203712 136933 80878 79743 16433 -37631 -71952
2422 -71952 -90889 -62846 -66372 -169099 -215084 -252456 -298804 -285338 -226950 -217835 -295619 -328330
2410 -328330 -324511 -377827 -433420 -510540 -544478 -511645 -508301 -528613 -553029 -549328 -554426 -489958
2398 -489958 -514477 -557321 -636160 -620926 -588106 -581083 -585108 -575041 -581017 -640492 -627759 -614494
2386 -614494 -630367 -646105 -659148 -716573 -700429 -712111 -741002 -748436 -719721 -661682 -669858 -724806
2374 -724806 -759820 -774096 -748222 -764003 -795751 -766479 -715235 -735635 -729884 -827880 -858597 -806040
2362 -806040 -841186 -815749 -874998 -853539 -804262 -774435 -746778 -791110 -860131 -863794 -841095 -853067
2350 -853067 -840935 -835916 -842364 -805821 -808936 -768285 -804298 -914553 -923057 -872101 -829648 -804539
2338 -804539 -765240 -852486 -857691 -852132 -859322 -871794 -823229 -792544 -813815 -848438 -934006 -897887
2326 -897887 -901668 -875955 -920037 -850959 -871706 -848160 -800643 -902955 -896269 -874980 -843242 -877727
2314 -877727 -883219 -883200 -909794 -901045 -884169 -874691 -829341 -800282 -816879 -803488 -881268 -907084 -913517
2301 -913517 -893340 -876196 -928042 -886440 -843677 -877636 -943053 -1003981 -999514 -918543 -953210 -962623
2289 -962623 -920137 -950013 -903858 -899551 -890350 -845199 -885561 -894602 -924026 -969720 -959265 -848994
2277 -848994 -798855 -919997 -904893 -851733 -849521 -866265 -913947 -902880 -918531 -927053 -906306 -879481
2265 -879481 -909768 -888815 -900238 -894781 -961463 -932492 -855160 -857656 -911729 -916543 -888951 -890397
2253 -890397 -857408 -815776 -845956 -849283 -820294 -837164 -858584 -859875 -853964 -903787 -927918 -908692
2241 -908692 -874731 -852978 -865754 -895391 -918829 -966535 -1002309 -958253 -982358 -984615 -951600 -901573
2229 -901573 -880243 -955184 -1039474 -1018977 -947073 -903671 -929766 -954578 -928884 -962252 -948657 -975571
2217 -975571 -921882 -924715 -964615 -1046640 -1030906 -955042 -938789 -938560 -876054 -897645 -882867 -919374
2205 -919374 -931641 -877127 -837105 -789056 -843185 -908468 -876033 -854888 -853826 -901092 -924096 -898287
2193 -898287 -857944 -842819 -893602 -878967 -853226 -897546 -885722 -819509 -813247 -731064 -654452 -744543
2181 -744543 -779339 -823072 -822099 -815788 -841738 -855264 -909365 -836750 -877561 -855770 -893167 -905010
2169 -905010 -937700 -941830 -955530 -882013 -851574 -926674 -952325 -965274 -910912 -941868 -905049 -908272
2157 -908272 -911415 -900867 -907213 -909554 -917430 -926222 -932751 -913180 -966370 -885356 -845684 -914625 -904069
2144 -904069 -885715 -902172 -843905 -889605 -884747 -931418 -1006318 -944118 -913623 -1002324 -939996 -826919
2132 -826919 -859952 -827379 -822216 -809205 -876204 -910840 -906129 -914152 -893425 -802998 -800588 -883003
2120 -883003 -935550 -957945 -902634 -861073 -917062 -913030 -937566 -941774 -893162 -931252 -911737 -866757
2108 -866757 -926133 -961001 -969678 -900273 -931627 -948118 -936119 -873261 -890491 -931342 -897672 -938972
2096 -938972 -865545 -889121 -944128 -930546 -979255 -1023762 -960882 -908565 -924576 -935521 -865441 -936036
2084 -936036 -985002 -895332 -852052 -898435 -883985 -939460 -994401 -983896 -930146 -930615 -963671 -899910
2072 -899910 -840157 -875840 -934294 -957627 -965083 -951942 -941484 -939795 -937595 -969755 -936620 -938012
2060 -938012 -955198 -975963 -990811 -977217 -943633 -887786 -929552 -967799 -942005 -907711 -870898 -809986
2048 -809986 -908107 -935584 -882847 -880640 -884945 -858699 -861446 -874405 -935320 -896196 -896570 -866122 -892516
2035 -892516 -937343 -937370 -979851 -958063 -921762 -923050 -924344 -869370 -866352 -917751 -961141 -899528 -845677
2022 -845677 -883041 -938921 -908856 -926767 -858446 -859647 -917198 -881142 -833122 -801206 -872549 -886163
2010 -886163 -960076 -934035 -858180 -860087 -890240 -852217 -889298 -885164 -928553 -941457 -893876 -924891
1998 -924891 -947754 -935442 -911762 -927200 -959158 -927090 -948097 -987950 -934224 -962794 -941456 -890582
1986 -890582 -824789 -847189 -889679 -868070 -892837 -919010 -886653 -851939 -925490 -926073 -901362 -856155
1974 -856155 -891476 -974841 -895540 -840856 -850047 -822026 -890571 -910709 -918789 -938493 -893856 -892513
1962 -892513 -886417 -887410 -898279 -845154 -800980 -822094 -865617 -884642 -801703 -834603 -881735 -951667
1950 -951667 -946107 -1023355 -914203 -915261 -954675 -922248 -864847 -921289 -942279 -929165 -878032 -865983
1938 -865983 -928155 -887582 -878391 -892747 -892069 -902513 -947500 -954795 -976889 -998062 -941300 -863637
1926 -863637 -838224 -861341 -907318 -862868 -933403 -981335 -965428 -954620 -945179 -948548 -1012707 -1031004
1914 -1031004 -1015307 -922018 -854003 -827398 -816864 -871446 -916352 -899572 -897856 -882945 -877966 -868111
1902 -868111 -898217 -863299 -868572 -889851 -880558 -868093 -880261 -905960 -878312 -950547 -932891 -924475
1890 -924475 -919860 -926671 -931889 -922178 -875827 -902768 -874507 -830364 -906237 -912757 -916511 -928711 -928665
1877 -928665 -899017 -889075 -897063 -803271 -769573 -870581 -920176 -921477 -936955 -918620 -911543 -889789
1865 -889789 -883122 -944057 -991426 -954912 -889928 -826866 -803502 -846565 -874653 -854394 -903059 -984854
1853 -984854 -921365 -851480 -825538 -873589 -838510 -870740 -959562 -944569 -917308 -927020 -938461 -909675
1841 -909675 -905293 -920024 -940891 -988152 -939637 -981382 -940669 -930585 -950141 -931005 -920688 -877679
1829 -877679 -875810 -980864 -957024 -943552 -923428 -858499 -854008 -874294 -938815 -900931 -847232 -864535
1817 -864535 -903656 -924550 -984389 -952869 -936867 -885734 -913693 -892989 -847841 -866673 -858836 -900142
1805 -900142 -895565 -859496 -822290 -812105 -847379 -873684 -893550 -922624 -860706 -853597 -963725 -905865
1793 -905865 -921479 -887484 -855394 -817530 -820495 -911440 -896792 -871937 -922237 -895802 -933218 -914891
1781 -914891 -900791 -909207 -843235 -922350 -908323 -879576 -848643 -911271 -942866 -897320 -879822 -891233
1769 -891233 -822234 -855866 -913054 -901683 -845581 -851246 -832079 -862492 -915117 -941311 -1009763 -929431
1757 -929431 -931012 -884850 -880269 -913150 -917255 -879110 -872745 -921655 -914768 -913203 -880865 -889402 -886406
1744 -886406 -850357 -895346 -895469 -846783 -851360 -901432 -865455 -835308 -861667 -853463 -898713 -898517 -913309
1731 -913309 -932204 -869137 -864596 -864563 -877522 -870383 -903094 -874343 -878688 -972683 -954939 -983028 -956869
1718 -956869 -902981 -921938 -893708 -934973 -946599 -972275 -951462 -930609 -859109 -866472 -913503 -977550
1706 -977550 -988806 -925418 -952145 -929879 -897512 -878334 -861816 -796962 -851091 -825201 -851345 -938518
1694 -938518 -886539 -835302 -864047 -922583 -914904 -917076 -858538 -810409 -853797 -868471 -925820 -880757
1682 -880757 -906505 -920929 -916787 -938783 -934832 -884868 -900371 -911884 -876858 -891141 -840009 -835705
1670 -835705 -829594 -831577 -835787 -872438 -825511 -810337 -904012 -976952 -950392 -913467 -859922 -868467
1658 -868467 -933006 -908408 -844525 -843888 -867994 -853046 -870896 -924019 -954214 -922548 -943162 -957809
1646 -957809 -906775 -948258 -870971 -870922 -929569 -868313 -881421 -912022 -912467 -916512 -952737 -902332 -887696
1633 -887696 -925124 -904174 -902953 -862517 -895280 -899119 -855434 -880754 -833894 -854663 -865738 -911413
1621 -911413 -890228 -904838 -845277 -824556 -812221 -827904 -850516 -889875 -886815 -870866 -888959 -932963
1609 -932963 -939532 -831985 -846560 -921270 -970649 -991070 -956964 -919208 -928003 -893022 -878218 -908703
1597 -908703 -937674 -952431 -967942 -930931 -940361 -913346 -938297 -924802 -876317 -911046 -930559 -890236
1585 -890236 -946123 -962621 -882976 -854770 -843133 -872212 -907580 -877033 -856657 -792513 -761973 -781336
1573 -781336 -742161 -810940 -871401 -914796 -920634 -886284 -877748 -873353 -801572 -855072 -901689 -885472
1561 -885472 -883593 -852651 -866661 -855125 -898316 -795931 -835311 -884666 -880801 -821818 -840498 -857271
1549 -857271 -843905 -834669 -813736 -866365 -891238 -845536 -901587 -885570 -867511 -921579 -924782 -913900
1537 -913900 -890120 -900524 -859935 -833711 -869394 -882097 -836330 -901568 -871106 -824614 -789944 -819610
1525 -819610 -822014 -847639 -851888 -900436 -845921 -883193 -922847 -954141 -943205 -890498 -879232 -846140
1513 -846140 -851277 -875568 -861231 -837044 -821566 -792130 -777663 -761579 -821189 -865642 -779029 -741794
1501 -741794 -806274 -838704 -860301 -780653 -835504 -808411 -843176 -823491 -904585 -921179 -853742 -849348
1489 -849348 -872612 -917571 -850141 -845108 -874653 -886129 -884067 -905704 -892791 -857808 -882049 -931351
1477 -931351 -981508 -944517 -936360 -908240 -956640 -1003509 -903094 -946542 -944480 -904872 -857361 -847739
1465 -847739 -879010 -880522 -954891 -965135 -922506 -961931 -911632 -912088 -902003 -934742 -897586 -870281
1453 -870281 -854618 -901164 -908023 -865420 -831323 -803424 -777409 -891796 -900915 -926224 -894142 -822584
1441 -822584 -814050 -803895 -877299 -891416 -886929 -901509 -895036 -872408 -923117 -924271 -873674 -862458
1429 -862458 -891685 -855095 -897764 -827003 -849168 -894460 -953193 -957711 -945100 -893151 -884341 -879814
1417 -879814 -878967 -867107 -808989 -848219 -873532 -857656 -828476 -873567 -976058 -856526 -747968
1406 -747968 -817768 -900395 -889144 -872672 -819435 -802313 -863133 -899549 -862036 -860232 -882166 -819662
1394 -819662 -821584 -791955 -870402 -878044 -893514 -895236 -862123 -846429 -793041 -794935 -766836 -841449
1382 -841449 -930408 -906866 -877306 -870447 -825553 -838131 -834171 -792140 -807402 -840743 -827980 -853284
1370 -853284 -848642 -864119 -901201 -890837 -862426 -867540 -852488 -871817 -885621 -861770 -918694 -869369
1358 -869369 -860182 -838983 -859718 -957969 -947450 -938407 -942921 -895749 -896045 -865007 -817125 -909630 -918215
1345 -918215 -938393 -927509 -896404 -909695 -822830 -806658 -878408 -922686 -854682 -846274 -834399 -811058
1333 -811058 -818132 -853274 -852991 -863538 -848945 -935244 -900030 -847862 -877575 -886219 -876581 -867441 -883466
1320 -883466 -892185 -891951 -849205 -789501 -788976 -814873 -756132 -836995 -844649 -860549 -901138 -914622 -920298
1307 -920298 -893753 -870603 -846293 -819738 -797569 -868220 -871964 -908853 -897677 -894006 -889978 -892536
1295 -892536 -908274 -864382 -833414 -822701 -832323 -823585 -875356 -912107 -884577 -818328 -785783 -900906
1283 -900906 -881285 -867394 -869688 -904572 -985369 -1000809 -924120 -898681 -862629 -826467 -883472 -859911
1271 -859911 -875347 -866986 -870988 -835762 -828235 -865782 -869125 -814649 -803227 -789655 -851999 -913715
1259 -913715 -858144 -898692 -953071 -869940 -874382 -850061 -888019 -877527 -917098 -926877 -936796 -930186
1247 -930186 -877597 -856407 -906835 -911551 -875252 -883869 -851543 -814299 -806784 -792354 -801637 -866218
1235 -866218 -830206 -840001 -846867 -814413 -824896 -900941 -889274 -938266 -910627 -872551 -836180 -934720
1223 -934720 -875462 -891546 -887431 -908940 -917364 -841579 -865644 -908611 -899162 -832272 -830954 -846976
1211 -846976 -837482 -852858 -830602 -784498 -904755 -913910 -884928 -863816 -883166 -901922 -859839 -864321
1199 -864321 -876301 -862297 -898993 -830194 -840930 -796158 -864730 -907922 -867181 -927512 -933351 -909316
1187 -909316 -891484 -853508 -928331 -923887 -909487 -889086 -858749 -836629 -804866 -808913 -845021 -854828
1175 -854828 -844017 -764037 -782115 -849241 -924218 -941646 -938827 -895994 -856935 -832822 -868820 -840604
1163 -840604 -797160 -857985 -945982 -906789 -804537 -808414 -811076 -833459 -796264 -831884 -844873 -847458
1151 -847458 -842224 -848631 -868131 -859432 -846080 -791833 -807985 -908642 -911691 -941107 -934800 -867099
1139 -867099 -874346 -939172 -908351 -914053 -912788 -900156 -886823 -944997 -837139 -830678 -809665 -804529
1127 -804529 -842576 -872175 -937836 -873179 -832209 -886815 -892890 -874807 -896147 -870595 -822294 -785677
1115 -785677 -789216 -801841 -801724 -828085 -870721 -870475 -814461 -794020 -816883 -850545 -835321 -822773 -796657
1102 -796657 -805123 -873368 -903453 -874666 -826687 -828075 -873313 -833598 -797727 -832501 -860975 -763081
1090 -763081 -844076 -905778 -875769 -906886 -910137 -885188 -910643 -983132 -934629 -847275 -795931 -736120
1078 -736120 -820530 -806496 -718265 -769316 -816428 -899804 -825605 -783465 -887237 -924496 -844571
1067 -844571 -830575 -820125 -842406 -896174 -869561 -866533 -863179 -881409 -871733 -828421 -886865 -826008
1055 -826008 -822144 -803166 -845452 -846239 -896628 -876292 -763589 -786343 -830598 -889008 -865509 -820945
1043 -820945 -793441 -772711 -822938 -845595 -910010 -879381 -835836 -822729 -820120 -845016 -912840 -903839
1031 -903839 -911443 -892044 -856431 -865922 -880115 -887905 -847959 -826766 -816554 -800998 -791200 -803911
1019 -803911 -829648 -881415 -894492 -837139 -863893 -905100 -820358 -827863 -805240 -750639 -783862 -845213
1007 -845213 -888933 -921342 -827760 -850613 -898551 -778329 -728011 -793214 -819022 -828666 -859070 -805330
995 -805330 -849055 -874178 -826658 -857211 -862353 -893623 -885430 -826100 -795867 -809481 -854993 -873749
983 -873749 -873895 -910048 -865369 -838450 -826210 -833992 -857544 -858037 -813760 -833960 -923337 -962187 -946108
970 -946108 -908976 -879216 -886005 -894736 -886191 -815603 -878735 -865049 -880817 -900167 -894323 -881122 -847810
957 -847810 -886289 -906239 -860789 -868658 -891239 -820817 -879894 -832613 -851280 -824794 -846065 -854475
945 -854475 -804072 -775576 -778723 -737814 -776781 -760427 -739431 -821921 -930301 -929285 -904422 -854630
933 -854630 -797493 -843110 -873838 -887261 -866123 -835208 -841241 -862260 -872870 -887843 -856977 -860942
921 -860942 -891630 -879853 -915440 -850012 -811499 -860045 -828372 -827004 -808501 -825293 -876511 -954794
909 -954794 -956028 -894059 -915184 -857826 -843103 -903885 -946469 -919278 -908820 -911052 -922685 -936440
897 -936440 -907696 -865788 -855491 -846625 -817752 -851791 -862624 -879709 -847006 -885194 -874699 -863887
885 -863887 -872049 -878566 -863488 -874484 -829523 -871106 -893503 -948634 -882442 -839309 -851424 -854240
873 -854240 -818914 -877454 -844528 -808314 -810165 -839868 -837937 -826165 -802898 -835659 -872936 -832660
861 -832660 -872553 -917599 -871971 -818907 -788966 -797228 -802720 -819586 -895080 -871184 -861985 -862679 -845402
848 -845402 -830463 -847611 -862231 -813058 -773647 -871768 -902353 -905784 -833522 -789014 -766717 -822840
836 -822840 -763047 -675631 -707106 -851570 -874244 -818922 -808025 -868392 -805939 -810546 -824045 -784202
824 -784202 -848200 -853328 -741386 -834584 -885729 -838261 -837905 -803307 -796268 -852312 -869647 -833035
812 -833035 -884229 -930001 -909450 -825722 -869677 -821032 -768363 -791154 -847230 -918558 -879537 -903194
800 -903194 -880209 -840865 -833419 -842257 -866184 -886873 -877720 -839162 -812673 -818957 -835778 -832031 -806431
787 -806431 -857874 -908109 -854723 -849237 -840112 -814008 -778649 -825234 -850185 -863311 -855354 -824696
775 -824696 -855087 -779919 -786590 -747730 -761813 -834115 -906423 -898088 -818541 -860852 -847022 -801654
763 -801654 -844913 -846025 -821555 -824844 -794793 -820167 -835577 -843444 -824788 -788986 -832277 -814958
751 -814958 -850528 -818738 -857820 -885216 -898469 -941709 -865885 -878943 -817567 -826332 -740003 -811311
739 -811311 -877091 -877190 -930072 -916056 -850891 -871353 -824795 -792651 -804821 -817906 -821835 -791890 -793340
726 -793340 -793437 -846001 -857720 -844776 -832483 -783928 -778858 -853994 -900860 -892446 -893947 -846190 -943968
713 -943968 -924070 -884928 -837580 -822264 -883941 -806361 -851865 -878389 -896063 -857246 -885162 -899465
701 -899465 -911261 -867702 -786241 -793567 -824659 -821530 -796171 -757888 -798490 -812099 -801793 -851563
689 -851563 -796124 -869953 -819776 -800487 -813898 -836802 -851060 -826298 -839376 -868155 -836189 -836648
677 -836648 -823112 -872365 -879750 -827263 -892612 -867798 -904542 -925862 -904252 -868082 -870872 -883675
665 -883675 -882874 -849688 -915178 -978099 -930954 -891302 -921720 -860377 -856314 -779058 -833896 -888199
653 -888199 -920603 -981101 -953272 -888772 -846115 -851534 -770855 -734573 -816275 -864290 -932800 -907363
641 -907363 -845415 -843522 -885604 -830422 -872255 -854610 -771027 -812232 -799541 -831258 -827717 -842450
629 -842450 -857386 -840734 -871842 -871690 -783141 -839730 -862249 -860793 -862144 -884227 -832807 -845908 -918640
616 -918640 -907456 -885125 -844481 -875529 -844962 -859675 -792981 -760058 -827753 -775639 -727577 -741994
604 -741994 -744313 -739199 -774047 -705622 -779948 -839398 -868020 -851025 -882776 -892576 -892739 -900765 -863545
591 -863545 -875559 -906160 -803140 -815943 -821796 -874546 -896026 -879501 -880984 -871357 -852308 -802893
579 -802893 -799137 -804228 -824026 -851529 -904466 -862524 -856610 -785542 -771351 -834175 -870158 -816257
567 -816257 -803820 -829057 -876743 -894117 -838296 -828450 -845632 -806587 -814396 -827559 -821453 -844912
555 -844912 -897358 -892013 -911090 -925921 -890866 -817804 -771418 -871952 -872618 -884203 -894543 -804024
543 -804024 -885000 -898759 -894673 -901077 -894602 -860023 -860114 -909302 -832098 -797562 -772093 -729768 -752172
530 -752172 -793465 -843745 -814770 -819465 -791375 -746159 -793223 -817009 -820263 -869187 -896959 -873502
518 -873502 -895325 -874449 -883911 -866173 -896003 -939816 -898757 -878174 -884639 -852304 -826927 -835804
506 -835804 -832182 -804332 -756770 -810589 -820389 -816885 -836805 -818014 -773803 -755113 -849319 -824872
494 -824872 -845343 -901943 -856046 -838685 -845161 -864130 -875427 -840059 -809988 -839826 -832386 -811433
482 -811433 -831267 -838693 -834233 -883726 -880222 -943126 -961980 -868419 -808488 -823876 -804420 -811649 -775441
469 -775441 -784356 -763579 -792239 -839349 -849788 -864561 -815848 -832945 -859315 -784831 -840481 -902295
457 -902295 -885204 -895721 -873171 -884285 -882062 -852055 -843852 -837779 -784345 -798572 -790060 -875590 -869265
444 -869265 -783282 -845536 -878738 -848823 -919023 -934270 -927278 -957777 -936117 -824275 -796082 -773827
432 -773827 -843247 -859699 -816993 -818519 -845537 -818805 -808332 -845958 -835052 -862761 -916937 -917954
420 -917954 -910265 -891716 -916267 -935726 -946477 -895070 -886940 -851670 -779088 -824654 -851074 -826918
408 -826918 -834584 -862484 -879750 -870000 -861606 -879416 -867190 -823974 -782518 -780948 -812415 -838397 -849047
395 -849047 -840468 -830831 -854670 -914353 -880279 -836802 -876639 -904543 -899031 -879535 -808259 -770120
383 -770120 -832257 -870801 -846279 -851187 -822682 -825589 -892501 -894970 -944338 -858071 -802065 -820803
371 -820803 -799165 -744213 -795182 -730114 -761659 -780596 -793057 -820161 -827799 -761229 -846194 -910924
359 -910924 -871619 -872418 -851027 -841947 -848047 -842172 -801021 -812011 -812119 -838413 -814505 -815806 -808097 -821217
345 -821217 -815199 -793872 -818046 -870979 -820756 -794196 -781184 -853630 -844502 -806420 -817227 -841552
333 -841552 -861895 -812609 -778040 -805394 -753226 -779823 -786826 -794682 -853717 -834597 -839037 -802371
321 -802371 -782361 -794488 -795880 -778389 -809087 -817291 -805311 -801653 -793998 -784202 -832937 -819594 -795420
308 -795420 -838328 -850185 -848534 -873019 -867048 -822298 -819800 -839950 -801566 -817213 -812940 -789140 -746763
295 -746763 -774738 -856672 -791345 -777238 -839246 -855124 -851130 -869268 -839335 -847226 -912343 -886562
283 -886562 -846461 -864000 -838720 -850199 -848160 -791954 -809169 -792321 -819301 -812277 -823897 -857065
271 -857065 -822619 -815452 -834959 -873996 -855547 -854493 -881280 -832857 -876354 -882173 -891381 -861115 -816866
258 -816866 -789438 -807210 -882435 -849160 -790981 -794360 -840406 -898773 -864962 -894973 -847997 -845052
246 -845052 -858734 -798217 -777823 -801497 -805767 -859407 -856050 -824245 -848119 -778361 -759552 -720770
234 -720770 -802003 -797726 -812347 -867077 -813353 -801875 -837468 -794130 -788033 -869604 -926886 -942582
222 -942582 -907231 -951160 -962502 -910329 -860740 -828473 -846062 -774056 -798487 -807888 -858389 -857463
210 -857463 -840096 -877817 -846286 -775152 -773505 -800625 -822172 -862856 -882781 -825170 -834723 -891765
198 -891765 -895315 -894140 -884802 -833494 -824987 -810002 -796224 -880516 -918940 -913011 -977732 -911807 -917222
185 -917222 -921871 -942741 -878403 -840738 -885282 -900256 -904615 -922418 -957013 -938737 -900464 -850720
173 -850720 -875274 -864784 -879575 -871864 -892368 -938619 -904172 -902226 -946034 -987026 -926047 -815189
161 -815189 -796733 -867354 -890803 -888980 -916276 -919410 -874640 -858124 -828596 -827421 -850448 -874722
149 -874722 -961263 -978700 -904051 -911289 -950005 -964636 -995972 -898946 -911024 -932074 -869197 -812951
137 -812951 -843682 -837536 -892854 -917045 -931770 -895365 -906796 -889900 -964698 -967262 -871527 -865744
125 -865744 -935496 -910082 -878511 -908156 -986539 -982418 -920434 -905884 -949977 -943370 -907848 -925164
113 -925164 -935933 -962202 -954532 -1026537 -1047774 -931662 -850836 -933642 -966994 -949091 -981181 -987144
101 -987144 -1017941 -961802 -911711 -971658 -972313 -956775 -961439 -926909 -917465 -933607 -929659 -960730 -909517
88 -909517 -926035 -938788 -1002365 -1019476 -958377 -963659 -900877 -919804 -973658 -984128 -1021444 -1036720
76 -1036720 -1069811 -1034253 -1063882 -1043590 -973880 -917154 -942885 -1010779 -978449 -935615 -971332 -1015648
64 -1015648 -1027118 -1060358 -1041605 -1056356 -1043218 -1020231 -1055417 -1092036 -1112025 -1100541 -1050734 -1059112
52 -1059112 -1032065 -1016406 -1068292 -1108246 -1087888 -1057390 -1003438 -988430 -1059968 -1087064 -1102930 -1068194
40 -1068194 -1060830 -1091482 -1078334 -1058505 -1102937 -1068444 -1065915 -1107663 -1105678 -1121685 -1163959 -1141807
28 -1141807 -1144341 -1128604 -1136698 -1094561 -1063219 -1083379 -1132920 -1145008 -1119393 -1148956 -1171394 -1196020
16 -1196020 -1166499 -1184602 -1174183 -1185895 -1189108 -1152780 -1157295 -1161676 -1149617 -1151224 -1174198 -1172300 -1122573
3 -1122573 -1135951 -1151688 -1194259
0 -1194259
$$ Imaginary data points
##PAGE= N=2
##DATA TABLE= (X++(I..I)), XYDATA
16383 -2207136 -2168469 -2088884 -2082589 -2015412 -1960358 -1963627 -1949635 -1883155 -1833929 -1731447 -1699206
16372 -1699206 -1690521 -1657589 -1647263 -1617000 -1551350 -1498527 -1501206 -1447289 -1362027 -1346560 -1277215 -1286242
16360 -1286242 -1289078 -1249498 -1172328 -1123030 -1083562 -1049448 -1034072 -1000301 -901769 -870757 -856228
16349 -856228 -774100 -754205 -727404 -705225 -647427 -622513 -551563 -528308 -463353 -402708 -375052
16338 -375052 -365415 -322271 -288436 -275436 -213327 -155261 -155737 -125205 -31703 3642 -18717 -42
16326 -42 57417 65584 140952 179298 215211 266235 309979 376318 424072 482784 515060 515408 570637
16313 570637 594524 575196 604433 705420 738942 775133 804452 786637 778070 768010 893962
16302 893962 956930 946919 987436 1059071 1104422 1097079 1123834 1195858 1244549 1276865 1301766 1300588
16290 1300588 1359528 1410831 1419788 1395926 1420392 1486460 1553037 1564468 1562588 1630722 1674206 1671018
16278 1671018 1642577 1717324 1701177 1778606 1826056 1876451 1888909 1923870 1986480 1939486 1915726
16267 1915726 1925634 1983642 1979065 2073518 2142586 2135945 2131709 2140314 2141185 2180987 2217468 2244677 2326458
16254 2326458 2281576 2319101 2363111 2394959 2414506 2422029 2445467 2473630 2549709 2613788 2648683
16243 2648683 2654867 2632659 2641139 2677184 2690691 2663101 2744877 2742696 2773107 2820385 2819940 2846257
16231 2846257 2868307 2922652 2971740 2968529 2935388 2960840 2985006 3000158 2995228 3062365 3040952 2975709
16219 2975709 3069842 3133337 3096853 3145153 3120601 3115182 3118654 3144925 3109379 3174954 3228554 3206206
16207 3206206 3254612 3235907 3280376 3383073 3390307 3377329 3360393 3390804 3398506 3398091 3444331 3477665
16195 3477665 3499973 3489031 3530040 3539516 3532017 3572535 3517724 3550999 3530828 3511857 3523651 3526711
16183 3526711 3540014 3564236 3658352 3665277 3599656 3625327 3671394 3669696 3690903 3757544 3748174 3750672
16171 3750672 3760206 3734458 3799789 3804343 3824911 3817211 3794236 3803989 3864063 3828163 3843062 3868781
16159 3868781 3815378 3863751 3941899 3941227 3921989 3914626 3947156 3972372 3970496 3984377 3946843 3966609
16147 3966609 3976844 4022805 4028780 4087186 4034629 4023448 3929128 3964506 4067783 4094893 4054214
16136 4054214 4028226 3989320 4005107 4043013 4068699 4081279 4086468 4113018 4118714 4105435 4001230
16125 4001230 4070075 4045871 4085959 4090512 4094307 4155670 4121875 4092037 4159935 4202885 4259487 4271710
16113 4271710 4230201 4198328 4183571 4204439 4176245 4182190 4294027 4211416 4135392 4187465 4125099
$$ [...]
##END NTUPLES=NMR SPECTRUM
##END=
