##TITLE=1H_DE-80H_X3
 200.13MHz, d2o
 8 sc
 
 19ns.26.2.2025
##JCAMPDX= 6.0         $$ Bruker NMR JCAMP-DX V2.0
##DATA TYPE= NMR SPECTRUM
##DATA CLASS= NTUPLES
##ORIGIN= UXNMR, Bruker Analytische Messtechnik GmbH
##OWNER= pz
$$ XWIN-NMR		Version 3.5
$$ Fri Mar  6 11:22:35 2026 Russian Standard Time (UT+4h)  Yarkov@DPX200
##.OBSERVE FREQUENCY= 200.1313
##.OBSERVE NUCLEUS= ^1H
##.ACQUISITION MODE= SIMULTANEOUS
##.ACQUISITION SCHEME= undefined
##.AVERAGES= 8
##.DIGITISER RES= 18
##SPECTROMETER/DATA SYSTEM= spect
##.PULSE SEQUENCE= zg30
##.SOLVENT NAME= CDCl3
##.SHIFT REFERENCE= (INTERNAL, CDCl3, 0, 15.337)
##AUDIT TRAIL= $$ (NUMBER, WHEN, WHO, WHERE, WHAT)
$$ ##TITLE= Audit trail, XWIN-NMR		Version 3.5
$$ ##JCAMPDX= 5.01
$$ ##ORIGIN= Bruker BioSpin GmbH
$$ ##OWNER= Yarkov
$$ C:/Bruker/XWIN-NMR/data/yarkov2/nmr/H-C/1/pdata/1/auditp.txt
$$ ##AUDIT TRAIL=  $$ (NUMBER, WHEN, WHO, WHERE, WHAT)
(   1,<2026-03-06 11:21:51.39 +0400>,<Yarkov>,<DPX200>,
      <created by zg, POWCHK disabled, PULCHK disabled
       configuration hash MD5:
       00 E9 B6 7A A2 85 ED C7 34 08 36 98 17 FE 4E 26
       data hash MD5: 16K
       62 B2 38 DC 51 95 35 6F F1 25 D6 2D 44 7B EF E0>)
(   2,<2026-03-06 11:21:57.06 +0400>,<Yarkov>,<DPX200>,
      <Start of raw data processing
       efp BC_mod = 2 LB = 0.25 FT_mod = 6 PKNL = 1 PHC0 = -5299.148 PHC1 = 6.821927 SI = 16K 
       data hash MD5: 16K
       5A BF 90 79 91 8A 4E 44 B2 B5 E8 7F F4 70 30 DC>)
$$ ##END=
$$ 
$$ hash MD5
$$ A5 B5 5A 2E 86 59 F7 D0 67 A3 58 84 9A 62 B2 4E
##$RELAX= 
##$RELAX= 
##$RELAX= 
##$RELAX= 
##$RELAX= 
##$RELAX= 
$$ Bruker specific parameters
$$ --------------------------
##$DU= <C:/Bruker/XWIN-NMR>
##$EXPNO= 1
##$NAME= <H-C>
##$PROCNO= 1
##$TYPE= <nmr>
##$USER= <yarkov2>
##$AMP= (0..31)
100 100 100 100 100 100 100 100 100 100 100 100 100 100 100 100 100 100 
100 100 100 100 100 100 100 100 100 100 100 100 100 100 
##$AQSEQ= 0
##$AQ_mod= 1
##$AUNM= <au_zg>
##$AUTOPOS= <>
##$BF1= 200.13
##$BF2= 200.13
##$BF3= 200.13
##$BF4= 200.13
##$BF5= 200.13
##$BF6= 200.13
##$BF7= 200.13
##$BF8= 200.13
##$BYTORDA= 1
##$CFDGTYP= 0
##$CFRGTYP= 5
##$CHEMSTR= <none>
##$CNST= (0..31)
1 1 145 1 1 1 1 1 1 1 1 1 1 1 1 1 1 1 1 1 1 1 1 1 1 1 1 1 1 1 1 1 
##$CPDPRG= <>
##$CPDPRG1= <>
##$CPDPRG2= <>
##$CPDPRG3= <>
##$CPDPRG4= <mlev>
##$CPDPRG5= <mlev>
##$CPDPRG6= <mlev>
##$CPDPRG7= <mlev>
##$CPDPRG8= <mlev>
##$CPDPRGB= <>
##$CPDPRGT= <>
##$D= (0..31)
0 0.7 0 0 0 0 0 0 0 0 0 0.03 0 0 0 0 0 0 0 0 0 0 0 0 0 0 0 0 0 0 0 0 
##$DATE= 1772781710
##$DBL= (0..7)
120 120 120 120 120 120 120 120 
##$DBP= (0..7)
150 150 150 150 150 150 150 150 
##$DBP07= 0
##$DBPNAM0= <>
##$DBPNAM1= <>
##$DBPNAM2= <>
##$DBPNAM3= <>
##$DBPNAM4= <>
##$DBPNAM5= <>
##$DBPNAM6= <>
##$DBPNAM7= <>
##$DBPOAL= (0..7)
0.5 0.5 0.5 0.5 0.5 0.5 0.5 0.5 
##$DBPOFFS= (0..7)
0 0 0 0 0 0 0 0 
##$DE= 6
##$DECBNUC= <off>
##$DECIM= 32
##$DECNUC= <off>
##$DECSTAT= 4
##$DIGMOD= 1
##$DIGTYP= 9
##$DL= (0..7)
0 120 120 120 120 120 120 120 
##$DP= (0..7)
$$ [...]
##$SUBNAM2= <"">
##$SUBNAM3= <"">
##$SUBNAM4= <"">
##$SUBNAM5= <"">
##$SUBNAM6= <"">
##$SUBNAM7= <"">
##$SUBNAM8= <"">
##$SUBNAM9= <"">
##$SW= 18.0517328524113
##$SWIBOX= (0..15)
0 0 2 0 0 0 0 0 0 0 0 0 0 0 0 0 
##$SW_h= 3612.71676300578
##$TD= 16384
##$TD0= 1
##$TE= 0
##$TE2= 300
##$TE3= 300
##$TEG= 300
##$TL= (0..7)
0 120 120 120 120 120 120 120 
##$TP= (0..7)
150 150 150 150 150 150 150 150 
##$TP07= 0
##$TPNAME0= <>
##$TPNAME1= <>
##$TPNAME2= <>
##$TPNAME3= <>
##$TPNAME4= <>
##$TPNAME5= <>
##$TPNAME6= <>
##$TPNAME7= <>
##$TPOAL= (0..7)
0.5 0.5 0.5 0.5 0.5 0.5 0.5 0.5 
##$TPOFFS= (0..7)
0 0 0 0 0 0 0 0 
##$TUNHIN= 0
##$TUNHOUT= 0
##$TUNXOUT= 0
##$USERA1= <user>
##$USERA2= <user>
##$USERA3= <user>
##$USERA4= <user>
##$USERA5= <user>
##$V9= 5
##$VALIST= <valist>
##$VCLIST= <CCCCCCCCCCCCCCC>
##$VD= 0
##$VDLIST= <DDDDDDDDDDDDDDD>
##$VPLIST= <PPPPPPPPPPPPPPP>
##$VTLIST= <TTTTTTTTTTTTTTT>
##$WBST= 1024
##$WBSW= 4
##$XGAIN= (0..3)
0 0 0 0 
##$XL= 0
##$YL= 0
##$YMAX_a= 810418
##$YMIN_a= -715866
##$ZGOPTNS= <>
##$ZL1= 120
##$ZL2= 120
##$ZL3= 120
##$ZL4= 120
##$ABSF1= 0
##$ABSF2= 0
##$ABSG= 0
##$ABSL= 0
##$ALPHA= 0
##$AQORDER= 0
##$ASSFAC= 0
##$ASSFACI= 0
##$ASSFACX= 0
##$ASSWID= 0
##$AUNMP= <proc_1d>
##$AZFE= 0.1
##$AZFW= 0.1
##$BCFW= 0
##$BC_mod= 2
##$BYTORDP= 0
##$COROFFS= 0
##$CY= -3
##$DATMOD= 1
##$DC= 0
##$DFILT= <>
##$DTYPP= 0
##$F1P= 0
##$F2P= 0
##$FCOR= 1
##$FTSIZE= 16384
##$FT_mod= 6
##$GAMMA= 0
##$GB= 0
##$INTBC= 1
##$INTSCL= 3.241238e-09
##$ISEN= 128
##$LB= 0.25
##$LEV0= 0
##$LPBIN= 0
##$MAXI= 10000
##$MC2= 0
##$MEAN= 0
##$ME_mod= 0
##$MI= 1.114404
##$NCOEF= 0
##$NC_proc= -5
##$NLEV= 6
##$NOISF1= 3.799351
##$NOISF2= 2.8
##$NSP= 0
##$NTH_PI= 0
##$NZP= 0
##$OFFSET= 15.33702
##$PC= 1
##$PHC0= -5299.148
##$PHC1= 6.821927
##$PH_mod= 1
##$PKNL= yes
##$PPARMOD= 0
##$PSCAL= 0
##$PSIGN= 0
##$REVERSE= no
##$SF= 200.130036959967
##$SI= 16384
##$SIGF1= 3
##$SIGF2= 2
##$SINO= 0.751879
##$SIOLD= 32768
##$SREGLST= <19F.Aceton>
##$SSB= 0
##$STSI= 16384
##$STSR= 0
##$SW_p= 3612.71676300578
##$SYMM= 0
##$S_DEV= 0
##$TDeff= 16384
##$TDoff= 0
##$TI= <>
##$TILT= no
##$TM1= 0
##$TM2= 0
##$TOPLEV= 0
##$USERP1= <user>
##$USERP2= <user>
##$USERP3= <user>
##$USERP4= <user>
##$USERP5= <user>
##$WDW= 1
##$XDIM= 16384
##$YMAX_p= 278952726
##$YMIN_p= -1292807
$$ End of Bruker specific parameters
$$ ---------------------------------
##NTUPLES= NMR SPECTRUM
##VAR_NAME=  FREQUENCY,     SPECTRUM/REAL,   SPECTRUM/IMAG
##SYMBOL=    X,             R,               I
##VAR_TYPE=  INDEPENDENT,   DEPENDENT,       DEPENDENT
##VAR_FORM=  AFFN,          ASDF,            ASDF
##VAR_DIM=   16384,         16384,           16384
##UNITS=     HZ,            ARBITRARY UNITS, ARBITRARY UNITS
##FACTOR=    0.220516191357247, 1,           1
##FIRST=     3069.39836351522, 0,            0
##LAST=      -543.318399490561, 0,           0
##MIN=       -543.318399490561, -1292807,    0
##MAX=       3069.39836351522, 278952726,    0
$$ Real data points
##PAGE= N=1
##DATA TABLE= (X++(R..R)), XYDATA
$$ [...]
$$ plain form
7899 -890303 -907358 -917793 -922611 -885690 -861584 -870870 -877299 -912064 -914341 -927077 -963436 -971942 -941228
7886 -941228 -936141 -904551 -869961 -851687 -840398 -848475 -859925 -856738 -884014 -906999 -925423 -888891
7874 -888891 -880166 -864039 -872824 -903952 -918352 -928372 -950998 -966955 -937601 -919943 -918819 -913598
7862 -913598 -903416 -918285 -917395 -943654 -949772 -956780 -926105 -914092 -909902 -913149 -905630 -908444 -893193
7849 -893193 -890851 -915055 -901800 -887031 -883548 -894068 -933444 -933681 -887569 -902937 -930595 -932819 -922987
7836 -922987 -923700 -906888 -908490 -931410 -900394 -905286 -917356 -928108 -954002 -936452 -908261 -894542
7824 -894542 -889455 -925161 -938976 -922108 -943445 -899633 -903926 -885852 -885386 -922117 -917258 -911062 -898406
7811 -898406 -899795 -961469 -952564 -953684 -974379 -976571 -895457 -798431 -876218 -899980 -899312 -892042 -893494
$$ packed form
7899h90303j7055j0435m818L6921K4106r286o429l4765k277j2736l6359q506L0714
7886i41228N087L1590L4590J8274J1289q077j1450L187k7276k2985j8424L6532
7874h88891Q725J6127q785l1128j4400j0020k2626j5957K9354J7658J124N221
7862i13598J0182j4869Q90k6259o118p008L0675J2013M190l247P519k814J5251
7849h93193K342k4204J3255J4769L483j0520l9376k37M6112j5368k7658k224R832
7836i22987p13J6812j602k2920L1016m892j2070j0752k5894J7550K8191J3719
7824h94542N087l5706j3815J6868k1337M3812m293J8074M66l6731M859O196J2656
7811h98406j389o1674Q905j120k0695k192Q1114R7026p7787k3762O68P270j452
$$ plain form
7798 -893494 -925376 -933148 -905386 -902326 -894122 -867641 -910039 -918447 -895391 -899267 -920868 -926138 -906501
7785 -906501 -922710 -949548 -975712 -959756 -962901 -956495 -963247 -933608 -928857 -908086 -921260 -944408
7773 -944408 -912205 -928092 -925400 -939160 -954976 -966739 -991674 -999405 -980263 -976065 -961752 -958211
7761 -958211 -963764 -945228 -920086 -917359 -893593 -914780 -941997 -928812 -926909 -915575 -951101 -940628
7749 -940628 -910550 -900264 -942800 -948803 -938311 -950316 -926216 -938165 -951580 -956379 -904717 -926149
7737 -926149 -912722 -899716 -879089 -906002 -938626 -969889 -935731 -917643 -916178 -924421 -891527 -886877
7725 -886877 -904915 -920865 -944590 -902486 -933023 -925510 -908899 -914781 -916908 -926642 -927293 -929145 -899447
7712 -899447 -885318 -892385 -874573 -884825 -910900 -936067 -933830 -943746 -921364 -930353 -957127 -939661
$$ packed form
7798h93494l1882p772K7762L060Q204K6481m2398q408K3056l876k1601n270J9637
7785i06501j6209k6838k6164J5956l145O406o752K9639M751K0771j3174k3148
7773i44408L2203j5887K692j3760j5816j1763k4935p731J9142M198J4313L541
7761i58211n553J8536K5142K727K3766k1187k7217J3185J903J1334l5526J0473
7749i40628L0078J0286m2536o003J0492j2005K4100j1949j3415m799N1662k1432
7737i26149J3427J3006K0627k6913l2624l1263L4158J8088J465q243L2894M650
7725h86877j8038j5950k3725M2104l0537P513J6611n882k127r734o51j852K9698
7712h99447J4129p067J7812j0252k6075k5167K237r916K2382q989k6774J7466
$$ plain form
7700 -939661 -926396 -897891 -859472 -880319 -914111 -913919 -883173 -916530 -945014 -964789 -930782 -905189
7688 -905189 -903647 -881313 -881711 -935761 -927132 -926720 -920831 -915825 -927276 -918829 -920014 -904056 -934144 -973629
7674 -973629 -956407 -948365 -939137 -893460 -891230 -915416 -940025 -943866 -925918 -909272 -903678 -956345 -947038
7661 -947038 -918868 -930163 -906196 -903829 -916451 -939258 -899436 -895125 -934257 -938544 -933916 -908269
7649 -908269 -911638 -921661 -958037 -962640 -968847 -975492 -985369 -958603 -952532 -950477 -927585 -959069 -985470
7636 -985470 -991689 -971501 -1002191 -980957 -963372 -977985 -962577 -940200 -938344 -916622 -935179 -947151
7624 -947151 -964119 -973064 -957669 -924407 -933335 -959168 -920729 -896358 -896248 -892453 -893659 -897571 -932213
7611 -932213 -936759 -941101 -961329 -969581 -958347 -950259 -971740 -976206 -1004578 -994505 -988582 -969565 -961765
$$ packed form
7700i39661J3265K8505L8419k0847l3792J92L0746l3357k8484j9775L4007K5593
7688i05189J542K2334l98n4050Q629M12N889N006j1451Q447j185J5958l0088l9485
7674i73629J7222Q042R228M5677K230k4186k4609l841J7948J6646N594n2667R307
7661i47038K8170j1295K3967K367j2622k2807L9822M311l9132m287M628K5647
7649i08269l369j0023l6376m603o207o645r877K6766O071K055K2892l1484k6401
7636i85470o219K0188l0690K1234J7585j4613J5408K2377J856K1722j8557j1972
7624i47151j6968q945J5395L3262q928k5833L8439K4371J10L795j206l912l4642
7611i32213m546m342k0228q252J1234Q088k1481m466k8372J0073N923J9017P800
$$ plain form
7598 -961765 -916009 -893601 -906698 -938259 -953338 -924446 -921532 -926838 -937923 -946312 -949150 -947440 -977366
7585 -977366 -976999 -975233 -955676 -962349 -981879 -1013453 -995953 -981034 -983694 -982406 -979332 -976343 -968430
7572 -968430 -976879 -991599 -973575 -957530 -952058 -949001 -932030 -976789 -983045 -1031766 -994151 -963139
7560 -963139 -959331 -928987 -930867 -926197 -943706 -940277 -943287 -933921 -947944 -940621 -962102 -971655 -978512
7547 -978512 -973762 -938427 -945345 -939839 -946460 -942742 -935277 -949769 -929239 -899508 -911149 -947221 -952652
7534 -952652 -967799 -981522 -946083 -924375 -931051 -956471 -959832 -954508 -954216 -946600 -963743 -964055 -960472
7521 -960472 -962962 -979261 -975029 -970247 -971286 -964080 -940324 -941187 -946630 -966003 -989828 -977930 -971018
7508 -971018 -947308 -912493 -918173 -943865 -946098 -901476 -947549 -968722 -930458 -909374 -894107 -888159
$$ packed form
7598i61765M5756K2408j3097l1561j5079K8892K914n306j1085q389k838J710k9926
7585i77366L67J766J9557o673j9530l1574J7500J4919k660J288L074K989P913
7572i68430q449j4720J8024J6045N472L057J6971m4759o256m8721L7615L1012
7560i63139L808L0344j880M670j7509L429l010R366j4023P323k1481r553o857
7547i78512M750L5335o918N506o621L718P465j4492K0530K9731j1641l6072n431
7534i52652j5147j3723L5439K1708o676k5420l361N324K92P616j7143l12L583
7521i60472k490j6299M232M782j039P206K3756q63n443j9373k3825J1898O912
7508i71018K3710L4815n680k5692k233M4622m6073k1173L8264K1084J5267N948
$$ plain form
7496 -888159 -875445 -936039 -952945 -946928 -923521 -943042 -950526 -973383 -977848 -967203 -968654 -948689
7484 -948689 -969879 -965961 -970472 -936358 -927707 -959284 -938652 -923999 -935869 -952033 -977493 -951879
7472 -951879 -967559 -976982 -937406 -926364 -907954 -931950 -936131 -910476 -896696 -902156 -912245 -917921
7460 -917921 -921169 -919222 -901034 -939514 -944122 -933161 -942935 -951787 -952430 -944816 -937336 -983452 -1016450
7447 -1016450 -980781 -964440 -990593 -978701 -966937 -963171 -960673 -976311 -959629 -922256 -906068 -947886
7435 -947886 -963501 -985840 -996108 -958507 -993311 -974642 -958380 -935485 -924593 -934906 -937933 -932672
7423 -932672 -921946 -952862 -977943 -966014 -947805 -970027 -980897 -974041 -990837 -971078 -961659 -979840
7411 -979840 -967447 -955764 -960463 -957730 -973108 -958207 -938024 -956039 -955549 -968033 -954534 -981914
$$ packed form
7496h88159J2714o0594j6906O017K3407j9521p484k2857m465J0645j451J9965
7484i48689k1190L918m511L4114Q651l1577K0632J4653j1870j6164k5460K5614
7472i51879j5680r423L9576J1042J8410k3996m181K5655J3780n460j0089n676
7460i17921l248J947J8188l8480m608J0961r774q852o43P614P480m6116l2998
7447a016450L5669J6341k6153J1892J1764L766K498j5638J6682L7373J6188m1818
7435i47886j5615k2339j0268L7601l4804J8669J6262K2895J0892j0313l027N261
7423i32672J0726l0916k5081J1929J8209k2222j0870O856j6796J9759R419j8181
7411i79840J2393J1683m699K733j5378J4901K0183j8015M90j2484J3499k7380
$$ plain form
7399 -981914 -997998 -1003923 -984045 -983810 -982414 -972131 -937940 -970953 -958267 -948518 -948761 -961235 -976456
7386 -976456 -979784 -958042 -933619 -980389 -984766 -935057 -946069 -963054 -973108 -958826 -933611 -965347
7374 -965347 -973682 -959474 -976844 -1010573 -996590 -984588 -968273 -961880 -966994 -967538 -972620 -973850 -963923
7361 -963923 -950618 -980185 -986224 -957177 -929748 -910068 -912991 -939351 -977737 -963538 -965417 -976141
7349 -976141 -968662 -980539 -962169 -956738 -957095 -933522 -926461 -932386 -936078 -956619 -957912 -979846 -951170
7336 -951170 -964114 -964557 -951673 -972011 -940419 -958641 -968246 -965505 -957751 -994383 -977020 -950838 -988618
7323 -988618 -994793 -985189 -967941 -956532 -964669 -965901 -976531 -1004741 -1011568 -981336 -983411 -1016875 -977650
7310 -977650 -923095 -953569 -970626 -1002086 -983767 -942139 -931355 -956889 -957923 -983548 -971478 -1001157
$$ packed form
7399i81914j6084n925J9878K35J396J0283L4191l3013J2686R749k43j2474j5221
7386i76456l328K1742K4423m6770m377M9709j1012j6985j0054J4282K5215l1736
7374i65347q335J4208j7370l3729J3983J2002J6315O393n114n44n082j230R927
7361i63923J3305k9567o039K9047K7429J9680k923k6360l8386J4199j879j0724
7349i76141P479j1877J8370N431l57K3573P061n925l692k0541j293k1934K8676
7336i51170j2944m43J2884k0338L1592j8222r605K741P754l6632J7363K6182l7780
7323i88618o175R604J7248J1409q137j232j0630k8210o827L0232k075l3464L9225
7310i77650N4555l0474j7057l1460J8319M1628J0784k5534j034k5625J2070k9679
$$ plain form
7298 -1001157 -1019985 -989343 -986501 -966868 -960795 -969497 -1009184 -1000047 -973613 -983133 -989851 -990771 -981998
7285 -981998 -957028 -955667 -962921 -938517 -975575 -974080 -955432 -950113 -946456 -961678 -970634 -966083 -974654
7272 -974654 -950346 -959694 -986692 -973762 -928707 -915845 -950482 -963136 -970613 -945237 -966476 -968204
7260 -968204 -965353 -1000459 -995278 -974230 -996264 -1002634 -999385 -975285 -958817 -958265 -974901 -957020 -969558
7247 -969558 -985410 -992288 -962046 -952399 -945496 -943784 -976412 -972432 -953202 -960955 -960147 -956893 -959382 -995882
7233 -995882 -1024187 -982318 -941957 -948924 -922546 -909188 -943312 -977052 -978625 -969385 -953078 -896283
7221 -896283 -924724 -913402 -884565 -878711 -885771 -874918 -868080 -848932 -791882 -780470 -755558 -743192
7209 -743192 -781209 -786718 -791576 -771814 -750506 -741638 -743177 -727933 -690845 -686490 -654090 -610860 -601533
$$ packed form
7298a001157j8828L0642K842J9633O073q702l9687R137K6434r520o718r20Q773
7285i81998K4970J361p254K4404l7058J495J8648N319L657j5222q956M551q571
7272i74654K4308r348k6998J2930M5055J2862l4637j2654p477K5376k1239j728
7260i68204K851l5106N181K1048k2034o370L249K4100J6468N52j6636J7881j2538
7247i69558j5852o878L0242R647O903J712l2628L980J9230p753Q08L254k489l6500
7233i95882k8305M1869M0361o967K6378J3358l4124l3740j573R240J6307N6795
7221h96283k8441J1322K8837N854p060J0853O838J9148N7050J1412K4912J2366
7209g43192l8017n509m858J9762K1308Q868j539J5244L7088M355L2400M3230R327
$$ plain form
7196 -601533 -567213 -543130 -569293 -587425 -634001 -647458 -643569 -645177 -673899 -689120 -694779 -696302
7184 -696302 -704757 -710090 -704685 -722117 -729278 -709373 -743911 -756701 -781729 -789979 -800141 -827725 -854767
7171 -854767 -887549 -868445 -846325 -886882 -903385 -878408 -866182 -869591 -881118 -917082 -910424 -910553
7159 -910553 -914795 -900623 -904259 -908691 -920029 -951584 -964935 -931893 -944767 -942513 -924494 -918575 -940492
7146 -940492 -952288 -945961 -927308 -911879 -884010 -915322 -928567 -895131 -881222 -914717 -926089 -962775
7134 -962775 -954775 -934762 -910186 -898803 -925740 -892585 -909627 -923451 -890203 -862888 -860338 -846539
7122 -846539 -846573 -821889 -811185 -844244 -837088 -846264 -842039 -840282 -809022 -772859 -772352 -803733 -747377
7109 -747377 -738695 -769301 -763163 -777339 -754313 -738015 -725250 -695801 -696641 -716131 -726600 -720437 -724822
$$ packed form
7196f01533L4320K4083k6163j8132m6576j3457L889j608k8722j5221n659j523
7184f96302q455n333N405j7432p161J9905l4538j2790k5028q250j0162k7584k7042
7171h54767l2782J9104K2120m0557j6503K4977J2226l409j1527l5964O658j29
7159i10553m242J4172l636m432j1338l1555j3351L3042j2874K254J8019N919k1917
7146i40492j1796O327J8653J5429K7869l1312j3245L3436J3909l3495j1372l6686
7134i62775Q000K0013K4576J1383k6937L3155j7042j3824L3248K7315K550J3799
7122h46539l4K4684J0704l3059P156r176M225J757L1260L6163N07l1381N6356
7109g47377Q682l0606O138j4176K3026J6298J2765K9449q40j9490j0469O163m385
$$ plain form
7096 -724822 -730758 -713071 -727754 -714508 -713745 -790859 -819434 -815904 -794941 -806473 -809622 -826825 -859488
7083 -859488 -879119 -875503 -823266 -858508 -880101 -894279 -885815 -867144 -876619 -900892 -946180 -906040
7071 -906040 -901355 -918283 -907362 -881190 -878408 -907051 -919816 -921950 -915642 -920567 -914291 -924397 -899645
7058 -899645 -912421 -917592 -942600 -957143 -967443 -974325 -971676 -964495 -945169 -945659 -964109 -934097 -923952
7045 -923952 -926243 -929597 -947399 -936265 -927220 -938556 -943239 -938633 -962114 -966996 -940240 -954293 -939532
7032 -939532 -913796 -916623 -907568 -918074 -940716 -964795 -1001917 -967190 -927718 -923528 -911750 -948795
7020 -948795 -960167 -934854 -906173 -912512 -908308 -925275 -942630 -913011 -912008 -917000 -888091 -896414 -901311
7007 -901311 -940572 -966726 -931566 -943671 -965957 -968505 -943654 -933661 -963973 -994546 -984963 -981568
$$ packed form
7096g24822n936J7687j4683J3246P63p7114k8575L530K0963j1532l149j7203l2663
7083h59488j9631L616N2237l5242k1593j4178Q464J8671r475k4273m5288M0140
7071i06040M685j6928J0921K6172K782k8643j2765k134O308m925O276j0106K4752
7058h99645j2776n171k5008j4543j0300o882K649P181J9326m90j8450L0012J0145
7045i23952k291l354j7802J1134R045j1336m683M606k3481m882K6756j4053J4761
7032i39532K5736k827R055j0506k2642k4079l7122L4727L9472M190J1778l7045
7020i48795j1372K5313K8681o339M204j6967j7355K9619J003m992K8909q323m897
7007i01311l9261k6154L5160j2105k2286k548K4851R993l0312l0573R583L395
$$ plain form
6995 -981568 -985942 -953359 -968003 -976792 -931858 -942376 -921579 -935641 -951841 -972973 -990719 -966449
6983 -966449 -936382 -965380 -1008352 -1005457 -1017898 -984312 -966330 -966017 -1005515 -1004898 -986329 -982156 -975600
6970 -975600 -954579 -962513 -960791 -973276 -990579 -961016 -937392 -945086 -953083 -967353 -970547 -951528 -938150
6957 -938150 -951406 -959994 -944039 -957418 -932084 -933002 -940259 -926098 -906809 -919990 -937056 -920082
6945 -920082 -906678 -918303 -896668 -900469 -905759 -908376 -916754 -899999 -922957 -933545 -926694 -956724 -930077
6932 -930077 -927748 -963996 -940001 -950557 -940525 -931795 -947818 -932375 -937990 -916529 -904408 -937319
6920 -937319 -920909 -933399 -940584 -933135 -943504 -955741 -952314 -915868 -917050 -968180 -956518 -967726
6908 -967726 -936826 -935324 -939295 -919858 -929316 -946917 -960757 -966635 -939635 -930769 -962096 -969865 -988452
$$ packed form
6995i81568m374L2583j4644q789M4934j0518K0797j4062j6200k1132j7746K4270
6983i66449L0067k8998m2972K895j2441L3586J7982L13l9498O17J8569M173O556
6970i75600K1021p934J722j2485j7303K9563K3624p694p997j4270l194J9019J3378
6957i38150j3256q588J5955j3379K5334r18p257J4161J9289j3181j7066J6974
6945i20082J3404j1625K1635l801n290k617q378J6755k2958j0588O851l0030K6647
6932i30077K329l6248K3995j0556J0032Q730j6023J5443n615K1461J2121l2911
6920i37319J6410j2490p185P449j0369j2237L427L6446j182n1130J1662j1208
6908i67726L0900J502l971J9437r458j7601j3840n878K7000Q866l1327p769j8587
$$ plain form
6895 -988452 -991595 -967496 -958056 -994939 -989549 -988529 -1001764 -1003494 -996336 -1015393 -1004306 -977136 -977184
6882 -977184 -944300 -940876 -971921 -1003748 -1004198 -1010736 -1042125 -1020050 -1009937 -997673 -968773 -980095
6870 -980095 -995791 -998594 -1009215 -1010822 -1040204 -1027281 -1002390 -1012171 -993544 -977462 -971997 -1003466
6858 -1003466 -1010909 -984693 -952109 -992361 -1033026 -1012517 -1014907 -1012984 -973788 -981632 -978598 -982072 -971584
6845 -971584 -996221 -977079 -956313 -968670 -992866 -987938 -971992 -1015756 -983050 -996060 -1028910 -1022594
6833 -1022594 -977693 -998704 -1023734 -1024971 -1012479 -1027459 -982758 -985576 -1006547 -1025764 -1014940 -1000994
6821 -1000994 -1013427 -992898 -982797 -956204 -960812 -990021 -997727 -991693 -998484 -1006767 -1000511 -998315 -994943
6808 -994943 -993673 -972697 -970817 -991934 -984183 -954170 -929628 -948420 -950172 -935916 -971854 -993328
$$ packed form
6895i88452l143K4099R440l6883N390J020j3235j730P158j9057J1087K7170m8
6882i77184L2884L424l1045l1827m50o538l1389K2075J0113J2264K8900j1322
6870i80095j5696k803j0621j607k9382J2923K4891r781J8627J6082N465l1469
6858a003466p443K6216L2584m0252m0665K0509k390J923L9196p844L034l474J0488
6845i71584k4637J9142K0766j2357k4196M928J5946m3764L2706j3010l2850O316
6833a022594M4901k1011k5030j237J2492j4980M4701k818k0971j9217J0824J3946
6821a000994j2433K0529J0101K6593m608k9209p706O034o791q283O256K196L372
6808i94943J270K0976J880k1117P751L0013K4542j8792j752J4256l5938k1474
$$ plain form
6796 -993328 -972547 -1017908 -1033800 -1000500 -1001139 -997556 -990394 -1004506 -1002144 -984156 -950480 -971767 -1000707
6783 -1000707 -981282 -971476 -995404 -985041 -992184 -980750 -972319 -975952 -965063 -966479 -979982 -958162
6771 -958162 -955197 -987764 -1002770 -990685 -957087 -931839 -920368 -921134 -949355 -967316 -960262 -953047 -1004973
6758 -1004973 -1016070 -979820 -980665 -975682 -994157 -960867 -997574 -1025877 -1000165 -999511 -1016617 -988973
6746 -988973 -985133 -965573 -964532 -965233 -949739 -986934 -1012484 -1006747 -990836 -994424 -1010313 -990014 -1016600
6733 -1016600 -991642 -963829 -955678 -961293 -971479 -959481 -974275 -969001 -961155 -985123 -969337 -935714
6721 -935714 -932412 -944873 -935988 -933895 -962309 -972153 -974720 -961101 -955822 -949131 -944187 -918423 -923871
6708 -923871 -945814 -939805 -918722 -944880 -945986 -946858 -926163 -957703 -954864 -968989 -974538 -961980 -947640
$$ packed form
6796i93328K0781m5361j5892L3300o39L583P162j4112K362J7988L3676k1287k8940
6783a000707J9425R806k3928J0363p143J1434Q431l633J0889j416j3503K1820
6771i58162K965l2567j5006J2085L3598K5248J1471p66k8221j7961P054P215n1926
6758a004973j1097L6250q45M983j8475L3290l6707k8303K5712O54j7106K7644
6746i88973L840J9560J041p01J5494l7195k5550N737J5911l588j5889K0299k6586
6733a016600K4958K7813Q151n615j0186J1998j4794N274P846k3968J5786L3623
6721i35714L302j2461Q885K093k8414r844k567J3619N279O691M944K5764n448
6708i23871k1943O009K1083k6158j106q72K0695l1540K839j4125n549J2558J4340
$$ plain form
6695 -947640 -944257 -951027 -969523 -975019 -992653 -978533 -947050 -920736 -955382 -952304 -900364 -918841
6683 -918841 -967131 -985940 -978321 -968441 -960439 -936511 -925588 -955641 -909176 -925541 -903988 -938099
6671 -938099 -946755 -926702 -936689 -938218 -969581 -955166 -969692 -977721 -945231 -942895 -953383 -954748 -966069
6658 -966069 -979596 -945335 -944878 -942751 -959913 -975035 -958665 -961607 -967793 -974410 -959762 -941294 -912250
6645 -912250 -902763 -905089 -897719 -939418 -957684 -932275 -925239 -920441 -942772 -920615 -900764 -902812 -911480
6632 -911480 -870638 -904179 -913318 -898072 -892300 -826195 -821683 -817603 -793497 -741612 -721801 -717094 -662924
6619 -662924 -614878 -607155 -658622 -721051 -723319 -756795 -791801 -778290 -771101 -749809 -725558 -692359
6607 -692359 -687047 -668189 -659981 -658005 -671361 -680454 -703273 -745713 -807233 -845384 -833452 -835984 -837178
$$ packed form
6695i47640L383o770j8496n496j7634J4120L1483K6314l4646L078N1940j8477
6683i18841m8290j8809P619R880Q002K3928J0923l0053M6465j6365K1553l4111
6671i38099q656K0053r987j529l1363J4415j4526q029L2490K336j0488j365j1321
6658i66069j3527L4261M57K127j7162j5122J6370k942o186o617J4648J8468K9044
6645i12250R487k326P370m1699j8266K5409P036M798k2331K2157J9851k048q668
6632i11480M0842l3541r139J5246N772O6105M512M080K4106N1885J9811M707N4170
6619f62924M8046P723n1467o2429k268l3476l5006J3511P189K1292K4251L3199
6607f92359N312J8858Q208J976j3356r093k2819m2440o1520l8151J1932k532j194
$$ plain form
6594 -837178 -886599 -875538 -858304 -883535 -910454 -910693 -878744 -896702 -901161 -898337 -902225 -849020 -840471
6581 -840471 -830342 -861986 -854370 -868682 -864158 -824776 -811026 -785355 -826398 -849454 -831757 -822862
6569 -822862 -827418 -833334 -788844 -746212 -670827 -634719 -569782 -581294 -582908 -554486 -620831 -628481
6557 -628481 -630915 -623904 -577503 -548318 -487509 -436337 -374246 -333395 -257219 -257344 -276142 -338206
6545 -338206 -389603 -407302 -421478 -455621 -488528 -462817 -457933 -450469 -386189 -366916 -408753 -431596
6533 -431596 -484421 -490666 -527336 -554091 -615982 -642232 -662271 -664753 -661229 -689491 -699154 -693784 -691552
6520 -691552 -701493 -682468 -679131 -686707 -671278 -690736 -731067 -733019 -698088 -701910 -691217 -701256 -670458
6507 -670458 -669590 -686721 -698939 -699720 -721673 -690239 -692607 -721586 -722571 -723126 -701649 -669235 -671874 -623420
$$ packed form
6594h37178m9421J1061J7234k5231k6919k39L1949j7958m459K824l888N3205Q549
6581h40471J0129l1644P616j4312M524L9382J3750K5671m1043k3056J7697Q895
6569h22862m556n916M4490M2632P5385L6108O4937j1512j614K8422o6345p650
6557f28481k434P011M6401K9185O0809N1172O2091M0851P6176j25j8798o2064
6545c38206n1397j7699j4176l4143l2907K5711M884P464O4280J9273m1837k2843
6533d31596n2825o245l6670k6755o1891k6250k0039k482L524k8262r663N370K232
6520f91552r941J9025L337p576J5429j9458m0331j952L4931l822J0693j0039L0798
6507f70458Q68j7131j2218p81k1953L1434k368k8979r85n55K1477L2414k639M8454
$$ plain form
6493 -623420 -578262 -522190 -482992 -448580 -418729 -434937 -479703 -469812 -480407 -476306 -489708 -486146
6481 -486146 -452124 -420941 -425512 -388606 -349879 -372701 -389343 -392254 -432139 -465946 -502182 -517891
6469 -517891 -494615 -483606 -493427 -534838 -512791 -505315 -544506 -583980 -584040 -579689 -602477 -597037 -565226
6456 -565226 -575898 -582459 -575463 -523261 -541730 -540018 -537710 -504324 -449119 -439891 -449541 -471293 -478196
6443 -478196 -477165 -473570 -458135 -460167 -511543 -533590 -467950 -427684 -422819 -461471 -455356 -440234 -450069
6430 -450069 -455260 -420248 -424841 -422312 -441581 -444374 -426493 -436192 -444048 -420999 -428426 -429075 -391020
6417 -391020 -354289 -346342 -325192 -341607 -327752 -319519 -353154 -362853 -346746 -362464 -386865 -373720
6405 -373720 -374155 -328448 -303398 -279375 -238014 -229702 -228598 -221238 -213691 -188567 -194912 -188090 -156763
$$ packed form
6493f23420M5158N6072L9198L4412K9851j6208m4766R891j0595M101j3402L562
6481d86146L4022L1183m571L6906L8727k2822j6642k911l9885l3807l6236j5709
6469e17891K3276J1009r821m1411K2047P476l9191l9474o0M351k2788N440L1811
6456e65226j0672o561O996N2202j8469J712K308L3386N5205R228r650k1752o903
6443d78196J031L595J5435k032n1376k2047O5640M0266M865l8652O115J5122r835
6430d50069n191L5012m593K529j9269k793J7881r699p856K3049p427o49L8055
6417c91020L6731P947K1150j6415J3855Q233l3635r699J6107j5718k4401J3145
6405c73720m35M5707K5050K4023M1361Q312J104P360P547K5124o345O822L1327
$$ plain form
6392 -156763 -164516 -121067 -100615 -48597 -9229 14559 14337 42311 38805 17341 49062 66493
6380 66493 103106 163420 207722 232899 271809 298596 326649 425427 494559 523696 596074 673884
6368 673884 722806 744798 792561 805217 822511 771842 755540 775117 782192 774986 823118 864049
6356 864049 935549 981756 1013811 1044470 1093082 1152831 1190624 1256665 1364182 1491598 1637094
6345 1637094 1823365 1946063 2051301 2140626 2165684 2220594 2257731 2330499 2444341 2565331
6335 2565331 2697417 2874207 3076623 3285358 3526683 3806489 4155319 4531178 4963442 5489464
6325 5489464 6047507 6678734 7378457 8213412 9170767 10255437 11713067 13648816 16426822
6316 16426822 20558606 26466234 33904207 41646609 47808105 50725618 49901125 46155692
$$ packed form
6392a56763p753M3449K0452N2018L9368K3788k22K7974l506k1464L1721J7431
6380F6493L6613O0314M4302K5177L8910K6787K8053R8778O9132K9137P2378P7810
6368F73884M8922K1992M7763J2656J7294n0669j6302J9577P075p206M8132M0931
6356H64049P1500M6207L2055L0659M8612N9749L7793O6041J07517J27416J45496
6345A637094J86271J22698J05238Q9325K5058N4910L7137P2768J13842J20990
6335B565331J32086J76790K02416K08735K41325K79806L48830L75859M32264N26022
6325E489464N58043O31227O99723Q34955R57355J084670J457630J935749K778006
6316A6426822M131784N907628P437973P742402O161496K917513q24493l745433
$$ plain form
6308 46155692 41046111 35932287 31671176 28675376 27128877 27245664 29401490 33845716
6300 33845716 40243917 47009884 51938574 53325899 50876452 45535500 38876064 32335261
6292 32335261 26626581 21961302 18304017 15454745 13219827 11451215 10061175 9015186
6284 9015186 8214308 7605727 7172058 6804822 6527054 6339583 6149913 5970710 5847847 5783886
6274 5783886 5743202 5718787 5756252 5827625 5851840 5912227 6025870 6119879 6273064 6493877 6711072
6263 6711072 6913434 7165461 7439762 7763396 8113671 8556447 9117316 9752333 10529014 11420539
6253 11420539 12467512 13635135 14990833 16533102 18320360 20536705 23512422 27759007
6245 27759007 34134119 43443564 55712460 69382752 81455050 88806357 89738800 84932880
$$ packed form
6308D6155692n109581n113824m261111k995800j546499J16787K155826M444226
6300C3845716O398201O765967M928690J387325k449447n340952o659436o540803
6292C2335261n708680m665279l657285k849272k234918j768612j390040j045989
6284I015186q00878o08581m33669l67236k77768j87471j89670j79203j22863o3961
6274E783886m0684k4415L7465P1373K4215O0387J13643R4009J53185K20813K17195
6263F711072K02362K52027K74301L23634L50275M42776N60869O35017P76681Q91525
6253A1420539J046973J167623J355698J542269J787258K216345K975717M246585
6245B7759007O375112R309445J2268896J3670292J2072298P351307R32443m805920
$$ plain form
6237 84932880 76704270 67542517 59382206 53180328 49362966 48261517 50407280 56283821
6229 56283821 65523330 76217382 85251129 89547017 87684754 80535440 70391091 59541118
6221 59541118 49540343 41131614 34291661 28819328 24462693 20957026 18172950 15927942
6213 15927942 14172463 12771284 11700094 10904724 10258008 9691452 9192988 8780968 8354004
6204 8354004 7968222 7594610 7311842 7015656 6743219 6508645 6279660 6076745 5852964 5646978
6194 5646978 5512820 5421754 5349474 5297585 5223429 5198652 5121846 5038316 4970802 4836073 4709657
6183 4709657 4619236 4439310 4320555 4244369 4177961 4094953 4025131 3944973 3867486 3814589 3736927
6172 3736927 3694318 3676791 3679921 3683032 3632000 3593517 3531574 3445658 3388908 3309935 3258489 3229799
$$ packed form
6237H4932880q228610r161753q160311o201878l817362j101449K145763N876541
6229E6283821R239509J0694052R033747M295888j862263p149314j0144349j0849973
6221E9541118j0000775q408729o839953n472333m356635l505667k784076k245008
6213A5927942j755479j401179j071190p95370o46716n66556m98464m12020m26964
6204H354004l85782l73612k82768k96186k72437k34574k28985k02915k23781k05986
6194E646978j34158r1066p2280n1889p4156k4777p6806q3530o7514j34729j26416
6183D709657r0421j79926j18755p6186o6408q3008o9822q0158p7487n2897p7662
6172C736927m2609j7527L130L111n1032l8483o1943q5916n6750p8973n1446k8690
$$ plain form
6160 3229799 3149470 3106351 3063968 3039273 3043357 3029494 3040013 3050252 3006076 2951164 2915754 2871878
6148 2871878 2852682 2809888 2788639 2767651 2729461 2713407 2664355 2640512 2605757 2557098 2512577
6137 2512577 2495583 2483362 2492778 2519851 2504771 2467754 2449226 2443940 2393882 2371716 2305364 2285415
6125 2285415 2202770 2210543 2176187 2157857 2149638 2150352 2152199 2148966 2152834 2180887 2178189 2186389 2181339
6112 2181339 2221357 2276314 2314040 2364157 2419023 2491014 2617070 2767232 2908336 3020033 3132320
6101 3132320 3245692 3372950 3462729 3595593 3692393 3766620 3847624 3920531 4020681 4088962 4188280
6090 4188280 4313811 4467542 4570461 4741997 4970581 5240343 5537826 5943095 6391064 6828796
6080 6828796 7327438 7905085 8472430 8998358 9514673 10023427 10567800 11195583 11865157 12697066
$$ packed form
6160C229799q0329m3119m2383k4695M084j3863J0519J0239m4176n4912l5410m3876
6148B871878j9196m2794k1249k0988l8190j6054m9052k3843l4755m8659m4521
6137B512577j6994j2221R416K7073j5080l7017j8528n286n0058k2166o6352j9949
6125B285415q2645P773l4356j8330q219P14J847l233L868K8053k698Q200n050
6112B181339M0018N4957L7726N0117N4866P1991J26056J50162J41104J11697J12287
6101C132320J13372J27258Q9779J32864R6800P4227Q1004P2907J00150O8281R9318
6090D188280J25531J53731J02919J71536K28584K69762K97483M05269M47969M37732
6080F828796M98642N77647N67345N25928N16315N08754N44373O27783O69574Q31909
$$ plain form
6070 12697066 13670200 14884824 16365711 18128518 20361622 23412023 27735263 34211049
6062 34211049 43618810 55838893 69000849 79667368 84670454 83038660 76097723 66443673
6054 66443673 56491911 47746650 40728249 35230791 31180924 28298026 26251309 25035488
6046 25035488 24542509 24711178 25555307 27222723 29988028 34439387 41534828 52048822
6038 52048822 65301277 78505624 87803501 90242109 85763656 76547896 65430829 54699443
6030 54699443 45393910 37882959 31946562 27283943 23595245 20704890 18467558 16752138
6022 16752138 15483125 14583032 14042477 13686764 13444499 13390230 13439789 13658318 13992135 14453617
6012 14453617 14947026 15349147 15565704 15631324 15441289 15113616 14785314 14443807 14143980 13951427
$$ packed form
6070A2697066R73134J214624J480887J762807K233104L050401M323240O475786
6062C4211049R407761J2220083J3161956J0666519N003086j631794o940937r654050
6054F6443673r951762q745261p018401n497458m049867k882898k046717j215821
6046B5035488m92979J68669Q44129J667416K765305M451359P095441J0513994
6038E2048822J3252455J3204347R297877K438608m478453r215760j1117067j0731386
6030E4699443r305533p510951n936397m662619l688698k890355k237332j715420
6022A6752138j269013r00093n40555l55713k42265n4269M9559K18529L33817M61482
6012A4453617M93409M02121K16557O5620j90035l27673l28302l41507k99827j92553
$$ plain form
6002 13951427 13864237 13910302 14083892 14330541 14770327 15341656 16065228 17026720 18388774 20385408
5992 20385408 23482546 28229160 35063874 43358816 51160802 56083369 56917330 54125777
5984 54125777 49230871 43866968 39146182 35477403 32733464 30721346 29138214 27772736
5976 27772736 26594998 25574053 24755139 24193737 24073336 24518326 25873154 28661365 33571415
5967 33571415 40636062 48671152 55298219 58342838 57053179 52372480 46089463 39622335
5959 39622335 33892697 29244318 25492460 22447302 19928010 17775914 15923418 14359458
5951 14359458 13003520 11868198 10865475 10019929 9291429 8625960 8037355 7489049 7030682
5942 7030682 6640140 6273939 5975502 5713911 5503310 5240849 5012649 4786252 4593553 4456086
$$ packed form
6002A3951427q7190M6065J73590K46649M39786N71329P23572R61492J362054J996634
5992B0385408L097138M746614O834714Q294942P801986M922567Q33961k791553
5984E4125777m894906n363903m720786l668779k743939k012118j583132j365478
5976B7772736j177738j020945q18914n61402j20401M44990J354828K788211M910050
5967C3571415P064647Q035090O627067L044619j289659m680699o283017o467128
5959C9622335n729638m648379l751858l045158k519292k152096j852496j563960
5951A4359458j355938j135322j002723q45546p28500o65469n88605n48306m58367
5942G030682l90542l66201k98437k61591k10601k62461k28200k26397j92699j37467
$$ plain form
5932 4456086 4328887 4227658 4159172 4107873 4008504 3906899 3794196 3681049 3550421 3425843
5922 3425843 3314659 3244118 3197038 3180006 3164692 3245957 3358907 3494440 3553374 3600410 3557918
5911 3557918 3402455 3228615 3021478 2800237 2583323 2411182 2243577 2082287 1956221 1890674
5901 1890674 1825392 1781387 1738923 1706939 1723147 1761597 1847701 1932300 1996438 1990934 1982769 2034276
5889 2034276 1960014 1866297 1821413 1712240 1587076 1484066 1370544 1287539 1190723 1092664 1026324
5878 1026324 888175 822913 796215 746931 671253 617433 573696 537921 493314 504091 457231
5867 457231 392033 339060 309824 280480 210015 195600 216973 182437 185450 162813 150523 131015
5855 131015 156784 130486 63751 40166 37352 59017 33341 24593 46040 49431 39557 31441 31988
$$ packed form
5932D456086j27199j01229o8486n1299r9369j01605j12703j13147j30628j24578
5922C425843j11184p0541m7080j7032j5314Q1265J12950J35533N8934M7036m2492
5911C557918j55463j73840k07137k21241k16914j72141j67605j61290j26066o5547
5901A890674o5282m4005m2464l1984J6208L8450Q6104Q4599O4138n504q165N1507
5889B034276p4262r3717m4884j09173j25164j03010j13522q3005r6816r8059o6340
5878A026324j38149o5262k6698m9284p5678n3820m3737l5775m4607J0777m6860
5867D57231o5198n2973k9236k9344p0465j4415K1373l4536L013k2637j2290j9508
5855A31015K5769k6298o6735k3585k814K1665k5676q748K1447L391r874q116N47
$$ plain form
5842 31988 70707 13458 -26273 -38949 -76180 -62191 -46442 -99746 -117829 -107447 -106810 -102393
5830 -102393 -114339 -107662 -102376 -63467 -57495 -55461 -16852 -215 -4526 12600 29904 -8589 -56682
5817 -56682 -88008 -70122 -98495 -125837 -171453 -199196 -187833 -201906 -228919 -202408 -206082 -200003
5805 -200003 -188789 -136554 -145277 -182844 -197111 -189034 -212108 -219301 -240061 -306760 -311408 -310839 -313694
5792 -313694 -324034 -319216 -290749 -279371 -286277 -291803 -259163 -226949 -241208 -214567 -225792 -242249
5780 -242249 -256896 -274596 -300248 -277873 -302737 -345881 -363766 -372516 -384104 -401485 -394712 -439052
5768 -439052 -477084 -497622 -473438 -493607 -469356 -456270 -409867 -438807 -522963 -480784 -442638 -451971
5756 -451971 -446381 -434234 -418544 -439041 -445086 -451643 -440402 -383587 -353633 -310333 -264721 -275656
$$ packed form
5842C1988L8719n7249l9731j2676l7231J3989J5749n3304j8083J0382O37M417
5830a02393j1946O677N286L8909N972K034L8609J6637m311J7126J7304l8493m8093
5817e6682l1326J7886k8373k7342m5616k7743J1363j4073k7013K6511l674O079
5805b00003J1214N2235q723l7567j4267Q077k3074p193k0760o6699m648N69k855
5792c13694j0340M818K8467J1378o906n526L2640L2214j4259K6641j1225j6457
5780b42249j4647j7700k5652K2375k4864m3144j7885q750j1588j7381O773m4340
5768d39052l8032k0538K4184k0169K4251J3086M6403k8940q4156M2179L8146r333
5756d51971N590J2147J5690k0497o045o557J1241N6815K9954M3300M5612j0935
$$ plain form
5744 -275656 -304938 -333023 -356512 -376448 -404098 -440166 -493092 -492441 -492488 -495845 -513339 -519884 -517390
5731 -517390 -490728 -491677 -467305 -448663 -435445 -380053 -359930 -343995 -302511 -289419 -283048 -323805
5719 -323805 -384021 -382380 -414674 -492417 -539033 -537623 -572181 -592084 -587332 -592040 -625653 -635047 -611058
5706 -611058 -609478 -601135 -612400 -624501 -632552 -629132 -622910 -619011 -619447 -602476 -606495 -625984 -644539
5693 -644539 -636257 -612542 -600365 -602771 -642583 -626635 -601141 -608690 -599093 -568324 -555194 -564328 -559056
5680 -559056 -556076 -535857 -527928 -472296 -420582 -338730 -281194 -269952 -258965 -251207 -271550 -276008
5668 -276008 -263269 -259024 -286971 -280755 -303074 -321669 -316636 -298763 -279485 -229729 -208703 -226393
5656 -226393 -212853 -165257 -106874 -82495 -44538 -28079 -65379 -79810 -135048 -197005 -228009 -230446
$$ packed form
5744b75656k9282k8085k3489j9936k7650l6068n2926O51m7l357j7494o545K494
5731e17390K6662r49K4372J8642J3218N5392K0123J5935M1484J3092O371m0757
5719c23805o0216J641l2294p7743m6616J410l4558j9903M752m708l3613r394K3989
5706f11058J580Q343j1265j2101q051L420O222L899m36J6971m019j9489j8555
5693f44539Q282K3715J2177k406l9812J5948K5494p549R597L0769J3130r134N272
5680e59056K980K0219P929N5632N1714Q1852N7536J1242J0987P758k0343m458
5668b76008J2739M245k7947O216k2319j8595N033J7873J9278M9756K1026j7690
5656b26393J3540M7596N8383K4379L7957J6459l7300j4431n5238o1957l1004k437
$$ plain form
5644 -230446 -251781 -288220 -302987 -336987 -355125 -391425 -356200 -366050 -392286 -368302 -354997 -368316
5632 -368316 -374496 -377132 -379561 -461956 -520476 -504731 -496088 -519373 -513191 -553996 -543428 -541660 -549787
5619 -549787 -526011 -495241 -512592 -571884 -598673 -608979 -634037 -659827 -669456 -613409 -646396 -667459
5607 -667459 -664303 -679304 -701853 -679811 -674454 -662608 -604628 -609959 -575414 -579416 -595377 -612696
5595 -612696 -599512 -590626 -614304 -640105 -638846 -654013 -663612 -681712 -706151 -676321 -683326 -691022 -709713
5582 -709713 -694473 -651574 -690323 -690380 -673867 -699879 -720024 -709816 -683769 -699203 -691798 -654462
5570 -654462 -658979 -656562 -679878 -688397 -690981 -680747 -678020 -664229 -658545 -667240 -670389 -679465 -664876
5557 -664876 -650454 -637979 -650286 -674613 -656064 -648160 -603078 -583254 -596434 -608830 -608213 -566432
$$ packed form
5644b30446k1335l6439j4767l4000j8138l6300L5225r850k6236K3984J3305j3319
5632c68316o180k636k429q2395n8520J5745Q643k3285O182m0805J0568J768q127
5619e49787K3776L0770j7351n9292k6789j0306k5058k5790r629N6047l2987k1063
5607f67459L156j5001k2549K2042N357J1846N7980n331L4545m002j5961j7319
5595f12696J3184Q886k3678k5801J259j5167r599j8100k4439K9830p005p696j8691
5582g09713J5240M2899l8749n7J6513k6012k0145J0208K6047j5434P405L7336
5570f54462m517K417k3316q519k584J0234K727J3791N684q695l149r076J4589
5557f64876J4422J2475j2307k4327J8549P904M5082J9824j3180j2396O17M1781
$$ plain form
5545 -566432 -596880 -583694 -576255 -591224 -561748 -568821 -551880 -592234 -588200 -567282 -561837 -575824
5533 -575824 -597359 -607514 -604546 -597149 -622337 -621083 -623343 -599448 -579355 -596993 -607545 -604235 -628430
5520 -628430 -646195 -616378 -593514 -626417 -632646 -665117 -674683 -654465 -650860 -673967 -672822 -623638
5508 -623638 -616447 -630493 -605590 -620528 -621806 -614810 -635583 -668307 -682501 -640280 -632465 -646159
5496 -646159 -690719 -667831 -657097 -660658 -639275 -645245 -669618 -643421 -646982 -657752 -655909 -665307 -692533
5483 -692533 -665283 -654084 -649480 -648561 -642415 -659612 -657072 -674489 -682921 -693877 -706619 -718574 -730921
5470 -730921 -666954 -662840 -659448 -698348 -706886 -716180 -722800 -692856 -665405 -671244 -671221 -648856 -655755 -696366
5456 -696366 -671553 -657897 -634976 -656070 -670953 -690376 -693144 -675603 -647987 -660435 -661819 -649779
$$ packed form
5545e66432l0448J3186P439j4969K9476p073J6941m0354M034K0918N445j3987
5533e75824k1535j0155K968P397k5188J254k260K3895K0093j7638j0552L310k4195
5520f28430j7765K9817K2864l2903o229l2471r566K0218L605k3107J145M9184
5508f23638P191j4046K4903j4938j278O996k0773l2724j4194M2221P815j3694
5496f46159m4560K2888J0734l561K1383n970k4373K6197l561j0770J843r398k7226
5483f92533K7250J1199M604R19O146j7197K540j7417q432j0956j2742j1955j2347
5470g30921O3967M114L392l8900q538r294o620K9944K7451n839K3K2365o899m0611
5456f96366K4813J3656K2921k1094j4883j9423k768J7541K7616j2448j384J2040
$$ plain form
5444 -649779 -671159 -662631 -670590 -686563 -663652 -659251 -668374 -649248 -627093 -605331 -602107 -638225 -627303
5431 -627303 -579543 -549616 -561171 -550941 -521059 -550932 -546859 -528806 -540931 -514757 -522640 -522212
5419 -522212 -497117 -496211 -474977 -453550 -444553 -439227 -429137 -410939 -453525 -449813 -375205 -384765 -393592
5406 -393592 -386966 -378277 -360035 -320746 -314935 -277385 -225466 -253226 -290490 -252922 -246860 -248960 -187782
5393 -187782 -153216 -127341 -118375 -108571 -84151 -70700 -15733 10792 27230 58824 88486 87100
5381 87100 90103 127844 153840 200307 234702 237328 271361 312264 368900 350024 360306 378801
5369 378801 388875 427678 465809 524169 534391 556064 572891 610398 628695 637594 669202 688046
5357 688046 733885 776028 811734 788539 762181 734880 765338 789474 822279 857975 833916 798552
$$ packed form
5444f49779k1380Q528p959j5973K2911M401r123J9126K2155K1762L224l6118J0922
5431f27303M7760K9927j1555J0230K9882k9873M073J8053j2125K6174p883M28
5419e22212K5095R06K1234K1427Q997N326J0090J8198m2586L712P4608r560q827
5406c93592O626Q689J8242L9289N811L7550N1919k7760l7264L7568O062k100O1178
5393a87782L4566K5875Q966R804K4420J3451N4967K6525J6438L1594K9662j386
5381H7100L003L7741K5996M6467L4395K626L4033M0903N6636j8876J0282J8495
5369C78801J0074L8803L8131N8360J0222K1673J6827L7507J8297Q899L1608J8844
5357F88046M5839M2143L5706k3195k6358k7301L0458K4136L2805L5696k4059l5364
$$ plain form
5345 798552 812442 841113 831206 841663 870305 877256 918536 954743 983891 1011953 999641 1024189
5333 1024189 1054712 1087879 1103401 1148092 1197555 1217885 1250995 1282850 1336070 1382706 1466588
5322 1466588 1506095 1547654 1597603 1627194 1702204 1775080 1837984 1907166 2002590 2149292 2278021
5311 2278021 2348109 2442554 2617682 2738115 2885602 3067721 3251053 3486121 3706202 3984443
5301 3984443 4283318 4573862 4904100 5273941 5653505 6095384 6655030 7359796 8191868 9470731
5291 9470731 11291159 13848504 17038363 20289519 22489476 23149784 22612870 21472612 20349910
5282 20349910 19693363 19700155 20611189 22623985 26086078 31036499 36830847 42143625 45955695
5273 45955695 47905878 48616673 49127272 49540172 49473211 49069673 49058230 49963717 51672539
$$ packed form
5345G98552J3890K8671r907J0457K8642O951M1280L6207K9148K8062j2312K4548
5333A024189L0523L3167J5522M4691M9463K0330L3110L1855N3220M6636Q3882
5322A466588L9507M1559M9949K9591P5010P2876O2904O9182R5424J46702J28729
5311B278021P0088R4445J75128J20433J47487J82119J83332K35068K20081K78241
5301C984443K98875K90544L30238L69841L79564M41879N59646P04766Q32072J278863
5291I470731J820428K557345L189859L251156K199957O60308n36914j140258j122702
5282B0349910o56547O792R11034K012796L462093M950421N794348N312778L812070
5273D5955695J950183P10795N10599M12900o6961m03538j1443R05487J708822
$$ plain form
5264 51672539 53612908 55451618 56787041 57308129 57800915 59129536 61456648 64398541
5256 64398541 67165976 69125419 70133466 70182540 68785647 66229642 63296851 61044415
5248 61044415 60267884 60361503 60124179 59415347 57938958 55399889 52670736 50570296 49289829
5239 49289829 48577861 48205712 48613510 49869829 51252357 51514715 49834679 45938367 40664789
5230 40664789 35169320 30188350 26148480 23202948 21280673 20417859 20740994 22066964
5222 22066964 23724596 24612241 24049535 22199364 19598220 16892100 14453093 12403192
5214 12403192 10767959 9457533 8397627 7504842 6798378 6267660 5813384 5432859 5152301
5205 5152301 4919393 4690969 4463048 4280444 4077475 3920050 3772003 3626196 3522111 3420707
$$ packed form
5264E1672539J940369J838710J335423N21088M92786J328621K327112K941893
5256F4398541K767435J959443J008047M9074j396893k556005k932791k252436
5248F1044415p76531R3619k37324p08832j476389k539069k729153k100440j280467
5239D9289829p11968l72149M07798J256319J382528K62358j680036l896312n273578
5230D0664789n495469m980970m039870k945532j922275q62814L23135J325970
5222B2066964J657632Q87645n62706j850171k601144k706120k439007k049901
5214A2403192j635233j310426j059906q92785p06464n30718m54276l80525k80558
5205E152301k32908k28424k27921j82604k02969j57425j48047j45807j04085j01404
$$ plain form
5195 3420707 3281521 3120532 2953052 2836101 2721686 2599552 2467987 2382890 2304825 2268954
5185 2268954 2227211 2156119 2076605 2030800 1967368 1926793 1874244 1815204 1765663 1704738 1663354
5174 1663354 1627658 1586752 1538006 1514341 1455456 1420841 1384185 1386123 1367121 1355283 1363857 1346502
5162 1346502 1355748 1359078 1391345 1387505 1379610 1397161 1396628 1418504 1392539 1379267 1417505 1416603 1411627
5149 1411627 1435452 1474461 1505169 1506596 1556914 1642579 1735949 1843169 1961734 2015469 2009320
5138 2009320 1988577 1966814 1914247 1866048 1848834 1872833 1873676 1862868 1917917 1959069 2022612 2129402
5126 2129402 2204886 2228264 2243340 2171558 2035010 1976157 1864824 1747099 1689936 1633737 1604016
5115 1604016 1574418 1540867 1550103 1610321 1673284 1724926 1753382 1786037 1809090 1829626 1812741 1829603
$$ packed form
5195C420707j39186j60989j67480j16951j14415j22134j31565q5097p8065l5871
5185B268954m1743p1092p9514m5805o3432m0575n2549n9040m9541o0925m1384
5174A663354l5696m0906m8746k3665n8885l4615l6656J938j9002j1838Q574j7355
5162A346502R246L330L2267l840p895J7551n33K1876k5965j3272L8238r02m976
5149A411627K3825L9009L0708J427N0318Q5665R3370J07220J18565N3735o149
5138B009320k0743k1763n2567m8199j7214K3999Q43j0808N5049M1152O3543J06790
5126B129402P5484K3378J5076p1782j36548n8853j11333j17725n7163n6199k9721
5115A604016k9598l3551R236O0218O2963N1642K8456L2655K3053K0536j6885J6862
$$ plain form
5103 1829603 1860462 1800722 1808686 1814196 1759267 1721712 1705748 1718603 1721389 1751316 1772992 1827374
5091 1827374 1926739 2090793 2231975 2310243 2313444 2274474 2193557 2099256 2014631 1933105 1911936
5080 1911936 1864275 1869013 1859483 1860449 1955559 2035857 2153793 2253850 2270980 2157700 2014440
5069 2014440 1899948 1772734 1660678 1538635 1406044 1318447 1276799 1268391 1234900 1169858 1141760
5058 1141760 1120406 1086317 1109538 1126505 1095032 1100194 1062559 1055222 1062869 1066098 1112670 1122718
5046 1122718 1136694 1175121 1164255 1174415 1185192 1162680 1172802 1142905 1147816 1157948 1183808 1168208
5034 1168208 1161739 1196424 1210412 1258218 1280208 1327081 1347007 1377251 1403724 1432112 1440727 1465384
5022 1465384 1502827 1518236 1562386 1589184 1573601 1603771 1627372 1656647 1713211 1771492 1780654 1782725
$$ packed form
5103A829603L0859n9740P964N510n4929l7555j5964J2855K786K9927K1676N4382
5091A827374R9365J64054J41182P8268L201l8970q0917r4301q4625q1526k1169
5080A911936m7661M738r530R66R5110Q0298J17936J00057J7130j13280j43260
5069B014440j14492j27214j12056j22043j32591q7597m1648q408l3491o5042k8098
5058A141760k1354l4089K3221J6967l1473N162l7635p337P647L229M6572J0048
5046A122718J3976L8427j0866J0160J0777k2512J0122k9897M911J0132K5860j5600
5034A168208o469L4685J3988M7806K1990M6873J9926L0244K6473K8388Q615K4657
5022A465384L7443J5409M4150K6798j5583L0170K3601K9275N6564N8281R162K071
$$ plain form
5010 1782725 1834608 1880914 1911559 1975715 2048286 2067096 2135447 2175967 2188676 2255005 2330998
4999 2330998 2423297 2482549 2533041 2650152 2791912 2952206 3064556 3170653 3289024 3353561
4989 3353561 3384301 3409044 3470334 3536982 3606669 3727596 3877481 4064693 4317113 4618927
4979 4618927 4877592 5038920 5121012 5196767 5271370 5276811 5297437 5369019 5406570 5429046 5425827
4968 5425827 5470864 5514031 5537695 5590448 5645110 5774983 5930521 6094866 6235688 6456695
4958 6456695 6686053 6901730 7105648 7299654 7495650 7645123 7731360 7758440 7726509 7640808
4948 7640808 7554309 7506879 7496476 7535990 7606987 7682290 7802062 7937319 8082639 8254509 8446154
4937 8446154 8657435 8852592 9093158 9319409 9532410 9784753 10072303 10363795 10649667 10951948
$$ packed form
5010A782725N1883M6306L0645O4156P2571J8810O8351M0520J2709O6329P5993
4999B330998R2299N9252N0492J17111J41760J60294J12350J06097J18371O4537
4989C353561L0740K4743O1290O6648O9687J20927J49885J87212K52420L01814
4979D618927K58665J61328Q2092P5755P4603N441K0626P1582L7551K2476l219
4968E425827M5037M3167K3664N2753N4662J29873J55538J64345J40822K21007
4958F456695K29358K15677K03918J94006J95996J49473Q6237K7080l1931q5701
4948G640808q6499m7430j0403L9514P0997P5303J19772J35257J45320J71870J91645
4937H446154K11281J95157K40566K26251K13001K52343K87550K91492K85872L02281
$$ plain form
4927 10951948 11257316 11514310 11733137 11913293 12129101 12435689 12776459 13124750 13554051
4918 13554051 14097797 14594667 15095975 15565792 16076529 16626417 17206876 17809164 18449092
4909 18449092 19138472 19945870 20807560 21714731 22723366 23837656 25058420 26336468 27787407
4900 27787407 29512916 31590015 34243127 37761947 42938500 51009988 63260253 78847821
4892 78847821 93550757 101564976 100843258 94050994 84497115 75512897 68614897 63822650
4884 63822650 61010002 59876052 60242954 61969369 65147441 70086973 77382571 88267536
4876 88267536 103940969 123769108 144864260 163879719 180550046 195097984 204772363
4869 204772363 206273845 199719218 188138255 174961358 163295825 154092857 147190028 142236734
$$ packed form
4927A0951948L05368K56994K18827J80156K15808L06588L40770L48291M29301
4918A3554051N43746M96870N01308M69817N10737N49888N80459O02288O39928
4909A8449092O89380Q07398Q61690R07171J008635J114290J220764J278048J450939
4900B7787407J725509K077099K653112L518820N176553Q071488J2250265J5587568
4892G8847821J4702936Q014219p21718o792264r553879q984218o898000m792247
4884F3822650k812648j133950L66902J726415L178072M939532P295598J0884965
4876H8267536J5673433J9828139K1095152J9015459J6670327J4547938R674379
4869B04772363J501482o554627j1580963j3176897j1665533r202968o902829m953294
$$ plain form
4861 142236734 138843196 136857636 136231388 137175988 140159839 146182675 156824940 173052794
4853 173052794 192805275 210695161 221705364 226252327 227699032 229527131 234118547 240879567
4845 240879567 248295863 254770492 259090945 260700410 259536788 255971032 250500338 243684413
4837 243684413 236175166 228272120 220265211 212316049 204786700 198167523 193116324 190093226
4829 190093226 189439726 191217920 195182818 200758916 207367144 214746635 222976873 232228172
4821 232228172 242482994 253197556 263415707 271980146 277550445 278952726 275690734 268003709
4813 268003709 256781027 243398609 229152796 215291303 202686211 191749491 182710897
4806 182710897 175498069 169885030 165710906 162729685 160877176 159809756 159325948 159160245
$$ packed form
4861A42236734l393538j985560o26248R44600K983851O022836J0642265J6227854
4853A73052794J9752481J7889886J1010203M546963J446705J828099M591416O761020
4845B40879567P416296O474629M320453J609465j163622l565756n470694o815925
4837B43684413p509247p903046q006909p949162p529349o619177n051199l023098
4829A90093226o53500J778194L964898N576098O608228P379491Q230238R251299
4821B32228172J0254822J0714562J0218151Q564439N570299J402281l261992p687025
4813B68003709j1222682j3382418j4245813j3861493j2605092j0936720r038594
4806A82710897p212828n613039m174124k981221j852509j067420m83808j65703
$$ plain form
4798 159160245 159003887 158650867 157949958 156764452 154908103 152197090 148296753 143010816
4790 143010816 136424056 129029536 121468828 114275050 107859878 102184259 97128049 92467791
4782 92467791 88210472 84401322 80996101 77982924 75267882 72769349 70363136 67926004
4774 67926004 65523829 63232073 61089802 58959505 56840983 54721307 52479259 50177466
4766 50177466 47917980 45764255 43735292 41867891 40235585 38836722 37626397 36731401
4758 36731401 36056315 35541859 35061952 34585032 34055155 33447411 32797465 32089217 31308319
4749 31308319 30527441 29738062 28911740 28008200 27106423 26158930 25111863 24138736 23139694
4740 23139694 22144061 21193839 20315311 19517618 18779998 18168877 17665720 17163127 16736499
$$ packed form
4798A59160245j56358l53020p00909j185506j856349k711013l900337n285937
4790A43010816o586760p394520p560708p193778o415172n675619n056210m660258
4782I2467791m257319l809150l405221l013177k715042k498533k406213k437132
4774F7926004k402175k291756k142271k130297k118522k119676k242048k301793
4766E0177466k259486k153725k028963j867401j632306j398863j210325q94996
4758C6731401o75086n14456m79907m76920n29877o07744o49946p08248p80898
4749C1308319p80878p89379q26322r03540r01777r47493j047067r73127r99042
4740B3139694r95633r50222q78528p97693p37620o11121n03157n02593m26628
$$ plain form
4731 16736499 16345108 15966351 15624166 15260181 14898883 14551898 14149141 13765626 13383405
4722 13383405 12996958 12636891 12299210 12066099 11837670 11575946 11333096 11112788 10895652
4713 10895652 10684567 10467873 10270374 10058988 9874147 9667038 9472815 9289182 9094223
4704 9094223 8948881 8818812 8738779 8680344 8586640 8499820 8401131 8297596 8138273 7983294
4694 7983294 7842826 7750749 7712623 7691544 7698310 7726732 7801891 7840989 7863668 7871766 7879086 7829825
4682 7829825 7718120 7651237 7587296 7508649 7369155 7232544 7146665 7075036 7017316 6951469 6929424
4671 6929424 6877931 6775010 6645421 6509682 6383114 6284021 6155673 6058740 5999625 6011768
4661 6011768 5993378 5993980 6000275 6004195 5972872 5935624 5825663 5742248 5712081 5712368 5771109 5778017 5792159
$$ packed form
4731A6736499l91391l78757l42185l63985l61298l46985m02757l83515l82221
4722A3383405l86447l60067l37681k33111k28429k61724k42850k20308k17136
4713A0895652k11085k16694j97499k11386j84841k07109j94223j83633j94959
4704I094223j45342j30069q0033n8435r3704q6820r8689j03535j59323j54979
4694G983294j40468r2077l8126k1079O766K8422P5159L9098K2679Q098P320m9261
4682G829825j11705o6883o3941p8647j39494j36611q5879p1629n7720o5847k2045
4671F929424n1493j02921j29589j35739j26568r9093j28348r6933n9115J2143
4661F011768j8390O02O295L920l1323l7248j09961q3415l0167K87N8741O908J4142
$$ plain form
4648 5792159 5746451 5694394 5672761 5651233 5599224 5613705 5629510 5727298 5812241 5908509 6000968
4637 6000968 6088578 6244443 6403047 6617881 6902765 7225021 7505293 7670832 7761184 7882629
4627 7882629 7982337 8106892 8389496 8772785 9271338 9849560 10412111 10960750 11484988 11909759
4617 11909759 12259895 12667070 13161474 13705095 14298667 14903126 15648960 16392391 17110112
4608 17110112 17835646 18568405 19429121 20607113 22182656 24421970 27544460 32114696 39202216
4599 39202216 50063077 64824012 80517384 91982730 95323025 91012570 82065319 72060780
4591 72060780 63757217 58173555 55919543 57773096 64583741 75820223 88077758 96135603
4583 96135603 96653627 90640087 81251869 72022453 65696804 63959157 67562577 75763776
$$ packed form
4648E792159m5708n2057k1633k1528n2009J4481J5805R7788Q4943R6268R2459
4637F000968Q7610J55865J58604K14834K84884L22256K80272J65539R0352J21445
4627G882629R9708J24555K82604L83289M98553N78222N62551N48639N24238M24771
4617A1909759L50136M07175M94404N43621N93572O04459P45834P43431P17721
4608A7110112P25534P32759Q60716J177992J575543K239314L122490M570236P087520
4599C9202216J0860861J4760935J5693372J1465346L340295m310455q947251j0004539
4591G2060780q303563n583662k254012J853553O810645J1236482J2257535Q057845
4583I6135603N18024o013540r388218r229416o325649j737647L603420Q201199
$$ plain form
4575 75763776 84992429 90346865 88997992 81985142 72208477 62573984 54940544 49959177
4567 49959177 48089616 50001313 56360785 66079077 75541127 80210059 77915590 70257313
4559 70257313 60065837 49913109 41254840 34223417 28654191 24250973 20788309 18064163
4551 18064163 15995408 14405902 13209080 12301702 11631144 11046259 10553466 10075304 9609311
4542 9609311 9218432 8853732 8512684 8177485 7886316 7697887 7516352 7291109 7082225 6862297
4532 6862297 6711058 6517509 6365114 6266346 6155640 6073139 6002583 5932638 5784382 5630648
4522 5630648 5448860 5259884 5095240 4912692 4751976 4591826 4440557 4369530 4338886 4243451
4512 4243451 4145198 4042774 3933743 3815682 3718728 3629978 3612507 3567412 3501592 3449519 3327838
$$ packed form
4575G5763776R228653N354436j348873p012850r776665r634493p633440m981367
4567D9959177j869561J911697O359472R718292R462050M668932k294469p658277
4559G0257313j0191476j0152728q658269p031423n569226m403218l462664k724146
4551A8064163k068755j589506j196822r07378o70558n84885m92793m78162m65993
4542I609311l90879l64700l41048l35199k91169j88429j81535k25243k08884k19928
4532F862297j51239j93549j52395r8768j10706q2501p0556o9945j48256j53734
4522E630648j81788j88976j64644j82548j60716j60150j51269p1027l0644r5435
4512D243451r8253j02424j09031j18061r6954q8750j7471m5095o5820n2073j21681
$$ plain form
4501 3327838 3289290 3201135 3134520 3019593 2931631 2874600 2818930 2765371 2760169 2805612 2871229
4490 2871229 2940357 2940266 2896264 2813676 2752213 2693735 2600653 2549020 2494900 2507500 2501343 2508464
4478 2508464 2596128 2647030 2713911 2885987 3164514 3672605 4453420 5236488 5674628 5587492
4468 5587492 5184197 4588792 3993627 3536410 3170008 2812163 2549702 2387385 2224050 2097214
4458 2097214 2024865 2002298 1990982 1971735 1992310 2058215 2090400 2132071 2142322 2093155 2033859
4447 2033859 1962936 1912807 1828376 1742398 1687632 1667427 1636767 1592803 1559668 1530687 1538608 1565102
4435 1565102 1572386 1580150 1573831 1610267 1621146 1617442 1634490 1623714 1637865 1652432 1639405 1640100 1620045
4422 1620045 1588984 1614313 1626083 1586903 1584906 1570686 1560361 1540626 1558899 1530142 1528603 1535084
$$ packed form
4501C327838l8548q8155o6615j14927q7962n7031n5670n3559n202M5443O5617
4490B871229O9128r1m4002q2588o1463n8478r3082n1633n4120J2600o157P121
4478B508464Q7664N0902O6881J72076K78527N08091P80815P83068M38140q7136
4468E587492m03295n95405n95165m57217l66402l57845k62461j62317j63335j26836
4458B097214p2349k2567j1316j9247K0575O5905L2185M1671J0251m9167n9296
4447B033859p0923n0129q4431q5978n4766k0205l0660m3964l3135k8981P921K6494
4435A565102P284P764o319L6436J0879l704J7048j0776J4151J4567j3027O95k0055
4422A620045l1061K5329J1770l9180j997j4220j0325j9735J8273k8757j539O481
$$ plain form
4410 1535084 1546323 1594601 1594344 1647021 1683551 1698535 1750938 1740932 1727267 1711047 1716956 1742038
4398 1742038 1739473 1762450 1790049 1737371 1754987 1784401 1814406 1834246 1814932 1822324 1847837 1880869
4386 1880869 1893382 1968501 2001394 2010599 2015400 1994264 2037310 2072179 2121812 2128593 2122488 2122597 2133794
4373 2133794 2148364 2087507 2072365 2032846 2044113 2016729 2048638 2065196 2121253 2152576 2161604 2190837
4361 2190837 2194269 2189202 2211431 2259226 2234713 2190343 2220662 2242516 2218640 2227771 2282235 2269340
4349 2269340 2222221 2246896 2296876 2314368 2348062 2457790 2578473 2769050 2979663 3122453
4339 3122453 3139738 3074360 2972677 2799988 2713246 2656711 2649996 2682458 2785513 2969020 3123275
4328 3123275 3278552 3339101 3302201 3209641 3082588 2989622 2977018 3028837 3141056 3301796 3429814
$$ packed form
4410A535084J1239M8278k57N2677L6530J4984N2403j0006j3665j6220N909K5082
4398A742038k565K2977K7599n2678J7616K9414L0005J9840j9314P392K5513L3032
4386A880869J2513P5119L2893R205M801k1136M3046L4869M9633O781o105J09J1197
4373B133794J4570o0857j5142l9519J1267k7384L1909J6558N6057L1323R028K9233
4361B190837L432n067K2229M7795k4513m4370L0319K1854k3876R131N4464j2895
4349B269340m7119K4675M9980J7492L3694J09728J20683J90577K10613J42790
4339C122453J7285o5378j01683j72689q6742n6535o715L2462J03055J83507J54255
4328C123275J55277O0549l6900r2560j27053r2966j2604N1819J12219J60740J28018
$$ plain form
4317 3429814 3455795 3412456 3296491 3186011 3085977 3007647 2998518 3029853 3038069 3157762 3336328
4306 3336328 3443484 3490964 3495238 3431094 3317771 3220244 3145017 3120394 3076519 3031246 3010272
4295 3010272 2964912 2977654 3006847 3041919 3023197 3038222 3094973 3095489 3119254 3169952 3169553 3192950
4283 3192950 3244527 3257044 3314174 3365784 3378544 3408004 3455580 3499745 3544935 3600777 3665176
4272 3665176 3730899 3805958 3816029 3838050 3918147 3989013 4070211 4158034 4241759 4348348 4398162
4261 4398162 4463027 4510615 4582330 4652966 4752553 4882082 4976523 5112511 5243932 5364250 5463612
4250 5463612 5566535 5684981 5802327 5903871 6034930 6198999 6344188 6512975 6699133 6901417
4240 6901417 7161991 7403308 7660067 7965927 8276337 8600601 9037033 9492434 9979343 10507151
$$ packed form
4317C429814K5981m3339j15965j10480j00034p8330r129L1335Q216J19693J78566
4306C336328J07156M7480M274o4144j13323r7527p5227k4623m3875m5273k0974
4295C010272m5360J2742K9193L5072j8722J5025N6751N16K3765N0698l99K3397
4283C192950N1577J2517N7130N1610J2760K9460M7576M4165M5190N5842O4399
4272C665176O5723P5059J0071K2021Q0097P0866Q1198Q7823Q3725J06589M9814
4261D398162O4865M7588P1715P0636R9587J29529R4441J35988J31421J20318R9362
4250E463612J02923J18446J17346J01544J31059J64069J45189J68787J86158K02284
4240F901417K60574K41317K56759L05860L10410L24264M36432M55401M86909N27808
$$ plain form
4230 10507151 11091088 11762008 12495017 13259905 14110986 15025214 15973465 16883222 17768672
4221 17768672 18609000 19321987 20090887 20900402 21714033 22628806 23567196 24428016 25227744
4212 25227744 25944434 26665040 27491155 28450655 29623539 31122499 32840387 34709221 36544445
4203 36544445 38161694 39444481 40410124 41228903 42045658 42903200 43869155 44912118 45973643
4194 45973643 46985396 47983749 49014630 50176948 51499565 52916764 54410753 55803809
4186 55803809 56983823 57968958 58893017 59983358 61631669 63976846 67245638 71314004
4178 71314004 75545355 79293182 81961136 83323569 83770391 83855814 84011112 84552114 85558621
4169 85558621 86854194 88331905 89896747 91390184 92698581 93721889 94320336 94600226
$$ packed form
4230A0507151N83937O70920P33009P64888Q51081R14228R48251R09757Q85450
4221A7768672Q40328P12987P68900Q09515Q13631R14773R38390Q60820P99728
4212B5227744P16690P20606Q26115R59500J172884J498960J717888J868834J835224
4203C6544445J617249J282787R65643Q18779Q16755Q57542R65955J042963J061525
4194D5973643J011753R98353J030881J162318J322617J417199J493989J393056
4186E5803809J180014R85135R24059J090341J648311K345177L268792M068366
4178G1314004M231351L747827K667954J362433M46822Q5423J55298N41002J006507
4169H5558621J295573J477711J564842J493437J308397J023308N98447K79890
$$ plain form
4161 94600226 94584303 94338987 93939736 93523750 93223398 93174612 93667173 94993419 97430256
4152 97430256 101199629 106243041 111982059 117705130 122717259 126938220 130713118 134525359
4144 134525359 138636623 142790218 146517493 149552303 152123903 154571182 156910426 158720009
4136 158720009 159559479 159411965 158421225 157090306 155936771 155364876 155588330 156447408 157631885
4127 157631885 158898489 159969751 160707752 161161798 161456117 161634910 161779339 162120472 163009323
4118 163009323 164862469 167899707 172123416 176956474 181360416 184373371 185466909 185042205
4110 185042205 183915139 182772453 181803708 180617610 178810690 176492257 174253821 172378961
4102 172378961 170596095 168071570 164274976 159276923 153624897 148095955 143176123 139145105
$$ packed form
4161I4600226j5923k45316l99251m15986l00352m8786M92561J326246K436837
4152I7430256L769373N043412N739018N723071N012129M220961L774898L812241
4144A34525359M111264M153595L727275L034810K571600K447279K339244J809583
4136A58720009Q39470j47514r90740j330919j153535n71895K23454Q59078J184477
4127A57631885J266604J071262P38001M54046K94319J78793J44429L41133Q88851
4118A63009323J853146L037238M223709M833058M403942L012955J093538m24704
4110A85042205j127066j142686r68745j186098j806920k318433k238436j874860
4102A72378961j782866k524525l796594m998053n652026n528942m919832m031018
$$ plain form
4094 139145105 136011837 133689442 131922636 130517675 129355832 128475944 127915042 127780644
4086 127780644 127889122 127735179 126875941 124939937 121998822 118482847 114668806 111013212
4078 111013212 107867823 105461811 103951612 103333081 103169005 102686384 101212250 98552238
4070 98552238 95002307 91026994 87231196 83795418 80792077 78152605 75726198 73462782
4062 73462782 71257035 69009375 66872391 64809863 62897939 61064703 59260862 57418309
4054 57418309 55604950 53881511 52325968 51010623 49912789 49018939 48165273 47279305 46237056
4045 46237056 44952426 43443760 41729422 39982144 38314549 36860422 35558546 34349887
4037 34349887 33213078 32101922 30972016 29751604 28569502 27405910 26350019 25389813
$$ packed form
4094A39145105l133268k322395j766806j404961j161843q79888n60902j34398
4086A27780644J08478j53943q59238j936004k941115l515975l814041l655594
4078A11013212l145389k406012j510199o18531j64076m82621j474134k660012
4070I8552238l549931l975313l795798l435778l003341k639472k426407k263416
4062G3462782k205747k247660k136984k062528j911924j833236j803841j842553
4054E7418309j813359j723439j555543j315345j097834q93850q53666q85968j042249
4045D6237056j284630j508666j714338j747278j667595j454127j301876j208659
4037C4349887j136809j111156j129906j220412j182102j163592j055891r60206
$$ plain form
4029 25389813 24496163 23691508 22853232 22004264 21126584 20197861 19297039 18433697 17574980
4020 17574980 16760000 16045059 15349662 14671891 14022600 13478118 12982645 12530525 12157115
4011 12157115 11826164 11539594 11288061 11099100 10925451 10831130 10753463 10745166 10868383 10971186
4001 10971186 11169324 11489091 11909570 12468759 13044463 13575729 13943234 14091234 13988864
3992 13988864 13709833 13269207 12590498 11880469 11118835 10352361 9643269 9012294 8449015
3983 8449015 7961754 7559874 7192125 6885982 6636509 6404581 6223665 6013314 5837793 5659533
3973 5659533 5456540 5310767 5178036 5036331 4912836 4813011 4707338 4622720 4551851 4475283
3963 4475283 4337460 4258048 4233717 4159469 4087466 4015697 3935596 3892375 3818937 3767237 3701145
$$ packed form
4029B5389813q93650q04655q38276q48968q77680r28723r00822q63342q58717
4020A7574980q14980p14941o95397o77771o49291n44482m95473m52120l73410
4011A2157115l30951k86570k51533j88961j73649r4321p7667q297J23217J02803
4001A0971186J98138L19767M20479N59189N75704N31266L67505J48000j02370
3992A3988864k79031m40626o78709p10029p61634p66474p09092o30975n63279
3983H449015m87261m01880l67749l06143k49473k31928j80916k10351j75521j78260
3973E659533k02993j45773j32731j41705j23495r9825j05673q4618p0869p6568
3963D475283j37823p9412k4331p4248p2003p1769q0101m3221p3438n1700o6092
$$ plain form
3952 3701145 3636930 3590994 3533557 3504351 3492282 3458089 3386329 3316660 3264048 3224427 3146188
3941 3146188 3120457 3080854 3018029 3012219 2969208 2892622 2866479 2837151 2803509 2785399 2760089 2736422
3929 2736422 2723254 2718145 2700532 2690976 2660523 2646534 2655612 2681682 2640271 2628661 2640979 2596600
3917 2596600 2588159 2587394 2572258 2558588 2540774 2539640 2535621 2539515 2566181 2587198 2612501 2607615 2630838
3904 2630838 2677601 2693713 2671946 2674991 2714174 2731403 2764111 2768679 2799292 2867841 2857660 2877498
3892 2877498 2906971 2973800 2952660 2922803 2910066 2880889 2862525 2857006 2845680 2837534 2830664 2793718
3880 2793718 2812763 2810165 2800211 2750244 2733074 2684587 2653084 2618171 2595563 2569672 2555676 2556215
3868 2556215 2532941 2529574 2515723 2478645 2457672 2404680 2336558 2273496 2263282 2281559 2213169 2166648
$$ packed form
3952C701145o4215m5936n7437k9206j2069l4193p1760o9669n2612l9621p8239
3941C146188k5731l9603o2825n810m3011p6586k6143k9328l3642j8110k5310k3667
3929B736422j3168n109j7613r556l0453j3989R078K6070m1411j1610J2318m4379
3917B596600q441p65j5136j3670j7814j134m019L894K6666K1017K5303m886K3223
3904B630838M6763J6112k1767L045L9183J7229L2708M568L0613O8549j0181J9838
3892B877498K9473O6829k1140k9857j2737k9177j8364n519j1326q146o870l6946
3880B793718J9045k598r954m9967j7170m8487l1503l4913k2608k5891j3996N39
3868B556215k3274l367j3851l7078k0973n2992o8122o3062j0214J8277o8390m6521
$$ plain form
3856 2166648 2136867 2138714 2137818 2118478 2098813 2080275 2050108 2010888 2024349 1991079 1976467 1972684
3844 1972684 1957960 1940948 1948594 1942416 1945443 1958427 1946643 1958444 1948724 1919510 1894152 1878991
3832 1878991 1862305 1885308 1882513 1881730 1893467 1932495 1952890 1992268 1978030 1977081 1997315 2024279
3820 2024279 2004219 1964032 1956896 1931054 1917869 1950826 1964261 1935378 1921645 1887165 1867647 1822831
3808 1822831 1798786 1825429 1822791 1813855 1795941 1775000 1762116 1733121 1694316 1685850 1697042 1710886
3796 1710886 1710284 1682000 1656143 1625395 1602764 1557304 1510363 1479366 1452268 1405181 1369476 1357183
3784 1357183 1345463 1344872 1296193 1278185 1234938 1195308 1220098 1178213 1180848 1203157 1186694 1193744
3772 1193744 1214230 1201102 1167845 1207680 1239006 1201263 1205712 1218521 1201666 1174601 1132343 1126280
$$ packed form
3856B166648k9781J847q96j9340j9665j8538l0167l9220J3461l3270j4612l783
3844A972684j4724j7012P646o178L027J2984j1784J1801r720k9214k5358j5161
3832A878991j6686K3003k795p83J1737L9028K0395L9378j4238r49K0234K6964
3820B024279k0060m0187p136k5842j3185L2957J3435k8883j3733l4480j9518m4816
3808A822831k4045K6643k638q936j7914k0941j2884k8995l8805q466J1192J3844
3796A710886o02k8284k5857l0748k2631m5460m6941l0997k7098m7087l5705j2293
3784A357183j1720n91m8679j8008m3247l9630K4790m1885K635K2309j6463P050
3772A193744K0486j3128l3257L9835L1326l7743M449J2809j6855k7065m2258o063
$$ plain form
3760 1126280 1125659 1139349 1167784 1168073 1143964 1168021 1188756 1188003 1213767 1190973 1190430 1185544 1193074
3747 1193074 1233370 1289722 1292619 1266579 1287457 1335258 1305841 1296242 1279538 1300731 1337808 1336024
3735 1336024 1324639 1303040 1288499 1291546 1285250 1300108 1303614 1315882 1320486 1287680 1275843 1314985
3723 1314985 1352721 1336470 1358771 1347250 1343122 1374392 1387401 1426341 1457091 1476228 1476949 1483468
3711 1483468 1499222 1510221 1544959 1601936 1619533 1649190 1719119 1780584 1835847 1909117 1936035
3700 1936035 1947640 2014246 2068863 2126064 2140430 2177006 2166639 2222171 2274260 2277333 2285577 2336200
3688 2336200 2371430 2448288 2564081 2686037 2786165 2861154 2959298 3072910 3212058 3320516
3678 3320516 3393988 3498556 3573454 3675753 3774818 3831879 3858796 3862895 3832659 3856093 3869728
$$ packed form
3760A126280o21J3690K8435K89k4109K4057K0735p53K5764k2794n43m886P530
3747A193074M0296N6352K897k6040K0878M7801k9417r599j6704K1193L7077j784
3735A336024j1385k1599j4541L047o296J4858L506J2268M604l2806j1837L9142
3723A314985L7736j6251K2301j1521m128L1270J3009L8940L0750J9137P21O519
3711A483468J5754J0999L4738N6977J7597K9657O9929O1465N5263P3270K6918
3700A936035J1605O6606N4617N7201J4366L6576j0367N5532N2089L073Q244N0623
3688B336200L5230P6858J15793J21956J00128P4989R8144J13612J39148J08458
3678C320516P3472J04568P4898J02299R9065N7061K6917M099l0236K3434J3635
$$ plain form
3667 3869728 3887336 3889931 3936475 4003058 4063212 4109771 4191870 4314253 4443674 4595708 4750564
3656 4750564 4937329 5106598 5312058 5532182 5806912 6059275 6294538 6473683 6628816 6798177
3646 6798177 6953093 7151164 7395541 7578662 7758181 7919675 8104523 8260988 8403127 8495337
3636 8495337 8600351 8713612 8865088 9028027 9180780 9401777 9670917 9983703 10373664 10769354
3626 10769354 11241266 11774962 12381212 12939481 13453466 13941389 14352147 14757476 15198782
3617 15198782 15726630 16286435 16891028 17614757 18482233 19503926 20770185 22264465 24115305
3608 24115305 26206055 28540140 30982240 33413379 35859152 38190956 40295958 41867668
3600 41867668 42659711 42669197 41923585 40488829 38566729 36380583 34067969 31815067 29827824
$$ packed form
3667C869728J7608K595M6544O6583O0154M6559Q2099J22383J29421J52034J54856
3656D750564J86765J69269K05460K20124K74730K52363K35263J79145J55133J69361
3646F798177J54916J98071K44377J83121J79519J61494J84848J56465J42139R2210
3636H495337J05014J13261J51476J62939J52753K20997K69140L12786L89961L95690
3626A0769354M71912N33696O06250N58269N13985M87923M10758M05329M41306
3617A5198782N27848N59805O04593P23729Q67476J021693J266259J494280J850840
3608B4115305K090750K334085K442100K431139K445773K331804K105002J571710
3600D1867668P92043R486p45612j434756j922100k186146k312614k252902j987243
$$ plain form
3591 29827824 28082945 26590389 25323250 24138221 22976563 21851881 20825698 19886484
3583 19886484 18930782 17956690 16963140 16007631 15034561 14109345 13240812 12421400 11647177
3574 11647177 10884123 10188813 9534914 8992759 8488360 8008282 7625373 7299552 7004128
3565 7004128 6749213 6526187 6304231 6133000 5939443 5730472 5536988 5382550 5197435 4996083
3555 4996083 4828479 4627268 4451260 4278598 4132283 4018075 3897497 3799027 3746627 3644788
3545 3644788 3563929 3498574 3473848 3457959 3417838 3405017 3412086 3431269 3387104 3314415 3275885 3221823
3533 3221823 3120355 2957394 2835287 2693077 2581663 2474694 2354749 2282774 2235880 2152898
3523 2152898 2139448 2129067 2116293 2161660 2187085 2187984 2200558 2206460 2203120 2186850 2095931 2025251
$$ packed form
3591B9827824j744879j492556j267139j185029j161658j124682j026183r39214
3583A9886484r55702r74092r93550r55509r73070r25216q68533q19412p74223
3574A1647177p63054o95310o53899n42155n04399m80078l82909l25821k95424
3565G004128k54915k23026k21956j71231j93557k08971j93484j54438j85115k01352
3555D996083j67604k01211j76008j72662j46315j14208j20578r8470n2400j01839
3545C644788q0859o5355k4726j5889m0121j2821P069J9183m4165p2689l8530n4062
3533C221823j01468j62961j22107j42210j11414j06969j19945p1975m6894q2982
3523B152898j3450j0381j2774M5367K5425Q99J2574N902l340j6270r0919p0680
$$ plain form
3511 2025251 1954660 1859907 1764769 1649083 1581575 1526989 1519461 1498724 1468648 1430551 1399123
3500 1399123 1392909 1359922 1347801 1299422 1252070 1233238 1197321 1150689 1156758 1157077 1126298 1106528
3488 1106528 1090551 1061002 1040107 1049535 1065570 1033444 1036190 1019109 1018416 1011158 995587 1029313
3476 1029313 1044930 1037571 1051277 1059359 1113730 1088993 1079152 1030114 944048 878621 842551 802032
3464 802032 805178 785388 753127 743104 735209 717764 736307 729709 712098 747107 771572 825656
3452 825656 831606 832266 786309 779774 750797 729069 689508 681355 683570 707953 712554 690204 664888
3439 664888 675349 700448 695751 674399 666730 671831 640476 600841 568720 559030 542022 562278
3427 562278 547135 520134 522238 575638 593794 577515 546775 586680 571981 581986 608484 590791
$$ packed form
3511B025251p0591r4753r5138j15686o7508n4586p528k0737l0076l8097l1428
3500A399123o214l2987j2121m8379m7352j8832l5917m6632O069L19l0779j9770
3488A106528j5977k9549k0895R428J6035l2126K746j7081o93p258j5571L3726
3476A029313J5617p359J3706Q082N4371k4737r841m9038q6066o5427l6070m0519
3464H02032L146j9790l2261j0023p895j7445J8543o598j7611L5009K4465N4084
3452H25656N950O60m5957o535k8977k1728l9561q153K215K4383M601k2350k5316
3439F64888J0461K5099m697k1352p669N101l1355l9635l2121r690j7008K0256
3427E62278j5143k7001K104N3400J8156j6279l0740L9905j4699J0005K6498j7693
$$ plain form
3415 590791 593533 563330 561053 570333 546380 525850 531774 522302 502028 478569 508953 542214 536109
3402 536109 538529 576620 563768 605876 674579 722095 700830 743018 796365 871506 925029 910586
3390 910586 905248 912432 895765 897137 847223 776609 765054 779522 801655 816254 825747 833019 870309
3377 870309 880385 903452 915225 957657 999463 1015374 1032350 1056943 1062015 1047258 1051895 1063040
3365 1063040 1124364 1189693 1245253 1301059 1390334 1535176 1685949 1828547 1957028 2046773 2111150
3354 2111150 2123932 2078144 1977526 1896832 1811191 1689448 1577320 1522782 1593318 1611897 1629690
3343 1629690 1678516 1702622 1729633 1779270 1828884 1845422 1832736 1834170 1857329 1846944 1838686 1891154
3331 1891154 1922791 1920131 1866082 1861803 1874670 1907837 1960468 1999654 2091762 2225417 2327452
$$ packed form
3415E90791K742l0203k277R280k3953k0530N924r472k0274k3459L0384L3261o105
3402E36109K420L8091j2852M2108O8703M7516k1265M2188N3347P5141N3523j4443
3390I10586n338P184j6667J372m9914p0614j1555J4468K2133J4599R493P272L7290
3377H70309J0076K3067J1773M2432M1806J5911J6976K4593N072j4757M637J1145
3365A063040O1324O5329N5560N5806Q9275J44842J50773J42598J28481Q9745O4377
3354B111150J2782m5788j00618q0694q5641j21743j12128n4538P0536J8579J7793
3343A629690M8826K4106K7011M9637M9614J6538j2686J434K3159j0385q258N2468
3331A891154L1637k660n4049m279J2867L3167N2631L9186R2108J33655J02035
$$ plain form
3320 2327452 2431297 2505339 2535800 2586821 2571932 2547714 2547232 2548541 2579045 2641855 2720969 2791825
3308 2791825 2909014 3038821 3170013 3348877 3579286 3759991 3998070 4243862 4495014 4792380
3298 4792380 5089747 5436493 5853483 6366200 6939136 7540803 8230029 9007704 9837884 10642791
3288 10642791 11388379 11961869 12223604 12315595 12305652 12163528 12021446 11936543 11850980 11805183
3278 11805183 11769149 11751398 11689089 11701328 11765904 11867774 11995005 12132873 12313814 12513261
3268 12513261 12706697 12951075 13345390 13968909 14892468 16271234 18396324 21647235 25716745
3259 25716745 29422142 31103721 30406375 28120805 25031885 22001005 19336218 17066619
3251 17066619 15187706 13723594 12614400 11758094 11082866 10567367 10126262 9791015 9521041
$$ packed form
3320B327452J03845P4042L0461N1021j4889k4218m82J309L0504O2810P9114P0856
3308B791825J17189J29807J31192J78864K30409J80705K38079K45792K51152K97366
3298D792380K97367L46746M16990N12717N72936O01667O89226P77675Q30180Q04907
3288A0642791P45588N73490K61735R1991r943j42124j42082q4903q5563m5797
3278A1805183l6034j7751o2309J2239O4576J01870J27231J37868J80941J99447
3268A2513261J93436K44378L94315O23519R23559J378766K125090L250911M069510
3259B5716745L705397J681579o97346k285570l088920l030880k664787k269599
3251A7066619j878913j464112j109194q56306o75228n15499m41105l35247k69974
$$ plain form
3242 9521041 9322087 9226745 9139631 9153962 9219258 9312148 9361101 9502353 9717645 10051034 10536382
3231 10536382 11098971 11715603 12226282 12490256 12464120 12083128 11402817 10491102 9575649 8755111
3221 8755111 7934722 7231534 6557201 6013284 5561907 5170952 4841748 4582651 4290928 4008459
3211 4008459 3778629 3558392 3307503 3122033 2944989 2762185 2586125 2410126 2247489 2105558
3201 2105558 1992389 1879649 1772898 1653835 1576104 1492184 1430733 1360128 1270493 1194648 1155147
3190 1155147 1120121 1088196 1005682 977015 976930 890670 844223 812298 741007 693311 650113 594703
3178 594703 563851 531184 521454 493319 421599 400224 410369 401653 341105 303731 282508 255685
3166 255685 234213 234767 209188 198706 209229 173002 133659 96326 118013 79838 72018 69979
$$ packed form
3242I521041j98954r5342q7114J4331O5296R2890M8953J41252K15292L33389M85348
3231A0536382N62589O16632N10679K63974k6136l80992o80311r11715r15453q20538
3221H755111q20389p03188o74333n43917m51377l90955l29204k59097k91723k82469
3211D008459k29830k20237k50889j85470j77044j82804j76060j75999j62637j41931
3201B105558j13169j12740j06751j19063p7731q3920o1451p0605q9635p5845l9501
3190A155147l5026l1925q2514k8667q5q6260m6447l1925p1291m7696m3198n5410
3178E94703l0852l2667r730k8135p1720k1375J0145q716o0548l7374k1223k6823
3166B55685k1472N54k5579j0482J0523l6227l9343l7333K1687l8175p820k039
$$ plain form
3154 69979 81249 67219 -13391 -14256 -41545 -74329 -51512 -52541 -70517 -68529 -72295 -101790 -109007
3141 -109007 -131594 -171865 -147700 -121058 -157176 -174756 -167093 -191612 -195385 -208100 -220531 -228904
3129 -228904 -261866 -252162 -248153 -249525 -251212 -265059 -249175 -265910 -281230 -286002 -321968 -330787 -363429
3116 -363429 -362606 -360259 -361936 -368947 -362030 -357160 -407216 -400589 -409655 -398511 -358366 -369541 -358667
3103 -358667 -404525 -411004 -407829 -420501 -393694 -385216 -422497 -484655 -476615 -450361 -452364 -447968 -463461
3090 -463461 -469597 -472552 -444489 -455105 -467898 -493922 -525462 -496685 -495191 -500351 -475124 -446693
3078 -446693 -472466 -482890 -477534 -465832 -453967 -451548 -483644 -490222 -528652 -496554 -494369 -497089 -507539
3065 -507539 -488032 -516923 -526808 -489143 -499138 -508452 -511479 -528705 -528339 -524559 -523837 -524490 -532578 -540396
$$ packed form
3154F9979J1270j4030q0610q65k7289l2784K2817j029j7976J988l766k9495p217
3141a09007k2587m0271K4165K6642l6118j7580P663k4519l773j2715j2431q373
3129b28904l2962R704M009j372j687j3847J5884j6735j5320m772l5966q819l2642
3116c63429Q23K347j677p011O917M870n0056O627r066J1144M0145j1175J0874
3103c58667m5858o479L175j2672K6807Q478l7281o2158Q040K6254k003M396j5493
3090d63461o136k955K8063j0616j2793k6024l1540K8777J494n160K5227K8431
3078d46693k5773j0424N356J1702J1865K419l2096o578l8430L2098K185k720j0450
3065e07539J9507k8891r885L7665r995r314l027j7226L66L780P22o53q088p818
$$ plain form
3051 -540396 -526038 -514381 -512551 -497384 -517424 -513225 -504303 -497758 -494584 -532256 -503941 -465042 -481439
3038 -481439 -474854 -464928 -468113 -466236 -470523 -460952 -438699 -405118 -399187 -390976 -399162 -368317 -344049
3025 -344049 -308876 -299010 -317340 -274509 -257909 -239696 -256353 -228530 -178765 -185692 -211239 -180299
3013 -180299 -188104 -226904 -203548 -214009 -210863 -202239 -234934 -268589 -271353 -251212 -253831 -215060 -228970
3000 -228970 -232354 -244411 -244918 -230795 -214237 -196791 -173731 -169148 -108151 -110325 -68639 -39372 2085
2987 2085 61199 92562 101074 116408 171674 188405 183476 200676 159604 165804 188588 169479 169774
2974 169774 191063 178317 70838 16534 5278 -57147 -125332 -149992 -190761 -225244 -226591 -246230
2962 -246230 -246585 -250161 -286129 -260061 -205344 -190318 -196821 -154900 -120521 -61859 -18346 9580
$$ packed form
3051e40396J4358J1657J830J5167k0040M199Q922O545L174l7672K8315L8899j6397
3038d81439O585R926l185J877m287R571K2253L3581N931Q211q186L0845K4268
3025c44049L5173R866j8330M2831J6600J8213j6657K7823M9765o927k5547L0940
3013a80299p805l8800K3356j0461L146Q624l2695l3655k764K0141k619L8771j3910
3000b28970l384j2057n07J4123J6558J7446K3060M583O0997k174M1686K9267M1457
2987B085N9114L1363Q512J5334N5266J6731m929J7200m1072O200K2784j9109K95
2974A69774K1289j2746j07479n4304j1256o2425o8185k4660m0769l4483j347j9639
2962b46230l55l576l5968K6068N4717J5026o503M1921L4379N8662M3513K7926
$$ plain form
2950 9580 38783 65213 66966 62623 55552 41535 51721 27498 10901 -39065 -46435 -53985 -123171
2937 -123171 -212100 -246390 -269628 -317852 -349232 -411303 -446471 -434444 -430795 -453034 -476664 -506664
2925 -506664 -482859 -475220 -485363 -456098 -430906 -425615 -377297 -389663 -401548 -424133 -425027 -397074
2913 -397074 -409354 -426276 -460270 -479071 -439645 -444076 -465984 -486919 -511937 -523463 -530142 -545505
2901 -545505 -569614 -572416 -569815 -621385 -618998 -643586 -650611 -657409 -638495 -658767 -701303 -734002 -713507
2888 -713507 -696998 -684202 -664890 -681600 -687402 -677587 -695261 -668158 -667462 -702889 -680698 -655228
2876 -655228 -669883 -698144 -684239 -721235 -730737 -720225 -727239 -708535 -687708 -699784 -678129 -688791
2864 -688791 -727582 -729536 -708182 -684488 -691642 -729780 -744461 -725756 -740982 -723861 -717291 -707154
$$ packed form
2950I580K9203K6430J753m343p071j4017J0186k4223j6597m9966p370p550o9186
2937a23171q8929l4290k3238m8224l1380o2071l5168J2027L649k2239k3630l0000
2925e06664K3805P639j0143K9265K5192N291M8318j2366j1885k2585q94K7953
2913c97074j2280j6922l3994j8801L9426m431k1908k0935k5018j1526o679j5363
2901e45505k4109k802K601n1570K387k4588p025o798J8914k0272m2536l2699K0495
2888g13507J6509J2796J9312j6710n802R815j7674K7103O96l5427K2191K5470
2876f55228j4655k8261J3905l6996r502J0512p014J8704K0827j2076K1655j0662
2864f88791l8791j954K1354K3694p154l8138j4681J8705j5226J7121O570J0137
$$ plain form
2852 -707154 -715786 -717306 -679193 -732272 -751323 -777910 -738487 -713229 -695151 -730472 -762967 -760546
2840 -760546 -727710 -682390 -688060 -743658 -751731 -729045 -719892 -743040 -737127 -747484 -721023 -709235
2828 -709235 -751047 -779045 -745070 -725404 -701379 -707310 -703339 -704425 -733498 -719467 -742114 -750717
2816 -750717 -721565 -722145 -743597 -723960 -707240 -691264 -729462 -699483 -734250 -753332 -763057 -747668
2804 -747668 -742040 -751338 -709357 -740411 -746021 -729042 -743053 -739495 -752739 -763529 -739981 -743541 -747814
2791 -747814 -767327 -759090 -768269 -774405 -782149 -794566 -796442 -786259 -752936 -753289 -762233 -764011 -778624
2778 -778624 -761952 -775728 -774065 -732171 -738038 -751577 -779440 -793973 -757713 -761420 -735893 -720991
2766 -720991 -741721 -763348 -768934 -755694 -759947 -756808 -761221 -752639 -764100 -775941 -743485 -731855 -775977
$$ packed form
2852g07154q632j520L8113n3079j9051k6587L9423K5258J8078l5321l2495K421
2840g60546L2836M5320n670n5598q073K2686R153k3148N913j0357K6461J1788
2828g09235m1812k7998L3975J9666K4025n931L971j086k9073J4031k2647q603
2816g50717K9152n80k1452J9637J6720J5976l8198K9979l4767j9082r725J5389
2804g47668N628r298M1981l1054n610J6979j4011L558j3244j0790K3548l560m273
2791g47814j9513Q237r179o136p744j2417j876J0183L3323l53q944j778j4613
2778g78624J6672j3776J663M1894n867j3539k7863j4533L6260l707K5527J4902
2766g20991k0730k1627n586J3240m253L139m413Q582j1461j1841L2456J1630m4122
$$ plain form
2753 -775977 -762753 -768375 -758113 -736981 -732511 -721147 -720290 -727479 -723665 -724553 -705114 -710267 -709339 -740632
2739 -740632 -740135 -712126 -728639 -703393 -708923 -714371 -697749 -665785 -642909 -638853 -662481 -672564 -687026
2726 -687026 -731674 -745471 -757572 -758971 -761276 -741284 -712604 -720384 -741185 -767178 -769272 -755670
2714 -755670 -748614 -760129 -764446 -732031 -759302 -790587 -770478 -763667 -760324 -721112 -695365 -746066
2702 -746066 -767401 -773213 -817409 -820152 -771043 -764215 -787736 -775234 -744166 -756629 -737997 -731141
2690 -731141 -773473 -771819 -758389 -748695 -774949 -788289 -750769 -757432 -782031 -757244 -750471 -750101 -769740
2677 -769740 -766751 -764371 -766434 -774276 -759169 -764623 -754822 -743626 -755171 -764319 -792544 -759046 -788486
2664 -788486 -792818 -717206 -702847 -748977 -784141 -766418 -776147 -745318 -772315 -797759 -788667 -769221
$$ packed form
2753g75977J3224n622J0262K1132M470J1364Q57p189L814q88J9439n153R28l1293
2739g40632M97K8009j6513K5246n530n448J6622L1964K2876M056k3628j0083j4462
2726f87026m4648j3797j2101j399k305J9992K8680p780k0801k5993k094J3602
2714g55670P056j1515m317L2415k7271l1285K0109O811L343L9212K5747n0701
2702g46066k1335n812m4196k743M9109O828k3521J2502L1068j2463J8632O856
2690g31141m2332J654J3430R694k6254j3340L7520o663k4599K4787O773L70j9639
2677g69740K989K380k063p842J5107n454R801J1196j1545r148k8225L3498k9440
2664g88486m332P5612J4359m6130l5164J7723r729L0829k6997k5444R092J9446
$$ plain form
2652 -769221 -787891 -748485 -738777 -735077 -706879 -734409 -742630 -756264 -753024 -771102 -768554 -747229 -707993
2639 -707993 -737242 -745515 -756831 -769174 -759888 -737143 -731922 -766386 -783873 -752694 -726241 -723441
2627 -723441 -773438 -762933 -734777 -712169 -750203 -740724 -741522 -769463 -763730 -761168 -757135 -756877 -752799
2614 -752799 -745300 -754374 -725989 -743697 -750566 -717052 -735440 -720097 -718256 -736517 -749172 -731391
2602 -731391 -738355 -745689 -765776 -770176 -752042 -765166 -737378 -736371 -760955 -741275 -709162 -731919
2590 -731919 -698506 -704816 -755819 -720388 -739495 -743298 -731759 -699291 -729511 -710513 -667080 -670560
2578 -670560 -715837 -716586 -709999 -724144 -694489 -723125 -765066 -747121 -747776 -748410 -697483 -675461 -664607
2565 -664607 -664342 -662684 -664594 -679017 -715913 -710964 -677619 -691792 -693515 -698955 -686002 -698273 -724538
$$ packed form
2652g69221j8670L9406R708L700K8198k7530q221j3634L240j8078K548K1325L9236
2639g07993k9249q273j1316j2343R286K2745N221l4464j7487L1179K6453K800
2627g23441m9997J0505K8156K2608l8034R479p98k7941N733K562M033K58M078
2614g52799P499r074K8385j7708o869L3514j8388J5343J841j8261j2655J7781
2602g31391o964p334k0087m400J8134j3124K7788J007k4584J9680L2113k2757
2590g31919L3413o310n1003L5431j9107l803J1539L2468l0220J8998M3433l480
2578f70560m5277p49O587j4145K9655k8636m1941J7945o55o34N0927K2022J0854
2565f64607K65J658j910j4423l6896M949L3345j4173j723n440J2953j2271k6265
$$ plain form
2552 -724538 -708881 -703543 -697231 -694513 -681881 -690599 -675404 -673462 -704833 -718190 -728281 -712852 -708474
2539 -708474 -700462 -737681 -698819 -673360 -686835 -664251 -680563 -678752 -670135 -663000 -656461 -644916 -665951
2526 -665951 -658025 -682077 -635514 -601887 -614791 -593669 -593876 -622226 -607539 -577792 -580289 -607587
2514 -607587 -603664 -607258 -596301 -586145 -590111 -558571 -547680 -547410 -574867 -564724 -525756 -514332 -509717
2501 -509717 -557448 -551026 -505698 -501299 -519529 -491780 -471940 -437277 -404460 -361898 -306199 -301042
2489 -301042 -247313 -227482 -192367 -144399 -105021 -23920 68051 235447 394481 580266 736769
2478 736769 810088 911914 914106 995068 1069672 1263932 1530201 1924492 2446465 3378903 5082562
2467 5082562 8359568 12914817 17173123 18314618 16584915 13605528 10174826 7635123
$$ packed form
2552g24538J5657N338O312K718J2632q718J5195J942l1371j3357j0091J5429M378
2539g08474Q012l7219L8862K5459j3475K2584j6312J811Q617P135O539J1545k1035
2526f65951P926k4052M6563L3627j2904K1122k07k8350J4687K9747k497k7298
2514f07587L923l594J0957J0156l966L1540J0891K70k7457J0143L8968J1424M615
2501e09717m7731O422M5328M399j8230K7749J9840L4663L2817M2562N5699N157
2489c01042N3729J9831L5115M7968L9378Q1101R1971J67396J59034J85785J56503
2478G36769P3319J01826K192Q0962P4604J94260K66269L94291N21973R32438J703659
2467E082562L277006M555249M258306J141495j729703k979387l430702k539703
$$ plain form
2459 7635123 5706822 4238790 3092167 2251636 1594073 1164348 886752 724338 655331
2450 655331 640075 575284 473537 380339 252690 137045 81953 -15852 -51928 -120486 -201624
2439 -201624 -247783 -288326 -321113 -310182 -327459 -338393 -370668 -381192 -394136 -391758 -366507 -389206
2427 -389206 -444295 -427435 -426975 -463963 -501759 -499609 -505363 -571284 -568661 -527807 -509419 -552342 -559825
2414 -559825 -577093 -591671 -556859 -571665 -592513 -597844 -605611 -623330 -632616 -614847 -623505 -631057 -639978
2401 -639978 -626470 -659979 -660188 -666697 -657005 -652533 -675564 -672121 -656180 -679743 -693186 -685505 -679830
2388 -679830 -653579 -648145 -694836 -689049 -679638 -714134 -722827 -706286 -697841 -693471 -724672 -726691 -692623
2375 -692623 -713051 -735671 -713961 -716883 -715262 -719068 -744916 -724935 -735572 -729029 -741875 -775394
$$ packed form
2459G635123j928301j468032j146623q40531o57563m29725k77596j62414o9007
2450F55331j5256o4791j01747r3198j27649j15645n5092r7805l6076o8558q1138
2439b01624m6159m0543l2787J0931j7277j0934l2275j0524j2944K378K5251k2699
2427c89206n5089J6860M60l6988l7796K150n754o5921K623M0854J8388m2923p483
2414e59825j7268j4578L4812j4806k0848n331p767j7719r286J7769q658p552q921
2401f39978J3508l3509k09o509R692M472k3031L443J5941k3563j3443P681N675
2388f79830K6251N434m6691N787R411l4496q693J6541Q445M370l1201k019L4068
2375f92623k0428k2620K1710k922J621l806k5848J9981j0637O543j2846l3519
$$ plain form
2363 -775394 -761161 -732720 -742004 -733752 -746459 -778828 -754414 -769277 -735822 -684099 -693496 -732055
2351 -732055 -774097 -790238 -795455 -758632 -735051 -755095 -762784 -762870 -786309 -762134 -785803 -753672 -719572
2338 -719572 -741373 -797206 -783688 -777269 -763151 -768225 -755572 -734629 -764816 -776435 -755615 -717191
2326 -717191 -725605 -753301 -761550 -746206 -763680 -785626 -805813 -803846 -805803 -817837 -811604 -782640 -817742
2313 -817742 -803418 -781430 -784189 -770719 -802798 -788767 -786440 -762296 -758761 -776715 -779309 -781184 -783730
2300 -783730 -789681 -797745 -797772 -782600 -782197 -751319 -739980 -739422 -785173 -792774 -747781 -737498 -745968 -759909
2286 -759909 -777608 -818439 -822906 -784819 -770590 -776986 -789114 -767777 -772174 -797565 -806242 -810697 -819283
2273 -819283 -798570 -796542 -772637 -768327 -785129 -798097 -761648 -782294 -802680 -758428 -784363 -793145
$$ packed form
2363g75394J4233K8441r284Q252j2707l2369K4414j4863L3455N1723r397l8559
2351g32055m2042j6141n217L6823K3581k0044p689q6k3439K4175k3669L2131L4100
2338g19572k1801n5833J3518O419J4118n074J2653K0943l0187j1619K0820L8424
2326g17191q414k7696q249J5344j7474k1946k0187J967j957j2034O233K8964l5102
2313h17742J4324K1988k759J3470l2079J4031K327K4144L535j7954k594j875k546
2300g83730n951q064k7J5172M03L0878J1339N58m5751p601M4993J0283q470j3941
2286g59909j7699m0831m467L8087J4229o396j2128K1337m397k5391q677m455q586
2273h19283K0713K028K3905M310j6802j2968L6449k0646k0386M4252k5935q782
$$ plain form
2261 -793145 -757810 -783356 -821044 -828067 -788342 -755068 -751654 -759358 -747060 -759650 -758061 -769635
2249 -769635 -762012 -770502 -751163 -761125 -779643 -757301 -793926 -795681 -806978 -805822 -803820 -811113 -813395
2236 -813395 -802153 -773948 -775062 -784449 -763028 -760630 -803751 -796234 -780177 -810021 -800680 -785665 -774343
2223 -774343 -807181 -800392 -789570 -799549 -771087 -777731 -742764 -727798 -766307 -756954 -777639 -782648 -789126
2210 -789126 -801463 -774715 -768560 -751578 -752599 -756920 -752687 -768333 -781954 -772972 -732682 -721242 -714282
2197 -714282 -706573 -674545 -660519 -669735 -690910 -716975 -716899 -751442 -747327 -747442 -774821 -756162 -789034
2184 -789034 -779681 -790227 -801882 -828594 -770503 -779086 -790536 -755555 -775518 -794643 -769858 -751212
2172 -751212 -745040 -747747 -781979 -791125 -751523 -745950 -809934 -837570 -848942 -808214 -772764 -759542
$$ packed form
2261g93145L5335k5546l7688p023L9725L3274L414p704J2298j2590J589j1574
2249g69635P623q490J9339r962j8518K2342l6625j755j1297J156K002p293k282
2236h13395J1242K8205j114r387K1421K398m3121P517J6057k9844R341J5015J1322
2223g74343l2838O789J0822r979K8462o644L4967J4966l8509R353k0685n009o478
2210g89126j2337K6748O155J6982j021m321M233j5646j3621Q982M0290J1440O960
2197g14282P709L2028J4026r216k1175k6065P6l4543M115j15k7379J8659l2872
2184g89034R353j0546j1655k6712N8091q583j1450L4981j9963j9125K4785J8646
2172g51212O172k707l4232r146L9602N573o3984k7636j1372M0728L5450J3222
$$ plain form
2160 -759542 -777622 -776762 -764973 -772660 -777637 -765949 -781761 -825659 -852566 -841282 -811479 -833291
2148 -833291 -843724 -800852 -777734 -757166 -768740 -792084 -792083 -804023 -805217 -758535 -747370 -778885 -776496
2135 -776496 -789514 -810745 -806275 -779945 -780353 -776696 -783484 -780624 -760979 -768309 -750438 -751493 -772367
2122 -772367 -779364 -755899 -731188 -750566 -763855 -788790 -794240 -771078 -736227 -738777 -774540 -780772
2110 -780772 -761681 -747639 -787075 -777271 -786912 -785883 -744405 -782195 -781207 -787409 -771730 -777804 -766452
2097 -766452 -757725 -746247 -759217 -778751 -754374 -807966 -824330 -795556 -774483 -790741 -803387 -813845
2085 -813845 -802798 -815295 -793729 -794711 -819951 -816248 -807261 -796235 -796436 -799329 -802126 -808403 -799043 -808544
2071 -808544 -806840 -822152 -770398 -790865 -793468 -804169 -815345 -807168 -806370 -811831 -807937 -788822 -799851
$$ packed form
2160g59542j8080Q60J1789p687m977J1688j5812m3898k6907J1284K9803k1812
2148h33291j0433M2872K3118K0568j1574k3344Jj1940j194M6682J1165l1515K389
2135g76496j3018k1231M470K6330m08L657o788K860J9645p330J7871j055k0874
2122g72367o997K3465K4711j9378j3289k4935n450K3162L4851k550l5763o232
2110g80772J9091J4042l9436R804r641J029M1478l7790R88o202J5679o074J1352
2097g66452Q727J1478j2970j9534K4377n3592j6364K8774K1073j6258j2646j0458
2085h13845J1047j2497K1566r82k5240L703Q987J1026k01k893k797o277R360r501
2071h08544J704j5312N1754k0467k603j0701j1176Q177P98n461L894J9115j1029
$$ plain form
2058 -799851 -781589 -774782 -773854 -775147 -765448 -763597 -767643 -769979 -755168 -789184 -788143 -799064 -780582
2045 -780582 -773105 -764340 -774027 -772675 -776037 -794504 -804563 -804751 -809590 -817426 -811301 -821127 -820342 -816510
2031 -816510 -827437 -842750 -809738 -826645 -820277 -811446 -793581 -789531 -773912 -775180 -799370 -831933
2019 -831933 -821744 -816330 -828157 -810080 -775535 -818031 -811262 -799315 -783094 -777270 -759898 -744353
2007 -744353 -784050 -791854 -796417 -751031 -759029 -793587 -783105 -774317 -784545 -756808 -751557 -756640 -815721
1994 -815721 -795486 -790991 -807173 -763646 -796977 -789774 -791772 -813496 -819694 -828962 -825698 -816753 -800653
1981 -800653 -795351 -756950 -796660 -817517 -795639 -750545 -763654 -779879 -787608 -764718 -800713 -786160
1969 -786160 -788656 -808945 -802701 -802468 -791416 -788237 -797469 -790146 -778388 -802222 -797755 -774611 -785827
$$ packed form
2058g99851J8262O807R28j293R699J851m046k336J4811l4016J041j0921J8482
2045g80582P477Q765r687J352l362j8467j0059j88m839p836O125r826P85L832
2031h16510j0927j5313L3012j6907O368Q831J7865M050J5619j268k4190l2563
2019h31933J0189N414j1827J8077L4545m2496O769J1947J6221N824J7372J5545
2007g44353l9697p804m563M5386p998l4558J0482Q788j0228K7737N251n083n9081
1994h15721K0235M495j6182M3527l3331P203j998k1724o198r268L264Q945J6100
1981h00653N302L8401l9710k0857K1878M5094j3109j6225p729K2890l5995J4553
1969g86160k496k0289O244K33J1052L179r232P323J1758k3834M467K3144j1216
$$ plain form
1956 -785827 -770069 -784293 -773674 -762459 -784299 -772320 -789099 -808872 -824523 -821726 -837785 -841495
1944 -841495 -838186 -819001 -832957 -787000 -785053 -798428 -757050 -739631 -749744 -800152 -800169 -789331 -823063
1931 -823063 -793792 -804758 -838287 -800970 -797270 -798942 -809990 -837529 -823855 -830052 -800955 -775973
1919 -775973 -804968 -786341 -775160 -794151 -806648 -808325 -813189 -777512 -788590 -775461 -778627 -820793
1907 -820793 -789989 -820603 -790092 -800702 -789537 -767814 -777992 -762850 -804513 -803694 -787428 -798050
1895 -798050 -815282 -824174 -833149 -819903 -811713 -821840 -794684 -757680 -794773 -795800 -782662 -804529
1883 -804529 -825368 -810999 -792720 -798384 -775363 -795893 -813791 -801760 -770624 -752508 -768888 -794201
1871 -794201 -817737 -825039 -840058 -810431 -810459 -849825 -860475 -841418 -785445 -779511 -768429 -766168 -769179
$$ packed form
1956g85827J5758j4224J0619J1215k1840J1979j6779j9773j5651K797j6059l710
1944h41495L309J9185j3956M5957J947j3375M1378J7419j0113n0408j7J0838l3732
1931h23063K9271j0966l3529L7317L700j672j1048k7539J3674o197K9097K4982
1919g75973k8995J8627J1181j8991j2497j677m864L5677j1078J3129l166m2166
1907h20793L0804l0614L0511j0610J1165K1723j0178J5142m1663Q19J6266j0622
1895g98050j7232q892q975J3246Q190j0127K7156L7004l7093j027J3138k1867
1883h04529k0839J4369J8279n664K3021k0530j7898J2031L1136J8116j6380k5313
1871g94201k3536p302j5019K9627k8l9366j0650J9057N5973N934J1082K261l011
$$ plain form
1858 -769179 -783852 -805770 -809133 -803166 -781892 -766166 -791190 -798852 -799291 -803021 -839871 -832257 -813395
1845 -813395 -809797 -805790 -774922 -772885 -791709 -818083 -797340 -798241 -809943 -791689 -790201 -816129 -788302
1832 -788302 -814155 -815459 -810003 -814876 -856962 -826703 -756110 -802495 -811523 -772290 -739743 -768455
1820 -768455 -751984 -748957 -745284 -762427 -785221 -774549 -788777 -800757 -822865 -850227 -823984 -814911
1808 -814911 -805108 -795698 -777975 -769351 -780928 -807905 -788600 -790756 -808356 -801721 -786280 -803275 -797418
$$ packed form
1858g69179j4673k1918l363N967K1274J5726k5024p662m39l730l6850P614J8862
1845h13395L598M007L0868K037j8824k6374K0743r01j1702J8254J488k5928K7827
1832g88302k5853j304N456m873m2086L0259P0593m6385r028L9233L2547k8712
1820g68455J6471L027L673j7143k2794J0672j4228j1980k2108k7362K6243R073
1808h14911R803R410J7723Q624j1577k6977J9305k156j7600O635J5441j6995N857
$$ [...]
##END NTUPLES=NMR SPECTRUM
##END=
