##TITLE=1H_DE-80H_X3
 200.13MHz, d2o
 8 sc
 
 19ns.26.2.2025
##JCAMPDX= 6.0         $$ Bruker NMR JCAMP-DX V2.0
##DATA TYPE= NMR SPECTRUM
##DATA CLASS= NTUPLES
##ORIGIN= UXNMR, Bruker Analytische Messtechnik GmbH
##OWNER= pz
$$ XWIN-NMR		Version 3.5
$$ Fri Mar  6 11:16:31 2026 Russian Standard Time (UT+4h)  Yarkov@DPX200
##.OBSERVE FREQUENCY= 200.1313
##.OBSERVE NUCLEUS= ^1H
##.ACQUISITION MODE= SIMULTANEOUS
##.ACQUISITION SCHEME= undefined
##.AVERAGES= 8
##.DIGITISER RES= 18
##SPECTROMETER/DATA SYSTEM= spect
##.PULSE SEQUENCE= zg30
##.SOLVENT NAME= CDCl3
##.SHIFT REFERENCE= (INTERNAL, CDCl3, 0, 15.3502)
##AUDIT TRAIL= $$ (NUMBER, WHEN, WHO, WHERE, WHAT)
$$ ##TITLE= Audit trail, XWIN-NMR		Version 3.5
$$ ##JCAMPDX= 5.01
$$ ##ORIGIN= Bruker BioSpin GmbH
$$ ##OWNER= Yarkov
$$ C:/Bruker/XWIN-NMR/data/yarkov2/nmr/H-C/1/pdata/1/auditp.txt
$$ ##AUDIT TRAIL=  $$ (NUMBER, WHEN, WHO, WHERE, WHAT)
(   1,<2026-03-06 11:15:53.45 +0400>,<Yarkov>,<DPX200>,
      <created by zg, POWCHK disabled, PULCHK disabled
       configuration hash MD5:
       00 E9 B6 7A A2 85 ED C7 34 08 36 98 17 FE 4E 26
       data hash MD5: 16K
       86 A9 D1 2D 7A 37 18 5A 82 DB E2 F6 C9 7B B5 9A>)
(   2,<2026-03-06 11:15:59.29 +0400>,<Yarkov>,<DPX200>,
      <Start of raw data processing
       efp BC_mod = 2 LB = 0.25 FT_mod = 6 PKNL = 1 PHC0 = -5299.148 PHC1 = 6.821927 SI = 16K 
       data hash MD5: 16K
       85 C1 F8 B2 8C BA 3D 40 82 B2 67 6D 81 FD ED 9E>)
$$ ##END=
$$ 
$$ hash MD5
$$ 9C 66 06 07 0E 52 27 B4 B7 24 DA ED E0 6A AE 88
##$RELAX= 
##$RELAX= 
##$RELAX= 
##$RELAX= 
##$RELAX= 
##$RELAX= 
$$ Bruker specific parameters
$$ --------------------------
##$DU= <C:/Bruker/XWIN-NMR>
##$EXPNO= 1
##$NAME= <H-C>
##$PROCNO= 1
##$TYPE= <nmr>
##$USER= <yarkov2>
##$AMP= (0..31)
100 100 100 100 100 100 100 100 100 100 100 100 100 100 100 100 100 100 
100 100 100 100 100 100 100 100 100 100 100 100 100 100 
##$AQSEQ= 0
##$AQ_mod= 1
##$AUNM= <au_zg>
##$AUTOPOS= <>
##$BF1= 200.13
##$BF2= 200.13
##$BF3= 200.13
##$BF4= 200.13
##$BF5= 200.13
##$BF6= 200.13
##$BF7= 200.13
##$BF8= 200.13
##$BYTORDA= 1
##$CFDGTYP= 0
##$CFRGTYP= 5
##$CHEMSTR= <none>
##$CNST= (0..31)
1 1 145 1 1 1 1 1 1 1 1 1 1 1 1 1 1 1 1 1 1 1 1 1 1 1 1 1 1 1 1 1 
##$CPDPRG= <>
##$CPDPRG1= <>
##$CPDPRG2= <>
##$CPDPRG3= <>
##$CPDPRG4= <mlev>
##$CPDPRG5= <mlev>
##$CPDPRG6= <mlev>
##$CPDPRG7= <mlev>
##$CPDPRG8= <mlev>
##$CPDPRGB= <>
##$CPDPRGT= <>
##$D= (0..31)
0 0.7 0 0 0 0 0 0 0 0 0 0.03 0 0 0 0 0 0 0 0 0 0 0 0 0 0 0 0 0 0 0 0 
##$DATE= 1772781352
##$DBL= (0..7)
120 120 120 120 120 120 120 120 
##$DBP= (0..7)
150 150 150 150 150 150 150 150 
##$DBP07= 0
##$DBPNAM0= <>
##$DBPNAM1= <>
##$DBPNAM2= <>
##$DBPNAM3= <>
##$DBPNAM4= <>
##$DBPNAM5= <>
##$DBPNAM6= <>
##$DBPNAM7= <>
##$DBPOAL= (0..7)
0.5 0.5 0.5 0.5 0.5 0.5 0.5 0.5 
##$DBPOFFS= (0..7)
0 0 0 0 0 0 0 0 
##$DE= 6
##$DECBNUC= <off>
##$DECIM= 32
##$DECNUC= <off>
##$DECSTAT= 4
##$DIGMOD= 1
##$DIGTYP= 9
##$DL= (0..7)
0 120 120 120 120 120 120 120 
##$DP= (0..7)
$$ [...]
##$SUBNAM2= <"">
##$SUBNAM3= <"">
##$SUBNAM4= <"">
##$SUBNAM5= <"">
##$SUBNAM6= <"">
##$SUBNAM7= <"">
##$SUBNAM8= <"">
##$SUBNAM9= <"">
##$SW= 18.0517328524113
##$SWIBOX= (0..15)
0 0 2 0 0 0 0 0 0 0 0 0 0 0 0 0 
##$SW_h= 3612.71676300578
##$TD= 16384
##$TD0= 1
##$TE= 0
##$TE2= 300
##$TE3= 300
##$TEG= 300
##$TL= (0..7)
0 120 120 120 120 120 120 120 
##$TP= (0..7)
150 150 150 150 150 150 150 150 
##$TP07= 0
##$TPNAME0= <>
##$TPNAME1= <>
##$TPNAME2= <>
##$TPNAME3= <>
##$TPNAME4= <>
##$TPNAME5= <>
##$TPNAME6= <>
##$TPNAME7= <>
##$TPOAL= (0..7)
0.5 0.5 0.5 0.5 0.5 0.5 0.5 0.5 
##$TPOFFS= (0..7)
0 0 0 0 0 0 0 0 
##$TUNHIN= 0
##$TUNHOUT= 0
##$TUNXOUT= 0
##$USERA1= <user>
##$USERA2= <user>
##$USERA3= <user>
##$USERA4= <user>
##$USERA5= <user>
##$V9= 5
##$VALIST= <valist>
##$VCLIST= <CCCCCCCCCCCCCCC>
##$VD= 0
##$VDLIST= <DDDDDDDDDDDDDDD>
##$VPLIST= <PPPPPPPPPPPPPPP>
##$VTLIST= <TTTTTTTTTTTTTTT>
##$WBST= 1024
##$WBSW= 4
##$XGAIN= (0..3)
0 0 0 0 
##$XL= 0
##$YL= 0
##$YMAX_a= 782717
##$YMIN_a= -680673
##$ZGOPTNS= <>
##$ZL1= 120
##$ZL2= 120
##$ZL3= 120
##$ZL4= 120
##$ABSF1= 0
##$ABSF2= 0
##$ABSG= 0
##$ABSL= 0
##$ALPHA= 0
##$AQORDER= 0
##$ASSFAC= 0
##$ASSFACI= 0
##$ASSFACX= 0
##$ASSWID= 0
##$AUNMP= <proc_1d>
##$AZFE= 0.1
##$AZFW= 0.1
##$BCFW= 0
##$BC_mod= 2
##$BYTORDP= 0
##$COROFFS= 0
##$CY= -3
##$DATMOD= 1
##$DC= 0
##$DFILT= <>
##$DTYPP= 0
##$F1P= 0
##$F2P= 0
##$FCOR= 1
##$FTSIZE= 16384
##$FT_mod= 6
##$GAMMA= 0
##$GB= 0
##$INTBC= 1
##$INTSCL= 3.241238e-09
##$ISEN= 128
##$LB= 0.25
##$LEV0= 0
##$LPBIN= 0
##$MAXI= 10000
##$MC2= 0
##$MEAN= 0
##$ME_mod= 0
##$MI= 1.114404
##$NCOEF= 0
##$NC_proc= -6
##$NLEV= 6
##$NOISF1= 3.799351
##$NOISF2= 2.8
##$NSP= 0
##$NTH_PI= 0
##$NZP= 0
##$OFFSET= 15.35024
##$PC= 1
##$PHC0= -5299.148
##$PHC1= 6.821927
##$PH_mod= 1
##$PKNL= yes
##$PPARMOD= 0
##$PSCAL= 0
##$PSIGN= 0
##$REVERSE= no
##$SF= 200.130034313989
##$SI= 16384
##$SIGF1= 3
##$SIGF2= 2
##$SINO= 0.751879
##$SIOLD= 32768
##$SREGLST= <19F.Aceton>
##$SSB= 0
##$STSI= 16384
##$STSR= 0
##$SW_p= 3612.71676300578
##$SYMM= 0
##$S_DEV= 0
##$TDeff= 16384
##$TDoff= 0
##$TI= <>
##$TILT= no
##$TM1= 0
##$TM2= 0
##$TOPLEV= 0
##$USERP1= <user>
##$USERP2= <user>
##$USERP3= <user>
##$USERP4= <user>
##$USERP5= <user>
##$WDW= 1
##$XDIM= 16384
##$YMAX_p= 438759816
##$YMIN_p= -2257575
$$ End of Bruker specific parameters
$$ ---------------------------------
##NTUPLES= NMR SPECTRUM
##VAR_NAME=  FREQUENCY,     SPECTRUM/REAL,   SPECTRUM/IMAG
##SYMBOL=    X,             R,               I
##VAR_TYPE=  INDEPENDENT,   DEPENDENT,       DEPENDENT
##VAR_FORM=  AFFN,          ASDF,            ASDF
##VAR_DIM=   16384,         16384,           16384
##UNITS=     HZ,            ARBITRARY UNITS, ARBITRARY UNITS
##FACTOR=    0.220516191357247, 1,           1
##FIRST=     3072.04400864057, 0,            0
##LAST=      -540.672754365209, 0,           0
##MIN=       -540.672754365209, -2257575,    0
##MAX=       3072.04400864057, 438759816,    0
$$ Real data points
##PAGE= N=1
##DATA TABLE= (X++(R..R)), XYDATA
$$ [...]
7747a370983j4470l971k671J3492l3014j954J5J9379o5297j7034N5911m2455J3185
$$ -1370983 -1385453 -1389424 -1392095 -1378603 -1411617 -1413571 -1413556 -1394177 -1459474 -1476508 -1420597 -1463052 -1449867
7734a449867J959P185k0273L2276n8254M6798R9769m4689m0867L5247O1150N4096
$$ -1449867 -1447908 -1440723 -1460996 -1428720 -1486974 -1440176 -1340407 -1385096 -1425963 -1390716 -1329566 -1275470
7722a275470r4790M5203n2195r0472M559n4468j111Q6319K5470o1083J4976M0713
$$ -1275470 -1370260 -1325057 -1377252 -1467724 -1463165 -1517633 -1518744 -1432425 -1406955 -1468038 -1453062 -1412349
7710a412349j6753j0005L3458O4829k743l0236k8895k1386O1676n390m4450j6246
$$ -1412349 -1429102 -1439107 -1405649 -1340820 -1343563 -1373799 -1402694 -1424080 -1362404 -1367794 -1412244 -1428490
7698a428490L3190o04m0351M2971M4836k4035m2181r631M4733l8395m1248N3327
$$ -1428490 -1395300 -1395904 -1436255 -1393284 -1348448 -1372483 -1414664 -1424295 -1379562 -1417957 -1459205 -1405878
7686a405878N2986o6983j8489l3296L9309L6088N0481L219m8523K4626o2179n2472
$$ -1405878 -1352892 -1419875 -1438364 -1471660 -1432351 -1396263 -1345782 -1342563 -1391086 -1366460 -1428639 -1481111
7674a481111J9456O0645M5809m8086j9174m3399K1367N7931M5004o772J6520j9974
$$ -1481111 -1461655 -1401010 -1355201 -1403287 -1422461 -1465860 -1444493 -1386562 -1341558 -1348330 -1331810 -1351784
7662a351784k2734L5917J0189r404l5226m2838J7009l7856p742L935M861m0594
$$ -1351784 -1374518 -1338601 -1328412 -1337816 -1373042 -1415880 -1398871 -1436727 -1444469 -1440534 -1435673 -1476267
7650a476267k241J236J0366j0071N613O7133J8886l7220J7515Q0375o9350m2676
$$ -1476267 -1478508 -1477272 -1466906 -1476977 -1471364 -1404231 -1385345 -1422565 -1405050 -1324675 -1394025 -1436701
7638a436701q565O1916r303j3999P530j8823M6806j751l2611j3110J5893L6996
$$ -1436701 -1445266 -1383350 -1392653 -1406652 -1399122 -1417945 -1371139 -1372890 -1405501 -1418611 -1402718 -1365722
7626a365722L848n7728j4336O6905J6071l7688j9740l0189j9664R475j3695P1503
$$ -1365722 -1361874 -1419602 -1433938 -1367033 -1350962 -1388650 -1408390 -1438579 -1458243 -1448768 -1462463 -1390960
7614a390960j618M0901n2596q1475l6540J7957O4852n776O0847m916n0132l5213
$$ -1390960 -1392578 -1351677 -1404273 -1485748 -1522288 -1504331 -1439479 -1445255 -1384408 -1389324 -1439456 -1474669
7602a474669j2535N407j8398j1462j5693K7755N5699j418m0484M9677k542J0150
$$ -1474669 -1487204 -1481797 -1500195 -1511657 -1527350 -1499595 -1443896 -1445314 -1485798 -1436121 -1438663 -1428513
7590a428513l9574k5786j5292l0095M8126L6979L3719j6030m730l1412k0738p0234
$$ -1428513 -1468087 -1493873 -1509165 -1539260 -1491134 -1454155 -1420436 -1436466 -1441196 -1472608 -1493346 -1563580
7578a563580O3981K1693J8583p069k9990K3673l0301M6024J0236j4429k1143l9006
$$ -1563580 -1499599 -1477906 -1459323 -1466392 -1496382 -1472709 -1503010 -1456986 -1446750 -1461179 -1482322 -1521328
7566a521328J7249J8695M0046j2816L6877l2212Q944K3549p5980P9111k1115k5888
$$ -1521328 -1504079 -1485384 -1445338 -1458154 -1421277 -1453489 -1444545 -1420996 -1496976 -1417865 -1438980 -1464868
7554a464868j3680q3580O2423L9779J9673M1127l9421j03707k4774J12750k6423
$$ -1464868 -1478548 -1562128 -1499705 -1459926 -1440253 -1399126 -1438547 -1542254 -1567028 -1454278 -1480701
7543a480701m0154N9946L4920K6034L7795n4540k2409O204n8954o6076N3401J02773
$$ -1480701 -1520855 -1460909 -1425989 -1399955 -1362160 -1416700 -1439109 -1432905 -1491859 -1557935 -1504534 -1401761
7531a401761l6327j5766J9195k2118N0596k3517m6217M6039L6939K7731j00425
$$ -1401761 -1438088 -1453854 -1434659 -1456777 -1406181 -1429698 -1475915 -1429876 -1392937 -1365206 -1465631
7520a465631l291l1324n9627q276J9842K4838K6368J5624m7085M2176L2300k0777
$$ -1465631 -1468922 -1500246 -1559873 -1568149 -1548307 -1523469 -1497101 -1481477 -1528562 -1486386 -1454086 -1474863
7508a474863m6813k2618J1136k638M4846M2587M28l5392k8009q1956L6159K3789
$$ -1474863 -1521676 -1544294 -1533158 -1535796 -1490950 -1448363 -1447935 -1483327 -1511336 -1593292 -1557133 -1533344
7496a533344j5299P2284r245K0521N748m6832J6898Q043K7323j2672o825M4573
$$ -1533344 -1548643 -1476359 -1485604 -1465083 -1459335 -1506167 -1489269 -1481226 -1453903 -1466575 -1473400 -1428827
7484a428827k2699k735L7309J02997p3021k6924N398J814J4702j4177o4257o1071
$$ -1428827 -1451526 -1454261 -1416952 -1313955 -1386976 -1413900 -1408502 -1406688 -1391986 -1406163 -1470420 -1531491
7472a531491Q5578P4911L78K5766j3046O404o8767m0310j8108N5482k1942L4994
$$ -1531491 -1445913 -1371002 -1370624 -1344858 -1357904 -1351500 -1420267 -1460577 -1478685 -1423203 -1445145 -1410151
7460a410151m6747j6058L0903N4224k641m1500M6860j8781P5641M3579m9565p3830
$$ -1410151 -1456898 -1472956 -1442053 -1387829 -1390470 -1431970 -1385110 -1403891 -1328250 -1284671 -1334236 -1408066
7448a408066m9889L6612M5425k1458L9166J3073m3209J692n4320M0748O4147m290
$$ -1408066 -1457955 -1421343 -1375918 -1397376 -1358210 -1345137 -1388346 -1386654 -1440974 -1400226 -1336079 -1340369
7436a340369n280m1231l1702K759M4396k5555L534k6525Q2741l8365q1046p424
$$ -1340369 -1345649 -1386880 -1418582 -1415823 -1371427 -1396982 -1393448 -1419973 -1337232 -1375597 -1456643 -1464067
7424a464067N0085K2354j6321J7146l9049Q210N2728o368l3712M1059p6525n1603
$$ -1464067 -1413982 -1391628 -1407949 -1390803 -1429852 -1421642 -1368914 -1375282 -1408994 -1367935 -1444460 -1496063
7412a496063K5132o0036k3468M1940P8369m4978L3337j5094k3565L8182J8763
$$ -1496063 -1470931 -1530967 -1554435 -1512495 -1434126 -1479104 -1445767 -1460861 -1484426 -1446244 -1427481
7401a427481k0148O60l9101N876P6794p616N887l834l9396J0262P216J9236l4731
$$ -1427481 -1447629 -1446969 -1486070 -1480194 -1403400 -1411016 -1405129 -1408963 -1448359 -1438097 -1430881 -1411645 -1446376
7388a446376k7335R135O2813m1520n592M722m118J7254p729J5944J4933o4868
$$ -1446376 -1473711 -1464576 -1401763 -1443283 -1448875 -1444153 -1448271 -1431017 -1438746 -1422802 -1407869 -1472737
7376a472737J3326m9615j077K4281J1821j955m0704L3467m559l1246J21711M6318
$$ -1472737 -1459411 -1509026 -1510103 -1485822 -1474001 -1475956 -1516660 -1483193 -1487752 -1518998 -1397287 -1350969
7364a350969j00415r5601k2804M8696R82K3909j6306N832l5955m7301R813O7204
$$ -1350969 -1451384 -1546985 -1569789 -1521093 -1520111 -1496202 -1512508 -1506676 -1542631 -1589932 -1580119 -1512915
7352a512915R804j621K5020J0955m3643k0715K2466p413L5804q157l5583k0668
$$ -1512915 -1503111 -1504732 -1479712 -1468757 -1512400 -1533115 -1510649 -1518062 -1482258 -1490415 -1525998 -1546666
7340a546666Q3638K3145m7729q815k8969M8308J7138J8972l5956L6479j0419O965
$$ -1546666 -1463028 -1439883 -1487612 -1496427 -1525396 -1477088 -1459950 -1440978 -1476934 -1440455 -1450874 -1443909
7328a443909r650K3264J887Q150j9175K3162m9330m9090O9176J6056Q767k1883
$$ -1443909 -1453559 -1430295 -1428408 -1420258 -1439433 -1416271 -1465601 -1514691 -1445515 -1429459 -1420692 -1442575
7316a442575o8524N1631L9586Q614p446K0365r9391j2789K8389M5947k0566N83
$$ -1442575 -1511099 -1459468 -1419882 -1411268 -1418714 -1398349 -1497740 -1510529 -1482140 -1436193 -1456759 -1456176
7304a456176K4114R284M7893k4227n7832K7203L8413k4527K574K6728l5181l1582
$$ -1456176 -1432062 -1422778 -1374885 -1399112 -1456944 -1429741 -1391328 -1415855 -1413281 -1386553 -1421734 -1453316
7292a453316R437m497K749m8271Q6129N1049q3975L7194K9616n543l5541k6246
$$ -1453316 -1443879 -1448376 -1445627 -1493898 -1407769 -1356720 -1440695 -1403501 -1373885 -1379428 -1414969 -1441215
7280a441215j8415P530p038K650J29366n8227j40181k3280Q3096L7346L5792m0348
$$ -1441215 -1459630 -1452100 -1459138 -1456488 -1327122 -1385349 -1525530 -1548810 -1465714 -1428368 -1392576 -1432924
7268a432924l6873J4726L0399j1679o0687n3875K2132o308K4266K9100N2104m3009
$$ -1432924 -1469797 -1455071 -1424672 -1436351 -1497038 -1550913 -1528781 -1535089 -1510823 -1481723 -1429619 -1472628
7256a472628j7074P4854j7109J4775K9109M3353Q100j7896K700n5639j852O6083
$$ -1472628 -1489702 -1414848 -1431957 -1417182 -1388073 -1344720 -1336620 -1354516 -1351816 -1407455 -1409307 -1343224
7244a343224j4484o0607K2143o104K9666J6038q4323N1683L2060O5173N9368l6068
$$ -1343224 -1357708 -1418315 -1396172 -1402276 -1372610 -1356572 -1440895 -1389212 -1357152 -1291979 -1232611 -1268679
7232a268679M9381k9601o470M5577N3356K3496q3387j4496P2805M8874m3124r0467
$$ -1268679 -1219298 -1248899 -1255369 -1209792 -1156436 -1132940 -1216327 -1230823 -1158018 -1109144 -1152268 -1242735
7220a242735k499N7757N2652n126L1589K6588O763p0557N2833J1600P7955l0269
$$ -1242735 -1245234 -1187477 -1134825 -1139951 -1108362 -1081774 -1075011 -1145568 -1092735 -1081135 -1003180 -1033449
7208a033449n3698M0611m7017L5893j2697m2941l6735m683M2447L8081J341J1667
$$ -1033449 -1087147 -1046536 -1093553 -1057660 -1070357 -1113298 -1150033 -1154716 -1112269 -1074188 -1072847 -1061180
7196a061180J1773l0520r5179k4704N5474k8532j3160O075m1516j3658M4731r930
$$ -1061180 -1049407 -1079927 -1175106 -1199810 -1144336 -1172868 -1186028 -1179953 -1221469 -1235127 -1190396 -1200326
7184a200326k87l5589l3816j1696L5125J8934k2117L6475l2043m0431N6015K5598
$$ -1200326 -1200613 -1236202 -1270018 -1281714 -1246589 -1227655 -1249772 -1213297 -1245340 -1285771 -1229756 -1204158
7172a204158k1661l6569r8893l7152J4240l287j8871L8388K6522L8021K2250k2670
$$ -1204158 -1225819 -1262388 -1361281 -1398433 -1384193 -1387480 -1406351 -1367963 -1341441 -1303420 -1281170 -1303840
7160a303840k0027J8492K989M4008k9648q112J2594k347m4689P6398L4729J4509
$$ -1303840 -1323867 -1305375 -1302386 -1258378 -1288026 -1296138 -1283544 -1285891 -1330580 -1254182 -1219453 -1204944
7148a204944O4698R3967k7889n727o086j221N1217l1656J0487J8216K5435J05441
$$ -1204944 -1140246 -1046279 -1074168 -1079895 -1085981 -1087202 -1035985 -1067641 -1057154 -1038938 -1013503 -908062
7136i08062R8883j8234L8741L176k4981k8170N379Q4249m637k6991P8874O4821
$$ -908062 -809179 -827413 -788672 -785496 -810477 -838647 -833268 -749019 -753656 -780647 -701773 -636952
7124f36952N2991Q9415P3558j634Q938J4900j3394M86o272K8937n801l6439K8852
$$ -636952 -583961 -494546 -420988 -422622 -413684 -398784 -412178 -411692 -417964 -389027 -394828 -431267 -402415
7111d02415q7225p0237m5516m8273j225J032k9069m3567l2764m5270n9156j5400
$$ -402415 -489640 -559877 -605393 -653666 -654891 -653859 -682928 -726495 -759259 -804529 -863685 -879085
7099h79085j7835j47921L49l3564r3677M6395J4387o1785j8213L262O4683J8406
$$ -879085 -896920 -1044841 -1044492 -1078056 -1171733 -1125338 -1110951 -1172736 -1190949 -1187687 -1123004 -1104598
7087a104598k1703J3373j20612M5205j4346l6470P582M900P1681o7022r275k7082
$$ -1104598 -1126301 -1112928 -1233540 -1188335 -1202681 -1239151 -1231569 -1226669 -1154988 -1222010 -1231285 -1258367
7075a258367O841M5903L4664k201M3101l4319k4610J8740L504O5419k3238l588
$$ -1258367 -1251526 -1205623 -1170959 -1173160 -1130059 -1164378 -1188988 -1170248 -1166744 -1101325 -1124563 -1128151
7063a128151L805l5559l5389j931l0691M3548n151k5307Q8713n9868m7233K2688
$$ -1128151 -1124346 -1159905 -1195294 -1197225 -1227916 -1184368 -1189519 -1214826 -1126113 -1185981 -1233214 -1210526
7051a210526J5650P0225p218k5669j4108J1602L2569l0287k1075j5418M0517k5417
$$ -1210526 -1194876 -1124651 -1131869 -1157538 -1171646 -1160044 -1127475 -1157762 -1178837 -1194255 -1153738 -1179155
7039a179155L3679J4831Q034m7552L0024L0296M425Q9881m71J4517o8407q4744
$$ -1179155 -1145476 -1130645 -1122611 -1170163 -1140139 -1109843 -1105418 -1015537 -1016008 -1001491 -1069898 -1154642
7027a154642j7995N6246j6791M1823L6341P2842p1710O9563R6508N308N3915q7458
$$ -1154642 -1172637 -1116391 -1133182 -1091359 -1055018 -982176 -1053886 -984323 -887815 -882507 -828592 -916050
7015i16050N1074n284n933l5178L649j8995o5941P9402n6275m4759N1601M7099
$$ -916050 -864976 -870260 -876193 -911371 -907722 -926717 -992658 -913256 -969531 -1014290 -962689 -915590
7003i15590r2695m4759N870j7532l9509N8458M1631K2337M649o4094q1040O375
$$ -915590 -1008285 -1053044 -1047174 -1064706 -1104215 -1045757 -1004126 -981789 -977140 -1041234 -1122274 -1115899
6991a115899m9390K584Q6628q161O045J5984j8047o1643l5525k8776m1904J9738
$$ -1115899 -1165289 -1162705 -1076077 -1084238 -1078193 -1062209 -1080256 -1141899 -1177424 -1206200 -1248104 -1228366
6979a228366J8787K5057K7748k5287m354l4451k0256P6978O316j0034k4885R327
$$ -1228366 -1209579 -1184522 -1156774 -1182061 -1186415 -1220866 -1241122 -1164144 -1157828 -1167862 -1192747 -1183420
6967a183420O4904M2029Q01j1536k7082J7939L8211J6911j5675j9110N5547M6704
$$ -1183420 -1118516 -1076487 -1075686 -1087222 -1114304 -1096365 -1058154 -1041243 -1056918 -1076028 -1020481 -973777
6955i73777l6755l1617Q1947L7495K9788l6833l428m1134L6173N3819M5993N6093
$$ -973777 -1010532 -1042149 -960202 -922707 -892919 -929752 -933180 -974314 -938141 -884322 -838329 -782236
6943g82236Q761n3135N353j1762J1224L4868N3010o4007n6439n2124K2981j1412
$$ -782236 -773475 -826610 -821257 -833019 -821795 -786927 -733917 -797924 -854363 -906487 -883506 -894918
6931h94918K8354k1184l8476N5394j8431M5515m0718k9547K9751l2235L6817K0690
$$ -894918 -866564 -887748 -926224 -870830 -889261 -843746 -884464 -914011 -884260 -916495 -879678 -858988
6919h58988q6694K3478l8922q3943k9051L9923l0176R917p9089K6372J3025j9533
$$ -858988 -945682 -922204 -961126 -1045069 -1074120 -1034197 -1064373 -1054456 -1133545 -1107173 -1094148 -1113681
6907a113681R058k461J2174K4132q062m8684m7433j6923N9646j08747J0859M4997
$$ -1113681 -1104623 -1107084 -1094910 -1070778 -1078840 -1127524 -1174957 -1191880 -1132234 -1240981 -1230122 -1185125
6895a185125L7973o0955m9031l1879K9603k3607M5582j6643k1268j589r312N4987
$$ -1185125 -1147152 -1208107 -1257138 -1289017 -1259414 -1283021 -1237439 -1254082 -1275350 -1276939 -1286251 -1231264
6883a231264m7721L450N9302j3028l4753J0084m6154l0300l646n37l5376q539
$$ -1231264 -1278985 -1275535 -1216233 -1229261 -1264014 -1253930 -1300084 -1330384 -1334030 -1334567 -1369943 -1378482
6871a378482j8757J150M5773n1722L1231O2380j979j6396J4246j8624k1673N0107
$$ -1378482 -1397239 -1396089 -1350316 -1402038 -1370807 -1308427 -1310406 -1326802 -1312556 -1331180 -1352853 -1302746
6859a302746O3010m3807l4620L0423j7055j9177p922L8788k7439K6943O805j5078
$$ -1302746 -1239736 -1283543 -1318163 -1287740 -1304795 -1323972 -1331894 -1293106 -1320545 -1293602 -1286797 -1301875
6847a301875l9329P457P176L1006K583K9995J6667m5455q5608l948L6980J6208
$$ -1301875 -1341204 -1333747 -1326571 -1295565 -1292982 -1262987 -1246320 -1291775 -1377383 -1381331 -1344351 -1328143
6835a328143l7158L1868R239N860J8398K1860j6711j0187J3151k449K4551k0738
$$ -1328143 -1365301 -1333433 -1324194 -1318334 -1299936 -1278076 -1294787 -1304974 -1291823 -1294272 -1269721 -1290459
6823a290459j88j7201n3874O4125k1762r3956k2311Q1268N4656k0360L6338L7690
$$ -1290459 -1290647 -1307848 -1361722 -1297597 -1319359 -1413315 -1435626 -1354358 -1299702 -1320062 -1283724 -1246034
6811a246034K2481n6578m9868N0133l7516L5862j2202l6001M0833K7988k5953
$$ -1246034 -1223553 -1280131 -1329999 -1279866 -1317382 -1281520 -1293722 -1329723 -1288890 -1260902 -1286855
6800a286855P661M6086L0436k0225q486k4373l1358N7801j632O8057j6853k8878
$$ -1286855 -1279194 -1233108 -1202672 -1222897 -1231383 -1255756 -1287114 -1229313 -1230945 -1162888 -1179741 -1208619
6788a208619j03428o3280O8802N9741J3830J9156O713K6078n782r884p9198q488
$$ -1208619 -1312047 -1375327 -1306525 -1246784 -1232954 -1213798 -1207085 -1181007 -1186789 -1196673 -1275871 -1284359
6776a284359O7170l260R6193l3054o112M4590l6804l4213K5977N052j9485N2419
$$ -1284359 -1217189 -1220449 -1124256 -1157310 -1163422 -1118832 -1155636 -1189849 -1163872 -1158820 -1178305 -1125886
6764a125886L973J1805j8203L5098n8079o6601n994n81L2971N8555k3651O452
$$ -1125886 -1121913 -1110108 -1128311 -1093213 -1151292 -1217893 -1223887 -1224468 -1191497 -1132942 -1156593 -1150141
6752a150141K3732L419o2745K9638l2382m1958J1258P2066j2347k4661J115J6422
$$ -1150141 -1126409 -1122990 -1185735 -1156097 -1188479 -1230437 -1219179 -1147113 -1159460 -1184121 -1183006 -1166584
6740a166584k8458L9204l7297o224M0554J5419K0605n5388J9218m0263k336L375
$$ -1166584 -1195042 -1155838 -1193135 -1199359 -1158805 -1143386 -1122781 -1178169 -1158951 -1199214 -1201550 -1198175
6728a198175Q8994M5791q3364p6139L6158K0863J19361m4237m5432K8626K0540
$$ -1198175 -1109181 -1063390 -1146754 -1222893 -1186735 -1165872 -1046511 -1090748 -1136180 -1107554 -1087014
6717a087014r320k2529j4211J7559j351o7471K295Q3398L3845k6255k7761j9287
$$ -1087014 -1096334 -1118863 -1133074 -1115515 -1116866 -1184337 -1182042 -1098644 -1064799 -1091054 -1118815 -1138102
6705a138102o2205n3818L5471j3382N5817L4012o1539k3586q532J0659O0424J3893
$$ -1138102 -1200307 -1254125 -1218654 -1232036 -1176219 -1142207 -1203746 -1227332 -1235864 -1225205 -1164781 -1150888
6693a150888M4917Q753l6148n5141o176j2386J7945K8252L06L4582k0162j0264
$$ -1150888 -1105971 -1097218 -1133366 -1188507 -1194683 -1207069 -1189124 -1160872 -1160566 -1125984 -1146146 -1156410
6681a156410M6343K5699o171O1942q5133K4921j0661J9327j6936R562M6168m5894
$$ -1156410 -1110067 -1084368 -1090539 -1028597 -1113730 -1088809 -1099470 -1080143 -1097079 -1087517 -1041349 -1087243
6669a087243K8606Q973J0317J0912L1965K9513M908p6244q660J2864o0862k3709
$$ -1087243 -1058637 -1049664 -1039347 -1028435 -996470 -966957 -962049 -1038293 -1046953 -1034089 -1094951 -1118660
6657a118660p7929k1681N3947m1068l275K6279p603L1067m0289k5481Q895j1082
$$ -1118660 -1196589 -1218270 -1164323 -1205391 -1208666 -1182387 -1189990 -1158923 -1199212 -1224693 -1215798 -1226880
6645a226880l7630J4259K4446Q164J3311m6751N0182O116k59l851J8524M6045
$$ -1226880 -1264510 -1250251 -1225805 -1217641 -1204330 -1251081 -1200899 -1194783 -1195042 -1198893 -1180369 -1134324
6633a134324p1209k9223R6392k1110k1023m087L2044k041n3428P8924n663K7680
$$ -1134324 -1205533 -1234756 -1138364 -1159474 -1180497 -1184584 -1152540 -1154581 -1208009 -1129085 -1134748 -1107068
6621a107068M3488J25106K6603j6143q020P6435O0998p4314k9333l9311j3487
$$ -1107068 -1063580 -938474 -911871 -928014 -936034 -859599 -798601 -872915 -902248 -941559 -955046
6610i55046j0022k5548N1440J7890q514K4778l4296K0872M930O78n4545l8546
$$ -955046 -965068 -990616 -939176 -921286 -929800 -905022 -939318 -918446 -913516 -912838 -967383 -1005929
6598a005929L0356j2266p4003o3777k9575J3247l7624K2831O3111L4602m9510
$$ -1005929 -975573 -987839 -1061842 -1125619 -1155194 -1141947 -1179571 -1156740 -1093629 -1059027 -1108537
6587a108537j6863j4686l6205N8225J8595n4179n508l4663O443P5751O8072m841
$$ -1108537 -1125400 -1140086 -1176291 -1118066 -1099471 -1153650 -1159158 -1193821 -1187378 -1111627 -1043555 -1048396
6575a048396m9001k4837L7311M3163l9923L4896k0706l1598O3746N8986n294J7405
$$ -1048396 -1097397 -1122234 -1084923 -1041760 -1081683 -1046787 -1067493 -1099091 -1035345 -976359 -981653 -964248
6563i64248k7932K592J13198q32m9301N8704L6386l9447J4574l108L4933Q5723
$$ -964248 -992180 -989588 -876390 -877222 -926523 -867819 -831433 -870880 -856306 -859414 -824481 -738758
6551g38758M8738O535J28326P1044K3548L0863n8013O856l4463l4087l0189R658
$$ -738758 -690020 -683485 -555159 -484115 -460567 -429704 -487717 -480861 -515324 -549411 -579600 -569942
6539e69942J6469r0642o3319P7755P7250M5876N9843J7676K7105j2m5281l1006
$$ -569942 -553473 -644115 -707434 -629679 -552429 -506553 -446710 -429034 -401929 -401941 -447222 -478228
6527d78228k1966j7474k356n4763p5320j4842M2334j22225J5J6182k7920k9119
$$ -478228 -500194 -517668 -520024 -574787 -650107 -664949 -622615 -744840 -744825 -728643 -756563 -785682
6515g85682k2448L9112R4536o6380k8711M4130N4136K7214m7007J5318m8656n9516
$$ -785682 -808130 -769018 -674482 -740862 -769573 -725443 -671307 -644093 -691100 -675782 -724438 -783954
6503g83954n3344J9508P461P3190r4536R2982N7568M4055N3905q751P6466K9013
$$ -783954 -837298 -817790 -810329 -737139 -831675 -738693 -681125 -637070 -583165 -591916 -515450 -486437
6491d86437M6471P6221l6337o6651J04240m1525l298K0214q0932M4865Q1345J3028
$$ -486437 -439966 -363745 -400082 -466733 -362493 -404018 -407316 -387102 -468034 -423169 -341824 -328796
6479c28796K0647N068p8201Q098L9330J1046p8857n7806l9347q5835m2988l113
$$ -328796 -308149 -303081 -381282 -373184 -333854 -322808 -401665 -459471 -498818 -584653 -627641 -630754
6467f30754m2057M6858n2270m5210K4474J03129N3102j956k9214L3122O4186M6832
$$ -630754 -672811 -625953 -678223 -723433 -698959 -595830 -542728 -544684 -573898 -540776 -476590 -429758
6455d29758O6566L3456O3336J5746l0023r2754r9438O5019j4513L1185O3144r643
$$ -429758 -363192 -329736 -266400 -250654 -280677 -373431 -472869 -407850 -422363 -391178 -328034 -337677
6443c37677L9409J6311j0671J1064L7411K7847k6251Q104Q964n0740K8949m6424
$$ -337677 -298268 -281957 -292628 -281564 -244153 -216306 -242557 -234453 -225489 -276229 -247280 -293704
6431b93704L2592k777m1674j0966K331N2287N6817J9193J13034L558R9526Q5680
$$ -293704 -261112 -263889 -305563 -316529 -314198 -261911 -205094 -185901 -72867 -69309 30217 115897
6419A15897p244l3004K3864k4712Q6036N6892o8141n801M9005J3399p1156K9243
$$ 115897 108653 75649 99513 74801 160837 217729 149588 143787 192792 206191 135035 164278
6407A64278P6647k0136j2761L6399l0870n4291m8214J08370L0899q9812j8901
$$ 164278 240925 220789 208028 244427 213557 159266 111052 219422 250321 160509 141608
6396A41608N8527K837k1178M1080O7558N6378K4447N1559R266N498O4669O1953
$$ 141608 200135 202972 181794 222874 290432 346810 371257 422816 432082 437580 502249 564202
6384E64202O0521N5144k8082Q412j6299J02257O3186P0409P633L9140Q1414J5359
$$ 564202 624723 679867 651785 660197 643898 746155 809341 879750 887383 926523 1007937 1023296
6372A023296R364P2934J23068J38053M0807J07221J75419j204M8724M9818p340
$$ 1023296 1032660 1105594 1228662 1366715 1407522 1514743 1690162 1688958 1737682 1787500 1780160
6361A780160L4862P5209K811N1538K4952P6535N5435K9118M6842M4879O1526P7095
$$ 1780160 1815022 1890231 1893042 1944580 1969532 2046067 2101502 2130620 2177462 2222341 2283867 2360962
6349B360962P8252J70443J49694R9970J69739J53589J50586J54552J41586J13475
$$ 2360962 2439214 2609657 2759351 2859321 3029060 3182649 3333235 3487787 3629373 3742848
6339C742848O0793J8771J13176J66400R9175K67931L28072L19744L47752L84637
$$ 3742848 3803641 3822412 3935588 4101988 4201163 4469094 4797166 5116910 5464662 5849299
6329E849299L63858M34450M68371N96757N44237O49108Q11001R06504J221003
$$ 5849299 6213157 6647607 7115978 7712735 8256972 8906080 9717081 10623585 11844588
6320A1844588J265589J537807J965633K215535K757051L496415M349424N491007
$$ 11844588 13110177 14647984 16613617 18829152 21586203 25082618 29432042 34923049
6312C4923049O619505P202422O956288N584766L243146K20530k498162m297447
$$ 34923049 41542554 48744976 55701264 61286030 64529176 64749706 62251544 57954097
6304E7954097m866425m309644l041269j285097P12914K693380M500836N475005
$$ 57954097 53087672 48778028 45736759 44451662 45164576 47857956 52358792 57833797
6296E7833797N252742L801176J261150k114096n073122o836176p464758p063322
$$ 57833797 63086539 66887715 68148865 66034769 60961647 54125471 46660713 39597391
6288C9597391o020420m788655l821432k919861k230362j836563j385580j103952
$$ 39597391 33576971 28788316 24966884 22047023 19816661 17980098 16594518 15490566
6280A5490566r98951p62559o02452m94365m65714l57457k35623j87430k07314
$$ 15490566 14491615 13729056 13126604 12632239 12166525 11809068 11573445 11386015 11178701
6271A1178701k3231n7179k02924j07935j1899N2703P1800M4302J97987L50668
$$ 11178701 11155470 11098291 10895367 10787432 10775533 10828236 10900036 10944338 11142325 11492993
6261A1492993N17216M29762M69338O15254O64689O87974Q08844Q35778R79514
$$ 11492993 12010209 12439971 12909309 13524563 14189252 14877226 15686070 16521848 17501362
6252A7501362J267063J483242J739765K094905K468793K807691L414525M223747
$$ 17501362 18768425 20251667 21991432 24086337 26555130 29362821 32777346 37001093
6244C7001093N239631O755833Q806247J0899270J2405305J2641790J0940947P361936
$$ 37001093 42240724 48996557 57802804 68702074 81107379 93749169 104690116 112052052
6236A12052052K412926k732227o609509q497652q256948o578821l941300o07602
$$ 112052052 114464978 111732751 105123242 96625590 88368642 81789821 77848521 77240919
6228G7240919K802324N928422Q213807Q680041P074605L494995j526031o505191
$$ 77240919 80043243 85971665 94185472 102865513 109940118 113435113 111909082 105403891
6220A05403891j0296866j2155995j2177878j0961411r118092p368571n951818
$$ 105403891 95107025 82951030 70773152 59811741 50693649 43325078 37373260
6213C7373260m677922l707615k947955k397814k010714j742832j565340j270059
$$ 37373260 32695338 28987723 26039768 23641954 21631240 19888408 18323068 17053009
6205A7053009j107037r90253q13949o66733n86963n36378n06056m97273m61694
$$ 17053009 15945972 14955719 14141770 13475037 12888074 12351696 11845640 11348367 10886673
6196A0886673l86728l85881m60010l57961k91825l04433k75218k40722k55657
$$ 10886673 10499945 10114064 9654054 9296093 9004268 8699835 8424617 8183895 7928238
6187G928238k25705k42966k40661j85957k04057j18656j24247k56902k08997j45959
$$ 7928238 7702533 7459567 7218906 7032949 6828892 6710236 6585989 6329087 6120090 5974131
6177E974131j53986j77563j73141o7659p4366p8062L9247q7235n1328k429n5124
$$ 5974131 5820145 5642582 5469441 5401782 5327416 5249354 5288601 5201366 5150038 5147609 5092485
6166E092485m9024o1368o8378j39629l6801j26064k9244M528j5520p9774j30338
$$ 5092485 5043461 4982093 4913715 4774086 4737285 4611221 4581977 4586505 4570985 4491211 4360873
6155D360873o2048K0450N0431m7394q3437r5388M0652M9605O915M9874O5020K1757
$$ 4360873 4298825 4319275 4369706 4322312 4238875 4143487 4184139 4233744 4240659 4290533 4355553 4377310
6143D377310K8082J0131j26524J9117N474J6700k6490k072m9615M2463Q9397N1547
$$ 4377310 4405392 4415523 4288999 4308116 4313590 4330290 4303800 4301728 4252113 4294576 4383973 4435520
6131D435520j457M082J0221Q4519N2668L9072Q8111L3061R4698M0302J18272Q2614
$$ 4435520 4434063 4438145 4448366 4532885 4585553 4624625 4712736 4745797 4840495 4880797 4999069 5081683
6119E081683K3035J8587K3578N8242J2701K8433O7587L3013K6323N8954Q4249
$$ 5081683 5104718 5123305 5146883 5205125 5217826 5246259 5313846 5346859 5373182 5432136 5516385
6108E516385R0577J32762J14261J95288J21772J64961J85032K37567L28883L32049
$$ 5516385 5606962 5739724 5853985 6049273 6171045 6336006 6521038 6758605 7087488 7419537
6098G419537L07464K76312L00329L19187K29901K97484L35485K55727K79011L27005
$$ 7419537 7727001 8003313 8303642 8622829 8852730 9150214 9485699 9741426 10020437 10347442
6088A0347442L70940K82582K83650J98857J97749J83838J97493L27725L59518
$$ 10347442 10718382 11000964 11284614 11483471 11681220 11865058 12062551 12390276 12749794
6079A2749794M21544N55145O27910O85783P02064P89040R27503J025394J088503
$$ 12749794 13171338 13726483 14354393 15040176 15742240 16531280 17458783 18484177 19572680
6070A9572680J299693J699348J979350K262710K652082L144538L823477M929153
$$ 19572680 20872373 22571721 24551071 26813781 29465863 32610401 36433878 41363031
6062D1363031O141427Q053230J0182515J1692723J1958290J0169766O433231J306350
$$ 41363031 47504458 55557688 65740203 77432926 89391216 99560982 105994213 107300563
6054A07300563m043372q334408j0473012j0613514r463093p691790n899297m097256
$$ 107300563 103257191 94922783 84449771 73836257 64373164 56681374 50782077 46684821
6046D6684821k541686j247527k79156O80962J721197K742352M048747N946960
$$ 46684821 44143135 42895608 42616452 43297414 45018611 47760963 51809710 57756670
6038E7756670Q218102J0501985J1833744J1426813Q880997M263014j503981p007060
$$ 57756670 65974772 76476757 88310501 99737314 108618311 112881325 111377344 104370284
6030A04370284j0726112j2266119j1797785j0268788q401648o579185n051893
$$ 104370284 93644172 81378053 69580268 59311480 50909832 44330647 39278754
6023C9278754l780401k964376k299682j856753j662784j423902j253068j203225
$$ 39278754 35498353 32533977 30234295 28377542 26714758 25290856 24037788 22834563
6015B2834563j094614j042263q80818o67955n94286m44949l84413k86008j59026
$$ 22834563 21739949 20697686 19816868 19148913 18554627 18109678 17725265 17439257 17280231
6006A7280231j20587n8163O3317J58759J41313L04183N28050N32769P59082J070830
$$ 17280231 17159644 17101481 17164798 17323557 17464870 17769053 18297103 18829872 19588954 20659784
5996B0659784J235504J512487J800259K234335K731504L424545M449952N743864
$$ 20659784 21895288 23407775 25208034 27442369 30173873 33598418 38048370 43792234
5988D3792234O970495P439726O862784M970732J875482j612197m523165o536231
$$ 43792234 50762729 58202455 65065239 70035971 71911453 70299256 65776091 59239860
5980E9239860p113844o586864n518736m368666l131541k137290j252005n53935
$$ 59239860 52126016 45539152 40020416 35651750 32520209 30382919 29130914 28576979
5972B8576979R4622N99890J196040K010312K994876M333143N749766O926525P160599
$$ 28576979 28671601 29271491 30467531 32477843 35472719 39805862 45555628 52482153 59642752
5963E9642752O070513L707578L21970l367989o045469p531196p651770o948997
$$ 59642752 65713265 69420843 69742813 66374824 60329355 52798159 45146389 38197392
5955C8197392n869203m589571l727049k894148k232130j869073j462322j154547
$$ 38197392 32328189 27738618 24011569 21117421 18885291 17016218 15553896 14399349
5947A4399349j018650p89003p18485o58019n77410m60648m62719l88072k84439
$$ 14399349 13380699 12591696 11873211 11215192 10637782 10177134 9714415 9326343 9041904
5938I041904l42151k55059k25586l04033k82644k01351l08159k33369j71638j47257
$$ 9041904 8699753 8444694 8219108 7915075 7632431 7431080 7122921 6889552 6717914 6570657
5928F570657j80709j03651r9758o6339p858o2277r078n9879j02064j34313k05619
$$ 6570657 6389948 6286297 6186539 6120200 6112342 6050065 6040987 5981108 5879044 5744731 5539112
5917E539112j22318j82259j83113k35019j92158j28099k04254j77428j86014j56972
$$ 5539112 5416794 5234535 5051422 4816403 4624245 4496146 4291892 4114464 3928450 3771478
5907C771478k12568j47462r2091p0771r9130q4202n1881m7705n8408k4767m755
$$ 3771478 3558910 3411448 3319357 3248586 3149456 3065254 3013373 2965668 2907260 2882493 2877738
5896B877738n1619o7395N005J4386j5667p1412j08091m8311j49133Q976n3593
$$ 2877738 2826119 2758724 2763729 2778115 2762448 2691036 2582945 2534634 2385501 2394477 2340884
5885B340884j14757n2420q2114q7721r3212m3932O828r3014J3994o3248j04720
$$ 2340884 2226127 2173707 2091593 2003872 1910660 1866728 1873556 1780542 1794536 1731288 1626568
5874A626568O1383j04622p3769k9105o665l7376q485p6388q6240n6674J0103m8838
$$ 1626568 1687951 1583329 1509560 1480455 1473790 1436414 1427929 1351541 1265301 1208627 1218730 1169892
5862A169892J236o6454l9268j5029k2214n7640o3860M8723K4186l545l7825l9491
$$ 1169892 1171128 1104674 1065406 1050377 1028163 970523 906663 955386 979572 976027 938202 898711
5850H98711k487K1046n2460q4890o9171K5653J3815K3645m2516j68690Q770M8683
$$ 898711 896224 917270 864810 779920 710749 736402 750217 773862 731346 562656 571426 620109
5838F20109l9241n6780m3699l5798k1772P850M0312N7737o4490J04016n225Q2498
$$ 620109 580868 524088 480389 444591 422819 430669 470981 528718 464228 568244 563019 645517
5826F45517P9707Q0361k6326M1946J62152J78730J31376K13759K09763R8812P0287
$$ 645517 725224 805585 779259 821205 983357 1162087 1293463 1507222 1716985 1815797 1886084
5815A886084N4692K9138j11510j59186j32286j94329j56471j21736j06177j19508
$$ 1886084 1940776 1969914 1858404 1699218 1566932 1372603 1216132 1094396 988219 868711
5805H68711m8054M2265k2578k4676M5860J33300J82066J45267J85240L00889J15891
$$ 868711 820657 862922 840344 815668 861528 994828 1176894 1322161 1507401 1808290 1924181
5794A924181Q8046J12415p1784k52275k37603k34040j55992j82737p2350r7838
$$ 1924181 2012227 2124642 2052858 1800583 1562980 1328940 1172948 990211 917861 820023
5784H20023m7063j3076m2417j14071p1852j04266m9533l7317m1627p9868M425
$$ 820023 772960 759884 717467 603396 531544 427278 377745 340428 298801 218933 223358
5773B23358j01112o9978O599J7221j5357o9946k0260o6300L1535l2299o4267j214
$$ 223358 122246 52268 58867 76088 60731 -9215 -29475 -95775 -64240 -96539 -160806 -162020
5761a62020K0468j3008J9510M0432m035j5053k6691M87J2562R940J3833m3355
$$ -162020 -141552 -154560 -135050 -94618 -98653 -113706 -140397 -139910 -127348 -117408 -103575 -146930
5749a46930K0105J6429P3600L2941L5124J9992l1877m3261K0787R210k0015l8056
$$ -146930 -126825 -110396 -36796 -3855 31269 51261 19384 -23877 -3090 6120 -13895 -51951
5737e1951j05870J218J922n8226k4310m4567N7480Q759k5249p412l528M8897l9386
$$ -51951 -157821 -156603 -154681 -212907 -237217 -281784 -224304 -215545 -240794 -248206 -251734 -202837 -242223
5724b42223R8299M8605L9837O0989o3813O519l2759q780l35q5490p831o6773k5887
$$ -242223 -143924 -95319 -55482 5507 -58306 -51787 -84546 -93326 -93661 -179151 -186982 -253755 -279642
5711b79642M5126r589k2686N924k6467J3315l4004n4281o6025j1072J110J4485
$$ -279642 -234516 -244105 -266791 -260867 -287334 -274019 -308023 -362304 -428329 -439401 -438291 -423806
5699d23806O527K6799K6646M7800J4361m5288K1006n0369p3244r792N7093L9679
$$ -423806 -417279 -390480 -363834 -316034 -301673 -346961 -325955 -376324 -449568 -459360 -402267 -362588
5687c62588L5208r015J7234R8472P2262p2871j1626L4369J6573N0428N6802o1465
$$ -362588 -327380 -336395 -319161 -220689 -148427 -221298 -232924 -198555 -181982 -131554 -74752 -136217
5675a36217k1Q0439K9766K5202K2367L6131Q4281K0038m342P254j0287k5472j5126
$$ -136217 -136238 -55799 -26033 -831 21536 57667 141948 161986 157644 164898 154611 129139 114013
5662A14013m4106p382m9439K1969K8255K8329p536l8619l4641N7513L7657R2570
$$ 114013 69907 62525 13086 35055 63310 91639 84103 45484 10843 68356 106013 198583
5650A98583K2604M3402l2468n4522j2053j0985j8899j00683k5648q4919P987L8291
$$ 198583 221187 264589 232121 177599 165546 154561 135662 34979 9331 -75588 -67601 -29310
5638b9310O44j23669n2998j0958n8357M6755J5134j0523J3248L024l6192R766
$$ -29310 -28666 -152335 -205333 -216291 -274648 -227893 -212759 -223282 -210034 -207010 -243202 -233436
5626b33436P4615k6548j01883m9010K6676Q115n0391j451Q193K0786L1212l6362
$$ -233436 -158821 -185369 -287252 -336262 -309586 -301471 -351862 -353313 -345120 -324334 -293122 -329484
5614c29484N025K3116k3481l4036j672k9479J2758N610n389k7975j8978J2765
$$ -329484 -324459 -301343 -324824 -358860 -360532 -390011 -377253 -371643 -377032 -405007 -423985 -411220
5602d11220N6666j4145O1906M7336L9646k1567J7381j03551j4956N5098Q519K786
$$ -411220 -354554 -368699 -306793 -259457 -219811 -241378 -223997 -327548 -342504 -287406 -278887 -276101
5590b76101k6392m4056n2323k3286N4198N3776n2433o2133o0322M1455M4187K1404
$$ -276101 -302493 -346549 -398872 -422158 -367960 -314184 -366617 -428750 -489072 -447617 -403430 -382026
5578c82026J6002M9326Q0295l9777J7835l0084j2273K5172n8194o5036J4420j594
$$ -382026 -366024 -316698 -236403 -276180 -258345 -288429 -300702 -275530 -333724 -398760 -384340 -385934
5566c85934m4669r865k3780K5574j02781L4408r960l9220j972L529K9736R285
$$ -385934 -430603 -440468 -464248 -438674 -541455 -507047 -517007 -556227 -558199 -554670 -524934 -515649
5554e15649K3669m2650j9408O2466M6916N562q6669R210j1189J8077O0351l0703
$$ -515649 -491980 -534630 -554038 -491572 -444656 -439094 -525763 -516553 -527742 -509665 -449314 -480017
5542d80017J9101P1297l6156J305L2410j4352k8322M959k2327j5204N5218l5972
$$ -480017 -460916 -389619 -425775 -424470 -392060 -406412 -434734 -429775 -452102 -467306 -412088 -448060
5530d48060R1481k4817j9542m6784m678o954j7351K6700K0699P48Q359L8804k7097
$$ -448060 -356579 -381396 -400938 -447722 -452400 -459354 -476705 -450005 -429306 -428558 -420199 -381395 -408492
5517d08492R243M7649P226l26J6731M331L3510OK5208j04651J4337O9590L0184
$$ -408492 -399249 -351600 -344374 -344700 -327969 -323638 -290128 -290122 -264914 -369565 -355228 -285638 -255454
5504b55454J3105j3236k3691o7329J2186N6784K8733J1603j7680K9458L1489J0794
$$ -255454 -242349 -255585 -279276 -346605 -334419 -277635 -248902 -237299 -254979 -225521 -194032 -183238
5492a83238K6425K3707o0389Q253J8014m123j8828k4816o5439l1253K8871O003
$$ -183238 -156813 -133106 -193495 -185242 -167228 -171351 -190179 -214995 -280434 -311687 -282816 -276813
5480b76813j91k7877p7045J8210K2859L4352j1631n4505L9772N0675j09952k2281
$$ -276813 -277004 -304881 -381926 -363716 -340857 -306505 -318136 -372641 -332869 -282194 -392146 -414427
5468d14427O5023M3872m6130O991m791o5340O1647q704M9069j16487j0286L8574
$$ -414427 -349404 -305532 -351662 -344671 -349462 -414802 -353155 -361859 -312790 -429277 -439563 -400989
5456d00989K2279k8999L4540k0715K7222L3641m6744j8989L246M1331l7986o2399
$$ -400989 -378710 -407709 -373169 -393884 -366662 -333021 -379765 -398754 -395508 -354177 -392163 -454562
5444d54562k4041k4117L4880R028K5414K6213R6920O6015l6623m3391j7452L8864
$$ -454562 -478603 -502720 -467840 -458812 -433398 -407185 -310265 -244250 -280873 -324264 -341716 -302852
5432c02852J6462J8812j8317P7511K6177j0208L8796k2379N5748P6028L8736Q04
$$ -302852 -286390 -267578 -285895 -208384 -182207 -192415 -153619 -175998 -120250 -44222 -5486 -4682
5420d682p566K9345L0127k4083l05o078J4898k6055N5616R1284R1403N6364J4019
$$ -4682 -12248 17097 47224 23141 22836 16758 31656 5601 61217 152501 243904 300268 314287
5407C14287O9123M748J01755l0866m4458M6186J01450J3484j4444l8672k4186
$$ 314287 383410 388158 489913 459047 414589 460775 562225 575709 561265 522593 498407
5396D98407L3672Q0843L6838l615R2266N8976Q3757J14m2561K8144P0347O9735
$$ 498407 532079 612922 649760 646145 738411 797387 881144 881258 838697 866841 937188 1006923
5384A006923M4528N5375L7676J7922j238O2406L045M7645P0334P1947j8614O6573
$$ 1006923 1051451 1106826 1144502 1162424 1161186 1223592 1226637 1274282 1344616 1416563 1397949 1464522
5372A464522J20933J5846R0889P2912L0395N5204M4122O2366p990K5595j8151
$$ 1464522 1585455 1601301 1692190 1765102 1795497 1850701 1894823 1957189 1949199 1974794 1956643
5361A956643O8190Q8960J3893L7206J08635Q1752M5619K9416j3841M8678J23785
$$ 1956643 2024833 2113793 2127686 2164892 2273527 2355279 2400898 2430314 2416473 2465151 2588936
5350B588936R1802l9404M575L5489J0659q8788j0452J01585L1595R8213J23513
$$ 2588936 2680738 2641334 2645909 2681398 2692057 2603269 2592817 2694402 2725997 2824210 2947723
5339B947723J0257j3247N6728R2432Q5452R2844k6375O2965P0560L1304O2590
$$ 2947723 2957980 2944733 3001461 3093893 3179345 3272189 3245814 3308779 3379339 3410643 3473233
5328C473233N8759K7938J44952R6418L8974J1424J04536Q2336R4406J42621J16406
$$ 3473233 3531992 3559930 3704882 3801300 3840274 3851698 3956234 4038570 4132976 4275597 4392003
5317D392003N3727J01306R5174R6414J84180J45259J77000K31454J92576K30191
$$ 4392003 4445730 4547036 4642210 4738624 4922804 5068063 5245063 5476517 5669093 5899284
5307E899284J90862K11812K77966K71138K23719L97935M05980L90361N20814M77494
$$ 5899284 6090146 6301958 6579924 6851062 7074781 7472716 7878696 8269057 8789871 9267365
5297I267365N84179O42993O96895Q03555R01025J066921J297498J594418K043916
$$ 9267365 9851544 10494537 11191432 11994987 12896012 13962933 15260431 16854849 18898765
5288A8898765K583642L062777K983969K759256K133873J058955Q2687m47019m04051
$$ 18898765 21482407 24545184 27529153 30288409 32422282 33481237 33563924 33116905 32712854
5279C2712854J03330R13871K065203L481054M709965N576470N876097N452201
$$ 32712854 32816184 33730055 35795258 39276312 43986277 49562747 55438844 60891045
5271F0891045M383547L104584J866872Q24772M15677M38354N07558Q67593J193533
$$ 60891045 65274592 68379176 70246048 71070820 71486497 71924851 72432409 73300002 74493535
5262G4493535J748817K257635K058750J720320J540807J649428J976522K388891
$$ 74493535 76242352 78499987 80558737 82279057 83819864 85469292 87445814 89834705
5254H9834705K657323K638611K078833P81377m49481j580528k326313k480522
$$ 89834705 92492028 95130639 97209472 97990849 97541368 95960840 93634527 91154005
5246I1154005k379291j896955j184276r53639j334338j820362k259627k252855
$$ 91154005 88774714 86877759 85693483 84739844 83405506 81585144 79325517 77072662
5238G7072662k120939j819030j110602l51325M0904j520m70447j342543k885712
$$ 77072662 74951723 73132693 72022091 71670766 71711670 71710150 71239703 69897160 67011448
5229F7011448m345755n583759o038492n622021m676326l507598k233357j035365
$$ 67011448 62665693 57081934 51043442 45421421 40745095 37237497 35004140 33968775
5221C3968775k2073N38437N22817n0440q94260j991152k878426l149576l118936
$$ 33968775 33946702 34485139 35007956 34957516 34063256 32072104 29193678 26044102 22925166
5212B2925166k768245k223737j817343j499779j139048r05817p86839p14859n87265
$$ 22925166 20156921 17933184 16115841 14616062 13477014 12571197 11784358 11069499 10482234
5203A0482234m51032l82251m29937m33160l37697k44039k71721k56044j98638
$$ 10482234 10031202 9648951 9219014 8785854 8448157 8204118 7932397 7676353 7477715
5194G477715j94224k06083j36056j96007k34048k79130k35422k33121k25244j48636
$$ 7477715 7283491 7077408 6941352 6745345 6511297 6232167 5996745 5763624 5538380 5389744
5184E389744j28841j18509j20929o7746j77178j24908r2951q8927k9528q3476
$$ 5389744 5260903 5142394 5021465 4953719 4776541 4651633 4558682 4469755 4440227 4356751
5174D356751j07613l3573q9501l0519L471j44218L6230j1709j8010m7175L863
$$ 4356751 4249138 4215565 4126064 4095545 4099016 3954798 3991028 3979319 3961309 3914134 3917997
5163C917997R107N1543l6516k0342R6922O3052P9073J26782M2508P7399K2307
$$ 3917997 3927104 3978647 3942131 3921789 4018711 4081763 4160836 4287618 4330126 4407525 4429832
5152D429832m7846k5411L5440N4012k972m126L1345P2901L7096O4017J31018J28744
$$ 4429832 4381986 4356575 4392015 4446027 4443055 4438929 4470274 4543175 4580271 4644288 4775306 4904050
5140D904050N3447R5724M3105M3327J10447K7562M0523J17321K07314K21631J82412
$$ 4904050 4957497 5053221 5096326 5139653 5250100 5277662 5318185 5435506 5642820 5864451 6046863
5129F046863J38616J73245l1735j13968j06734k22082j25529j5362r4911j13463
$$ 6046863 6185479 6358724 6326989 6213021 6106287 5884205 5758676 5743314 5648403 5534940
5119E534940L8279l1437m8857J4996k457j2623j1878l2945n8456j46390j09723
$$ 5534940 5573219 5541782 5492925 5507921 5505464 5492841 5480963 5448018 5389562 5243172 5133449
5108E133449J2976m7822n3723o8267K5260L4318K6816Q6169N2119O8919p6134
$$ 5133449 5146425 5098603 5044880 4976613 5001873 5036191 5063007 5149176 5201295 5270214 5194080
5097E194080L6881O2921J7991K6859M1969K8085l506j01259p9612q3272o4883
$$ 5194080 5230961 5293882 5311873 5338732 5380701 5408786 5405280 5304021 5224409 5141137 5076254
5086E076254N2208k1068O0412N9074J68399J78622N8167J27417J50956J38178
$$ 5076254 5128462 5107394 5167806 5226880 5395279 5573901 5632068 5759485 5910441 6048619
5076F048619N2965o964j04704j42054m5351m7314o6139l4948N8308J55965K01969
$$ 6048619 6101584 6094620 5989916 5847862 5802511 5755197 5689058 5654110 5712418 5868383 6070352
5065F070352J77060J66729J76429M2001j3188n5043j46835k99471k67590k79251
$$ 6070352 6247412 6414141 6590570 6632571 6619383 6564340 6417505 6118034 5850444 5571193
5055E571193k72085r7220j37948j25005j27942j21128k6253j37554k4887k7619
$$ 5571193 5299108 5201888 5063940 4938935 4810993 4689865 4663612 4526058 4501171 4473552
5045D473552r6850O894J4327K0134r187n8605N7554L9409O4603J1941K6165M6959
$$ 4473552 4376702 4383596 4397923 4418057 4408870 4350265 4407819 4447228 4511831 4523772 4549937 4596896
5033D596896q376m584O4518J10783K0739N3112N8635L959O394l1866J3762j9634
$$ 4596896 4588520 4583936 4648454 4759237 4779976 4833088 4891723 4895682 4902076 4870210 4883972 4864338
5021D864338q749P581k4360J7765j3203k8056M5714Q0492Q427J45103Q4287Q9725
$$ 4864338 4855589 4863170 4838810 4856575 4843372 4815316 4861030 4941522 4949949 5095052 5179339 5269064
5009E269064J34524N3424J6711L0612m0997P2209J08335M3158N2888N7650J05823
$$ 5269064 5403588 5457012 5473723 5504335 5463338 5535547 5643882 5687040 5739928 5797578 5903401
4998E903401J03523J21959J84885K16974K27343J70464J17007K25280K10389J13434
$$ 5903401 6006924 6128883 6313768 6530742 6758085 6928549 7045556 7270836 7481225 7594659
4988G594659M1809O883P077P6872R0231M3830J32824K48897J14441J64724K24214
$$ 7594659 7636468 7643351 7650428 7727300 7817531 7861361 7994185 8243082 8357523 8522247 8746461
4977H746461J59205K00801K30345K40338J95126K47283K46148K60846L33560K63980
$$ 8746461 8905666 9106467 9336812 9577150 9772276 10019559 10265707 10526553 10860113 11124093
4967A1124093J89804K17895Q0747p0114m5898L3955N5287J04913K13677K11978
$$ 11124093 11313897 11531792 11612539 11542425 11496527 11530482 11585769 11690682 11904359 12116337
4957A2116337L05029L46989L11190L16224K27796K22192J40883J09451J95485
$$ 12116337 12421366 12768355 13079545 13395769 13623565 13845757 13986640 14096091 14291576
4948A4291576K24716K90711K71992K64161L80175L91165L42327L20117K20689
$$ 14291576 14516292 14807003 15078995 15343156 15723331 16114496 16456823 16776940 16997629
4939A6997629J54424J99604J27239J38115J63306K72552K29134J93985L21373
$$ 16997629 17152053 17351657 17478896 17617011 17780317 18052869 18282003 18475988 18797361
4930A8797361L70750M03936N18978M65642M53005N47348O24111N97920O01400
$$ 18797361 19168111 19572047 20091025 20556667 21009672 21557020 22181131 22779051 23380451
4921B3380451O91618O49955O98510P03962P27169R07635R07479R75694J072683
$$ 23380451 24072069 24722024 25420534 26124496 26851665 27759300 28666779 29642473 30715156
4912C0715156J095318J167570J246336J292672J360331J463445J548348J570685
$$ 30715156 31810474 32978044 34224380 35517052 36877383 38340828 39889176 41459861
4904D1459861J573883J614587J613571J705728J777600J909538K180653K454756
$$ 41459861 43033744 44648331 46261902 47967630 49745230 51654768 53835421 56290177
4896E6290177K802848L484876M378949N686660P639258J0293983J2801828J3895663
$$ 56290177 59093025 62577901 66956850 72643510 80282768 90576751 103378579 117274242
4888A17274242J2543767R347388M039512k349760p179959r417244q832876o828760
$$ 117274242 129818009 139165397 143204909 140855149 133675190 124257946 115425070 108596310
4880A08596310m520598k219037J15738K293000M544059O846203R767919J3216991
$$ 108596310 104075712 101856675 101972413 104265413 108809472 115655675 125423594 138640585
4872A38640585J6880630J9792182K1152798K1321508J9252200J4472017Q626063
$$ 138640585 155521215 175313397 196466195 217787703 237039903 251511920 260137983
4865B60137983K823524k939873p576933j0386484j0522710q376767n684326l385950
$$ 260137983 262961507 260021634 252444701 242058217 231535507 223158740 217474414 214088464
4857B14088464j467087M50521K062195L697976N680325Q254271J1190357J3788062
$$ 214088464 212621377 213071898 215134093 218832069 224512394 232766665 243957022 257745084
4849B57745084J4446833J3092425R824522M785820j4128k422793j680819J428180
$$ 257745084 272191917 285284342 295108864 299894684 299880556 297457763 295776944 297205124
4841B97205124N398716Q885939J1367381J2559314J2114246J0299435P737159
$$ 297205124 302603840 311489779 322857160 335416474 347530720 357830155 365567314
4834C65567314M598583J636038j018138l172016m827869n855812o430597o344243
$$ 365567314 370165897 371801935 370783797 367611781 362783912 356928100 350497503 344153260
4826C44153260o021296n232349m091853k303699k26269K244067M841216P109576
$$ 344153260 338131964 332899615 328807762 326504063 326277794 328521861 333363077 340472653
4818C40472653Q996099J0361636J1140577J1442644J1538928J1221738J0553493
$$ 340472653 349468752 359830388 370970965 382413609 393952537 405174275 415727768
4811D15727768R344369P431170M816180J440329k066746n327329p984567r683277
$$ 415727768 425072137 432503307 437319487 438759816 436693070 431365741 423381174 413697897
4803D13697897j0423991j0342792r694049q723316p592368o455508n370447m214386
$$ 413697897 403273906 392931114 383237065 374513749 366921381 360465873 355095426 350881040
4795C50881040k984437j567141j47493R52082J775676K150641K082657J297433
$$ 350881040 347896603 346329462 346181969 347134051 348909727 351060368 353143025 354440458
4787C54440458k10618k611501n574801q503975j0833820j2086052j2590919j2286747
$$ 354440458 354229840 351618339 346043538 337539563 326705743 314619691 302028772 289742025
4779B89742025j1764143j0687935r645935q773139q125673p805344p892006q177043
$$ 289742025 277977882 267289947 257644012 248870873 240745200 232939856 225047850 216870807
4771B16870807q470964q830023q928318q905581q598554p989785p402701o556838
$$ 216870807 208399843 199569820 190641502 181735921 173137367 165147582 157744881 151188043
4763A51188043n705155m891743m141816l627605l258730l194114l345320l566043
$$ 151188043 145482888 140591145 136449329 132821724 129562994 126368880 123023560 119457517
4755A19457517l799455l972958m285174m179100m123505l945411l703072l569696
$$ 119457517 115658062 111685104 107399930 103220830 99097325 95151914 91448842 87879146
4747H7879146l403117l312726l259388l117602k950924k827358k626420k432772
$$ 87879146 84476029 81163303 77903915 74786313 71835389 69008031 66381611 63948839
4739F3948839k237269k009480j883404j668591j530999j408057j261017j105754
$$ 63948839 61711570 59702090 57818686 56150095 54619096 53211039 51950022 50844268
4731E0844268r74848q96845q41611q59215q84955r64534r62886r22436r56727
$$ 50844268 49869420 48972575 48130964 47271749 46386794 45422260 44459374 43536938 42580211
4722D2580211q60014p59263p04846o92710o15462n66488m67709m44208m26589
$$ 42580211 41720197 40960934 40256088 39563378 38947916 38381428 37913719 37469511 37042922
4713C7042922l59322l53225l27951l16703k91492k49031j94867j97795k16751
$$ 37042922 36683600 36330375 36002424 35685721 35394229 35145198 34950331 34752536 34535785
4704C4535785k43950l38356n12277n06129n86996p26157p32701p41779p68040
$$ 34535785 34291835 33953479 33441202 32935073 32348077 31621920 30889219 30147440 29379400
4695B9379400p19949p52988o87257p54010p55826q17619p22797n70502n83283
$$ 29379400 28659451 27906463 27219206 26465196 25709370 24891751 24168954 23598452 23015169
4686B3015169m28350m10260k71196k11508k06278j21406k88750l09416m31586
$$ 23015169 22586819 22176559 21905363 21693855 21487577 21366171 21077421 20768005 20336419
4677B0336419l60395l36868l83061l19226j39084j00346j07067o8299q0775j07734
$$ 20336419 19976024 19639156 19256095 18936869 18797785 18697439 18590372 18522073 18441298 18333564
4667A8333564m2448j11483j45694n8691K6115l9354O7596J47760K58760K79474
$$ 18333564 18291116 18179633 18033939 17975248 18001363 17962009 18029605 18177365 18436125 18715599
4657A8715599K60920L60765K83538K96168J74837K00186Q1970M2084R6436O8507
$$ 18715599 18976519 19337284 19620822 19916990 20091827 20292013 20373983 20416067 20512503 20581010
4647B0581010Q5493M6086J19270J65767K67995J97788J46088Q3129k1976j47553
$$ 20581010 20666503 20712589 20831859 20997626 21265621 21463409 21609497 21692626 21670650 21523097
4637B1523097k63334k22013j01479q5607n2072K2301K7448M5368N0062Q441M3411
$$ 21523097 21259763 21037750 20936271 20850664 20798592 20820893 20848341 20893709 20943771 20952212 20995623
4626B0995623k2632q8468j57388k15584k35100k90366k79956k17277k3095N4386
$$ 20995623 20972991 20884523 20727135 20511551 20276451 19986085 19706129 19488852 19465757 19520143
4616A9520143L8204J42194L07841K81395L90963M78842O23569Q28812J046511
$$ 19520143 19558347 19700541 20008382 20289777 20680740 21159582 21783151 22611963 23658474
4607B3658474J260244J562721J769589K129831K429393K613464L120944L839964
$$ 23658474 24918718 26481439 28251028 30380859 32810252 35423716 38544660 42384624
4599D2384624M904615O689030R121168J1886576J3770638J3788581J1525858P033154
$$ 42384624 47289239 53978269 63099437 74986013 88756651 102545232 114071090 121104244
4591A21104244J058961m529221q002775q301580o090678k536416J804716O019971
$$ 121104244 122163205 117633984 109631209 101329629 95238951 92702535 94507251 100527222
4583A00527222R267922J0049296Q152363M208948j140822n814027p975035o907030
$$ 100527222 109795144 119844440 127996803 132205751 131064929 125250902 117275867 110368837
4575A10368837l389053Q79795M096608N129992L901452O47320l952257p741199
$$ 110368837 106979784 107859579 111956187 117086179 120987631 121634951 117682694 109941495
4567A09941495r505533q896502o360297k959555P91802M252792O336488O083235
$$ 109941495 100435962 91539460 85179163 82219608 83011410 87264202 93600690 99683925
4559I9683925L831046l36002n437149r421697j1482232j1286278r862652q043993
$$ 99683925 103514971 103178969 97741820 88320123 76837891 65551613 55688961 47644968
4551D7644968o364054m995226l789111k857719k103025j835401j443522j310181
$$ 47644968 41280914 36285688 32496577 29638858 27535833 25700432 24256910 22946729
4543B2946729j134118j038345r25312q12955p54675o56708n79466n73833n68309
$$ 22946729 21812611 20774266 19848954 19035999 18281324 17624616 17045150 16471317 15903008
4534A5903008m60347m21672l65354m13153l85309l15396k96282j85347j79548
$$ 15903008 15442661 15020989 14655635 14242482 13857173 13541777 13245495 13060148 12880600
4525A2880600k08191j41126j75672k12898j06977j34144j54239j47648j95632
$$ 12880600 12672409 12531283 12355611 12142713 12035736 11901592 11747353 11599705 11404073
4516A1404073j96729k21855j31547j53363j11846r4637k01335j15481q7345r8252
$$ 11404073 11207344 10985489 10853942 10700579 10588733 10494096 10292761 10177280 10089935 9991683
4506I991683j09670j23633j46554j12472j01059k46180r2009j09004n0335q3353
$$ 9991683 9882013 9758380 9611826 9499354 9398295 9152115 9060106 8951102 8900767 8817414
4496H817414r9736o9589p0784j42747j70581o3191k7827p6029p1380r65n3894
$$ 8817414 8717678 8648089 8577305 8434558 8263977 8200786 8172959 8096930 8025550 8024585 7970691
4485G970691K1345j41811j16834j40946p0299p6187j02445j01888l2525l9882
$$ 7970691 7992036 7850225 7733391 7592445 7522146 7445959 7343514 7241626 7209101 7169219
4475G169219P591J8152K0047J00570J25278J53862K81787M07228N07995O82361
$$ 7169219 7176810 7194962 7215009 7315579 7440857 7594719 7876506 8283734 8791729 9474090
4465I474090P34536N65491K72496J6057k86440o03886p53174p10711n75876l96436
$$ 9474090 10208626 10774117 11046613 11062670 10776230 10172344 9419170 8708459 8132583 7736147
4455G736147l30846k20281j26036m4262m2217j9286L5490J0364L0615R964p5765
$$ 7736147 7405301 7185020 7058984 7014722 6972505 6953219 6988709 6999073 7029688 7039652 6963887
4444F963887m1946l3334o8554m4222l4804l5187J085l7414k5222N6733K4756n9522
$$ 6963887 6921941 6888607 6820053 6775831 6741027 6705840 6706925 6669511 6644289 6701022 6725778 6666256
4432F666256K9665p2437j817j8007o2306J9539j7550j8577n3324L2021L2324O1051
$$ 6666256 6695921 6623484 6621667 6603660 6541354 6560893 6543343 6524766 6471442 6503463 6535787 6596838
4420F596838P2033R177m1090JJ10622M6849p8701J6452L6592L4216O9238M5894
$$ 6596838 6668871 6678048 6636958 6636959 6747581 6794430 6715729 6732181 6768773 6802989 6872227 6918121
4408F918121p60j047J34689J26161N1924L0366J00596J36317P8566J51660J35787
$$ 6918121 6917361 6916314 7051003 7177164 7229088 7259454 7360050 7496367 7574933 7726593 7862380
4397G862380J57370J92783Q1402J63428J30548P2563Q554N3880O0376R1510J65227
$$ 7862380 8019750 8212533 8293935 8457363 8587911 8660474 8669028 8722908 8783284 8874794 9040021
4386I040021J73036J42927J95251J55625J17756J46401J82778J06842J68854J04287
$$ 9040021 9213057 9355984 9551235 9706860 9824616 9971017 10153795 10260637 10429491 10533778
4376A0533778J38573J64458K04250J77156K08848K00429J33509J31578J62869
$$ 10533778 10672351 10836809 11041059 11218215 11427063 11627492 11761001 11892579 12055448
4367A2055448J61226L9969J07261k2508N0411J0380J05047Q4295m065J1143P0681
$$ 12055448 12216674 12256643 12363904 12341396 12391807 12402187 12507234 12591529 12587464 12598607 12669288
4356A2669288Q1060M5219K4565n1058P3923J32265P3704L6306O0909P5112O6002
$$ 12669288 12750348 12795567 12820132 12769074 12842997 12975262 13048966 13085272 13146181 13221293 13287295
4345A3287295J07244k779r8246j5473l366j7922K4245L8539J62725J73356J78031
$$ 13287295 13394539 13391760 13293514 13278041 13274675 13256753 13280998 13319537 13482262 13655618 13833649
4334A3833649K18411J43908m624K4590m0736m9685o7946L7192M3503R9767J54265
$$ 13833649 14052060 14195968 14191344 14215934 14175198 14125513 14057567 14094759 14138262 14238029 14392294
4323A4392294J50206J73069J93616J59013j3523N274P0909R0167P6507n75J59355
$$ 14392294 14542500 14715569 14909185 15068198 15054675 15059949 15130858 15221025 15297532 15296957 15456312
4312A5456312J45875J04133L1974m1720M6192m0201L1306J06508M7780J11974
$$ 15456312 15602187 15706320 15738294 15696574 15742766 15702565 15733871 15840379 15888159 16000133
4302A6000133J46686J50734J58039P5827p8743j40654j59865j34016r1819j33806
$$ 16000133 16146819 16297553 16455592 16531419 16452676 16312022 16152157 16018141 15926322 15792516
4292A5792516j15848L127j3110J6887O4315L5954L6463N3079j3039o1250q395
$$ 15792516 15676668 15679795 15666685 15683572 15747887 15783841 15820304 15873383 15860344 15799094 15790699
4281A5790699q0699k4826j2680K8166k3801m031N7856k4248q7673L271Q1390L0216
$$ 15790699 15710000 15685174 15672494 15700660 15676859 15672828 15730684 15706436 15618763 15622034 15703424 15733640
4269A5733640N1498O595m9849r440J56897J6112l2861P4313M054P7545l5448j0266
$$ 15733640 15785138 15791733 15741884 15732444 15889341 15905453 15872592 15946905 15950959 16028504 15993056 15982790
4257A5982790J2575Q8027N8489L3722P0562K9387j0170J22296J35116K06940J75366
$$ 15982790 15995365 16083392 16141881 16175603 16246165 16275552 16265382 16387678 16522794 16729734 16905100
4246A6905100J59316J99209J79475J91229K70664J70266J76845K68290J63241
$$ 16905100 17064416 17263625 17443100 17634329 17904993 18075259 18252104 18520394 18683635
4237A8683635J38064K21978K84501L08706L42363L78116L78846M62808N82351
$$ 18683635 18821699 19043677 19328178 19636884 19979247 20357363 20736209 21199017 21781368
4228B1781368N86985N74338P25624P84518Q16319R08593Q10784R28301J027189
$$ 21781368 22368353 22942691 23668315 24452833 25269152 26177745 26988529 27916830 28944019
4219B8944019J075553J107322J099370J206847J266387J364821J205832J178877
$$ 28944019 30019572 31126894 32226264 33433111 34699498 36064319 37270151 38449028
4211C8449028J205527J185904J329085J261589J356846J440612J454145J393510
$$ 38449028 39654555 40840459 42169544 43431133 44787979 46228591 47682736 49076246
4203D9076246J289374J229804J261710J315579J386185J687687J906491K118750
$$ 49076246 50365620 51595424 52857134 54172713 55558898 57246585 59153076 61271826
4195F1271826K164665K155952J997869J726589J550467J323758J367300J324617
$$ 61271826 63436491 65592443 67590312 69316901 70867368 72191126 73558426 74883043
4187G4883043J389419J523780J617622J631784J661093J740902J866688J947669
$$ 74883043 76272462 77796242 79413864 81045648 82706741 84447643 86314331 88262000
4179H8262000K077817K188286K199930K266043K208487K352437K792748L290278
$$ 88262000 90339817 92528103 94728033 96994076 99202563 101555000 104347748 107638026
4171A07638026M017324M564828M819604M832180M428938L645055K763304K099454
$$ 107638026 111655350 116220178 121039782 125871962 130300900 133945955 136709259 138808713
4163A38808713J755689J716926J847304K013975K159922K182869K093174J956470
$$ 138808713 140564402 142281328 144128632 146142607 148302529 150485398 152578572 154535042
4155A54535042J702525J315671R26393O64147N35505L50805M33938P56226J140193
$$ 154535042 156237567 157553238 158479631 159143778 159679283 160030088 160464026 161220252 162360445
4146A62360445J729377K638805L752902N063870O166486P126721P534271P540781
$$ 162360445 164089822 166728627 170481529 175545399 181711885 188838606 196372877 203913658
4138B03913658P266223O827779O595620O395689O310034O107863N846330N569077
$$ 203913658 211179881 218007660 224603280 230998969 237309003 243416866 249263196 254832273
4130B54832273N184510M953866M671382M065223L178406K062064J081846M83534
$$ 254832273 260016783 264970649 269642031 273707254 276885660 278947724 280029570 280513104
4122B80513104L47986Q50920J570181K371712L121653L627601L690918L762199
$$ 280513104 280861090 281712010 283282191 285653903 288775556 292403157 296094075 299856274
4114B99856274L709474L692939L890973M400236N344434O177616O909286O983066
$$ 299856274 303565748 307258687 311149660 315549896 320894330 327071946 333981232 340964298
4106C40964298O517042N389409M089241K938308K223303J989827K065906K042734
$$ 340964298 347481340 352870749 356959990 359898298 362121601 364111428 366177334 368220068
4098C68220068J669097O76818o79376k079741l269648m110705m838467n510178
$$ 368220068 369889165 370565983 369886607 367806866 364537218 360426513 355588046 350077868
4090C50077868o370994p385184q246264q595571q354271p799149o614545n126395
$$ 350077868 343706874 336321690 328075426 319479855 311125584 303326435 296711890 291585495
4082B91585495l577868k364658j861590k109896l070993m176159n382779o153965
$$ 291585495 288007627 285642969 283781379 281671483 278600490 274424331 269041552 262887587
4074B62887587o575076o762785o636475o615087o286217o008710n531042m888307
$$ 262887587 256312511 249549726 242913251 236298164 230011947 224003237 218472195 213583888
4066B13583888m292775l853316l755653m093413m797020n704410o599573p186893
$$ 213583888 209291113 205437797 201682144 197588731 192791711 187087301 180487728 173300835
4058A73300835p319705p014622o491141n891043n276061m752740m421664m235706
$$ 173300835 165981130 158966508 152475367 146584324 141308263 136555523 132133859 127898153
4050A27898153m133412m078862l928653l732474l488232l126944k916155k632541
$$ 127898153 123764741 119685879 115757226 112024752 108536520 105409576 102493421 99860880
4042I9860880k461956k245683k071296j894638j856301j948747j985528k112936
$$ 99860880 97398924 95153241 93081945 91187307 89331006 87382259 85396731 83283795
4034H3283795k244242k444100k456601k361978k284894k091281j972106j845410
$$ 83283795 81039553 78595453 76138852 73776874 71491980 69400699 67428593 65583183
4026F5583183j851048j761814j822391j894308k004847j935806j748422j632123
$$ 65583183 63732135 61970321 60147930 58253622 56248775 54312969 52564547 50932424
4018E0932424j574866j559969j464218j427598j512316j488784j587612j501254
$$ 50932424 49357558 47797589 46333371 44905773 43393457 41904673 40317061 38815807
4010C8815807j428690j455164j371187j278888j080139j045275r36565q97472
$$ 38815807 37387117 35931953 34560766 33281878 32201739 31156464 30219899 29322427
4002B9322427q89472q30705p57570p63566o94977o61659n32036n62757m90912
$$ 29322427 28432955 27602250 26844680 26081114 25386137 24724478 24192442 23629685 23138773
3993B3138773m58460m49826m30955m50492l92163k88893l69581l87794k63184
$$ 23138773 22680313 22230487 21799532 21349040 20956877 20667984 20298403 19910609 19647425
3984A9647425k47046l24781l24366l58245k41905l37579k94433k25178k20791
$$ 19647425 19400379 19075598 18751232 18392987 18151082 17813503 17519070 17293892 17073101
3975A7073101k92151l08741j13722j93889j52674j95357j05412j46164j75762
$$ 17073101 16780950 16472209 16358487 16164598 16011924 15816567 15711155 15564991 15389229
3966A5389229k50534j62635r5391k21191r2370j38047j47529r2067j80860r9713
$$ 15389229 15138695 14976060 14880669 14659478 14567108 14429061 14281532 14189465 14008605 13908892
3956A3908892p7386j35242j52389q0304j26101q6564j04626j05984o8884p9411
$$ 13908892 13831506 13696264 13543875 13463571 13337470 13250906 13146280 13040296 12971412 12892001
3946A2892001j31899r7923j15916p8777p7433m2447k8543q6427j04389q4523o2671
$$ 12892001 12760102 12662179 12546263 12467486 12390053 12347606 12319063 12232636 12128247 12043724 11981053
3935A1981053n8535q3931n8534l5391n2780n2974r7750o9662p6388K7380M352
$$ 11981053 11922518 11838587 11780053 11744662 11691882 11638908 11541158 11471496 11395108 11422488 11426840
3924A1426840j8758K6920J320K215M2337J18804J38002K9137P2629P2920J98296
$$ 11426840 11408082 11435002 11436322 11438537 11480874 11599678 11737680 11766817 11839446 11912366 12110662
3913A2110662J21867J34946J76624J30060J43169J76165J98898K27023K19893
$$ 12110662 12232529 12367475 12544099 12674159 12817328 12993493 13192391 13419414 13639307
3904A3639307J35934K05014J73290J33856K72717K71034J85406J63755J58321
$$ 13639307 13775241 13980255 14153545 14287401 14560118 14831152 15016558 15180313 15338634
3895A5338634J77790J42526J66423J81233J30464L9973N9188J11173Q7343M2416
$$ 15338634 15516424 15658950 15825373 16006606 16137070 16177043 16236231 16347404 16434747 16477163
3885A6477163P1498M1408J4596R9810J36836r5951j50540j11553j30453j15674
$$ 16477163 16548661 16590069 16604665 16704475 16841311 16745360 16594820 16483267 16352814 16237140
3875A6237140j98497j55946k19582j93084k20961k49171j50336k46918j87051
$$ 16237140 16038643 15882697 15663115 15470031 15249070 14999899 14849563 14602645 14415594
3866A4415594k13653k75189k11634j83233j79535k16033k29728k30978k41698
$$ 14415594 14201941 13926752 13715118 13531885 13352350 13136317 12906589 12675611 12433913
3857A2433913j84100j21408j18229k51587j27388p4067J3277p7806q0220K1890
$$ 12433913 12249813 12128405 12010176 11758589 11631201 11557134 11570411 11492605 11412385 11434275
3847A1434275K0711K3554P267M8796L3659Q7727N0995K5411R6182Q1979M0135
$$ 11434275 11454986 11478540 11485807 11534603 11568262 11655989 11706984 11732395 11828577 11910556 11950691
3836A1950691J07494j3163K8699J35357J09565M2521P0410J29936Q9151M7078
$$ 11950691 12058185 12045022 12073721 12209078 12318643 12361164 12431574 12561510 12650661 12697739
3826A2697739j30451p9134L983l2381l5024N4190k7709n1220J3400p2052q5519
$$ 12697739 12567288 12488154 12492137 12459756 12424732 12478922 12451213 12399993 12413393 12341341 12255822
3815A2255822n6858l2972o0716j75554k39360j91675j47143j57400k03135j21266
$$ 12255822 12198964 12165992 12105276 11929722 11690362 11498687 11351544 11194144 10991009 10869743
3805A0869743j28711j74734j02235j53377j31467j95058k42347j81684l35571
$$ 10869743 10741032 10566298 10464063 10310686 10179219 9984161 9741814 9560130 9224559
3796I224559j13297r2206j17842j54931m4260p5948j62728p5849l1519o2103j63957
$$ 9224559 9111262 9019056 8901214 8746283 8702023 8626075 8463347 8387498 8355979 8293876 8129919
3785H129919j04839j39422j53307j31495j52239p2732j65088j16670m1980n589
$$ 8129919 8025080 7885658 7732351 7600856 7448617 7375885 7210797 7094127 7052147 7046558
3775G046558o4562j8902o2719r0454n7888l903o5337l4275K77k7491m9131K7195
$$ 7046558 6981996 6963094 6900375 6809921 6752033 6748130 6682793 6648518 6648795 6621304 6572173 6599368
3763F599368J19852Q6948Q3291K2729m566M1575L9874m0412k5353N3703j8764
$$ 6599368 6719220 6806168 6889459 6912188 6907622 6949197 6989071 6948659 6923306 6977009 6958245
3752F958245n6547j5274J4191J4371J6890N3042L8691M3119l707J06481R2664
$$ 6958245 6901698 6886424 6900615 6914986 6931876 6984918 7023609 7066728 7063021 7169502 7262166
3741G262166M5748l0059k8948M5654L6151P8121L1506n6814O9277Q614N0532n7034
$$ 7262166 7307914 7277855 7248907 7294561 7330712 7408833 7440339 7383525 7452802 7461416 7511948 7454914
3729G454914L4642Q4560N0693N3228R5671N1857J335P8342P7844N1606l1665K7605
$$ 7454914 7489556 7574116 7624809 7678037 7773708 7825565 7826900 7905242 7983086 8034692 8003027 8030632
3717H030632L422o4172O7824O685l0453k065N991R2504J23728J17907J08721N9534
$$ 8030632 8034054 7969882 8037706 8044391 8013938 8011873 8017864 8110368 8234096 8352003 8460724 8520258
3705H520258J29675L9428L8245J30659J00844J73646K36753J58797J59984K07381
$$ 8520258 8649933 8689361 8727606 8858265 8959109 9132755 9369508 9528305 9688289 9895670
3695I895670K14454J44548Q1808J22569J80827R7757J89621J81663J68672K31489
$$ 9895670 10110124 10254672 10336480 10459049 10639876 10737633 10927254 11108917 11277589 11509078
3685A1509078K51342K56795J36823J56042P2662J18783O8374J06815O8333m3901
$$ 11509078 11760420 12017215 12154038 12310080 12382742 12501525 12569899 12676714 12745047 12701146
3675A2701146J01981J21534J43216P5592J22372K26286J99074K32078K22362K94127
$$ 12701146 12803127 12924661 13067877 13143469 13265841 13492127 13691201 13923279 14145641 14439768
3665A4439768K40350J64398J78831J27432K2353l3645J9984M3993L0026P0513
$$ 14439768 14680118 14844516 15023347 15150779 15173132 15139487 15159471 15203464 15233490 15304003
3655A5304003J21815J33003J88440K25779K37094M38146N34333N01954N09875
$$ 15304003 15425818 15558821 15747261 15973040 16210134 16648280 17182613 17684567 18194442
3646A8194442N01947P09216P14030O47779O27253N18448O12063N68309N80657
$$ 18194442 18696389 19405605 20119635 20767414 21394667 21913115 22525178 23093487 23674144
3637B3674144L97416L83077L56401L00723L80089L64897K98336M03780L78071
$$ 23674144 24071560 24454637 24811038 25111761 25491850 25856747 26155083 26558863 26936934
3628B6936934L80423L66982L56845L97240L87592M06649L83583N44792M80103
$$ 26936934 27317357 27684339 28041184 28438424 28826016 29232665 29616248 30161040 30641143
3619C0641143M89462N75985P58462Q82044Q66878J048393J191446J095323J098306
$$ 30641143 31130605 31706590 32465052 33347096 34213974 35262367 36453813 37549136 38647442
3610C8647442J092191J126254J221213J292566J481190J632793J860736K018910
$$ 38647442 39739633 40865887 42087100 43379666 44860856 46493649 48354385 50373295
3602E0373295K315804K736659L052591L523274L840763M097785M371279M405556
$$ 50373295 52689099 55425758 58478349 62001623 65842386 69940171 74311450 78717006
3594G8717006M306217M104169L610795K915029J988041P84517m22868j639967
$$ 78717006 83023223 87127392 90738187 93653216 95641257 96425774 96002906 94362939
3586I4362939k565018l214757l729083l858720l854489l760923l571081l243178
$$ 94362939 91797921 88583164 84854081 80995361 77140872 73379949 69808868 66565690
3578F6565690l127063k997908k808873k726740k683784k558286k551699k409727
$$ 66565690 63438627 60440719 57631846 54905106 52221322 49663036 47111337 44701610
3570D4701610k237741k278318k053616j906564j833696j617439j547515j589672
$$ 44701610 42463869 40185551 38131935 36225371 34391675 32774236 31226721 29637049
3562B9637049j425770j393476j186003j118396j017788q51196q17470p31759o17022
$$ 29637049 28211279 26817803 25631800 24513404 23495616 22644420 21826950 21095191 20478169
3553B0478169n91538n44514m67610m29871m51341l52049k95583k57196k13376
$$ 20478169 19886631 19342117 18874507 18444636 17993295 17641246 17345663 17088467 16875091
3544A6875091j39747o7445M186O0862M0703K7310J1363j33510j08496l43237m51410
$$ 16875091 16735344 16667899 16672085 16732947 16773650 16800960 16812323 16678813 16570317 16227080 15775670
3533A5775670m63931n03746n14114m63489l92817l66509l38078k48797k08657
$$ 15775670 15311739 14807993 14293879 13830390 13437573 13071064 12732986 12484189 12275532
3524A2275532j95191m9728p3452l6633M7508P7377L1943m9787j20659k66458l60855
$$ 12275532 12080341 12030613 11957161 11920528 11968036 12045413 12077356 12027569 11906910 11640452 11279597
3513A1279597m31632m44520m54508m60895l84875l18392k34995l15620j14985
$$ 11279597 10847965 10403445 9948937 9488042 9103167 8784775 8549780 8234160 8119175
3504H119175q1306m2327n3995K293M9481k426m2205P658j02436q7908j68510j72623
$$ 8119175 8037869 7995542 7941547 7943840 7993321 7990895 7948690 7956348 7853912 7766004 7597494 7424871
3492G424871k35493j29894j70144j88851j22166j04221K4282L799K8381L6094
$$ 7424871 7189378 7059484 6889340 6700489 6578323 6474102 6498384 6502183 6530564 6566658
3482F566658J87875J95619N7365J69139K48795J00736J30151R8385m1539r9230
$$ 6566658 6754533 6950152 7007517 7176656 7425451 7526187 7656338 7754723 7713184 7613954
3472G613954q8874k05712k89188k65855l71225k75998k61271k34407j62922j36715
$$ 7613954 7525080 7319368 7030180 6764325 6393100 6117102 5855831 5621424 5458502 5321787
3462E321787j8738j1605j263K5023J6702O2630M0224R0354R7081O8019K2439m9201
$$ 5321787 5303049 5291444 5290181 5315204 5331906 5394536 5434760 5525114 5622195 5690214 5712653 5663452
3450E663452j23039j86608j14841j71615r7012p7442O7747l3763K1858K39592
$$ 5663452 5540413 5353805 5238964 5067349 4970337 4892895 4960642 4926879 4948737 5188329
3440E188329J60105K06868K23163K25445K22881J95258O8526j8642j35343j88509
$$ 5188329 5348434 5555302 5778465 6003910 6226791 6422049 6490575 6471933 6336590 6148081
3430F148081j61048k21366k65379j60805j39870R165r3534m7252K3194J03831
$$ 6148081 5987033 5765667 5500288 5339483 5199613 5208778 5115244 5067992 5091186 5195017
3420E195017J05318J34445J32017L7648n299q362j00226k43394j97419k39057
$$ 5195017 5300335 5434780 5566797 5604445 5599146 5590784 5490558 5247164 5049745 4810688
3410D810688k05560k71949k40808k39206j63732r7860r9041j14668o1523p5981
$$ 4810688 4605128 4333179 4092371 3853165 3689433 3591573 3492532 3377864 3316341 3240360
3400C240360l071r190n3334o1892J8775j1515j0369p6945j2746R1973M0509K9354
$$ 3240360 3237289 3228099 3174765 3112873 3131648 3120133 3109764 3032819 3020073 3112046 3152555 3181909
3388C181909m9965O0264L0940L1040J47910J24584J11887O0997J36214J34744
$$ 3181909 3131944 3192208 3223148 3254188 3402098 3526682 3638569 3699566 3835780 3970524
3378C970524J12461J14458J07821J14586J42169M7440M2113p3723m6600k0089
$$ 3970524 4082985 4197443 4305264 4419850 4562019 4609459 4651572 4577849 4531249 4511160
3368D511160m6362j07375j10639j03302n720J234J0849O4421J7391R8660J33708
$$ 4511160 4464798 4357423 4246784 4143482 4137762 4138996 4149845 4214266 4231657 4330317 4464025
3357D464025j261J17715J20182m368N0765Q8481n5130K8400R5516O6155J43310
$$ 4464025 4462764 4580479 4700661 4696293 4747058 4835539 4780409 4808809 4904325 4970480 5113790
3346E113790O5473M9460O2851J2478k6237l0399j00419j02047q6959j76400j12457
$$ 5113790 5179263 5228723 5291574 5304052 5277815 5247416 5146997 5044950 4957991 4781591 4669134
3335D669134O298P547Q3603N3871k0280j986K1943r510L5123Q0912J0741L7544
$$ 4669134 4675432 4682979 4766582 4820453 4800173 4798187 4820130 4810620 4845743 4926655 4937396 4974940
3323D974940K6423k7012Q165O7405N9685J44342j161l5775J10640J02132J79761
$$ 4974940 5001363 4974351 4982516 5049921 5109606 5253948 5252787 5217012 5327652 5429784 5609545
3312E609545J45601L54797J97492K88921J66285J37898J19548J07112P8816J11121
$$ 5609545 5755146 6109943 6307435 6596356 6762641 6900539 7020087 7127199 7206015 7317136
3302G317136J07894M5215O1172J48993J83228K39644L50789K91598M10169M27181
$$ 7317136 7425030 7470245 7531417 7680410 7863638 8103282 8454071 8745669 9155838 9583019
3292I583019N13853O19438O45223O36725P32034R16493R58361J064645J205564
$$ 9583019 10096872 10716310 11361533 11998258 12730292 13646785 14605146 15669791 16875355
3283A6875355J308099J499503J576981J583300J650416J566641J438062J233726
$$ 16875355 18183454 19682957 21259938 22843238 24493654 26060295 27498357 28732083
3275B8732083P98495M37622J39515j08415k46077k37482j80575j55611j05150
$$ 28732083 29530578 29968200 30107715 29999300 29753223 29515741 29335166 29179555 29074405
3266B9074405j22832J6206R1376J41471J71278L03031M61797O03554P02403P76657
$$ 29074405 28951573 28967779 29059155 29200626 29371904 29674935 30136732 30740286 31442689 32219346
3256C2219346J004372J213781J776661K455228L441507M565220N567339N476672
$$ 32219346 33223718 34437499 36214160 38669388 42110895 46676115 52243454 57720126
3248E7720126M440146K477406m99230l353478n251548n722375n417567m738681
$$ 57720126 62160272 64637678 64138448 60784970 55533422 49811047 44393480 39654799
3240C9654799m051045l074128k475009j855183j453721j200383j007333q24724
$$ 39654799 35603754 32529626 30054617 28199434 26745713 25545330 24537997 23713273
3232B3713273o53748n63332l72357j33129p4834N5335J84698J97394L67868M83253
$$ 23713273 23059525 22496193 22123836 21990707 21915873 21971208 22155906 22353300 22721168 23204421
3222B3204421P55962P79563Q59502Q97739N78024J76438l11574q50041j361658
$$ 23204421 23960383 24739946 25599448 26497187 27075211 27251649 26940075 26090034 24728376
3213B4728376j718037j764635j847506j728538j531343j292742j197383j022249
$$ 24728376 23010339 21245704 19398198 17669660 16138317 14845575 13648192 12625943
3205A2625943r20168p59292o72927o62435n47527o23057n39491m19712m95953
$$ 12625943 11705775 10946483 10273556 9611121 9063594 8440537 7901046 7481334 6985381
3196F985381m08355m14659l27452l27367l11508l06226k26205k25030l12789j99027
$$ 6985381 6577026 6162367 5834915 5507548 5196040 4889814 4663609 4438579 4125790 3926763
3186C926763k21865k00780k14013j54904j21086q9926j13613j02917r0714j26882
$$ 3926763 3704898 3504118 3290105 3135201 3014115 2924189 2810576 2707659 2616945 2490063
3176B490063r5439j40750o8614j26279j24615j10142j53886m9743p3987j45958
$$ 2490063 2394624 2253874 2185260 2058981 1934366 1824224 1670338 1620595 1546608 1400650
3166A400650p3462o3568j06596o7120M0265o224j15035p4489m2663J7126p1521
$$ 1400650 1327188 1263620 1157024 1089904 1130169 1123945 1008910 934421 891758 908884 837363
3155H37363n3204l4745p5934j0569p1831J0200k5707o6046q3556j3205M671k6349
$$ 837363 784159 749414 673480 662911 591080 601280 575573 509527 425971 412766 417437 391088
3143C91088j14104j4803l6143k9570O9023k4588l6224n9044O9257L7910o4718
$$ 391088 276984 262181 226038 196468 265491 240903 204679 145635 214892 252802 188084
3132A88084o1041n1680M357o3669p120n0350m7231O29Q393r4028k0146K0495n4724
$$ 188084 127043 75363 79720 16051 8931 -41419 -88650 -88021 -79628 -173656 -193802 -173307 -228031
3119b28031K6266l8926m9868o845M4089j3057l5829l5298k4756o4862N038Q333
$$ -228031 -201765 -240691 -290559 -297404 -253315 -266372 -302201 -337499 -362255 -427117 -422079 -413746
3107d13746l7118r797n3949n3807j7292K5112N4552l2117K873K89q6206J7765
$$ -413746 -450864 -460661 -514610 -568417 -585709 -560597 -506045 -538162 -535289 -535000 -621206 -603441
3095f03441o5876n0771N3262k8716m8978J3742N3679m378o8660l7506N9107L3031
$$ -603441 -669317 -720088 -666826 -695542 -744520 -730778 -677099 -681477 -750137 -787643 -728536 -695505
3083f95505k5040j06013L3326j9649P3249k9029Q545Q128j4876P5032n5176j30930
$$ -695505 -720545 -826558 -793232 -812881 -739632 -768661 -760116 -751988 -766864 -691832 -747008 -877938
3071h77938K2333M3323R627k398O676j7447q04R1247m34r1195k5521j8249j9938
$$ -877938 -855605 -812282 -802655 -805053 -798377 -815824 -816628 -725381 -725815 -817010 -842531 -860780 -880718
3058h80718Q154L7928o3155j7120k8500K3571r73K631J9465k2299K4830p1472
$$ -880718 -872564 -834636 -897791 -914911 -943411 -919840 -920813 -918182 -898717 -921016 -896186 -967658
3046i67658n0488Q2991K9962p33L2933l0819l4739J2021j613o5989M4164M8920
$$ -967658 -1018146 -935155 -905193 -905926 -872993 -903812 -938551 -926530 -928143 -994132 -949968 -901048
3034i01048o1406N7089L7695n0699N414K315L3656L4213j5020K2692O9195m9300
$$ -901048 -962454 -905365 -867670 -918369 -912955 -910640 -876984 -842771 -857791 -835099 -765904 -815204
3022h15204j8829j9891J13953l818m7416N156P4583j4967K8473O1427n6294O1585
$$ -815204 -834033 -853924 -739971 -743789 -791205 -786049 -711466 -726433 -697960 -636533 -692827 -631242
3010f31242L2871M2913P7643p4867l3855K0119L114p324L7108j0080n8702J8767
$$ -631242 -598371 -555458 -477815 -552682 -586537 -566418 -563304 -570628 -533520 -543600 -602302 -583535
2998e83535L3812k6332J2855r540o9676J9049Q7407J5349j4951l8895o667N920
$$ -583535 -549723 -576055 -563200 -572740 -642416 -623367 -535960 -520611 -535562 -574457 -581124 -575204
2986e75204Q0552O6155n4010o1115J01198K9962M9982K8125N7628J01905L9888
$$ -575204 -494652 -428497 -482507 -543622 -442424 -412462 -362480 -334355 -276727 -174822 -134934
2975a34934L0110o8459P5070N3230N2470N4363r117L7415K3792l003J2826M1060
$$ -134934 -104824 -173283 -98213 -44983 7487 61850 52733 90148 113940 110937 123763 164823
2963A64823r339r4834j25980p0489p6321q9537q7853o7664m220n0944o3321m2450
$$ 164823 155484 60650 -65330 -135819 -212140 -301677 -389530 -457194 -461414 -512358 -575679 -618129
2951f18129L9762M2369J1400l6888n5701j1023p133k1377J18018J30519P5076
$$ -618129 -578367 -535998 -524598 -561486 -617187 -628210 -635343 -656720 -538702 -408183 -333107
2940c33107j2475Q2850M6446J6345L7534J4999Q921k0363p8564n5332j1512m5821
$$ -333107 -345582 -262732 -216286 -199941 -162407 -147408 -138487 -158850 -237414 -292746 -304258 -350079
2928c50079m4437o1219q6531l3738o5607j16922n057n8721J6116l7746q6130k8336
$$ -350079 -394516 -455735 -542266 -576004 -641611 -758533 -763590 -822311 -806195 -843941 -930071 -958407
2916i58407O0128m058m3230l8738l6948L1630L564K3871r7891o1180O9922N3797
$$ -958407 -898279 -902337 -945567 -984305 -1021253 -989623 -986059 -962188 -1060079 -1121259 -1051337 -997540
2904i97540N7329K3192L4466o4741n5437J0888K3776p686j6046m9771q4612K771
$$ -997540 -940211 -917019 -882553 -947294 -1002731 -991843 -968067 -975753 -991799 -1041570 -1126182 -1123411
2892a123411o141J1858n2873r2550J6599L1891n9314n276Q5626k3497j8247J9866
$$ -1123411 -1129552 -1117694 -1170567 -1263117 -1246518 -1214627 -1273941 -1279217 -1193591 -1217088 -1235335 -1215469
2880a215469j7181n3066j1090J2835k3037K2890j1086j8410M934J6017M9013K2254
$$ -1215469 -1232650 -1285716 -1296806 -1283971 -1307008 -1284118 -1295204 -1313614 -1308680 -1292663 -1243650 -1221396
2868a221396j0677q2234P526K7468k891m661q877M9614p3971o214j4533Q704K6268
$$ -1221396 -1232073 -1314307 -1306781 -1279313 -1282204 -1286865 -1295742 -1246128 -1320099 -1326313 -1340846 -1332142 -1305874
2855a305874L4232m5523j9502J8612L1891k1151m5017L3151l3593o477M9548L528
$$ -1305874 -1271642 -1317165 -1336667 -1318055 -1286164 -1307315 -1352332 -1319181 -1352774 -1359251 -1309703 -1306175
2843a306175q7380j1140P9617l6548l8822m7659K5938k8473n3573R7449M4894
$$ -1306175 -1393555 -1404695 -1325078 -1361626 -1400448 -1448107 -1422169 -1450642 -1504215 -1406766 -1361872
2832a361872k5088q3102k8552J9973N8550J9338L6134k4219q6653M0348p364j5115
$$ -1361872 -1386960 -1470062 -1498614 -1478641 -1420091 -1400753 -1364619 -1388838 -1475491 -1435143 -1442507 -1457622
2820a457622Q008L5599L412l3480k4126L2520o902J9218L6044M0925N50l1673
$$ -1457622 -1449614 -1414015 -1410603 -1444083 -1468209 -1435689 -1442591 -1423373 -1387329 -1346404 -1345854 -1377527
2808a377527l9231j1023k3888j6806M7907j7840K3301n5672J6233L200N606K4774
$$ -1377527 -1416758 -1427781 -1451669 -1468475 -1420568 -1438408 -1415107 -1470779 -1454546 -1451346 -1445740 -1420966
2796a420966k4969L409N3957Q2865n2724n3989J4231j9989M1968J644J9696m2474
$$ -1420966 -1445935 -1442526 -1388569 -1305704 -1358428 -1412417 -1398186 -1418175 -1376207 -1374563 -1354867 -1397341
2784a397341l0651O4938k3941P975N3245m0684m0291n547M011j9832j00456O201
$$ -1397341 -1427992 -1363054 -1386995 -1379020 -1325775 -1366459 -1406750 -1412297 -1408286 -1428118 -1528574 -1522373
2772a522373M0106k9770Q9738M7819l3758j9433k1780J4011K1446K3298j6942
$$ -1522373 -1482267 -1512037 -1422299 -1374480 -1408238 -1427671 -1449451 -1435440 -1413994 -1390696 -1407638
2761a407638K3650L8069o4198j8839N666J2696o937R960n5276L5935L381J8108
$$ -1407638 -1383988 -1345919 -1410117 -1428956 -1423290 -1410594 -1417531 -1407571 -1462847 -1426912 -1423531 -1405423
2749a405423M491m984k0860l6849O1296L208L0717k4750o4873M1361O810l5266
$$ -1405423 -1400932 -1405916 -1426776 -1463625 -1402329 -1399121 -1368404 -1393154 -1458027 -1416666 -1409856 -1445122
2737a445122l9010m4107K8899K9542J0158K3844N2490j9046N2734l6876J1265
$$ -1445122 -1484132 -1528239 -1499340 -1469798 -1459640 -1435796 -1383306 -1402352 -1349618 -1386494 -1375229
2726a375229J19372l4286o8630O279K2808j3348k2653K3191j3240m5371Q225J2817
$$ -1375229 -1255857 -1290143 -1358773 -1352494 -1329686 -1343034 -1365687 -1342496 -1355736 -1401107 -1392882 -1380065
2714a380065L5647o1743j5269L3931j4970J8488L9687k9894l2283k0343K8888
$$ -1380065 -1344418 -1406161 -1421430 -1387499 -1402469 -1383981 -1344294 -1374188 -1406471 -1426814 -1397926
2703a397926J1821r224j2490m1112O4665J8121K3058p9048l356J373l1527K2835
$$ -1397926 -1386105 -1395329 -1407819 -1448931 -1384266 -1366145 -1343087 -1422135 -1425491 -1424118 -1455645 -1432810
2691a432810M833J8709k2732o920J516j4826N4661j6583L6960m3829L1640J5834
$$ -1432810 -1427977 -1409268 -1432000 -1438920 -1437404 -1452230 -1397569 -1414152 -1377192 -1421021 -1389381 -1373547
2679a373547m8653o036l2938L1386Q189j3365n1601o798L7936L2360L2277k0806
$$ -1373547 -1422200 -1428236 -1461174 -1429788 -1421599 -1434964 -1486565 -1493363 -1455427 -1423067 -1390790 -1411596
2667a411596q4712r635Q2092L8910K710j6386m7309m4998J45K4367J3943O4270
$$ -1411596 -1496308 -1505943 -1423851 -1384941 -1382231 -1398617 -1445926 -1490924 -1490779 -1466412 -1452469 -1388199
2655a388199k1689K0021J2133k0586l5471n1817J6420Q0353n0002M2818J0570
$$ -1388199 -1409888 -1389867 -1377734 -1398320 -1433791 -1485608 -1469188 -1388835 -1438837 -1396019 -1385449
2644a385449K1194k7657Q49k7960l8912p3724j601L8273j5469N2357K7790P189
$$ -1385449 -1364255 -1391912 -1391063 -1419023 -1457935 -1531659 -1533260 -1494987 -1510456 -1458099 -1430309 -1423120
2632a423120m022P456r269r257j4971M0144L0409l5957Q053M0623n3461j729j0523
$$ -1423120 -1427142 -1419686 -1428955 -1438212 -1453183 -1413039 -1382630 -1418587 -1410534 -1369911 -1423372 -1425101 -1435624
2619a435624l0666R138P4365K0506m1405k3378j5815K5100K5470q5277K5688J17461
$$ -1435624 -1466290 -1457152 -1382787 -1362281 -1403686 -1427064 -1442879 -1417779 -1392309 -1477586 -1451898 -1334437
2607a334437m2685K1393P8348k1903o5724m5717l0624O4569P4856l8630j2253
$$ -1334437 -1377122 -1355729 -1277381 -1299284 -1365008 -1410725 -1441349 -1376780 -1301924 -1340554 -1352807
2596a352807k6789K3868m6873O565m8050M549l0868N488O3913L4208Q744O589
$$ -1352807 -1379596 -1355728 -1402601 -1396036 -1444086 -1439537 -1470405 -1464917 -1401004 -1366796 -1358052 -1351463
2584a351463m9248N3601o7215N2528j6301l1980J6317N1770k2702o475J3696P531
$$ -1351463 -1400711 -1347110 -1414325 -1361797 -1378098 -1410078 -1393761 -1341991 -1364693 -1371168 -1357472 -1349941
2572a349941L8720j05089N1610L325k1361j1695o08k8232L2556J6550j6997L6812
$$ -1349941 -1311221 -1416310 -1364700 -1361375 -1382736 -1394431 -1395039 -1423271 -1390715 -1374165 -1391162 -1354350
2560a354350l3196m5082P7250M0182J6922l7673L7475l0990Q8145K8782n2036
$$ -1354350 -1387546 -1432628 -1355378 -1315196 -1298274 -1335947 -1298472 -1329462 -1241317 -1212535 -1264571
2549a264571k4437K3809J2658k1691n8814M3423q992j6560J4408L8152M311P4512
$$ -1264571 -1289008 -1265199 -1252541 -1274232 -1333046 -1289623 -1298615 -1315175 -1300767 -1262615 -1258304 -1183792
2537a183792O193q6344M7917L6094o3082j4974j4829J6181k36K2763m8578J1319
$$ -1183792 -1177599 -1263943 -1216026 -1179932 -1243014 -1257988 -1272817 -1256636 -1256872 -1234109 -1282687 -1271368
2525a271368M5286m0917l3388j4483j3287o386r61R7012P7356k7125M2042n9333
$$ -1271368 -1226082 -1266999 -1300387 -1314870 -1328157 -1334543 -1335504 -1238492 -1161136 -1188261 -1146219 -1205552
2513a205552j8685L2083Q861k7769O6785K0241R314k8854m1763k5281O5082o228
$$ -1205552 -1224237 -1192154 -1183293 -1211062 -1144277 -1124036 -1114722 -1143576 -1185339 -1210620 -1145538 -1151766
2501a151766M4859N6474K3338j1341j0118K315O025K3425l7989r418R6948K3819
$$ -1151766 -1106907 -1050433 -1027095 -1038436 -1048554 -1046239 -1040214 -1016789 -1054778 -1064196 -967248 -943429
2489i43429K4391k9303M0639J4176P8297P4494L4138m360n6269J03099N7973L4137
$$ -943429 -919038 -948341 -907702 -893526 -815229 -740735 -706597 -710957 -767226 -664127 -606154 -572017
2477e72017N1810J39245K01974J93943J50160J52571J48052K53910K49298J71317
$$ -572017 -520207 -380962 -178988 14955 165115 317686 465738 719648 968946 1140263
2467A140263K86883J76591K63266L55833L71853N57600N92468R64087J385315
$$ 1140263 1427146 1603737 1867003 2222836 2594689 3152289 3744757 4708844 6094159
2458F094159K096331K942407M041764L677940L049759J775468q82123k901859
$$ 6094159 8190490 11132897 15174661 18852601 21902360 23677828 22795705 19893846
2450A9893846m091875l762092k833348k302884j844034j274731q61115n66370
$$ 19893846 15801971 12039879 9206531 6903647 5059613 3784882 2923767 2357397
2442B357397m56737k82258j86806j82161j18824k02427k25114j26088k23033k04625
$$ 2357397 1900660 1618402 1431596 1249435 1130611 928184 703070 576982 353949 149324
2432A49324j94604o5691l6514r6898l3902k0254p3581p1134N045p5710n4329q5592
$$ 149324 -45280 -110971 -147485 -244383 -278285 -298539 -372120 -443254 -438209 -513919 -568248 -653840
2420f53840j3491m3515n4301j08053K524O0915p3917k9156J2884q420m7420o461
$$ -653840 -667331 -710846 -765147 -873200 -870676 -809761 -883678 -912834 -899950 -908370 -955790 -962251
2408i62251k9912p9397l6590N9657L8269r586J1817p2425l9887L8464L820k7813
$$ -962251 -992163 -1071560 -1108150 -1048493 -1010224 -1019810 -1007993 -1080418 -1120305 -1081841 -1078021 -1105834
2396a105834m6301J8143j3015j1005r932L5539p8727n5199P1737O5170j02371
$$ -1105834 -1152135 -1133992 -1147007 -1158012 -1167944 -1132405 -1211132 -1266331 -1194594 -1129424 -1231795
2385a231795j0563j292m4250M1510j3003o2658l4297n246Q8135K2351r1724k0850
$$ -1231795 -1242358 -1243650 -1287900 -1246390 -1259393 -1322051 -1356348 -1361594 -1273459 -1251108 -1342832 -1363682
2373a363682M9622j3239L8809l4775O029K5574o4902l5661Q538n769n5482m049
$$ -1363682 -1314060 -1327299 -1288490 -1323265 -1317236 -1291662 -1356564 -1392225 -1383687 -1389456 -1444938 -1448987
2361a448987M7943O5037J5345N9451q7970o9619N3911L5433L4559l4399q918j8406
$$ -1448987 -1401044 -1336007 -1320662 -1261211 -1349181 -1418800 -1364889 -1329456 -1294897 -1329296 -1338214 -1356620
2349a356620m3487j1194K7709M2061j6366k3202k1918N6568P825n3752Q491P583
$$ -1356620 -1400107 -1411301 -1383592 -1341531 -1357897 -1381099 -1403017 -1346449 -1338624 -1392376 -1383885 -1376302
2337a376302p1846L8399O4138K7169n1080j6984Q0080k759q4954N2757J8780l6964
$$ -1376302 -1448148 -1409749 -1345611 -1318442 -1369522 -1386506 -1306426 -1309185 -1394139 -1341382 -1322602 -1359566
2325a359566n761m6220j2672m7589J7309Q1936Q7981o5338o9639M7674l3523M2442
$$ -1359566 -1365327 -1411547 -1424219 -1471808 -1454499 -1372563 -1284582 -1349920 -1419559 -1371885 -1405408 -1362966
2313a362966n1081r716o9375k342P4967o4358N722K0649l3291R004J4065j0505
$$ -1362966 -1414047 -1423763 -1493138 -1495480 -1420513 -1484871 -1479149 -1458500 -1491791 -1482787 -1468722 -1479227
2301a479227J19796l4193o5304k7119j5731L7531L2700J2219k7562L7851R439
$$ -1479227 -1359431 -1393624 -1458928 -1486047 -1501778 -1464247 -1431547 -1419328 -1446890 -1409039 -1399600
2290a399600k2908n656j3724K0213j2447r999N9599l3682R885l6784J9953J7493
$$ -1399600 -1422508 -1428164 -1441888 -1421675 -1434122 -1444121 -1384522 -1418204 -1408319 -1445103 -1425150 -1407657
2278a407657j834L6589p9418J03702J148k6945r00k9676m9371l2410K3721o6645
$$ -1407657 -1409491 -1372902 -1452320 -1348618 -1347470 -1374415 -1375315 -1404991 -1454362 -1486772 -1463051 -1529696
2266a529696O5239O1056m1165k6614L1529j8201j6522m619K4975J3343k3075L0064
$$ -1529696 -1464457 -1403401 -1444566 -1471180 -1439651 -1457852 -1474374 -1478993 -1454018 -1440675 -1463750 -1433686
2254a433686j3619N166n930J167J6717J5145K5285n3570J772k6736p9493L0820
$$ -1433686 -1447305 -1442139 -1448069 -1446902 -1430185 -1415040 -1389755 -1443325 -1441553 -1468289 -1547782 -1516962
2242a516962K1263l4627j7705j907n540L2420k959J3089P5291M3566K2975l616
$$ -1516962 -1495699 -1530326 -1548031 -1549938 -1555478 -1523058 -1526017 -1512928 -1437637 -1394071 -1371096 -1374712
2230a374712j5287p8895m8780K3033J0044L0340j630k7456K0076j0948j0436P603
$$ -1374712 -1389999 -1468894 -1517674 -1494641 -1484597 -1454257 -1455887 -1483343 -1463267 -1474215 -1484651 -1477048
2218a477048Q425J9265r8515J0171j750M5080M7831L748o1311J4824j3400J7671
$$ -1477048 -1468623 -1449358 -1547873 -1537702 -1539452 -1494372 -1446541 -1442793 -1504104 -1489280 -1502680 -1485009
2206a485009K3577P198j9484j1213j1602n4530n267J7599Q0301O3720m226l6509
$$ -1485009 -1461432 -1454234 -1473718 -1484931 -1496533 -1551063 -1556330 -1538731 -1458430 -1394710 -1398936 -1435445
2194a435445M9817p1694p0511q0794L6922P3262K8122q886L0615J6894L1808J5694
$$ -1435445 -1385628 -1457322 -1527833 -1608627 -1571705 -1498443 -1470321 -1479207 -1448592 -1431698 -1399890 -1384196
2182a384196J082N347N046R648l1383j4846m6415L282k807j5128o261K1569n9247
$$ -1384196 -1383114 -1377767 -1372721 -1363073 -1394456 -1409302 -1455717 -1452435 -1455242 -1470370 -1476631 -1455062 -1514309
2169a514309M0301J7522p8111m1166K1372P2956l8143M3927l9818l5917K2549
$$ -1514309 -1474008 -1456486 -1534597 -1575763 -1554391 -1481435 -1519578 -1475651 -1515469 -1551386 -1528837
2158a528837L3211N021J6493K7867j8021K9820K7596m7070o2044N213K9504n894
$$ -1528837 -1495626 -1490605 -1474112 -1446245 -1464266 -1434446 -1406850 -1453920 -1515964 -1510751 -1481247 -1487141
2146a487141n884J5802q380J8576l6138K7560p819l7148m4206K7979N4812m0772
$$ -1487141 -1493025 -1477223 -1485603 -1467027 -1503165 -1475605 -1483424 -1520572 -1564778 -1536799 -1481987 -1522759
2134a522759M5254k8219m7794L6250N0052R719k7011p219L7195l5836j3007Q696
$$ -1522759 -1477505 -1505724 -1553518 -1517268 -1467216 -1457497 -1484508 -1491727 -1454532 -1490368 -1503375 -1494679
2122a494679k5694k8392N0677O9280l4487K4504J7486j491m5323k8090J6167r721
$$ -1494679 -1520373 -1548765 -1498088 -1428808 -1463295 -1438791 -1421305 -1422796 -1468119 -1496209 -1480042 -1489763
2110a489763p1218J00286L581j00883R1001k7224n450j6897L4452j6770j9684
$$ -1489763 -1560981 -1460695 -1457114 -1557997 -1466996 -1494220 -1499670 -1516567 -1482115 -1498885 -1518569
2099a518569L2108L2443m5143n9412Q9047j2842N1375n2799m6528k4239O2914
$$ -1518569 -1486461 -1454018 -1499161 -1558573 -1469526 -1482368 -1430993 -1483792 -1530320 -1554559 -1491645
2088a491645K3857l5017k494M6375m9530o7803O1672N0006N1795k7963r9415J9551
$$ -1491645 -1467788 -1502805 -1505299 -1458924 -1508454 -1576257 -1514585 -1464579 -1412784 -1440747 -1540162 -1520611
2076a520611M7694j4038K3372N0392l244n2690J3338N2827l4390q3859k8841L5722
$$ -1520611 -1472917 -1486955 -1463583 -1413191 -1416435 -1469125 -1455787 -1402960 -1437350 -1521209 -1550050 -1514328
2064a514328R5673n5605p0066J3009K701L4411M8968k9209J2035k4788K1346K3643
$$ -1514328 -1418655 -1474260 -1544326 -1531317 -1528616 -1494205 -1445237 -1474446 -1462411 -1487199 -1465853 -1442210
2052a442210O4481k9124m6526l4632K358L0571l5488n9809M9145n5288m197N3130
$$ -1442210 -1377729 -1406853 -1453379 -1488011 -1485653 -1455082 -1490570 -1550379 -1501234 -1556522 -1560719 -1507589
2040a507589L1724l8403k2454k6571L6225N6857k3794J0114L7571j4933k1997
$$ -1507589 -1475865 -1514268 -1536722 -1563293 -1527068 -1470211 -1494005 -1483891 -1446320 -1461253 -1483250
$$ [...]
##END NTUPLES=NMR SPECTRUM
##END=
