##TITLE=1H_DE-80H_X3
 200.13MHz, d2o
 8 sc
 
 19ns.26.2.2025
##JCAMPDX= 6.0         $$ Bruker NMR JCAMP-DX V2.0
##DATA TYPE= NMR SPECTRUM
##DATA CLASS= NTUPLES
##ORIGIN= UXNMR, Bruker Analytische Messtechnik GmbH
##OWNER= pz
$$ XWIN-NMR		Version 3.5
$$ Wed Mar  4 11:41:29 2026 Russian Standard Time (UT+4h)  Yarkov@DPX200
##.OBSERVE FREQUENCY= 200.1313
##.OBSERVE NUCLEUS= ^1H
##.ACQUISITION MODE= SIMULTANEOUS
##.ACQUISITION SCHEME= undefined
##.AVERAGES= 8
##.DIGITISER RES= 18
##SPECTROMETER/DATA SYSTEM= spect
##.PULSE SEQUENCE= zg30
##.SOLVENT NAME= CDCl3
##.SHIFT REFERENCE= (INTERNAL, CDCl3, 0, 15.3029)
##AUDIT TRAIL= $$ (NUMBER, WHEN, WHO, WHERE, WHAT)
$$ ##TITLE= Audit trail, XWIN-NMR		Version 3.5
$$ ##JCAMPDX= 5.01
$$ ##ORIGIN= Bruker BioSpin GmbH
$$ ##OWNER= Yarkov
$$ C:/Bruker/XWIN-NMR/data/yarkov2/nmr/H-C/1/pdata/1/auditp.txt
$$ ##AUDIT TRAIL=  $$ (NUMBER, WHEN, WHO, WHERE, WHAT)
(   1,<2026-03-04 11:40:32.93 +0400>,<Yarkov>,<DPX200>,
      <created by zg, POWCHK disabled, PULCHK disabled
       configuration hash MD5:
       00 E9 B6 7A A2 85 ED C7 34 08 36 98 17 FE 4E 26
       data hash MD5: 16K
       A2 CB 93 64 15 A1 0E CC 4A B2 BE 6B F6 DE 4C 3A>)
(   2,<2026-03-04 11:40:37.62 +0400>,<Yarkov>,<DPX200>,
      <Start of raw data processing
       efp BC_mod = 2 LB = 0.25 FT_mod = 6 PKNL = 1 PHC0 = -5299.748 PHC1 = 6.821927 SI = 16K 
       data hash MD5: 16K
       6E F5 E0 5A 5B 87 64 D9 63 6E 9D 11 7D 35 DC EA>)
(   3,<2026-03-04 11:40:48.43 +0400>,<Yarkov>,<DPX200>,
      <abs ABSG = 5 
       data hash MD5: 16K
       62 F9 BF 2A AD 68 55 E7 39 66 DE FD 23 E5 F1 52>)
$$ ##END=
$$ 
$$ hash MD5
$$ EE 06 AA 5E DC E9 3B 46 F6 95 15 68 60 15 BD 69
##$RELAX= 
##$RELAX= 
##$RELAX= 
##$RELAX= 
##$RELAX= 
##$RELAX= 
$$ Bruker specific parameters
$$ --------------------------
##$DU= <C:/Bruker/XWIN-NMR>
##$EXPNO= 1
##$NAME= <H-C>
##$PROCNO= 1
##$TYPE= <nmr>
##$USER= <yarkov2>
##$AMP= (0..31)
100 100 100 100 100 100 100 100 100 100 100 100 100 100 100 100 100 100 
100 100 100 100 100 100 100 100 100 100 100 100 100 100 
##$AQSEQ= 0
##$AQ_mod= 1
##$AUNM= <au_zg>
##$AUTOPOS= <>
##$BF1= 200.13
##$BF2= 200.13
##$BF3= 200.13
##$BF4= 200.13
##$BF5= 200.13
##$BF6= 200.13
##$BF7= 200.13
##$BF8= 200.13
##$BYTORDA= 1
##$CFDGTYP= 0
##$CFRGTYP= 5
##$CHEMSTR= <none>
##$CNST= (0..31)
1 1 145 1 1 1 1 1 1 1 1 1 1 1 1 1 1 1 1 1 1 1 1 1 1 1 1 1 1 1 1 1 
##$CPDPRG= <>
##$CPDPRG1= <>
##$CPDPRG2= <>
##$CPDPRG3= <>
##$CPDPRG4= <mlev>
##$CPDPRG5= <mlev>
##$CPDPRG6= <mlev>
##$CPDPRG7= <mlev>
##$CPDPRG8= <mlev>
##$CPDPRGB= <>
##$CPDPRGT= <>
##$D= (0..31)
0 0.7 0 0 0 0 0 0 0 0 0 0.03 0 0 0 0 0 0 0 0 0 0 0 0 0 0 0 0 0 0 0 0 
##$DATE= 1772610032
##$DBL= (0..7)
120 120 120 120 120 120 120 120 
##$DBP= (0..7)
150 150 150 150 150 150 150 150 
##$DBP07= 0
##$DBPNAM0= <>
##$DBPNAM1= <>
##$DBPNAM2= <>
##$DBPNAM3= <>
##$DBPNAM4= <>
##$DBPNAM5= <>
##$DBPNAM6= <>
##$DBPNAM7= <>
##$DBPOAL= (0..7)
0.5 0.5 0.5 0.5 0.5 0.5 0.5 0.5 
##$DBPOFFS= (0..7)
0 0 0 0 0 0 0 0 
##$DE= 6
$$ [...]
##$SUBNAM3= <"">
##$SUBNAM4= <"">
##$SUBNAM5= <"">
##$SUBNAM6= <"">
##$SUBNAM7= <"">
##$SUBNAM8= <"">
##$SUBNAM9= <"">
##$SW= 18.0517328524113
##$SWIBOX= (0..15)
0 0 2 0 0 0 0 0 0 0 0 0 0 0 0 0 
##$SW_h= 3612.71676300578
##$TD= 16384
##$TD0= 1
##$TE= 0
##$TE2= 300
##$TE3= 300
##$TEG= 300
##$TL= (0..7)
0 120 120 120 120 120 120 120 
##$TP= (0..7)
150 150 150 150 150 150 150 150 
##$TP07= 0
##$TPNAME0= <>
##$TPNAME1= <>
##$TPNAME2= <>
##$TPNAME3= <>
##$TPNAME4= <>
##$TPNAME5= <>
##$TPNAME6= <>
##$TPNAME7= <>
##$TPOAL= (0..7)
0.5 0.5 0.5 0.5 0.5 0.5 0.5 0.5 
##$TPOFFS= (0..7)
0 0 0 0 0 0 0 0 
##$TUNHIN= 0
##$TUNHOUT= 0
##$TUNXOUT= 0
##$USERA1= <user>
##$USERA2= <user>
##$USERA3= <user>
##$USERA4= <user>
##$USERA5= <user>
##$V9= 5
##$VALIST= <valist>
##$VCLIST= <CCCCCCCCCCCCCCC>
##$VD= 0
##$VDLIST= <DDDDDDDDDDDDDDD>
##$VPLIST= <PPPPPPPPPPPPPPP>
##$VTLIST= <TTTTTTTTTTTTTTT>
##$WBST= 1024
##$WBSW= 4
##$XGAIN= (0..3)
0 0 0 0 
##$XL= 0
##$YL= 0
##$YMAX_a= 944225
##$YMIN_a= -959071
##$ZGOPTNS= <>
##$ZL1= 120
##$ZL2= 120
##$ZL3= 120
##$ZL4= 120
##$ABSF1= 15.46042
##$ABSF2= -2.59143
##$ABSG= 5
##$ABSL= 3
##$ALPHA= 0
##$AQORDER= 0
##$ASSFAC= 0
##$ASSFACI= 0
##$ASSFACX= 0
##$ASSWID= 0
##$AUNMP= <proc_1d>
##$AZFE= 0.1
##$AZFW= 0.1
##$BCFW= 0
##$BC_mod= 2
##$BYTORDP= 0
##$COROFFS= 0
##$CY= -3
##$DATMOD= 1
##$DC= 0
##$DFILT= <>
##$DTYPP= 0
##$F1P= 0
##$F2P= 0
##$FCOR= 1
##$FTSIZE= 16384
##$FT_mod= 6
##$GAMMA= 0
##$GB= 0
##$INTBC= 1
##$INTSCL= 3.241238e-09
##$ISEN= 128
##$LB= 0.25
##$LEV0= 0
##$LPBIN= 0
##$MAXI= 10000
##$MC2= 0
##$MEAN= 0
##$ME_mod= 0
##$MI= 1.114404
##$NCOEF= 0
##$NC_proc= -5
##$NLEV= 6
##$NOISF1= 3.799351
##$NOISF2= 2.8
##$NSP= 0
##$NTH_PI= 0
##$NZP= 0
##$OFFSET= 15.30286
##$PC= 1
##$PHC0= -5299.748
##$PHC1= 6.821927
##$PH_mod= 1
##$PKNL= yes
##$PPARMOD= 0
##$PSCAL= 0
##$PSIGN= 0
##$REVERSE= no
##$SF= 200.130043796117
##$SI= 16384
##$SIGF1= 3
##$SIGF2= 2
##$SINO= 0.751879
##$SIOLD= 32768
##$SREGLST= <19F.Aceton>
##$SSB= 0
##$STSI= 16384
##$STSR= 0
##$SW_p= 3612.71676300578
##$SYMM= 0
##$S_DEV= 0
##$TDeff= 16384
##$TDoff= 0
##$TI= <>
##$TILT= no
##$TM1= 0
##$TM2= 0
##$TOPLEV= 0
##$USERP1= <user>
##$USERP2= <user>
##$USERP3= <user>
##$USERP4= <user>
##$USERP5= <user>
##$WDW= 1
##$XDIM= 16384
##$YMAX_p= 424730924
##$YMIN_p= -692702
$$ End of Bruker specific parameters
$$ ---------------------------------
##NTUPLES= NMR SPECTRUM
##VAR_NAME=  FREQUENCY,     SPECTRUM/REAL,   SPECTRUM/IMAG
##SYMBOL=    X,             R,               I
##VAR_TYPE=  INDEPENDENT,   DEPENDENT,       DEPENDENT
##VAR_FORM=  AFFN,          ASDF,            ASDF
##VAR_DIM=   16384,         16384,           16384
##UNITS=     HZ,            ARBITRARY UNITS, ARBITRARY UNITS
##FACTOR=    0.220516191357247, 1,           1
##FIRST=     3062.56209404161, 0,            0
##LAST=      -550.154668964167, 0,           0
##MIN=       -550.154668964167, -692702,     0
##MAX=       3062.56209404161, 424730924,    0
$$ Real data points
##PAGE= N=1
##DATA TABLE= (X++(R..R)), XYDATA
$$ [...]
8014b71782L1888l7207o792k118k2572K1065K5879L717k4828j7387p128K3431
8002b83834L7037j2829p831L5344l2516K418O978k0098L5456l471n39M112J1241
7989b28532o779n0120J3354L7706K1798J238j3303k6007l3721K276j313j5725
7977b99128L2658J5949K9352j4762l0140Q836j1261M8338p766l6899K2787m668
7965b46704O928j4741n773r96O236j3466j1511K8385L0123j7471J8053J8697J8583
7952a83657l4142n1914n746J6727K9358o609j1805M094J4995k046K9793J5506
7940a85446o2403j7632J6938J7850l0872L0015J2732J960J0926q951k8909j2600
7928b56392K1137J5697J4904j9531l458l324l1245n1905M7636M2687j6078j7736
$$ y = [-271782, -239894, -277101, -283893, -286011, -308583, -287518, -261639, -257922, -282750, -300137, -307265, -283834, -246797, -259626, -267457, -232113, -264629, -262211, -255233, -275331, -239875, -243346, -243885, -239773, -228532, -235311, -285431, -272077, -234371, -212573, -211335, -224638, -250645, -284366, -282090, -283403, -299128, -266470, -250521, -221169, -235931, -266071, -257235, -268496, -220158, -227924, -264823, -242036, -246704, -239776, -254517, -260290, -261286, -255050, -268516, -280027, -251642, -221519, -238990, -220937, -202240, -183657, -217799, -269713, -275459, -258732, -229374, -235983, -247788, -243694, -228699, -230745, -200952, -185446, -247849, -265481, -248543, -230693, -261565, -231550, -218818, -216858, -205932, -214883, -243792, -256392, -235255, -219558, -204654, -224185, -227643, -230967, -262212, -314117, -266481, -223794, -239872, -257608]
7916b57608L420J4085K2994j9933j7194j046O833L4406p326k711J2237j1632l2990
7903b56465j030J4752K5076k3303Q566K3832m5048P996O88k2091J2686p495n646
7890b67482N515N1447k8998L002M0558k0596q600L165O876O942j9582k7899P012
7877b48640j3141l653L6528J6976j7865P534R900k1787j2150K1717m522k4291
7865b53394R714N539L772j011O997L058k8111j7041J5279K4958j2409J4806K2570
7852b05273m0653l935K5781l653Q708l5683k4449J2115K280m717J7407J8867J7776
7839b15429j0999n387J6192l3187l3793n000j6826M1906J7384k1853o008L2447
7827b40553J8152j8084J5136K7008Q622j0524l6185k3659L8801j0657J539K4857
$$ y = [-257608, -254188, -240103, -217109, -237042, -254236, -255282, -248449, -214043, -221369, -224080, -211843, -223475, -256465, -257495, -242743, -217667, -240970, -232404, -208572, -253620, -245624, -244936, -267027, -254341, -261836, -267482, -261967, -210520, -239518, -236516, -195958, -216554, -225154, -221989, -215113, -208171, -227753, -255652, -248640, -261781, -265434, -228906, -211930, -229795, -222261, -212361, -234148, -246298, -224581, -229103, -253394, -243680, -238141, -234369, -235380, -228383, -225325, -253436, -270477, -255198, -230240, -242649, -227843, -205273, -245926, -249861, -224080, -227733, -219025, -254708, -279157, -267042, -264762, -269479, -252072, -233205, -215429, -226428, -231815, -215623, -248810, -282603, -287603, -304429, -262523, -245139, -266992, -273000, -240553, -222401, -240485, -225349, -198341, -189719, -200243, -236428, -260087, -221286, -231943, -230404, -205547]
7815b05547j822J3828k773n0295J2237M001M796M988p2141N4552J208J3j7484
7802b54439o684K9053j6640L3737L9854N994l4458j4985J8755O121L051n606L149
7789a93098j873j5785K2786q52J888l857j1016k869j8019K2475O860l6487J6780
7776b13067J6124q54j9318j786j5413k2280J9068m203K2323J7820l352m2418o93
7763b48049p150Q147J6311J8974N32j5680k0156k1155J3009L2651J9951l2031
7751b34646j360M5013J4904j2917j3336j651N0610J8826m5523r83j8130j829n811
7738b06833j1864O421q100J3070k0207J1207J6524m240k2414n335j3805K4489
7726b21087J2054j1207m674J9103J0553K282j8047l8734J7533J7979J0416J2018
$$ y = [-205547, -207369, -193541, -196314, -246609, -234372, -230371, -225575, -220587, -292728, -238176, -236968, -236955, -254439, -261123, -232070, -248710, -214973, -175119, -169125, -203583, -218568, -199813, -193692, -190641, -196247, -193098, -194971, -210756, -187970, -188822, -186934, -190791, -201807, -204676, -222695, -200220, -193360, -229847, -213067, -196943, -197797, -217115, -218901, -234314, -256594, -237526, -241729, -219406, -201586, -204938, -247356, -248049, -255199, -247052, -230741, -211767, -211235, -226915, -247071, -268226, -255217, -222566, -202615, -234646, -236006, -190993, -176089, -189006, -202342, -203993, -153383, -134557, -180080, -181063, -199193, -201022, -206833, -218697, -212276, -220376, -207306, -227513, -216306, -199782, -204022, -226436, -231771, -245576, -221087, -209033, -220240, -224914, -205811, -195258, -192976, -211023, -249757, -232224, -214245, -203829, -191811]
7714a91811L855J0397k8536j1007L0788J1337j6705j075M872K4897k5133J0126
7702a77995J5677m1229M710L4299K2288l195j6179j4875r178J5840J1086j8435
7690a77186k8479L467K067q978p626k970l35j154q034L923L6969m1k1938m0452
7676b50767J5994L1865K7591J5605j1762k116o86K671l8966N7907j0516k7751
7664a90931K0563k2811N318P459P115l4015J0999L7928J1171l8497q423l311k1391
7651b18826J0871R984L2907m2146l8152J9085M0976M070J2575k4447l0985O787
7639b17301L1770J8254l1726j4453r244o88N766l832o2R141O051j1850j5684M246
7625b29612K4552J3639N229K3803k8829l7777j0194J9572K7067J8384k27j8216
$$ y = [-191811, -187956, -177559, -206095, -217102, -186314, -174977, -191682, -192757, -187885, -162988, -188121, -177995, -162318, -203547, -198837, -164538, -142250, -145445, -161624, -176499, -185677, -169837, -158751, -177186, -205665, -202198, -200131, -209109, -216735, -219705, -220040, -221194, -229228, -225305, -188336, -188377, -210315, -250767, -234773, -202908, -175317, -159712, -171474, -173590, -174276, -171605, -210571, -152664, -163180, -190931, -170368, -193179, -187861, -180402, -173287, -207302, -196303, -158375, -147204, -185701, -194124, -197435, -218826, -207955, -197971, -165064, -207210, -245362, -226277, -185301, -181231, -168656, -193103, -224088, -217301, -185531, -167277, -199003, -213456, -222700, -223388, -217622, -221454, -221516, -212375, -206324, -218174, -233858, -229612, -205060, -191421, -186192, -162389, -191218, -228995, -239189, -219617, -192550, -174166, -174393, -192609]
7613a92609j0280K2454l980p800q859M466J6274m49J0736R846o431L625j4261
7600a77268j7088k3856K6675k4594q79N464k4885J9262l336k836J0562k454R408
7587b05825j7479J2120J3589l348K5582j8368K0219K4487l5669k6663J654J496
7575b08205K1854K7217j7506M6018j8231k6843N983l5922L4292K7117k9218k843
7563a76287q783k3617k0944M1143J8915J1282l2729j7321L6224l0452M7156L8034
7551a17379k5797j5127k2267j6395R608j7977J1706j5718n425K179p362K0701
7539a99253J0715r251K5782O199l7126K8750J1790K0638k1522m976j989K802j5281
7526a82722j9699q013l8169N349O8508K2454K32Q432l4560l4j2729P711j0851
$$ y = [-192609, -202889, -180435, -184415, -192215, -201074, -196608, -180334, -180783, -170047, -160201, -166632, -163007, -177268, -194356, -218212, -191537, -216131, -217010, -211546, -236431, -217169, -220505, -223341, -212779, -215233, -205825, -223304, -211184, -197595, -200943, -175361, -193729, -173510, -149023, -184692, -211355, -209701, -208205, -186351, -159134, -176640, -130622, -148853, -175696, -169713, -205635, -171343, -144226, -173444, -176287, -185070, -208687, -229631, -188488, -169573, -158291, -191020, -208341, -172117, -202569, -155413, -117379, -143176, -158303, -180570, -196965, -187357, -205334, -193628, -209346, -214771, -212592, -219954, -199253, -188538, -197789, -172007, -165808, -202934, -174184, -162394, -141756, -163278, -168254, -170243, -167441, -182722, -202421, -210434, -248603, -243254, -174746, -152292, -152060, -143628, -178188, -178222, -190951, -183240, -194091]
7513a94091L410J5985L9061n0576k4648K3805N792J6557J4804K6208k9286m1693
7501a94672K6537l58J144J0770q333j8709K1091R039L05j4899J4856O292l083
7488a50020P124k2768j5644l504J7351J0687L346K1752J2173j8602j1547J7870
7476a31782N367j0331J059J5624n89l8857K4689M611J1053j8626m1782M041L1402
7463a44121K603R434P333j3734l372j3924k859Q625L8302k6515j0770O897J6543
7450a25558J2716l1636R996n617j9731m550j1853J7373J6778M329k780J3237K9167
7437i8129o315j7573N7325j3807n1630j3062j0369k1493j8819N6649K5714N158
7425a06351m4018P165N6574j9009l0783k6741K751L8999N393N290J3544j1079
$$ y = [-194091, -190681, -174696, -135635, -186211, -210859, -187054, -181262, -164705, -149901, -123693, -152979, -194672, -168135, -168493, -167349, -156579, -164912, -183621, -162530, -153491, -153186, -168085, -153229, -146937, -150020, -142896, -165664, -181308, -184812, -167461, -156774, -153428, -131676, -119503, -138105, -149652, -131782, -126415, -136746, -135687, -120063, -120652, -159509, -134820, -130209, -119156, -137782, -179564, -175523, -144121, -141518, -132084, -124751, -138485, -141857, -155781, -158640, -150015, -111713, -138228, -148998, -142101, -125558, -112842, -144478, -134482, -140099, -159830, -164380, -176233, -158860, -142082, -137753, -140533, -127296, -98129, -104444, -122017, -64692, -78499, -130129, -143191, -153560, -175053, -193872, -137223, -111509, -106351, -150369, -143204, -86630, -105639, -136422, -163163, -160412, -121413, -116020, -110730, -97186, -108265]
7413a08265k332k4471k5782j9888O685J4185L3262J018k5326J2466J6986k2731
7401a44193K338p874k645k5565l4907O2714J1350N153O323r30j866J742k2621
7388a50981L0277J5610j6171k1257j5217o170N275q453J0047J5852J0249M216
7376a26723M436K526J4367j6551l0621K7212p643M858P016J9546l8687Q442O148
7363a25674j8709P253j0082K9369J89L4306L408n4968j8128k319L192K5206J748
7350a25209J9900j9898j8556M3952K887m3624k9356Q850k2612j5317M1357K3824
7338a33802J9681o401K7003j0815k4277J9362N760j0283j559j9705L997j5242
7326a46281Q570k965J1049m51K0580N696n2921J6734O318K632Q528J4085j7901
$$ y = [-108265, -110597, -135068, -160850, -180738, -174053, -159868, -126606, -125588, -150914, -138448, -121462, -144193, -141855, -149729, -152374, -177939, -212846, -150132, -138782, -133629, -127306, -128236, -130102, -128360, -150981, -120704, -105094, -121265, -142522, -157739, -163909, -158634, -167087, -157040, -141188, -130939, -126723, -122287, -119761, -105394, -121945, -152566, -125354, -132997, -128139, -121123, -101577, -140264, -131822, -125674, -144383, -137130, -147212, -117843, -117654, -83348, -79940, -134908, -153036, -155355, -152163, -126957, -125209, -105309, -125207, -143763, -99811, -96924, -140548, -169904, -161054, -183666, -198983, -157626, -133802, -114121, -120522, -93519, -104334, -128611, -109249, -103489, -113772, -115331, -135036, -131039, -146281, -137711, -140676, -129627, -130078, -109498, -103802, -156723, -139989, -133671, -131039, -122511, -108426, -126327]
7313a26327r9j3983K3486l1420J6075m657j9159N4412l038l4149j8429K0549J6321
7300a20418j3228J5913K7055m6389k4580l551K9533M4286j8328j6940Q857K2560
7288i5230k2609R496j2965o456J1810J9590M842k3300r962J6923O435j2763Q35
7275a13354L0669j3259k9125Q797J2046K1356l131O640n2715j36k5035P788K254
7262a47205J6572K8963J6331o232l916k8631J9360J8996l3059J0024n144k3969
7250a37910n579L4967K0412l211m0985k318N471K0170j4535J9926J0925K3217
7238f9450J1454K5736j4563p2767j9111N1186p501J1814K14K8957l6473k3946
7226a14450o1L9153J5075j7601j3692j6174J6827J0844o573J6423K725p949k411
$$ y = [-126327, -126426, -140409, -116923, -148343, -132268, -136925, -156084, -101672, -104710, -138859, -157288, -136739, -120418, -133646, -117733, -90678, -137067, -161647, -165198, -135665, -91379, -109707, -126647, -117790, -95230, -117839, -108343, -121308, -127764, -115954, -96364, -91522, -114822, -124784, -107861, -101426, -114189, -113354, -82685, -95944, -125069, -116272, -104226, -82870, -86001, -79361, -132076, -132212, -157247, -149459, -147205, -130633, -101670, -85339, -91571, -95487, -124118, -104758, -85762, -118821, -108797, -113941, -137910, -143489, -108522, -88110, -91321, -132306, -134624, -129153, -108983, -123518, -103592, -92667, -69450, -57996, -32260, -46823, -119590, -138701, -87515, -95016, -83202, -82988, -54031, -90504, -114450, -114511, -75358, -60283, -77884, -91576, -107750, -90923, -80079, -86652, -70229, -67504, -75453, -77864]
7213g7864N363K1674J2106j2248o293j4855P916p842j3395L1613j1536j8025J4204
7200f9182p574j6666J3946K8365K7478m3610m4527K424K5390J4173o309j6307
7188i2399K0689R501L4943J2392k4138k3634J1016R150J3783l3677P599j7968
7176g2743J284q405K4494L624q31l9453L650J1584J0929K3174j7693j2525R592
7163f3319k2703J6023J2387K7535j4044j8170J1836k5528j2960J2514j1303O938
7151h0794K5836K087J5099k513j5273j9424j1706K8174j1110k1525K759Q219J7211
7138f2960n835K2193J2226j0478j06R253k9044K9126k5859N816R059k7295K1575
7125e2329J7218M659N635k8408n114k808K657J4775j5451J1198J297j9095l9924
$$ y = [-77864, -72501, -50827, -38721, -50969, -57262, -72117, -64201, -72043, -85438, -53825, -65361, -83386, -69182, -76756, -93422, -79476, -51111, -23633, -67243, -111770, -109346, -83956, -69783, -76092, -92399, -71710, -62209, -27266, -14874, -39012, -62646, -51630, -42480, -28697, -62374, -54775, -72743, -71459, -79864, -55370, -51746, -52577, -92030, -88380, -76796, -65867, -42693, -60386, -72911, -63319, -86022, -69999, -57612, -30077, -44121, -62291, -50455, -75983, -88943, -76429, -87732, -80794, -54958, -52871, -37772, -40285, -55558, -74982, -86688, -58514, -69624, -91149, -88390, -80171, -62960, -68795, -46602, -34376, -44854, -44960, -35707, -64751, -35625, -61484, -55668, -46609, -73904, -52329, -35111, -30452, -24817, -53225, -58339, -61147, -58490, -43715, -59166, -47968, -46671, -65766, -105690]
7112a05690L1018p402l744J6155M003k690K0210K9790l0363p088J9053Q990m3552
7099g1310L0384R532l5628k90R669J7041J8408M61j9836Q929J1464o785J59j2004
7085c9806p256m1942j2396L4485J653j2257k017K5150K4948o2100J6356N3063
7073b2119j1402m198K8133l550p102q525k2202J3670M0693k2066J4443j2468j8232
7060c4925j7330J2773K3618j6581J771K1428l2055m5668R694J1467j0895R944
7048f6759Q839M723J5026j391j258l180J1610k9181n154J3393K3405K7443k1864
7035b4348K716J3099j2560N123K3747J592P41m559j2235k1713j3111J5583J0606
7022a5319j548k780N405l561r14Q94K4535l0566k1599M1695j4928J1200K5447
$$ y = [-105690, -74672, -82074, -85818, -69663, -65660, -68350, -48140, -18350, -48713, -55801, -36748, -27758, -71310, -40926, -31394, -67022, -67312, -57643, -40602, -22194, -21733, -41569, -32640, -21176, -27961, -27802, -39806, -47062, -89004, -101400, -66915, -65262, -77519, -79536, -54386, -29438, -91538, -75182, -22119, -33521, -37719, -9586, -13136, -20238, -28763, -50965, -37295, 3398, -18668, -4225, -16693, -34925, -52255, -39482, -15864, -32445, -30674, -9246, -41301, -86969, -77275, -65808, -76703, -66759, -57920, -53197, -38171, -39562, -40820, -44000, -32390, -61571, -66725, -53332, -29927, -2484, -24348, -21632, -8533, -21093, -15970, 7777, 9369, 10110, 5551, -6684, -28397, -41508, -25925, -15319, -16867, -19647, -14242, -17803, -18717, -17823, 6712, -23854, -45453, -3758, -18686, -7486, 17961]
7009A7961j0875j5895j864l0143r316N901l2663j4943j7964L7333K5875J1300
6997c5293R084M249l661j4314K5404R133k995J9379q655k7306l9949j6231K7602
6984e3553N0291N192O268r599N903K9630j6578j1535N155J3178n050j8168J3366
6971A4500n643L672k5544m143N537J3470j509K3218N820k4251J5746j9139K3418
6958B5152p020k0782k361J646J3005l6789M425j0731m440M1718L7128l9914j6852
6945a5815k1689Q07K4604J9345J1482J175K6241K0678r967k9685k5212O902J02
6932H968m223l65P044J6721k3310L819k4232p196L1543J4359j8594l0273R565
6919a6174n458q584L1579K9293P260j3131m306L716L499j610K414O647R541K5171
$$ y = [17961, 7086, -8809, -10673, -40816, -50132, -44231, -76894, -91837, -109801, -72468, -46593, -35293, -26209, -21960, -25621, -39935, -14531, -5398, -8393, 10986, 2331, -24975, -64924, -81155, -53553, -3262, 1930, 8198, -1401, 4502, 34132, 17554, 6019, 11174, 24352, 19302, 1134, 14500, 8857, 12529, -13015, -17158, -11621, 1849, 340, 23558, 29378, 5127, 20873, 1734, 25152, 18132, -2650, -5011, -3365, 9640, -27149, -22724, -33455, -37895, 3823, 40951, 1037, -15815, -37504, -36697, -12093, 7252, 18734, 19909, 46150, 66828, 56861, 27176, 1964, 8866, 8968, 4745, 4380, 11424, 28145, 4835, 8654, -15578, -22774, 8769, 23128, 4534, -25739, -16174, -21632, -30216, 1363, 30656, 37916, 24785, 20479, 24195, 27694, 26084, 28498, 35145, 44686, 69857]
6905F9857J459J4624k053j5342j9351l0636O928N530k9356M3319N4433k0617p354
6892G1441r027m387J240j2044R616R789k6690J2836j5810R705m652l1935K6951
6879C7033K3104J98j5774j7990L3072j5642K370n0722J0842K8272j74l1643K0477
6866B3423k259k5047K8597K5033p627J4553P451k459j4891J1056j2570k4462N818
6853B6616K0784J0585k3016J0089J3356M210j3484j7621P010J3512k184J4409
6841F4266N3208K197n6145j3080K2465M685N541j7812j1857L8114j3395j9110
6829E9077K3827Q190k0703M1152J382k412l314O134o694Q919r908l887j8467k3871
6815E9425K0061M534j2466N0023q420m4209J8672L7578l4567n134j3723k1569
$$ y = [69857, 71316, 85940, 83887, 68545, 49194, 18558, 25486, 31016, 1660, 44979, 99412, 78795, 71441, 62414, 58027, 59267, 47223, 56839, 66628, 39938, 52774, 36964, 46669, 42017, 10082, 37033, 60137, 60335, 44561, 26571, 59643, 44001, 46371, -4351, 6491, 34763, 34589, 2946, 23423, 21164, -3883, 24714, 49747, 42120, 56673, 64124, 61665, 46774, 57830, 45260, 20798, 26616, 47400, 57985, 34969, 45058, 58414, 62624, 49140, 31519, 38529, 52041, 49857, 64266, 117474, 119671, 63526, 50446, 72911, 77596, 83137, 65325, 53468, 91582, 78187, 59077, 82904, 91094, 70391, 111543, 112925, 110513, 107199, 113333, 106639, 115558, 105650, 101763, 83296, 59425, 79486, 84020, 71554, 121577, 113157, 68948, 87620, 125198, 90631, 85497, 71774, 50205]
6803E0205K571M768P066L6562j64k9741k0450K5179J3219j3634k3619K1272K2523
6790I5757k2493J7871J5885N012n634K856j2632m0119q907J3737M7847j0031L843
6777A02992j26j9484J029K9079L6474m3882J390Q164L191Q550k3311l1157P297
6764H0206o333L3171L6650j8379K0699J4904j9663o883q790N923k0228K096K7426
6751A40799J2794k3916l660j5783R890K5354L2044k1698j8220Q447J8227j6474
6739A47804j8742J6006k466Q811n235m958r253o516J4052J4582K4136n852j5768
6726A56601m142K5077J0600J5657l3514R490J7364k3208o421k2417j1470K724
6714A36341N79L6066P358J5052J4024k9137N612M323l7301j1697M2928n189J528
$$ y = [50205, 52776, 57544, 64610, 101172, 101008, 71267, 50817, 75996, 89215, 75581, 51962, 73234, 95757, 73264, 91135, 107020, 112032, 106398, 109254, 96622, 56503, 47596, 61333, 109180, 99149, 102992, 102866, 83382, 84411, 113490, 149964, 106082, 107472, 115636, 118827, 127377, 104066, 72909, 80206, 73873, 107044, 143694, 125315, 146014, 160918, 141255, 134372, 125582, 131505, 111277, 113373, 140799, 153593, 129677, 126017, 110234, 120124, 145478, 177522, 155824, 137604, 146051, 164278, 147804, 129062, 145068, 142602, 151413, 146178, 141220, 131967, 125451, 139503, 154085, 178221, 172369, 156601, 152459, 177536, 188136, 203793, 170279, 179769, 197133, 173925, 167504, 145087, 133617, 136341, 136920, 172986, 180344, 195396, 209420, 180283, 185895, 190218, 152917, 141220, 184148, 178959, 180487]
6701A80487K1764l8482l278N4148M728J2939j5562k5639j4219J1362l084P268
6689A92432R727n2481P423J7766k1034K1422M1692K9117k3016K6612k7406J1757
6677B34011j1162K1985L9804P763k5077j0835L9191l0042J3946J0246o1417J2242
6665B40655K3933n523J7949k0563j3159O008J1474k429j9714J1654L1908O106
6653B88299L711j3976k6393n054K8426K4771J676P319k1108p7j9320j0148j944
6640B56182j1901N018N5038L2866R112L3335l5490j162K4434J7582O0831K6311
6628D72156j2482K7818L0899K6725L7372M2549J2440L702K413l2045l4825K6263
6616F02985J2484J427j5414j3284L1441N7070M8140j1698k3559j3687l1959p3273
$$ y = [180487, 202251, 163769, 160491, 214639, 219367, 232306, 216744, 191105, 176886, 188248, 185164, 192432, 202159, 149678, 157101, 174867, 153833, 175255, 216947, 246064, 223048, 249660, 222254, 234011, 222849, 244834, 284638, 292401, 267324, 256489, 295680, 265638, 279584, 289830, 228413, 240655, 264588, 259065, 277014, 256451, 243292, 249300, 260774, 258345, 238631, 250285, 282193, 288299, 292010, 278034, 251641, 246587, 275013, 299784, 301460, 308779, 287671, 287594, 268274, 258126, 256182, 244281, 249299, 304337, 337203, 346315, 379650, 344160, 342998, 367432, 385014, 445845, 472156, 459674, 487492, 518391, 545116, 582488, 625037, 637477, 641179, 643592, 611547, 576722, 602985, 615469, 616896, 601482, 588198, 619639, 676709, 724849, 713151, 689592, 675905, 643946, 570673]
6604E70673p3786p928l6114k1785J804j2510L775k666k1498M5584j0783j3590
6592D21176l1842j1229L4770j877q012R423N342l343J8095J9254J315l703n705
6579D43664L9125k3620o028L2438P935o606j5834J0781l200K1224J8456K5684
6567E44019Q337K8091J2729J2798J0389L3471L8388J00991M7074L3389P7793J9834
6555I67303N5281N4814K9760M7464L0886n4485m3362k4675o686O022q402l1185
6543A022735L0808K3129j1300L3541P910m3669k4640k5219m8629p3434p9471n8831
6531G52930n1700m3109k2822L7732m4472l6939j1751n197j5166K444m806J6469
6519E73613R395l6930K6962M6048J2627O869k0503J2511k3699J8287Q548L131
$$ y = [570673, 496887, 488959, 452845, 431060, 432864, 420354, 424129, 421463, 399965, 445549, 434766, 421176, 389334, 378105, 412875, 410998, 402986, 412409, 417751, 414408, 432503, 451757, 453072, 449369, 443664, 482789, 459169, 453141, 485579, 493514, 486908, 471074, 481855, 478655, 499879, 518335, 544019, 552356, 580447, 593176, 605974, 616363, 649834, 688222, 789213, 836287, 869676, 947469, 967303, 1022584, 1077398, 1107158, 1154622, 1185508, 1131023, 1087661, 1062986, 1056300, 1062322, 1053920, 1022735, 1053543, 1076672, 1065372, 1098913, 1106823, 1063154, 1038514, 1013295, 964666, 891232, 811761, 752930, 701230, 658121, 635299, 673031, 628559, 591620, 579869, 574672, 559506, 561950, 557144, 573613, 583008, 546078, 573040, 619088, 631715, 638584, 618081, 630592, 606893, 625180, 633728, 636859]
6507F36859M783J6640J1756k824L529N415K9086L5581K5910k5675K3986L826L464
6494G72336O819N909K4806K158L2597K6058K7401M5601N3493K5834l677l0815
6482I88520J6391M180j6841J6487J2906J6702K2103J9893M9019J9733k2974j7151
6470A108968j7748j9120j9127j8330j9067M830n246L0917k8254q463l9657j2523
6458I57180J1588l841L6336J1081O018M445j3327K3949K6445L2309k503M0497
6446A130177K795O774Q190P796n028N179J8527K3794P88K3096k528M5961M2370
6433A307891M951M3188K5129J6481j9078L516J7727L1565j2252l919J7623N311
6421A438133K7371L9929L7045M7647J0634M5717j621K5826J0274J5352K4304L348
$$ y = [636859, 641642, 658282, 670038, 667214, 670743, 676158, 705244, 740825, 766735, 741060, 765046, 768872, 772336, 779155, 785064, 809870, 812028, 844625, 870683, 898084, 943685, 997178, 1023012, 1019335, 988520, 1004911, 1009091, 992250, 1008737, 1021643, 1038345, 1060448, 1080341, 1129360, 1149093, 1126119, 1108968, 1091220, 1072100, 1052973, 1034643, 1015576, 1020406, 1015160, 1046077, 1017823, 1009360, 969703, 957180, 968768, 964927, 1001263, 1012344, 1018362, 1022807, 1009480, 1033429, 1059874, 1092183, 1089680, 1130177, 1132972, 1139746, 1147936, 1155732, 1150704, 1155883, 1174410, 1198204, 1198992, 1222088, 1219560, 1265521, 1307891, 1312842, 1356030, 1381159, 1397640, 1378562, 1382078, 1399805, 1431370, 1419118, 1415199, 1432822, 1438133, 1465504, 1505433, 1542478, 1590125, 1600759, 1646476, 1644855, 1670681, 1680955, 1696307, 1720611, 1723959]
6409A723959k691M1840K6215K3259M2681L615K4862N398J3083K7353N8178j750
6397A986002Q628M3796J5605O0938L3863N0744K417K9897J5534K5868L4909L5622
6385B343823M1304M7473P7534O8880L1727N7672J09161M0135N2011P7169K3941
6374B970830L8003J02419K9513O4767M7394Q4794O8369O7076J37309J37052J32202
6363C879728J20858J53177J44365J20408J05498J21010O2657L4177K7302L3294
6353D802474Q4773J09498J01465J85336J74512J63669K07247K26239K59080K27040
6343F541333K42924K93032L42053L58897M06628L95884M34345M05282M22983M59667
6333A0303028M76503N19321N93229O99480P76416R38796J144807J358336J602938
$$ y = [1723959, 1721268, 1763108, 1789323, 1812582, 1855263, 1858878, 1883740, 1889138, 1902221, 1929574, 1987752, 1986002, 1994630, 2038426, 2054031, 2114969, 2148832, 2199576, 2201993, 2231890, 2247424, 2273292, 2308201, 2343823, 2385127, 2432600, 2510134, 2579014, 2610741, 2668413, 2777574, 2817709, 2869720, 2946889, 2970830, 3008833, 3111252, 3140765, 3205532, 3252926, 3337720, 3406089, 3473165, 3610474, 3747526, 3879728, 4000586, 4153763, 4298128, 4418536, 4524034, 4645044, 4707701, 4741878, 4769180, 4802474, 4887247, 4996745, 5098210, 5283546, 5458058, 5621727, 5828974, 6055213, 6314293, 6541333, 6784257, 7077289, 7419342, 7778239, 8184867, 8580751, 9015096, 9420378, 9843361, 10303028, 10779531, 11298852, 11892081, 12591561, 13367977, 14306773, 15451580, 16809916, 18412854]
6324A8412854J826717K137697K613242L342247M422587O001407P978493R585645
6316E6320889R611962P414826L391001j056574m572458o422848o651750n666588
6308E2368460l859209j616265Q33820L493692O209925P954124P605100M589565
6300G7579212j9226m665551p897748r293797r201694q025390o493654m991682
6292B6990470l833926k974643k243818j740974j332480j052350q44265p07325
6284A2260689n60707m43741l05448k24028j28699p2943Q175J28437J85899J97115
6274A1044749K38454K53737K60348L12693L45401M39472M76089N54504O62876
6265A4588323O94921O65871P58399P97798Q19646R49172J073598J264161J491956
$$ y = [18412854, 20239571, 22377268, 24990510, 28332757, 32755344, 38756751, 46735244, 56320889, 65932851, 73347677, 76738678, 75682104, 71109646, 64686798, 58035048, 52368460, 48509251, 46892986, 47726806, 51220498, 57430423, 65384547, 72989647, 77579212, 77559986, 72894435, 64996687, 55702890, 46501196, 38475806, 31982152, 26990470, 23156544, 20181901, 17938083, 16197109, 14864629, 13812279, 12968014, 12260689, 11699982, 11256241, 10950793, 10726765, 10598066, 10525123, 10533298, 10661735, 10847634, 11044749, 11283203, 11536940, 11797288, 12109981, 12455382, 12894854, 13370943, 13925447, 14588323, 15283244, 15949115, 16707514, 17505312, 18324958, 19274130, 20347728, 21611889, 23103845]
6256B3103845J750750K076582K474920K884832L390164M058585N066927O764254
6248E1570859R253792J2481232J5446894J6475812J4040910Q152067P54355n792494
6240A22383427r930377j1332418j0318548p799279m366350m61515L797629Q184675
6232I0157244J1408900J1948247Q550879K164663m991422j0796856j4074635j4885701
6224G9481319j3773471j1689629r354135p363487n833382m587790l635088k951780
6216B0292557k320365j868145j598931j332790j117791r32033q10810o90297n75793
6207I045602m34315l94029l02849k37982k30105k05780j73942j94930j87636j47805
6197F536229j42282j38582q5640r0730j04846j55891j41937j70510j21959j40204
$$ y = [23103845, 24854595, 26931177, 29406097, 32290929, 35681093, 39739678, 44806605, 51570859, 60824651, 73305883, 88752777, 105228589, 119269499, 127421566, 128175921, 122383427, 112453050, 101120632, 90802084, 83002805, 78636455, 78174940, 81972569, 90157244, 101566144, 113514391, 122065270, 124229933, 119238511, 108441655, 94367020, 79481319, 65707848, 54018219, 44664084, 37300597, 31467215, 26879425, 23244337, 20292557, 17972192, 16104047, 14505116, 13172326, 12054535, 11122502, 10311692, 9621395, 9045602, 8611287, 8217258, 7914409, 7676427, 7446322, 7240542, 7066600, 6871670, 6684034, 6536229, 6393947, 6255365, 6169725, 6078995, 5974149, 5818258, 5676321, 5505811, 5383852, 5243648]
6187E243648j32261j12082j13982j45791j17546j16898j20847r5566j40170m2899
6177D105606q1317m4814p9445o5529o8230o8236l2569k2576n8351n6979o2066
6166C465494n99J0598J8142K078J4492o738J5740J3337m832K6756l5607l7423
6154C481438l9476k063j2120J255p655K148K2170J8766K8563J1452l8128j173
6142C465177k1845k4006j4685n8573j0050n7855j9618j3871j8251p737N305J0230
6130C234221N235J9278L8580M4191O5695J7255n025Q3763N9970Q0874K6351k695
6118C667693K8768N9095N3158M1352Q4687N5449P7927O3547Q3018K5279R7238
6107D337211N2227P3494P2307J400L6219L3035N5288J3392Q8151J02783J65022
$$ y = [5243648, 5111387, 4999305, 4885323, 4739532, 4621986, 4505088, 4384241, 4288675, 4148505, 4105606, 4024289, 3979475, 3900030, 3834501, 3766271, 3698035, 3665466, 3642890, 3584539, 3527560, 3465494, 3464895, 3475493, 3493635, 3495713, 3510205, 3503467, 3519207, 3532544, 3527712, 3554468, 3518861, 3481438, 3441962, 3439899, 3427779, 3429034, 3421379, 3423527, 3445697, 3464463, 3493026, 3504478, 3466350, 3465177, 3443332, 3419326, 3404641, 3346068, 3336018, 3278163, 3258545, 3244674, 3226423, 3218686, 3223991, 3234221, 3239456, 3258734, 3297314, 3341505, 3407200, 3424455, 3419430, 3503193, 3563163, 3644037, 3670388, 3667693, 3696461, 3755556, 3808714, 3850066, 3934753, 3990202, 4068129, 4131676, 4214694, 4239973, 4337211, 4389438, 4462932, 4535239, 4536639, 4572858, 4605893, 4661181, 4674573, 4762724, 4865507, 5030529]
6096E030529J43873J49835J94668J95111J84070J79871J75995K16674K01340K00394
6086F872360K58726K93049K71918K97349L20557K95457K88359L55609L52998M50276
6076A0056658N40877N11658N79185O68452O76493P02702P85749Q18458R03493
6067A6243725J056153J174050J387373J633042J904073K212748K610944L105024
6059C1327132L642448M518255N885379P862233J0451613J3032746J4251166J2613227
6051A03584199Q164007K339003l192944p613590j0702589j1888819j1268851r460461
6043E9959955p211201n176808l585083k179091j014369J8719R37523J935679L087351
6034D6772675M805641P147806J0157384J3019126J4151260J2153863P206436J086012
$$ y = [5030529, 5174402, 5324237, 5518905, 5714016, 5898086, 6077957, 6253952, 6470626, 6671966, 6872360, 7131086, 7424135, 7696053, 7993402, 8313959, 8609416, 8897775, 9253384, 9606382, 10056658, 10597535, 11109193, 11688378, 12356830, 13033323, 13736025, 14521774, 15340232, 16243725, 17299878, 18473928, 19861301, 21494343, 23398416, 25611164, 28222108, 31327132, 34969580, 39487835, 45373214, 53235447, 63687060, 76719806, 90970972, 103584199, 111748206, 114087209, 110894265, 103280675, 92578086, 80689267, 69420416, 59959955, 52748754, 47571946, 43986863, 41807772, 40793403, 40812122, 41749645, 43685324, 46772675, 51578316, 58726122, 68883506, 81902632, 96053892, 108207755, 115414191, 116500203]
6026A16500203m687033r339216j2475529j3632651j2879793j0968657q732022
6019D3785302o781864n256571m042340l146216k516836j979373j556300j255127
6011A7250675j008396q26703o93205o09229m70869l74635k25354r9581K3152O3092
6001A3028947J15585J40471J44952J76692K10392L08817M44913N29187P01153
5992A5801109Q89180J061629J252883J499532J757684K144894K778058L918372
5984C1103341N432969P293996Q717159Q556400O332850K784219q76703l958056
5976F5386175o221574p381071p341902o329608m907830l589296k495419j601525
5968B5517950q78850k93794L13566Q33350J494424K364797L671110N417840P421123
$$ y = [116500203, 111813170, 102473954, 89998425, 76365774, 63485981, 52517324, 43785302, 37003438, 31746867, 27704527, 24558311, 22041475, 20062102, 18505802, 17250675, 16242279, 15415576, 14722371, 14113142, 13642273, 13267638, 13042284, 12942703, 12965855, 13028947, 13144532, 13285003, 13429955, 13606647, 13817039, 14125856, 14570769, 15099956, 15801109, 16690289, 17751918, 19004801, 20504333, 22262017, 24406911, 27184969, 31103341, 36536310, 43830306, 52547465, 61103865, 67436715, 70220934, 69344231, 65386175, 59164601, 51783530, 44441628, 38112020, 33204190, 29614894, 27119475, 25517950, 24639100, 24345306, 24658872, 25492222, 26986646, 29351443, 33022553, 38440393, 45861516]
5959D5861516Q774838Q327930N767733K061679j708069m869716p202032q422368
5951D8591511q278034p243511n895974m619080l523844k759500k227783j759527
5943A2284258j425642j158830r22148p72365o72716n36148m20760l94347l53918
5934E627384k78999k09145j38641j48967j25199j60556j93658j58857j93059j73961
5924C846342j35796j37028q6002o8128l5474l2322l5494n8897j14779p7890p9716
5913B984816j29619q1198p2785l4735n8160n9304m0007j3369l9820p7674p4978
5902B303167r1011o3771n5652p0028r2568m3629q8449j02494o1347m0672r6261
5891A497285m9328p1379r307J2396m3813l3188J1526o2278p2119k8404m894q056
$$ y = [45861516, 54636354, 62964284, 68732017, 70793696, 69085627, 64215911, 57013879, 48591511, 40313477, 33069966, 27173992, 22554912, 19031068, 16271568, 14043785, 12284258, 10858616, 9699786, 8777638, 8005273, 7332557, 6796409, 6375649, 5981302, 5627384, 5348385, 5139240, 5000599, 4851632, 4726433, 4565877, 4372219, 4213362, 4020303, 3846342, 3710546, 3573518, 3487516, 3419388, 3383914, 3351592, 3316098, 3257201, 3142422, 3064532, 2984816, 2855197, 2773999, 2701214, 2666479, 2608319, 2549015, 2509008, 2495639, 2455819, 2378145, 2303167, 2212156, 2148385, 2092733, 2022705, 1930137, 1886508, 1798059, 1695565, 1634218, 1593546, 1497285, 1447957, 1376578, 1367271, 1379667, 1335854, 1302666, 1314192, 1251914, 1179795, 1151391, 1146497, 1138441]
5879A138441n4281o0642k3529J7827Q160k616l5520Q110j4586m4495n7283j6394
5867H63192l6246Q380k4963k8981l9242k7155j3760K0012J3445j8630J295J49
5855G17496j1518p426k2581o4054m995J1248l2264m275q960n7472J466m3079N81
5842D74167L2537q00K929L2277N690J0812r930P814J4617l597L840l8058l4539
5829D97759j6607l6932K1564j3421m1523j209K160P041J6449L8888k6505k0915
5817D26749P726o451j4138K0815k1524J2421j2010l0805J410J7427j7816L3472
5805D17276L629j389k2943o168k0677j7636K2199M464M424k7528J948J976K8094
5792C87669j3427n37P662L3831l0055k3220J8386J9905K0244k0475J7116j4411
$$ y = [1138441, 1084160, 1023518, 999989, 1017816, 1025976, 1023360, 987840, 995950, 981364, 936869, 879586, 863192, 826946, 835326, 810363, 781382, 742140, 714985, 701225, 721237, 734682, 716052, 717347, 717496, 705978, 698552, 675971, 611917, 606922, 618170, 585906, 581631, 572671, 515199, 516665, 473586, 474167, 506704, 505904, 508833, 541110, 546800, 557612, 547682, 555496, 570113, 566516, 570356, 532298, 497759, 481152, 444220, 465784, 452363, 410840, 409631, 411791, 418832, 435281, 474169, 447664, 426749, 434475, 428024, 413886, 434701, 413177, 425598, 413588, 382783, 384193, 401620, 383804, 417276, 420905, 419516, 396573, 390405, 369728, 352092, 374291, 378755, 383179, 355651, 357599, 359575, 387669, 374242, 373705, 381367, 415198, 385143, 361923, 380309, 400214, 420458, 399983, 417099, 402688]
5780D02688l5484L7423J6206K1683k5360j9989p38j4814L6596J252j8049J9496
5768D20910r54J201J2419K6126M711J649N577q861M057k2624J6862k7546R442
5755D42969M3294M4124k5331n3068J9151L2027K4362n297O833k140N2577J6271
5743E95772L4612M1828K7594L5359J6343K5034N6756P60M78l8600m7607l8135
5731G10194l796k3241n6691k7447r391R057J6568l2468k475Q39O085L9165L2126
5718F58525N8949L8371L2528o881q145K838M054m3687n0145k9027k9280m4482
5706E83618k4427M759j5807l9223j0193l0727k5718P200M9639p447Q39Q671n667
5693D95517o182L4340q243N7972P6270j1538L676m298L687k8985J4315l0526N1312
$$ y = [402688, 367204, 404627, 420833, 442516, 417156, 397167, 396429, 381615, 418211, 419463, 401414, 420910, 419956, 421157, 433576, 459702, 464413, 466062, 471639, 462778, 466835, 444211, 461073, 433527, 442969, 486263, 530387, 505056, 451988, 471139, 503166, 527528, 522231, 529064, 526924, 579501, 595772, 630384, 672212, 699806, 735165, 751508, 776542, 833298, 834058, 834536, 795936, 748329, 710194, 706398, 683157, 626466, 599019, 589628, 598685, 615253, 582785, 580310, 581149, 587234, 626399, 658525, 717474, 755845, 788373, 781492, 773347, 776185, 780239, 736552, 686407, 657380, 628100, 583618, 559191, 563950, 548143, 508920, 498727, 468000, 442282, 449482, 499121, 491674, 492513, 501184, 495517, 489335, 523675, 515432, 573404, 649674, 638136, 641812, 637514, 641201, 612216, 626531, 596005, 647317]
5680F47317O5545r568O3095N6862K8839K0743L6391K9844J8092n454K7234K0738
5668I99678M7948N6915R8185j1496n8578j9115j0915N324m5329j8018J3607J600
5656A059806J6946k7359K9184j0936k5638k2629J746L5892o912O0025M3104p428
5644A145801k8067J1957j9814j3290k530l9986l8413k3388m8847l0621l875n8132
5632H50795p5734l0286k2262n3114k3271L3601K995k3269q15J3943O276L7417
5620G16276l2318k7863l4732k4622j9610L574J8696j1681n1924P972N949j1442
5608E38275J1767J9358K259K1962O299p773P111j037J2243k7097J3527j2448k5490
5595E58956j0777j9738L0947O875M31J3596l1904p418k1948N199K5056j3034q433
$$ y = [647317, 712862, 703294, 766389, 823251, 852090, 872833, 909224, 939068, 957160, 951706, 978940, 999678, 1047626, 1104541, 1202726, 1191230, 1132652, 1113537, 1102622, 1107946, 1062617, 1044599, 1058206, 1059806, 1076752, 1049393, 1078577, 1067641, 1042003, 1019374, 1021120, 1057012, 1050100, 1110125, 1153229, 1145801, 1117734, 1129691, 1109877, 1096587, 1094057, 1054071, 1015658, 992270, 943423, 912802, 908927, 850795, 775061, 744775, 722513, 669399, 646128, 679729, 682724, 659455, 658640, 672583, 678859, 716276, 683958, 656095, 621363, 596741, 577131, 580705, 599401, 587720, 535796, 543768, 549717, 538275, 550042, 569400, 571659, 593621, 599920, 592147, 599258, 598221, 610464, 583367, 596894, 584446, 558956, 548179, 528441, 559388, 566263, 566694, 580290, 548386, 540968, 519020, 524219, 549275, 536241, 527808]
5582E27808j1038M8049Q677j5535k9799K4305J9332m6075M9702n058j901K3917
5570E92384j0059r623L2858l451j4406J7462R102O049R81k1591n948J6498n7101
5557E53155j6433K8450k7169l0898M5957M4249j9309J2067n999n637J5205J6827
5545F10465J9812K950J8005l4423l7458J5929R332j2333L568N1664P184n057J1631
5532F61269j4331j283Q560j5121R197K4559K3744N0506j1148j8519J4k629J5870
5519G30688j9701j8753j4888N0764J8326L91l9920L4854K5898m0739L6658M460
5507G68038J3538J3712K8833k1206K4311M1711j9022l6565J9475l993J0955J557
5495H41344L483M704J5964Q800J4165J4446o008K6445p16L5687k6939j0910L9208
$$ y = [527808, 516770, 564819, 573496, 557961, 528162, 552467, 571799, 525724, 575426, 570368, 568467, 592384, 582325, 572702, 605560, 602109, 587703, 605165, 614267, 620316, 621297, 599706, 593758, 610256, 553155, 536722, 565172, 538003, 507105, 553062, 597311, 578002, 590069, 584070, 578433, 593638, 610465, 630277, 633227, 651232, 616809, 579351, 595280, 604612, 592279, 595847, 647511, 654695, 649638, 661269, 646938, 645655, 654215, 639094, 648291, 672850, 696594, 747100, 735952, 717433, 717447, 714818, 730688, 710987, 692234, 677346, 728110, 746436, 746827, 706907, 741761, 767659, 726920, 763578, 768038, 781576, 795288, 824121, 802915, 827226, 868937, 849915, 813350, 832825, 828832, 839787, 841344, 844827, 849531, 865495, 874295, 888460, 902906, 896898, 923343, 922627, 958314, 931375, 920465, 959673]
5482I59673j416J181L3545o521o420J5559l8652L0820N1320R96r624L53R070Q597
5468A048481J1841m1618K3675M1003r856J8875p871J8518J6733Q270M478j6141
5456A116388K8535p212K2910J626O430l332m089J3304L6563O1240J4577J0486
5444A297426L2001R473n984M118J729K0721K3973L0135K9039M994K3672k1983
5432A449314J7480J2207O568K4233L4357j155L6064K7247K3911K3820l513L0563
5420A681096R592k5813j8224J4513q613M8797J8952M3673M4555L6779N987K6706
5408A878000L6091K0714K1763K0719n850J5740m068J7737M6809Q580L4894N4687
5396B145816K1027k348L8107K7407O1967K6524J1957L4192K2289r7K8197P3800
$$ y = [959673, 958257, 959438, 992983, 986462, 980042, 995601, 956949, 987769, 1039089, 1040085, 1030461, 1030814, 1039884, 1048481, 1060322, 1018704, 1042379, 1083382, 1073526, 1092401, 1084530, 1103048, 1119781, 1128051, 1132529, 1116388, 1144923, 1137711, 1160621, 1162247, 1168677, 1165345, 1161256, 1174560, 1211123, 1272363, 1286940, 1297426, 1329427, 1338900, 1332916, 1337034, 1338763, 1359484, 1383457, 1413592, 1442631, 1447625, 1471297, 1449314, 1466794, 1479001, 1485569, 1509802, 1544159, 1543004, 1579068, 1606315, 1630226, 1654046, 1650533, 1681096, 1690688, 1664875, 1646651, 1661164, 1652551, 1701348, 1720300, 1763973, 1808528, 1845307, 1851294, 1878000, 1914091, 1934805, 1956568, 1977287, 1971437, 1987177, 1983109, 2000846, 2047655, 2056235, 2091129, 2145816, 2166843, 2164495, 2202602, 2230009, 2291976, 2318500, 2330457, 2364649, 2386938, 2386841, 2415038, 2488838]
5384B488838N2143J3321L4365N3736N4122M6913M0430K7130K0976J6828L1228
5373B880030L3280M0308M5875J8048K9305M7386K3954R567N4284K9751k855l124
5361C205809Q2737P5867R3639K5796K5519P5525M2880L4109K6696K3038M4785
5350C756400M6143n67K6821O0892N3993N8848Q6348O1698L6764M0657N4489P8915
5338D361401J11565R0133N6820N5377Q2396R4745O3958R7311R3140J42965J26080
5327E375891J07041J17146J43807J46108J53068J56181J57018J77673J47063J69477
5317F850473K10733K59263K94307L10099K72421K71826L29837L12282L83818L67969
5307I863028M67986N14951N15345O29721P30525Q18794Q57992R88226J151103
$$ y = [2488838, 2540981, 2554302, 2588667, 2642403, 2696525, 2743438, 2783868, 2810998, 2831974, 2848802, 2880030, 2913310, 2953618, 2999493, 3017541, 3046846, 3094232, 3118186, 3127753, 3182037, 3211788, 3208933, 3205809, 3288546, 3364413, 3458052, 3483848, 3509367, 3584892, 3627772, 3661881, 3688577, 3711615, 3756400, 3802543, 3801976, 3828797, 3889689, 3943682, 4002530, 4088878, 4150576, 4187340, 4227997, 4282486, 4361401, 4472966, 4563099, 4619919, 4675296, 4757692, 4852437, 4916395, 5013706, 5106846, 5249811, 5375891, 5482932, 5600078, 5743885, 5889993, 6043061, 6199242, 6356260, 6533933, 6680996, 6850473, 7061206, 7320469, 7614776, 7924875, 8197296, 8469122, 8798959, 9111241, 9495059, 9863028, 10331014, 10845965, 11361310, 11991031, 12721556, 13540350, 14398342, 15386568, 16537671]
5298A6537671J360960J740669K269546K963194L822886M415653M067011K507409
5290C9684999Q08386l72475r43968p97026r2450J024628K304356L936765N805568
5281E1358783P320334P663361O393799M211269J864033O92005N10760L28868k71686
5272H0071526k98356P39515K276938L320460L290607K826961J584985K55335N82345
5263I4650316J773729K908264L191036K328941J070505N15762n62780k395680
5255A03480093l532291l728697k666120p16410L13079l30408j281978k822715
5247H8714553m365205m424805l326659k131177j400560p78887L32117J442809
5239G4062186J103977p78865l359704n942163p361592p463538o670120n261569
$$ y = [16537671, 17898631, 19639300, 21908846, 24872040, 28694926, 33110579, 37177590, 39684999, 40493385, 40120910, 39176942, 38379916, 38287466, 39312094, 41616450, 45553215, 51358783, 58679117, 66342478, 72736277, 76947546, 78811579, 79503584, 80014344, 80343212, 80071526, 79773170, 80512685, 82789623, 86110083, 89400690, 92227651, 93812636, 94067971, 94650316, 96424045, 99332309, 102523345, 104852286, 105922791, 106438553, 105875773, 103480093, 99947802, 96219105, 93552985, 92836575, 93149654, 92819246, 91537268, 88714553, 84349348, 79924543, 76597884, 74466707, 73066147, 72287260, 72619377, 74062186, 75166163, 74387298, 71027594, 65085431, 57723839, 50260301, 43590181, 38328612]
5231C8328612l735155k236963p87763M94413J495177J526830J93910j690719k990036
5222C0598306l632096l707967l330071k774622k217318j703217j361946j038264
5214A0832805q23082o07249n46825m01596l63845l39975k54887k38324k52170
5205G004852l05602k23997j97068j61844j73735j40355j10350j10084j12990j01053
5195E367774j01383j01648q6636j08444j26570n7449q0626o7327l8808j04886
5185D493997o4038o9419o1341n5950q5273j8711m9351n3359j5293k4540l2059
5174C964663k3314n7061k5274J0128k1410O332L2769L9464K4921L678K1181J5741
5162C991818l499k4877j9325K4678J2823O9113M7999O2863P5970N6343M3470n269
$$ y = [38328612, 34593457, 32356494, 31568731, 32063144, 33558321, 35085151, 35279061, 33588342, 30598306, 26966210, 23258243, 19928172, 17153550, 14936232, 13233015, 11871069, 10832805, 10009723, 9402474, 8855649, 8454053, 8090208, 7750233, 7495346, 7257022, 7004852, 6699250, 6475253, 6278185, 6116341, 5942606, 5802251, 5691901, 5581817, 5468827, 5367774, 5266391, 5164743, 5078107, 4969663, 4843093, 4785644, 4705018, 4637691, 4598883, 4493997, 4429959, 4360540, 4299199, 4243249, 4157976, 4139265, 4089914, 4036555, 4021262, 3996722, 3964663, 3941349, 3884288, 3859014, 3869142, 3847732, 3854064, 3886833, 3926297, 3951218, 3954896, 3976077, 3991818, 3988319, 3963442, 3944117, 3968795, 3981618, 4050731, 4098730, 4161593, 4237563, 4293906, 4337376, 4332107]
5150D332107k2773O740l4272l9792N811k5194K4421L2870K1963K4742L3262M7771
5138D407656N2590q134j0737l6419p5724n7187k6604l0845o0153r366K9490p254
5126D167313R3J1405M2629L6995k3788m8882n6819k3558l3017k5942m4210l2423
5114C969796k7035j2493m5487o4369m4133j022J3009O9068N6420M1247P1284J28129
5102D154414J23179P5842O1425m8587q5994q9759p1222r9226j06008q7879o0703
5091C765482j1600L4177O4250P9587J00809R3268Q9595J0753p5625q3677j08883
5080C958136j47554n8774l2317n4139n7692k3222k2684j8992J6613R893K903k081
5068C570090J7989P4631O9333K1488M2329L9999O9110M8213L3146l855K4078M1527
$$ y = [4332107, 4309334, 4316074, 4281802, 4242010, 4247821, 4222627, 4247048, 4279918, 4301881, 4326623, 4359885, 4407656, 4460246, 4452112, 4441375, 4404956, 4329232, 4272045, 4245441, 4214596, 4154443, 4145077, 4174567, 4167313, 4167406, 4178811, 4221440, 4258435, 4234647, 4185765, 4128946, 4105388, 4072371, 4046429, 4002219, 3969796, 3942761, 3930268, 3884781, 3820412, 3776279, 3775257, 3788266, 3857334, 3913754, 3955001, 4026285, 4154414, 4277593, 4353435, 4414860, 4366273, 4280279, 4190520, 4119298, 4020072, 3914064, 3826185, 3765482, 3753882, 3788059, 3852309, 3931896, 4032705, 4125973, 4215568, 4226321, 4150696, 4067019, 3958136, 3810582, 3751808, 3719491, 3665352, 3607660, 3584438, 3561754, 3542762, 3559375, 3569268, 3572171, 3570090, 3588079, 3662710, 3732043, 3753531, 3795860, 3835859, 3904969, 3953182, 3986328, 3982473, 4006551, 4048078]
5056D048078M7272N685L9556q870L4689N4933J3264L6882M3499M1178P8278Q2815
5044D517259K3646R5841R7089L484Q3229M8481P2906M5858K6662N5058P9467R1178
5032E240158N1474M3013O8019L6345M5202J14126N4259O9195P3793P5955J19480
5021E991019J09446R5598R0623J06674R7884P8039J04456J15678J00114J03812
5011F993343J20624P7635Q2059R8632J12403J35780J30460J56869J92076J89103
5001H288984K45938K06422J85665J93451J82802J60714J67092J58036J58165J71288
4991A0118557J86613J22334O1865P6557Q9009M2987M4821O7799J23098Q4131J56589
4980A1174360J82578K07568K08924J44188R4540O4145J13685J39307Q3785J35404
$$ y = [4048078, 4095350, 4101035, 4140591, 4131721, 4166410, 4221343, 4234607, 4271489, 4314988, 4356166, 4434444, 4517259, 4540905, 4636746, 4733835, 4737319, 4820548, 4869029, 4941935, 4987793, 5014455, 5069513, 5148980, 5240158, 5291632, 5334645, 5402664, 5439009, 5484211, 5598337, 5652596, 5721791, 5795584, 5871539, 5991019, 6100465, 6196063, 6286686, 6393360, 6491244, 6569283, 6673739, 6789417, 6889531, 6993343, 7113967, 7191602, 7273661, 7372293, 7484696, 7620476, 7750936, 7907805, 8099881, 8288984, 8534922, 8741344, 8927009, 9120460, 9303262, 9463976, 9631068, 9789104, 9947269, 10118557, 10305170, 10427504, 10489369, 10565926, 10654935, 10697922, 10742743, 10810542, 10933640, 11017771, 11174360, 11356938, 11564506, 11773430, 11917618, 12012158, 12076303, 12189988, 12329295, 12413080, 12548484]
4970A2548484K20938K14005K67335K86428L50096L39442K38346J48348J14376
4961A4727798L6514K1833J13761J08162J19953J65070J85642J97998K13002J94831
4951A6084564J82411K35924K80513K68860L06093L66892L91866L78314M20948
4942A8916385M77046M53590M85362M50514M81352M40470M19247M51408M92447
4933B3067821N11583N47118O20191N69209O05338O17479O81498P31859P86449
4924B8738545Q73874R82702J113269J143969J134484J128227J126015J173653
4916C7414738J218234J390993J586897J716253J825254J955859K168354K359835
4908E1636417K616906L011921L548952M264916N217506O669117Q946816J2548619
$$ y = [12548484, 12769422, 12983427, 13250762, 13537190, 13887286, 14226728, 14465074, 14613422, 14727798, 14764312, 14786145, 14899906, 15008068, 15128021, 15293091, 15478733, 15676731, 15889733, 16084564, 16266975, 16502899, 16783412, 17052272, 17358365, 17725257, 18117123, 18495437, 18916385, 19393431, 19847021, 20332383, 20782897, 21264249, 21704719, 22123966, 22575374, 23067821, 23579404, 24126522, 24746713, 25315922, 25921260, 26538739, 27220237, 27952096, 28738545, 29612419, 30595121, 31708390, 32852359, 33986843, 35115070, 36241085, 37414738, 38632972, 40023965, 41610862, 43327115, 45152369, 47108228, 49276582, 51636417, 54253323, 57265244, 60814196, 65079112, 70296618, 76965735, 85912551, 98461170]
4900I8461170J7366887K1784683K0782246J1109427p53094q281761j1435040j0686514
4892A38348004p564108l764557l11362K540920N006743P291087R741980J2605056
4884A63893763J6156793K0690956K5982543L0523671L0436181K4616547J9036623
4877C31337077J5845539R837434j607230j2103658j7646951j9104346j7089500
4870B89468365j3039056q407255l875877L30064M232352P815224J0964961J4021050
4862C01509828J7171804K0979904K5139746K7376608K2522840J0030194j901802
4855D22829122r074551j2256754j2271233j0886555r337488p895370o669904n446336
4847C48990931m308715l286732k413319j702660j241470r94968q68425o89279
$$ y = [98461170, 115828057, 137612740, 158394986, 169504413, 168751319, 160469558, 149034518, 138348004, 130783896, 127019339, 126707977, 129248897, 134255640, 141546727, 151288707, 163893763, 180050556, 200741512, 226724055, 257247726, 287683907, 312300454, 331337077, 347182616, 357020050, 355412820, 343309162, 325662211, 306557865, 289468365, 276429309, 268022054, 264146177, 264476241, 268708593, 276523817, 287488778, 301509828, 318681632, 339661536, 364801282, 392177890, 414700730, 424730924, 422829122, 413754571, 401497817, 389226584, 378340029, 369002541, 361107171, 354437267, 348990931, 344682216, 341395484, 338982165, 337279505, 336038035, 335043067, 334174642, 333485363]
4839C33485363l75636j86955m75408j166172j950796k618301l168649l871968
4831C19671478n095718o683509q414969r945066j0807562j1142369j0870205j0134826
4823B46577254q956948p525844n991830m749173m048713l836775m003951m434777
4815B03029243m966075n415496n916696o602091p587374q875475j0089936j0933280
4807A42642820j1199153j0917539j0210587r329263q432456p576342o801735o062433
4799G2113312n403462m782169m226215l663144l202189k777612k476544k160533
4791D3421444j899058j759211j578863j508283j327631j264384j154920j073737
4783C1855357j012244r18310q48196p88950p54544p04197o26417n29430n49367
$$ y = [333485363, 333109727, 332922772, 332447364, 331281192, 329330396, 326712095, 323543446, 319671478, 314575760, 307892251, 299477282, 289532216, 278724654, 267582285, 256712080, 246577254, 237620306, 230094462, 224102632, 219353459, 215304746, 211467971, 207464020, 203029243, 198063168, 192647672, 186730976, 180128885, 172541511, 163666036, 153576100, 142642820, 131443667, 120526128, 110315541, 100986278, 92553822, 84977480, 78175745, 72113312, 66709850, 61927681, 57701466, 54038322, 50836133, 48058521, 45581977, 43421444, 41522386, 39763175, 38184312, 36676029, 35348398, 34084014, 32929094, 31855357, 30843113, 29924803, 29076607, 28287657, 27533113, 26828916, 26202499, 25673069, 25123702]
4774B5123702n18992n15546n00676n04615n37366n26269o04206n81605n94793
4765B0239634o08101o40379n64456o08092n66547n24361n14405m20259m28142
4756A5364892l99575l83135l58864l60506l78019l27965l48801l27128l23422
4747A2157477l31980l25523l19645k81044k59028k30545k59940k39576k07662
4738I702534k12735k10320j71590j69664k14315k16991k61500k09973j78991j83081
4728G673374j33763j43049j50366j54397r3708j31588j51399j33369r7441r4750
4718F389544p1081q2248j06939r0214o1985p0653r2854n4671j1950L2231k6263
4707E752917n6285r0582j18259p2697p8886q8683m3243m4555n7509m4614L515
$$ y = [25123702, 24604710, 24089164, 23588488, 23083873, 22546507, 22020238, 21416032, 20834427, 20239634, 19631533, 18991154, 18426698, 17818606, 17252059, 16727698, 16213293, 15793034, 15364892, 14965317, 14582182, 14223318, 13862812, 13484793, 13156828, 12808027, 12480899, 12157477, 11825497, 11499974, 11180329, 10899285, 10640257, 10409712, 10149772, 9910196, 9702534, 9489799, 9279479, 9107889, 8938225, 8723910, 8506919, 8245419, 8035446, 7856455, 7673374, 7539611, 7396562, 7246196, 7091799, 6998091, 6866503, 6715104, 6581735, 6484294, 6389544, 6318463, 6236215, 6129276, 6039062, 5977077, 5906424, 5813570, 5758899, 5746949, 5779180, 5752917, 5696632, 5606050, 5487791, 5415094, 5336208, 5247525, 5204282, 5159727, 5102218, 5057604, 5061119]
4696E061119O4j2867n9161j01543o8575o8183m2087k3719k5554P359K7834L1865
4684D726552L6862P404J9040M7686p366m4773k3061j4005J6827J221L8901m8613
4672D756675J1047R815M6738M3420Q7509R3305R8851Q0377N0690J09203O9511
4661E457141M0753l2043J5458M9350Q4290Q1984N5609O8585Q5764Q7608N2701
4650F047200J03152J28700J24237K15856J93891J85898K24114K03223K24749L01162
4640G952182L60721L00348K80171K79072K13006J88783K13790K13429K16497K22120
4630A0440119K64438L11994M29045O21618P44118P37026P22886P21599P56928
4621A5749771Q54545R51086J041098J131198J317224J511341J647883J797458
$$ y = [5061119, 5061183, 5048316, 4989155, 4887612, 4819037, 4750854, 4708767, 4685048, 4659494, 4666853, 4694687, 4726552, 4763414, 4770818, 4789858, 4837544, 4830178, 4785405, 4762344, 4748339, 4765166, 4766387, 4805288, 4756675, 4767722, 4777537, 4824275, 4867695, 4955204, 5048509, 5147360, 5227737, 5278427, 5387630, 5457141, 5497894, 5465851, 5481309, 5530659, 5614949, 5696933, 5752542, 5821127, 5906891, 5994499, 6047200, 6150352, 6279052, 6403289, 6619145, 6813036, 6998934, 7223048, 7426271, 7651020, 7952182, 8312903, 8613251, 8893422, 9172494, 9385500, 9574283, 9788073, 10001502, 10217999, 10440119, 10704557, 11016551, 11445596, 12067214, 12811332, 13548358, 14271244, 14992843, 15749771, 16604316, 17555402, 18596500, 19727698, 21044922, 22556263, 24204146, 26001604]
4613B6001604J982666K300774K754341L462213M471589O025980Q545356J2477950
4605F8022473J7565340K1624690K0184377J0817436j242718j0031972j3705871
4598A13233755j2883191r380951m690982O26511O741740J3049941J7278862J5171312
4590A39146997N579260n338021j2292404j4199161j1724960o463896L19928P528829
4582A02556572J2842976J1986858L978815n677371j2002061j4125774j2623016
4575H6936999r223474m998913k69298N065519J0503258J3621787J0554252J322555
4567A13512685q117893j3975723j5683609j4330235j1677923r003430o843690
4560C3880182n255466l988781l104709k412058j749066j325856j013097q59461
$$ y = [26001604, 27984270, 30285044, 33039385, 36501598, 40973187, 46999167, 55544523, 68022473, 85587813, 107212503, 127396880, 138214316, 136971598, 126939626, 113233755, 100350564, 90969613, 86278631, 86905142, 93646882, 106696823, 123975685, 139146997, 144726257, 139388236, 127095832, 112896671, 101171711, 94707815, 95027743, 102556572, 115399548, 127386406, 131365221, 125687850, 113685789, 99560015, 86936999, 77713525, 72714612, 72445314, 77510833, 88014091, 101635878, 112190130, 113512685, 105394792, 91419069, 75735460, 61405225, 49727302, 40723872, 33880182, 28624716, 24635935, 21531226, 19119168, 17370102, 16044246, 15031149, 14171688]
4552A4171688q06377p31208o99734o19505n76451n28812m44466l06815k35210
4543I223110j73933j92370k07683k20687k88169k38554k55549k39210k10983j07690
4533G088282r9680j34899q2471j38039j87846j74074j95356j73720j40123j74097
4523E587977j39125o2678j20880j27290j29309j33394j70994j85501j35555j54160
4513D229091j30040j33408r1761l2632o5925o1936p7730n3722j6015k0397l2070
4502C513455N2388Q8616N9986J17857J47464J34137J42718J21304Q4138N8406
4492D520469J24055K79183N25907R32813J469798J416828M40056o82029j267199
4483G759881j283426r43357o33867m34778k61983k11118j06942q6438r6345j14299
$$ y = [14171688, 13365311, 12634103, 11934369, 11314864, 10738413, 10209601, 9765135, 9458320, 9223110, 9049177, 8856807, 8649124, 8428437, 8140268, 7901714, 7646165, 7406955, 7195972, 7088282, 6988602, 6853703, 6771232, 6633193, 6445347, 6271273, 6075917, 5902197, 5762074, 5587977, 5448852, 5386174, 5265294, 5138004, 5008695, 4875301, 4704307, 4518806, 4383251, 4229091, 4099051, 3965643, 3873882, 3841250, 3775325, 3713389, 3635659, 3581937, 3565922, 3545525, 3513455, 3565843, 3654459, 3714445, 3832302, 3979766, 4113903, 4256621, 4377925, 4462063, 4520469, 4644524, 4923707, 5449614, 6382427, 7852225, 9269053, 9709109, 9027080, 7759881, 6476455, 5533098, 4899231, 4464453, 4202470, 3991352, 3884410, 3797972, 3701627, 3587328]
4473C587328j45076j33032j71791j24158j57454j06081r0413q5500p0544n6716
4463B446563o8129l739K8903K3732P733L0302J02831J4713l902k4050j3570p6311
4451B465076m2260m9563p7056n9409m1320q579N373j7135j361M0136J58l745Q33
4438B211148k8145o5106m2925k3172k50k8717l1001J1306N4660M0599R429N7183
4426B165009K6989k239j2144j0975j3635J2675P409k6313j5679k2226K4074R330
4414B142275N8955P201K0015O5283J8383l6496L340j623l8183q444K7726K0630
4402B279062J0154M5051L7961M5022Q82j8370r171K0190J8121k7492o3810K2909
4390B360509K40K4007L0030j7322k1368Q427L0944N2300K6277k4824L4835L9093
$$ y = [3587328, 3442252, 3309220, 3137429, 3013271, 2855817, 2749736, 2659323, 2573823, 2503279, 2446563, 2378434, 2374695, 2403598, 2427330, 2435063, 2465365, 2568196, 2582909, 2579007, 2554957, 2541387, 2465076, 2422816, 2373253, 2296197, 2236788, 2195468, 2186889, 2192262, 2175127, 2173766, 2213902, 2214060, 2210315, 2211148, 2183003, 2117897, 2074972, 2051800, 2051550, 2022833, 1991832, 2003138, 2057798, 2098397, 2107826, 2165009, 2191998, 2189759, 2177615, 2166640, 2153005, 2165680, 2173089, 2146776, 2131097, 2108871, 2132945, 2142275, 2201230, 2208431, 2228446, 2293729, 2312112, 2275616, 2278956, 2277333, 2239150, 2230706, 2258432, 2279062, 2289216, 2334267, 2372228, 2417250, 2418132, 2399762, 2390591, 2410781, 2428902, 2401410, 2337600, 2360509, 2360749, 2384756, 2414786, 2397464, 2376096, 2384523, 2415467, 2467767, 2494044, 2469220, 2504055, 2543148]
4378B543148L2228J7260M1750O6787J3017k7807j2797K4712J2071N99o617K865
4366B707216q369J2786L0412J5348k6198j2823L6548M1761O7637M7255J1895K9981
4354B953449N3376O1251N1947Q9253J07265J08731J19124J59427J57972J01676
4344C963471L5210j7097l9199o3568j9730M2504J6708P3101J38219J10861J31043
4333D371523R1169j2007j8620k1174k8023j7380O4452J24378R9095J42608J18469
4322D914490O1600k5183o781k8657l7166M8373P1446M9025Q4343J57903K04172
4311E493565J45946O5235J8999m4165j8160k2684j0454K0941P2264M1425P4503
4300E837415N8041M0606J21053J06761R3983Q8963R9720Q7820Q8843J11185J01159
$$ y = [2543148, 2575376, 2592636, 2634386, 2701173, 2714190, 2686383, 2673586, 2698298, 2710369, 2710968, 2704351, 2707216, 2698847, 2711633, 2742045, 2757393, 2731195, 2718372, 2754920, 2796681, 2864318, 2911573, 2923468, 2953449, 3006825, 3068076, 3120023, 3209276, 3316541, 3425272, 3544396, 3703823, 3861795, 3963471, 3998681, 3981584, 3942385, 3878817, 3859087, 3901591, 3918299, 3991400, 4129619, 4240480, 4371523, 4462692, 4450685, 4432065, 4410891, 4382868, 4365488, 4429940, 4554318, 4653413, 4796021, 4914490, 4976090, 4950907, 4944126, 4915469, 4878303, 4926676, 4998122, 5047147, 5131490, 5289393, 5493565, 5639511, 5704746, 5723745, 5679580, 5661420, 5638736, 5628282, 5649223, 5721487, 5762912, 5837415, 5895456, 5936062, 6057115, 6163876, 6257859, 6346822, 6446542, 6534362, 6623205, 6734390, 6835549]
4289F835549J20295J33490Q8974J15800J37618Q4303R9137J40470J14223J03520
4279G973379J99016J94471J48294J88726J93896J73756J82019J83663K41287K16596
4269I895103J80404J80087K18121K40853K61415K79347K56893K88090L20422L27396
4259A2448131L25636L67551M14731M02221M64180N31660N49858O06417O63301
4250A6773686P68313P82466R10683J024758J098927J137196J211247J227684J248945
4241B6183905J262277J246992J238531J177748J181656J211187J304630J495497
4233C6302423J593030J653656J580614J471672J308682J214378J208194J336393
4225D7669042J471079J743748K030646K134324K092074J945116J727578J495730
$$ y = [6835549, 6955844, 7089334, 7178308, 7294108, 7431726, 7516029, 7615166, 7755636, 7869859, 7973379, 8172395, 8366866, 8515160, 8703886, 8897782, 9071538, 9253557, 9437220, 9678507, 9895103, 10075507, 10255594, 10473715, 10714568, 10975983, 11255330, 11512223, 11800313, 12120735, 12448131, 12773767, 13141318, 13556049, 13958270, 14422450, 14954110, 15503968, 16110385, 16773686, 17541999, 18324465, 19235148, 20259906, 21358833, 22496029, 23707276, 24934960, 26183905, 27446182, 28693174, 29931705, 31109453, 32291109, 33502296, 34806926, 36302423, 37895453, 39549109, 41129723, 42601395, 43910077, 45124455, 46332649, 47669042, 49140121, 50883869, 52914515, 55048839, 57140913, 59086029, 60813607, 62309337]
4217F2309337J356441J291816J448412J526177J586180J562403J460012J381727
4209G3922505J418387J607405J885391K106542K207511K085070J821001J684753
4201H8738565J788175K123281K849046L689269M543633N014083M760104L784123
4193A17290279K411572J188374M70618L47043N80907J008817J411772J744566
4185A26453948J897369J896946J788449J553150J162204P37212L44800J34209
4177A35968287K4217j31862j83855L2461N86934J529365K891158M536020O199243
4168A51451968P466694P972289P588723O571695N515443N004013M965383N011048
4160B01547256M609804L705264K859353K426542K304854K030201J065622m31102
$$ y = [62309337, 63665778, 64957594, 66406006, 67932183, 69518363, 71080766, 72540778, 73922505, 75340892, 76948297, 78833688, 80940230, 83147741, 85232811, 87053812, 88738565, 90526740, 92650021, 95499067, 99188336, 103731969, 108746052, 113506156, 117290279, 119701851, 120890225, 121360843, 121707886, 122288793, 123297610, 124709382, 126453948, 128351317, 130248263, 132036712, 133589862, 134752066, 135489278, 135834078, 135968287, 135992504, 135860642, 135676787, 135709248, 136296182, 137825547, 140716705, 145252725, 151451968, 158918662, 166890951, 174479674, 181051369, 186566812, 191570825, 196536208, 201547256, 206157060, 209862324, 212721677, 215148219, 217453073, 219483274, 220548896, 220117794]
4152B20117794j878686k801391k943303k405308j677739j116530q25275q19403
4144B05650159q72031q67860p76599o59200m03344l8398M32929J130952K091349
4135B05687957L079416L794306L744958K687946J004544n86620j575660j850408
4127B15986439j830845k264273l330950m399733m840997m629751m389346n026034
4119A85274510o481789p792134q290583p902209o792626n402447l914372k486131
4111A36212219j257211m71419j26931k38489n06604p00767q26240r91386j232761
4102A29860411j596078k061086k393158k542002k512888k311509j961666j295096
4094A13186928o30681k43933m90677j422419k803978l997348m536607m474109
$$ y = [220117794, 218239108, 215437717, 212494414, 210089106, 208411367, 207294837, 206469562, 205650159, 204778128, 203910268, 203133669, 202474469, 202071125, 202032727, 202465656, 203596608, 205687957, 208767373, 212561679, 216306637, 218994583, 219999127, 219412507, 217836847, 215986439, 214155594, 211891321, 208560371, 204160638, 199319641, 194689890, 190300544, 185274510, 178792721, 171000587, 162710004, 154807795, 148015169, 142612722, 138698350, 136212219, 134955008, 134483589, 134356658, 134118169, 133611565, 132910798, 132084558, 131093172, 129860411, 128264333, 126203247, 123810089, 121268087, 118755199, 116443690, 114482024, 113186928, 112556247, 112312314, 111821637, 110399218, 107595240, 103597892, 99061285, 94587176]
4086I4587176m034402l378137k790057k349498k171209k184828k247800k444365
4078G2986880k542040k417103k191463k048646j898414j800678j710263j595880
4070E6782393j363418j218645j065059j073656j173796j434243j652073j923277
4062D5878226k009511j944777j791529j522300j330816j201957j183351j303696
4054C3590289j501340j574810j668907j618615j465217j281314j083406r50498
4046B2446182r07930q89327r15328r89959j004665r83711r48289q98356q74326
4037A4034291q37278p64690o95413o43766n65694n34925m62717m01019m24207
4028H704582l22908k97289l24433k90671k15637j98683k12573j67917j53361j23798
$$ y = [94587176, 90552774, 87174637, 84384580, 82035082, 79863873, 77679045, 75431245, 72986880, 70444840, 68027737, 65836274, 63787628, 61889214, 60088536, 58378273, 56782393, 55418975, 54200330, 53135271, 52061615, 50887819, 49453576, 47801503, 45878226, 43868715, 41923938, 40132409, 38610109, 37279293, 36077336, 34893985, 33590289, 32088949, 30514139, 28845232, 27226617, 25761400, 24480086, 23396680, 22446182, 21538252, 20648925, 19733597, 18743638, 17738973, 16755262, 15806973, 14908617, 14034291, 13197013, 12432323, 11736910, 11093144, 10527450, 9992525, 9529808, 9128789, 8704582, 8381674, 8084385, 7759952, 7469281, 7253644, 7054961, 6842388, 6674471, 6521110, 6397312]
4018F397312j44068j30218j12211j23253o1165p3758p1045m7747l7423K817P5177
4007E674418J17783J62120K23704L66190N18529P24671P99308Q80418P93508L83721
3997A0644370j88499o14527q08523q17262q08881q23375p11230o53226n35723
3988D683124m17188l49238k95338k29416k08314j58230j46421j27833r4476r7432
3978B559238q0922j00041j05663n1632m8632j3905n9029p9453j07342l7125o5123
3967A810371p2272m2410o4278j9462l5278l2373m8030o0883l3799L444k1429o2635
3955A320966m7272j9681L1743N090o1541j0603k1868k0604J6541j2850l843k9122
3943A146956N811j1250l1318K5583l854k6645L15j9392k1604j6653K00K3958j5321
$$ y = [6397312, 6253244, 6123026, 6010815, 5887562, 5826397, 5752639, 5681594, 5633847, 5596424, 5599241, 5674418, 5792201, 5954321, 6178025, 6544215, 7062744, 7787415, 8586723, 9467141, 10260649, 10644370, 10455871, 9841344, 9032821, 8215559, 7406678, 6583303, 5872073, 5218847, 4683124, 4265936, 3916698, 3621360, 3391944, 3183630, 3025400, 2878979, 2751146, 2656670, 2559238, 2478316, 2378275, 2272612, 2220980, 2172348, 2158443, 2099414, 2019961, 1912619, 1875494, 1810371, 1738099, 1695689, 1631411, 1611949, 1576671, 1544298, 1496268, 1435385, 1401586, 1405030, 1383601, 1320966, 1273694, 1254013, 1285756, 1290846, 1229305, 1218702, 1196834, 1176230, 1192771, 1179921, 1176078, 1146956, 1152767, 1141517, 1110199, 1135782, 1131928, 1105283, 1105598, 1086206, 1064602, 1047949, 1048149, 1072107, 1056786]
3930A056786l3476k0655J8930M0102j743m5790k0830m0536m2194K8103K3901j6682
3918I45916K7428O455n56M2755J5219M0744J1617K2706J6268J9760j6580L2108
3906A163840j8957l4552J9706l5828m1357O285M613n268k268p703p259k0746j6422
3893A004084m1667L0694l8354m752j7421r33K2433M9254L7317l839N250K4541
3881A066607j2693j3796j4744k4072N163l1873J9373k2105l44O794L2990J9371
3869A030671r879l8283l1221l9336n0057K092l3119R318J3469N1464L7326R976
3857I52421l8230k3522K3580n2099l194Q52n2275k3732M0029M8188J1803J7376
3845I01197k6164L043M684m4100K1743k5608k6411K7710k4511k9023q656K5872
$$ y = [1056786, 1023310, 1002655, 1021585, 1061687, 1059944, 1014154, 993324, 952788, 910594, 938697, 962598, 945916, 973344, 979799, 979243, 1021998, 1037217, 1077961, 1089578, 1112284, 1128552, 1148312, 1131732, 1163840, 1144883, 1110331, 1130037, 1094209, 1052852, 1059137, 1063750, 1058482, 1056214, 1048511, 1041252, 1020506, 1004084, 962417, 993111, 954757, 950005, 932584, 931651, 954084, 1003338, 1040655, 1036816, 1042066, 1066607, 1053914, 1040118, 1025374, 1001302, 1006465, 974592, 993965, 971860, 971516, 978310, 1011300, 1030671, 1020792, 982509, 951288, 911952, 861895, 863987, 830868, 840186, 853655, 905119, 942445, 952421, 914191, 890669, 914249, 862150, 858956, 859808, 807533, 783801, 823830, 872018, 883821, 901197, 875033, 878076, 882760, 838660, 860403, 834795, 808384, 836094, 811583, 782560, 773904, 799776]
3833G99776L7117j8893j1263J220n869k4614l4189l0534j5246n200P458L9782
3821G39545J3514j0098J5229l2301K734R748l5158J0344m6465k2594O450j0091
3809F40857m6670m1621J8007k4358M0657K7329k4978l928k5637n2853k4436k4019
3797D58350L666J61L5349N5221k0365q489k9653K8249l064j5303m8680J5j6014
3784D39443l5682l1069l1579J6248K3447l4415l3093K2138j0535P078J6002R325
3772C57308R47R954L4324m3109k6786J050K7937K0006J4846k9446k5969K1372
3760C62434J7466J8460j5232j7309j4597j2953J9164J6846r994j7970l0330O1880
3748C77865M3644P825j619J6360J8910N488k2800J8812K4428K6527L906M6754
$$ y = [799776, 836893, 818000, 806737, 807957, 802088, 777474, 743285, 712751, 697505, 692305, 699763, 739545, 753059, 742961, 758190, 725889, 728623, 738371, 703213, 713557, 667092, 644498, 650948, 640857, 594187, 552566, 570573, 546215, 586872, 614201, 589223, 585295, 559658, 506805, 482369, 458350, 462016, 462177, 497526, 552747, 532382, 523893, 494240, 522489, 519425, 504122, 455442, 455457, 439443, 403761, 372692, 341113, 357361, 380808, 346393, 313300, 335438, 324903, 331981, 347983, 357308, 358255, 368209, 402533, 359424, 332638, 333688, 361625, 381631, 396477, 367031, 341062, 362434, 379900, 398360, 383128, 365819, 351222, 338269, 357433, 374279, 364285, 346315, 315985, 377865, 421509, 429334, 427715, 444075, 462985, 468473, 445673, 464485, 488913, 515440, 519346, 566100]
3736E66100K5617J2357K0732k319M9975N9422o702L8444K9579P417L3886p935
3724H26573J2173K3766O2545M0412R912j6290M9630M2753M0929Q9940K5298N2795
3712A260436Q6366O4354M8023N3122M2166O3485P3586M7445Q1330J18178L6702
3701A975193K0136L3302L4038J5318M1509J8978K5870K8367J8674M6923N6119
3690B314427K8065O8673P5021P7765J07207R2156J16503J53802J45420J47386
3680C326425J35505J41706J97572J04005Q9184J19638J28051J34723J55639J71556
3670D704004J03679J01232J38256J04750P2870R4233J08250J09679J14713J21122
3660E772788J97543J15315K04618K52653K25385K82750K95442L64089L37130L70816
$$ y = [566100, 591717, 604074, 624806, 622487, 672462, 731884, 725182, 763626, 793205, 800622, 834508, 826573, 838746, 862512, 925057, 965469, 975381, 959091, 1008721, 1051474, 1092403, 1182343, 1207641, 1260436, 1346802, 1411156, 1459179, 1512301, 1554467, 1617952, 1691538, 1738983, 1820313, 1938491, 1975193, 1995329, 2028631, 2062669, 2077987, 2119496, 2138474, 2164344, 2192711, 2211385, 2258308, 2314427, 2342492, 2411165, 2486186, 2563951, 2671158, 2763314, 2879817, 3033619, 3179039, 3326425, 3461930, 3603636, 3801208, 3905213, 3994397, 4114035, 4242086, 4376809, 4532448, 4704004, 4807683, 4908915, 5047171, 5151921, 5224791, 5319024, 5427274, 5536953, 5651666, 5772788, 5970331, 6085646, 6290264, 6542917, 6768302, 7051052, 7346494, 7710583, 8047713, 8418529]
3650H418529L47458L20754L46224L42950L50313L29830L93890M62550N48846N96792
3640A2458136O99907Q30705R93386J102206J231321J332049J441130J450087J297333
3631B2836260J122099R01192N53515J19636k50025o33780r20509j062282j242430
3622B1423676j284314j333313j245146j044085q51106p43866o84817o52407o47878
3613A2936744o83187o82891o49337o64390o53835o51211o10527o18294n77862
3604G145210n01001m37715m11353m14234l69115l34887l03858k52104k33463j94455
3594C693025j45291j38572j47847j00340r4090j23227j10978j32579j19979r5505
3584B484617j21837n6475j28130j35372j00466m1691o6628p7284n3764k0491p3087
$$ y = [8418529, 8765987, 9086741, 9432965, 9775915, 10126228, 10456058, 10849948, 11312498, 11861344, 12458136, 13158043, 13988748, 14982134, 16084340, 17315661, 18647710, 20088840, 21538927, 22836260, 23958359, 24859551, 25413066, 25532702, 25282677, 24648897, 23728388, 22666106, 21423676, 20139362, 18806049, 17560903, 16516818, 15665712, 14921846, 14237029, 13584622, 12936744, 12253557, 11570666, 10921329, 10256939, 9603104, 8951893, 8341366, 7723072, 7145210, 6644209, 6206494, 5795141, 5380907, 5011792, 4676905, 4373047, 4120943, 3887480, 3693025, 3547734, 3409162, 3261315, 3160975, 3066885, 2943658, 2832680, 2700101, 2580122, 2484617, 2362780, 2306305, 2178175, 2042803, 1942337, 1900646, 1834018, 1756734, 1702970, 1682479, 1609392]
3573A609392m2499k1082o4019n8906m6055n8556p1669k6616l5273n2691o9886
3562A062140l4300o6814k4840M358m4047l1444m6748l4680m8714j3161m677k6050
3550F91023m0876l4668j9076j6545k4769m612l9315k0052j1588K2520r048j6176
3538D76818P174l7289Q925l7778m3901k1253k3091J8731k9187n697J0732j6710
3526C07474k6010l2207L9117k2342n9784j2362J4321K4315L056k7867k0187J9749
3514B07273k0817j6558j2218k1858M3049J2797K1109o1132k9088k77L6338J0052
3502A68670j8901R679j5942n7481j6156o771P736n072J2285L5903J2205p221l9851
3489G9083p041O5991j2296l1652l377L0197r327j2842n51K1817J2741J8989N514
$$ y = [1609392, 1566893, 1545811, 1481792, 1422886, 1376831, 1318275, 1246606, 1219990, 1184717, 1132026, 1062140, 1027840, 961026, 936186, 940544, 896497, 865053, 818305, 783625, 734911, 721750, 717073, 691023, 650147, 615479, 596403, 579858, 555089, 550477, 511162, 491110, 479522, 502042, 492994, 476818, 483992, 446703, 455628, 417850, 373949, 352696, 329605, 348336, 319149, 313452, 324184, 307474, 281464, 249257, 288374, 266032, 206248, 193886, 208207, 232522, 235578, 207711, 187524, 207273, 186456, 169898, 157680, 135822, 178871, 191668, 212777, 151645, 122557, 122280, 158618, 168670, 149769, 159448, 143506, 86025, 69869, 63098, 70834, 65762, 78047, 113950, 126155, 118934, 79083, 72042, 138033, 125737, 94085, 90708, 120905, 111578, 98736, 98185, 120002, 132743, 151732, 157246]
3476A57246l4523m008j3582M9160J5099q297k8949J786Q137j4172j0662L6329
3464A53564K5986q629l5336N6936L1383q876K3240M477O256j3196q861J2986j1101
3451B28829J1842O919L6792L3214M8634L7902j3874k2548Q125N2213k884P7961
3439E03125N7298K4222O8027L2888O0194L4381N3790K0099Q87K248m7692l0894
3427G78573j6717k3856L424l5327j0610J6942j9527N1016K3937L5018L1109L1970
3415H65952J5392M418p328N406O9015L091M2177L8417M9559O4931Q8642R7377
3403A337049R9536J01879R0325J08320Q2169Q2441M1563L6594n9320p5791o6043
3392A778722r2988r2732j20625p3981o9431n2446l1438J2258L6835L4001O0156
$$ y = [157246, 122723, 118715, 105133, 154293, 169392, 161095, 132146, 133932, 142069, 127897, 117235, 153564, 179550, 170921, 135585, 192521, 223904, 215028, 238268, 242745, 249001, 235805, 226944, 239930, 228829, 240671, 247590, 284382, 317596, 366230, 404132, 390258, 367710, 375835, 428048, 425164, 503125, 560423, 584645, 652672, 685560, 745754, 780135, 833925, 854024, 854911, 857159, 809467, 778573, 761856, 738000, 741424, 706097, 695487, 712429, 692902, 743918, 767855, 802873, 833982, 865952, 881344, 885762, 878434, 883840, 952855, 955946, 998123, 1036540, 1086099, 1151030, 1239672, 1337049, 1436585, 1538464, 1628789, 1737109, 1819278, 1901719, 1943282, 1979876, 1920556, 1844765, 1778722, 1685734, 1593002, 1472377, 1398396, 1328965, 1276519, 1245081, 1257339, 1294174, 1328175, 1388331]
3381A388331O9715O7539J3391N9656J5153k6422k799q239K4175p479K1157N2568
3369A666746P1311Q3559L8458M6810N168j1733J234K4109J7510n7992k0164n8521
3357A806495l8841j6538m9591n2418m003j5906l1489J6634K9252R1804M6963O512
3345A788874O2280R0572O1977O2906K4073O3253N8832N8540L9579N9971R7746
3334B468603J31084J41896J07687J63691J49072J48254J90550J75164K31367L06461
3324D213829L28669L79705M32742M48563N04515N06546M25348L51863K06264J02509
3314G900553j6357o3563p1191n6882n0907k7113j8858l919k2745l5327j2567Q4031
3302G605155J18651R3093P9628J40543J67335K04076K36763L49505N58351P22897
$$ y = [1388331, 1458046, 1525585, 1538976, 1598632, 1613785, 1587363, 1584564, 1576325, 1600500, 1593021, 1614178, 1666746, 1738057, 1821616, 1860074, 1906884, 1912052, 1900319, 1901553, 1925662, 1943172, 1885180, 1865016, 1806495, 1767654, 1751116, 1701525, 1649107, 1645104, 1629198, 1597709, 1614343, 1643595, 1735399, 1782362, 1788874, 1851154, 1941726, 2003703, 2066609, 2090682, 2153935, 2212767, 2271307, 2310886, 2370857, 2468603, 2599687, 2741583, 2849270, 3012961, 3162033, 3310287, 3500837, 3676001, 3907368, 4213829, 4542498, 4922203, 5354945, 5803508, 6308023, 6814569, 7239917, 7591780, 7798044, 7900553, 7884196, 7820633, 7749442, 7692560, 7641653, 7614540, 7595682, 7591763, 7569018, 7533691, 7521124, 7605155, 7723806, 7816899, 7896527, 8037070, 8204405, 8408481, 8645244, 8994749, 9553100, 10275997]
3292A0275997J111808J583998K094900K231663J577866q6306j455820j834540
3284A5499566j860877j697055j467990j147205r02417o86626n17639l81965l01884
3275F535908k84240k25886k36694j53749r2176o7675j3747O98N47N6362Q8458
3264E607806R3928J49693K25700L12214L64042L05447K45728K1509k25650l77526
3254F722891m89842n66560n42974m70766m48497l75535l70192k61502k59035j97976
3244B740012j48462j70647j65758j23165j26558j44102j93048j17321j04654j45875
3234A300422p8877p0688o3482p0186p5597o9085k9058k5233o7975n9830j379o2905
3222F26127r510k7414l2468p863l1851o6932l513K0770m4063l6392n662l2405
$$ y = [10275997, 11387805, 12971803, 15066703, 17298366, 18876232, 18789926, 17334106, 15499566, 13638689, 11941634, 10473644, 9326439, 8424022, 7737396, 7219757, 6837792, 6535908, 6251668, 6025782, 5789088, 5635339, 5543163, 5475488, 5461741, 5462439, 5462986, 5519348, 5607806, 5701734, 5851427, 6077127, 6389341, 6753383, 7058830, 7304558, 7326067, 7100417, 6722891, 6233049, 5666489, 5123515, 4652749, 4204252, 3828717, 3458525, 3197023, 2937988, 2740012, 2591550, 2420903, 2255145, 2131980, 2005422, 1861320, 1668272, 1550951, 1446297, 1300422, 1221545, 1150857, 1087375, 1017189, 941592, 872507, 843449, 818216, 750241, 690411, 689032, 626127, 616617, 589203, 556735, 548872, 517021, 450089, 446576, 467346, 423283, 386891, 381229, 348824]
3210C48824m3514K817n4866l1777J1735j5273K041l4329Q691n454n5374k617Q665
3197A39569j5833l4198q369N456Q571j441k8599k8641J5133R646k2307o2702j1918
3184c5633J7133k3370P286j7074M101J5753l5544k312o53j5920J7042n31j0346
3171h0068J6212j9384k283l5151J1473J3474j6394J6680j8090N494q074j5068
3159a31179J3465j8130O856r746p595O535m3821P971J8806P568k2969k0194j0391
3146b02824N027K0342M100J8401k4970O005k6635k7869N531j4114K4344K5125
3134a87537k1048q445J3679j3515m994r29o240P073K6237O855j8710J975r265
3121b14864o975J1890K539p610l483K5613j1168l319n214m861J1204o101j7329
$$ y = [348824, 305310, 308127, 253261, 221484, 233219, 217946, 219987, 185658, 194349, 188895, 133521, 130904, 139569, 123736, 89538, 81169, 86625, 95196, 93755, 65156, 36515, 51648, 61294, 38987, -23715, -35633, -18500, -41870, -34584, -51658, -47557, -31804, -67348, -69660, -70313, -86233, -69191, -69722, -80068, -63856, -83240, -85523, -120674, -109201, -95727, -112121, -95441, -113531, -108037, -116111, -131179, -117714, -135844, -128988, -138734, -146329, -139794, -183615, -175644, -156838, -149270, -172239, -192433, -202824, -197797, -177455, -173355, -154954, -179924, -173919, -200554, -228423, -222892, -237006, -212662, -187537, -208585, -217030, -203351, -216866, -221860, -222789, -229029, -221956, -195719, -188864, -207574, -205599, -214864, -221839, -209949, -207410, -215020, -218503, -192890, -204058, -207377, -212591, -217452, -206248, -212349, -229678]
3108b29678j4309K6417o670j3339J3620L3671L11j9353J7959N438l036k365l753
3095a95087K2293M497j4794m30J273j0386L2352p626K4682R337J898r407j6971
3082a58369K0867J9212K5210j2938r716L4189j5500K4789K3676k1796L9185J8741
3070a2450M769o587J5773Q746K0084K0723L7715O350K7447N3690m91L0738M2957
3057B49464m3024K0909K4555J2147o0674k0970K4944o418k8655J2655M495K7399
3045B16827n678j1162k5254o270l166m044Q850k8244M2373J5022l451N4759N6791
3032C07353n430L9140O6027N0379J0652M9764Q9684N1967O0120M1394K5906m5623
3020G41333l7555j8013m1935m0140k1508l9616q009m2716m6539k4012o3822j0767
$$ y = [-229678, -243987, -217570, -224240, -237579, -223959, -190288, -189977, -209330, -191371, -185933, -188969, -191334, -195087, -172794, -168297, -183091, -183521, -182248, -192634, -160282, -167908, -143226, -133889, -131991, -141398, -158369, -137502, -118290, -93080, -106018, -115734, -81545, -97045, -72256, -48580, -70376, -31191, -12450, -7681, -14268, 1505, 10251, 30335, 51058, 88773, 95123, 122570, 176260, 175769, 206507, 249464, 206440, 227349, 251904, 264051, 203377, 182407, 207351, 200933, 172278, 184933, 189428, 216827, 211149, 199987, 174733, 168463, 165297, 161253, 170103, 141859, 184232, 199254, 195803, 250562, 307353, 301923, 341063, 407090, 457469, 468121, 517885, 607569, 659536, 719656, 761050, 786956, 741333, 703778, 685765, 643830, 603690, 582182, 542566, 534557, 491841, 445302, 421290, 357468, 346701]
3008C46701k409l691m0753k495j2799J4715m8147p648j8367j2194j2160N8139
2996B58892M2766P599L2631N6872N9823J9268K0571N6138L6213j0566j2469l6598
2984E31140k6110o453k7633o7135p5352l2201O447n3959j141j8889m2289l8212
2972A48213k2111m1996m5521p584k0398j3649N931P831k0279j992j0136p1J0434
2959a1328K0630j1012N526L9456L9302k0170m0826n202k4117L556J2553j7184
2947h816o70r494k7034j8578k0987n6048k6766J3629j8598O034p952k7534j9845
2934b22659M990L0332J8227n933k0951j3507k4605m697m808N12J7589j4908L2194
2921b08224L3428l6847j4650j4230K8155J772l6831R834J1726k6060J1074j7140
$$ y = [346701, 344292, 340601, 299848, 297353, 284554, 299269, 251122, 243474, 225107, 212913, 200753, 258892, 301658, 309257, 341888, 398760, 458583, 477851, 498422, 554560, 590773, 580207, 567738, 531140, 505030, 498577, 470944, 403809, 328457, 296256, 302703, 248744, 247603, 228714, 186425, 148213, 126102, 84106, 38585, 31001, 10603, -3046, 2885, 10716, -9563, -11555, -21691, -21762, -11328, 9302, -1710, 3816, 43272, 82574, 62404, 21578, 16376, -7741, -4185, 8368, -8816, -9486, -18980, -46014, -64592, -85579, -141627, -168393, -154764, -173362, -167328, -175280, -202814, -222659, -217669, -187337, -169110, -175043, -195994, -209501, -234106, -238803, -243611, -243099, -225510, -240418, -208224, -174796, -211643, -226293, -240523, -212368, -210596, -247427, -237593, -225867, -251927, -240853, -257993]
2909b57993j6282J3831K0029k3446k669K8857n797L60j3232J7975K39M299n2541
2896b86370L5958j7517n656K3965J8151n0029l46K6853J8079n595m782l0892j5551
2883b93732K3671l1757K6650n706k766L0038J2229k2808m1047M243M1331J9224
2871b40430j0303J143J1482K5295l5209J4035J7j3821q26l535j1935k4730M7701
2858b41116l6166K5898M589J9732k035j82J6806k3952j6424j4878J9090J8049
2846b30589j9478l2790J2101K4871N521J8800J505p827p6859j8788P355M1397
2834b74781k180J0022J3518m5652L3528L1064k921O39n4248L8270J5553m4659
2822b81847Q068k625J4352Q6M530q679J8135l6905L6097K8850k7628L496O226
$$ y = [-257993, -274275, -260444, -240415, -263861, -266530, -237673, -243470, -243110, -256342, -238367, -238128, -233829, -286370, -250412, -267929, -273585, -249620, -231469, -281498, -281844, -254991, -236912, -242507, -247289, -278181, -293732, -270061, -301818, -275168, -280874, -283640, -253602, -241373, -264181, -305228, -300985, -259654, -240430, -250733, -249590, -238108, -212813, -248022, -233987, -233970, -247791, -248617, -252152, -264087, -288817, -241116, -277282, -251384, -246795, -227063, -229098, -229280, -212474, -236426, -252850, -267728, -248638, -230589, -250067, -282857, -270756, -245885, -240364, -221564, -220059, -227886, -304745, -323533, -316178, -274781, -276961, -266939, -253421, -299073, -265545, -234481, -237402, -236763, -291011, -252741, -237188, -281847, -273779, -276404, -262052, -261966, -257436, -266115, -247980, -284885, -248788, -219938, -247566, -244070, -237844]
2809b37844m4412n061M7965J6161j4127j1920m831q612l209j3975o876K5220J8536
2796b42985J9109M547j0230Q150k0008j0793J2744Q43p238j5738K7406j7525M442
2783b47276k23k649k8799K9185K4079J3445q46r268j161k6820J2176J785j4181
2770b50553j0965M2738L582j6O6N1122K1195Q766p031n163J5503k4441l6428P508
2756a84117J9022n2337l8488L1770K4683j7046m1377M7220q241n972n775J2099
2744b18559k0903R813Q745k1562J8952k7074K6774J6690j2625j1546p438K9393
2732b09340R37P710K9041J2136k6001k113j3013O73J6613n6686J0471L9220J3318
2719a77034j1525J8497K8318l495k993k8561R475R182J411J1342j9733k7509m558
$$ y = [-237844, -282256, -287317, -239352, -223191, -237318, -249238, -254069, -262681, -265890, -279865, -286741, -261521, -242985, -223876, -219329, -229559, -221409, -241417, -252210, -239466, -238623, -245861, -261599, -234193, -251718, -247276, -247499, -250148, -278947, -249762, -225683, -212238, -213084, -222352, -223513, -250333, -238157, -236372, -250553, -261518, -218780, -215198, -215214, -215148, -164026, -142831, -134065, -141096, -146259, -130756, -155197, -191625, -184117, -165095, -217432, -255920, -224150, -199467, -216513, -257890, -210670, -218911, -224883, -230658, -218559, -239462, -229649, -220904, -242466, -223514, -250588, -223814, -207124, -219749, -231295, -238733, -209340, -208403, -200693, -171652, -159516, -185517, -187630, -200643, -199970, -183357, -240043, -229572, -190352, -177034, -188559, -170062, -141744, -145239, -148232, -176793, -167318, -158136, -156725, -145383, -165116, -192625, -197183]
2706a97183O328k1603J7737J7075j3850j1637K321K7581j892j2454K7898Q434
2694a51245J5222l0171Q656m6764j7846j4476K5108K6087J9483M845j4383N458
2682a70026m5483K4159j3204l1607J5358L8549J1967k6637J6323J0968L125L5591
2670a30917L992j8969n551L7304l6600l4995J624J8487K5894p613l3792j4211
2658a95347r322N516P720L0083N37j4868L5083M4535k5136k8633J1475m0625K6507
2645a52475j0256O317M2042R591l7845J8587K8558k2832k4281P232J3411J0361
2633a11590j9025N525j5136J0592j4336K3789K610l7248O091N23L9318K840l7145
2620a43192P537Q307o189J7519k0722O955M474L1219j5573J8185j977J0412m032
$$ y = [-197183, -190855, -212458, -194721, -177646, -191496, -203133, -200812, -173231, -175123, -187577, -159679, -151245, -136023, -166194, -157538, -204302, -222148, -236624, -211516, -185429, -165946, -161101, -175484, -170026, -215509, -191350, -204554, -236161, -220803, -182254, -170287, -196924, -180601, -169633, -166508, -130917, -126925, -145894, -151445, -114141, -150741, -185736, -184112, -165625, -139731, -147344, -181136, -195347, -204669, -199153, -191433, -161350, -160813, -175681, -140598, -96063, -121199, -149832, -138357, -178982, -152475, -162731, -156414, -114372, -104781, -142626, -124039, -95481, -118313, -142594, -135362, -121951, -111590, -130615, -125090, -140226, -129634, -143970, -120181, -117571, -154819, -148728, -148205, -108887, -106047, -143192, -135655, -127348, -133537, -116018, -136740, -129785, -125311, -94092, -109665, -91480, -93457, -83045, -87077]
2607h7077Q914j637O094O986j0327q345J1468q699J5737k7104Q327K959l1377
2594a14081N456l040K3314j175k4846l159K3335n924N175j682j5837J2834q643
2581a08273J5795J2832j0254R788K6262J5782l7802j6140k30K1689q868K2098
2569e7321J2110m901J2259L616j8397j5132J1328J4245k033M1238J8447l3209
2557a7750o113P048m265R021R826J1124J0083R230J5929q768n710M3484m2730
2544C0409m1962M3409L4891J9709p683j4672J2788O42P502J1648j6377K6442L0863
2531A37609K7533M2415j462K4330p522K6219Q874l256O9969J9042J1256L2929
2519C87936O2359O5920M3699N0874M3743O3919J11170J31843J42600J47611K1557
$$ y = [-87077, -78163, -79800, -73706, -66720, -77047, -85392, -73924, -82623, -66886, -93990, -85663, -82704, -114081, -108625, -111665, -88351, -89526, -114372, -117531, -94196, -100120, -94945, -96627, -112464, -99630, -108273, -92478, -79646, -89900, -80112, -53850, -38068, -75870, -92010, -92240, -70551, -79419, -57321, -45211, -50112, -37853, -34237, -52634, -67766, -56438, -42193, -44226, -2988, 15459, -17750, -23863, -16815, -21080, -12059, -2233, 8891, 18974, 28204, 44133, 35365, 29655, 73139, 30409, -11553, 31856, 66747, 86456, 78773, 64101, 76889, 77531, 85033, 96681, 80304, 106746, 137609, 165142, 207557, 206095, 230425, 222903, 249122, 257996, 254740, 324709, 343751, 355007, 387936, 450295, 516215, 559914, 610788, 654531, 718450, 829620, 961463, 1104063, 1251674, 1273231]
2508A273231O133O1798J27345J49288K05685K65695L76505N74966R06497J389645
2498E336788K429134L081093K917216N66298k536599k503387j968542j739251
2490E582750j401092j076350o89760m99932l86691k25829j56761r0627k9451k0483
2480A005774n5282j19328j47706o6504r0392r3198p8594o3092k6419j1411k6115
2469B27733q697n177J4327m184m4592P041l0620l8721j84J7020l9550J1122j8435
2456H7083l508L0562J4890j6509l2785L5892k2271j803J8385l5203K5162q097
2444I1798p206K1106q914j2962j86o1274o3700J1586j3912j177K6620k1039p709
2431d6969M117r304k4784R668L085N932R586N0729k0709j2519K6742K720j0033
$$ y = [1273231, 1279364, 1341162, 1468507, 1617795, 1823480, 2089175, 2465680, 3040646, 3947143, 5336788, 7765922, 10847015, 13764231, 14330529, 11793930, 9290543, 7322001, 5582750, 4181658, 3105308, 2415548, 1915616, 1528925, 1303096, 1146335, 1055708, 1026257, 1005774, 950492, 831164, 683458, 616954, 526562, 433364, 354770, 291678, 265259, 253848, 227733, 219036, 213859, 228186, 224002, 179410, 186451, 155831, 117110, 116926, 133946, 94396, 105518, 87083, 83575, 114137, 129027, 112518, 79733, 115625, 93354, 91551, 109936, 74733, 99895, 91798, 84592, 105698, 96784, 83822, 83636, 22362, -41338, -29752, -43664, -44841, -18221, -39260, -46969, -42852, -52156, -76940, -67272, -64187, -58255, -48669, 2060, -18649, -31168, -4426, -1706, -11739]
2418a1739m2012q441M8547r906j6194J2504J0645j1573j0908j5877n6783j9847
2406a31584K2527L3086L6072k5096j3907P768P139j6204l0054l7888L2582L9641
2394g5918K09J649n657j1500j5419O890l019K2305R785k6596p543q80j719M983
2380a02430L450J971q67L6153k1718J2022J0941Q70J2730j5464m5885r02J9345
2367h9784J2439j8960j3047L098j0212m630n059J7657k7543J4619q142Q269J8707
2354a02588o362j7111o133J5540M939o242M780m436N875O8K2857N700j5703l905
2340a02721J864L1645j9368j3247j703P322j3968K8011L9147l4403j5588Q518
2328h4491j9083L79r959N1916j0699l6167l3756K9816J1567j7773l62R673k9471
$$ y = [-11739, -53751, -62192, -13645, -23551, -39745, -27241, -16596, -28169, -39077, -54954, -111737, -131584, -109057, -75971, -39899, -64995, -78902, -71134, -63995, -80199, -110253, -148141, -115559, -75918, -75709, -74060, -79717, -91217, -106636, -99746, -102765, -80460, -70675, -97271, -104814, -105694, -107413, -102430, -98980, -97009, -97876, -61723, -83441, -71419, -60478, -59608, -46878, -62342, -108227, -109129, -89784, -77345, -96305, -109352, -106254, -116466, -121096, -126155, -108498, -136041, -121422, -129564, -121295, -102588, -108950, -126061, -132194, -116654, -111715, -117957, -113177, -117613, -111738, -111670, -88813, -83113, -98816, -102721, -100857, -69212, -88580, -101827, -103530, -96208, -110176, -82165, -43018, -77421, -93009, -84491, -103574, -103195, -113154, -61238, -71937, -108104, -141860, -112044, -100477, -118250, -118612, -108939, -138410]
2315a38410K4815J23r594J4269q503P796K6592K1169m7447r750J8435j2372j8270
2302a31147K4512L1409r348Q326j3177k649J5350n7209K6118M3803k2975l8621
2290a25608J636M0524N300l193j7875K6858K0042j2249M3826m4984k7837K6686
2278f6874J1745k604m0042j6726O2725j8872l7986Q885M0344j8403j6835K611
2266i2032l3834J2295K5901M9397m553k7621l9746j5419N6047j7452J1177j0340
2254h6180K2443m1110k0111l062L352J0135O225K838Q778J1162J0962K4664k1003
2241g0907r256O791J1413k0479K9530o201j8353k530J7459k8235J925L9664J0163
2228c9016N710R575K1116J3969r44L819m8367l4928j5601J800R87L314K3859j7005
$$ y = [-138410, -113595, -113472, -123066, -108797, -117300, -109504, -82912, -61743, -109190, -118940, -100505, -112877, -131147, -106635, -75226, -84574, -76248, -89425, -92074, -76724, -133933, -107815, -64012, -86987, -125608, -123972, -83448, -78148, -81341, -99216, -72358, -52316, -64565, -20739, -65723, -93560, -66874, -55129, -57733, -97775, -114501, -51776, -70648, -108634, -99749, -59405, -77808, -94643, -92032, -125866, -113571, -87670, -38273, -42826, -70447, -110193, -125612, -69565, -87017, -75840, -86180, -63737, -104847, -124958, -128020, -124668, -114533, -108308, -105470, -96692, -85530, -74568, -49904, -70907, -80163, -73372, -61959, -82438, -52908, -59109, -77462, -79992, -62533, -90768, -88843, -49179, -39016, -33306, -23731, -2615, 11354, 10410, 14229, -34138, -69066, -84667, -82867, -81880, -78566, -54707, -71712]
2214g1712n067n240k1249j161j8069J7732K4659n473J2328m168J62j4777k989
2201i5024K7742L6507k9865k1342P282O639N366j7145k744K5900N777l6254J2876
2188g4285P61l235K1030L4705m333n1165k1567K0591J8064l0081R922j892k885
2175h4370o967p884R998K257k4548Q750L5995J4901k7268n707M9211k0645K344
2162e3933K914M755k3742L2607j7743J0635l646J4248R492j2148J7819Q657n5738
2149f5823k2182J2986o50J1014o029m633k2253K6766J8222K9291j1816J2667k162
2136b4602j2392n1904J0739J35j427K7490m294k2867n142L186J1625R566j4042
2123g3929k1132J3832J6898K6008k1289j4329j0106p450Q501K7766K0725q051
$$ y = [-71712, -76779, -82019, -103268, -104429, -122498, -104766, -80107, -85580, -73252, -77420, -77258, -92035, -95024, -67282, -30775, -60640, -81982, -74700, -68061, -62695, -79840, -82584, -56684, -50907, -87161, -74285, -73524, -76759, -55729, -21024, -25357, -76522, -98089, -77498, -59434, -89515, -79593, -81485, -84370, -91337, -99221, -89223, -86966, -111514, -102764, -66769, -51868, -79136, -84843, -35632, -56277, -53933, -51019, -46264, -70006, -37399, -55142, -44507, -48153, -33905, -24413, -36561, -18742, -10085, -65823, -88005, -75019, -75669, -64655, -70684, -75317, -97570, -70804, -52582, -23291, -35107, -22440, -24602, -36994, -88898, -78159, -78024, -79451, -51961, -56255, -79122, -84264, -81078, -69453, -59887, -73929, -95061, -81229, -64331, -38323, -59612, -73941, -84047, -91497, -82996, -55230, -34505, -42556]
2111d2556J240j1428J389k5441Q696J1100J4681p138q740L0942P527k6434m781
2098e0943q605L2514K3470j8023j7075j0652N634Rk422k8755K8099J8473O498
2085b1778K1339j9333O804k6879j1971K537R798j773k7477p884J3240L1589K8821
2072b967j5477j1234J2184k8481l9542o475j1308J1193O7508j6425k0080J9561
2060d1543J4337L3166r382k3488P36r035l767J1818m70m391j2714o079J0823L4592
2046e397j4844l8970p63K2146Q419K452J083N069P615Q053K2484J1602m0020j2553
2032b3624N897j9252J4965k4024j2420L0444O300m507k3981j1572L6892J331L858
2019a9693K245j5460J7474k7976J2372K0273j4861K502j206K2550L7654j6535
$$ y = [-42556, -41316, -52744, -51355, -76796, -68100, -57000, -42319, -49457, -58197, -27255, -19728, -46162, -50943, -59548, -27034, -3564, -21587, -38662, -49314, -43680, -43671, -46093, -74848, -46749, -28276, -21778, -439, -19772, -12968, -39847, -51818, -49281, -39483, -41256, -68733, -76617, -63377, -31788, -2967, -18444, -29678, -17494, -45975, -85517, -91992, -103300, -92107, -24599, -41024, -61104, -41543, -27206, 5960, -3422, -26910, -26174, -35209, -38976, -27158, -27628, -32019, -44733, -50812, -39989, -5397, -20241, -59211, -59974, -37828, -29409, -26957, -25874, -20805, -13190, -5137, 17347, 28949, -11071, -23624, -17727, -36979, -22014, -46038, -58458, -28014, -21714, -26221, -50202, -61774, -24882, -23551, -19693, -17448, -32908, -15434, -43410, -31038, -10765, -25626, -23124, -24330, -1780, 35874, 19339]
2007A9339K368K3794m7167l8469R610K4896q523j2149k7423L1031j8915l2676
1995g4284K9666J1056J2248j0145K6917K2018Q980n577N1398p795n4978l3979
1983b4475Q770k1073j7641J7927p19M5563k5768q729Q593R569j2736J0236K7328
1970A6845k3157j41m744p868k2517J5460P352q501J5960o767K7038j5919l5118
1957d2077J3898J327q229J6318K5045j0707k1408J7148j0807P231k399j349j9690
1944c5699l3135M646J5825J1212K195J8287K8770k639K5824m437k3734K0718k9642
1931a809k5783K5938n776J1496j464k4244j158J1823Q181m237j1683R406q771
1918a8081q951M2964l110j4581p534L2228r296q393k8908k7665J8599K467R358
$$ y = [19339, 21707, 45501, -1666, -40135, -30525, -5629, -14152, -26301, -53724, -22693, -41608, -74284, -44618, -33562, -21314, -31459, -4542, 17476, 26456, 20879, 72277, 64482, 9504, -24475, -15705, -36778, -54419, -36492, -37211, 8352, -17416, -26145, -17552, -7983, -20719, -10483, 16845, -6312, -6453, -11197, -19065, -41582, -26122, -18770, -27271, -11311, -18078, 8960, -6959, -42077, -28179, -26852, -35081, -18763, 6282, -4425, -25833, -8685, -19492, -12261, -14660, -16009, -35699, -68834, -64188, -48363, -37151, -34956, -16669, 12101, 9462, 35286, 30849, 7115, 27833, -1809, -27592, -1654, -7430, 4066, 2602, -21642, -22800, -10977, -2796, -7033, -18716, -9310, -18081, -27032, 15932, 12822, -1759, -9293, 22935, 13639, 5246, -23662, -51327, -32728, -30261, -20903]
1905b0903k8076K0212L339n396K3502n740q437p697R882K5355J5999J2968m149
1892C0859r531J2066n4224j3084J9080k0091L5582K0852L865q809j6478J7131
1880A7218j2842k4322O581Q340L4285M763m9208J5056J2389k173m939n06l2884
1867b8242M2133k8832N764J3899l894r335l3806J8200M9460Q242j9474j5619J382
1854a22R979j9181L8175j5084j982l667J6013L356R466K5583j2387n8444J4238
1841E943l78k8192K4880K2206m9842J2117k7461J1923M0496l1923j1611K4270
1829g572L3536j070j4528n126K833q751J8889k3207J3432K6979k910K7902j0018
1816E0389k0383J9682L420J7116j1336j6567k5138N603K2927j3978j9255K929
$$ y = [-20903, -48979, -28767, -25428, -30824, -7322, -13062, -21499, -29196, -19314, 6041, 22040, 35008, 30859, 21328, 33394, -20830, -33914, -14834, -34925, 657, 21509, 25374, 16565, 87, 17218, 4376, -19946, -13365, -5025, 29260, 34023, -15185, -129, 12260, 10087, 5148, 4642, -28242, 13891, -14941, -9177, 4722, 828, -8507, -42313, -24113, 25347, 33589, 14115, -1504, -122, 9857, -9324, 28851, 13767, 11785, 8118, 24131, 27487, 36953, 62536, 50149, -8295, 5943, 5565, -22627, 2253, 24459, -25383, -13266, -40727, -28804, 11692, -20231, -31842, -7572, 25964, 24894, 10366, 5240, 8073, -678, 18211, -4996, 8436, 35415, 32505, 60407, 50389, 30006, 49688, 53108, 70224, 58888, 42321, 17183, 22786, 45713, 31735, 12480, 15409]
1804A5409k7974j6021M898K1563j8127m067M314R688N9562M958n367o12k6088
1791B2136j6271J3140J0751j5417j748K7627J0502l0863k0745K0881J9542j7607
1779B1928l8312L0948J1694n508j308k3272Q025L8109J0778m5323J3348L1389
1767E2496j5895j4212k9120k713Q658K9796k5074j9631N4623M8891k8987k1618
1755C7214k8088M955L9723k2284K0556J9495l3694R954r465l5836J02J3131J51
$$ y = [15409, -12565, -28586, -23688, -2125, -20252, -24319, -20005, -10317, 49245, 54203, 48836, 48224, 22136, 5865, 19005, 29756, 14339, 12591, 40218, 50720, 19857, -888, 19993, 39535, 21928, -16384, 14564, 26258, 20750, 19442, -3830, 4195, 42304, 53082, 7759, 21107, 52496, 36601, 22389, -6731, -9444, -786, 29010, 3936, -15695, 38928, 87819, 58832, 37214, 9126, 14081, 53804, 31520, 52076, 71571, 37877, 47831, 38366, 2530, 2632, 15763, 15914]
$$ [...]
##END NTUPLES=NMR SPECTRUM
##END=
