##TITLE=1H_DE-80H_X3
 200.13MHz, d2o
 8 sc
 
 19ns.26.2.2025
##JCAMPDX= 6.0         $$ Bruker NMR JCAMP-DX V2.0
##DATA TYPE= NMR SPECTRUM
##DATA CLASS= NTUPLES
##ORIGIN= UXNMR, Bruker Analytische Messtechnik GmbH
##OWNER= pz
$$ XWIN-NMR		Version 3.5
$$ Mon Mar 16 10:57:44 2026 Russian Standard Time (UT+4h)  Yarkov@DPX200
##.OBSERVE FREQUENCY= 200.1313
##.OBSERVE NUCLEUS= ^1H
##.ACQUISITION MODE= SIMULTANEOUS
##.ACQUISITION SCHEME= undefined
##.AVERAGES= 8
##.DIGITISER RES= 18
##SPECTROMETER/DATA SYSTEM= spect
##.PULSE SEQUENCE= zg30
##.SOLVENT NAME= DMSO
##.SHIFT REFERENCE= (INTERNAL, DMSO, 0, 15.4703)
##AUDIT TRAIL= $$ (NUMBER, WHEN, WHO, WHERE, WHAT)
$$ ##TITLE= Audit trail, XWIN-NMR		Version 3.5
$$ ##JCAMPDX= 5.01
$$ ##ORIGIN= Bruker BioSpin GmbH
$$ ##OWNER= Yarkov
$$ C:/Bruker/XWIN-NMR/data/yarkov2/nmr/H-C/1/pdata/1/auditp.txt
$$ ##AUDIT TRAIL=  $$ (NUMBER, WHEN, WHO, WHERE, WHAT)
(   1,<2026-03-16 10:56:47.17 +0400>,<Yarkov>,<DPX200>,
      <created by zg, POWCHK disabled, PULCHK disabled
       configuration hash MD5:
       00 E9 B6 7A A2 85 ED C7 34 08 36 98 17 FE 4E 26
       data hash MD5: 16K
       26 98 F2 0C 47 A7 5E 80 99 67 01 3A 2A 45 29 6A>)
(   2,<2026-03-16 10:56:55.26 +0400>,<Yarkov>,<DPX200>,
      <Start of raw data processing
       efp BC_mod = 2 LB = 0.25 FT_mod = 6 PKNL = 1 PHC0 = -5299.148 PHC1 = 6.821927 SI = 16K 
       data hash MD5: 16K
       84 3F 94 2B 2A D9 26 13 3B 7A 8E 84 85 9A 70 72>)
$$ ##END=
$$ 
$$ hash MD5
$$ 36 B3 8B C6 38 D9 99 EE 24 9E 86 05 0A BC 38 8C
##$RELAX= 
##$RELAX= 
##$RELAX= 
##$RELAX= 
##$RELAX= 
##$RELAX= 
$$ Bruker specific parameters
$$ --------------------------
##$DU= <C:/Bruker/XWIN-NMR>
##$EXPNO= 1
##$NAME= <H-C>
##$PROCNO= 1
##$TYPE= <nmr>
##$USER= <yarkov2>
##$AMP= (0..31)
100 100 100 100 100 100 100 100 100 100 100 100 100 100 100 100 100 100 
100 100 100 100 100 100 100 100 100 100 100 100 100 100 
##$AQSEQ= 0
##$AQ_mod= 1
##$AUNM= <au_zg>
##$AUTOPOS= <>
##$BF1= 200.13
##$BF2= 200.13
##$BF3= 200.13
##$BF4= 200.13
##$BF5= 200.13
##$BF6= 200.13
##$BF7= 200.13
##$BF8= 200.13
##$BYTORDA= 1
##$CFDGTYP= 0
##$CFRGTYP= 5
##$CHEMSTR= <none>
##$CNST= (0..31)
1 1 145 1 1 1 1 1 1 1 1 1 1 1 1 1 1 1 1 1 1 1 1 1 1 1 1 1 1 1 1 1 
##$CPDPRG= <>
##$CPDPRG1= <>
##$CPDPRG2= <>
##$CPDPRG3= <>
##$CPDPRG4= <mlev>
##$CPDPRG5= <mlev>
##$CPDPRG6= <mlev>
##$CPDPRG7= <mlev>
##$CPDPRG8= <mlev>
##$CPDPRGB= <>
##$CPDPRGT= <>
##$D= (0..31)
0 0.7 0 0 0 0 0 0 0 0 0 0.03 0 0 0 0 0 0 0 0 0 0 0 0 0 0 0 0 0 0 0 0 
##$DATE= 1773644206
##$DBL= (0..7)
120 120 120 120 120 120 120 120 
##$DBP= (0..7)
150 150 150 150 150 150 150 150 
##$DBP07= 0
##$DBPNAM0= <>
##$DBPNAM1= <>
##$DBPNAM2= <>
##$DBPNAM3= <>
##$DBPNAM4= <>
##$DBPNAM5= <>
##$DBPNAM6= <>
##$DBPNAM7= <>
##$DBPOAL= (0..7)
0.5 0.5 0.5 0.5 0.5 0.5 0.5 0.5 
##$DBPOFFS= (0..7)
0 0 0 0 0 0 0 0 
##$DE= 6
##$DECBNUC= <off>
##$DECIM= 32
##$DECNUC= <off>
##$DECSTAT= 4
##$DIGMOD= 1
##$DIGTYP= 9
##$DL= (0..7)
0 120 120 120 120 120 120 120 
##$DP= (0..7)
$$ [...]
##$SUBNAM2= <"">
##$SUBNAM3= <"">
##$SUBNAM4= <"">
##$SUBNAM5= <"">
##$SUBNAM6= <"">
##$SUBNAM7= <"">
##$SUBNAM8= <"">
##$SUBNAM9= <"">
##$SW= 18.0517328524113
##$SWIBOX= (0..15)
0 0 2 0 0 0 0 0 0 0 0 0 0 0 0 0 
##$SW_h= 3612.71676300578
##$TD= 16384
##$TD0= 1
##$TE= 0
##$TE2= 300
##$TE3= 300
##$TEG= 300
##$TL= (0..7)
0 120 120 120 120 120 120 120 
##$TP= (0..7)
150 150 150 150 150 150 150 150 
##$TP07= 0
##$TPNAME0= <>
##$TPNAME1= <>
##$TPNAME2= <>
##$TPNAME3= <>
##$TPNAME4= <>
##$TPNAME5= <>
##$TPNAME6= <>
##$TPNAME7= <>
##$TPOAL= (0..7)
0.5 0.5 0.5 0.5 0.5 0.5 0.5 0.5 
##$TPOFFS= (0..7)
0 0 0 0 0 0 0 0 
##$TUNHIN= 0
##$TUNHOUT= 0
##$TUNXOUT= 0
##$USERA1= <user>
##$USERA2= <user>
##$USERA3= <user>
##$USERA4= <user>
##$USERA5= <user>
##$V9= 5
##$VALIST= <valist>
##$VCLIST= <CCCCCCCCCCCCCCC>
##$VD= 0
##$VDLIST= <DDDDDDDDDDDDDDD>
##$VPLIST= <PPPPPPPPPPPPPPP>
##$VTLIST= <TTTTTTTTTTTTTTT>
##$WBST= 1024
##$WBSW= 4
##$XGAIN= (0..3)
0 0 0 0 
##$XL= 0
##$YL= 0
##$YMAX_a= 132274
##$YMIN_a= -101242
##$ZGOPTNS= <>
##$ZL1= 120
##$ZL2= 120
##$ZL3= 120
##$ZL4= 120
##$ABSF1= 0
##$ABSF2= 0
##$ABSG= 0
##$ABSL= 0
##$ALPHA= 0
##$AQORDER= 0
##$ASSFAC= 0
##$ASSFACI= 0
##$ASSFACX= 0
##$ASSWID= 0
##$AUNMP= <proc_1d>
##$AZFE= 0.1
##$AZFW= 0.1
##$BCFW= 0
##$BC_mod= 2
##$BYTORDP= 0
##$COROFFS= 0
##$CY= -3
##$DATMOD= 1
##$DC= 0
##$DFILT= <>
##$DTYPP= 0
##$F1P= 0
##$F2P= 0
##$FCOR= 1
##$FTSIZE= 16384
##$FT_mod= 6
##$GAMMA= 0
##$GB= 0
##$INTBC= 1
##$INTSCL= 3.241238e-09
##$ISEN= 128
##$LB= 0.25
##$LEV0= 0
##$LPBIN= 0
##$MAXI= 10000
##$MC2= 0
##$MEAN= 0
##$ME_mod= 0
##$MI= 1.114404
##$NCOEF= 0
##$NC_proc= -7
##$NLEV= 6
##$NOISF1= 3.799351
##$NOISF2= 2.8
##$NSP= 0
##$NTH_PI= 0
##$NZP= 0
##$OFFSET= 15.47034
##$PC= 1
##$PHC0= -5299.148
##$PHC1= 6.821927
##$PH_mod= 1
##$PKNL= yes
##$PPARMOD= 0
##$PSCAL= 0
##$PSIGN= 0
##$REVERSE= no
##$SF= 200.130010280349
##$SI= 16384
##$SIGF1= 3
##$SIGF2= 2
##$SINO= 0.751879
##$SIOLD= 32768
##$SREGLST= <19F.Aceton>
##$SSB= 0
##$STSI= 16384
##$STSR= 0
##$SW_p= 3612.71676300578
##$SYMM= 0
##$S_DEV= 0
##$TDeff= 16384
##$TDoff= 0
##$TI= <>
##$TILT= no
##$TM1= 0
##$TM2= 0
##$TOPLEV= 0
##$USERP1= <user>
##$USERP2= <user>
##$USERP3= <user>
##$USERP4= <user>
##$USERP5= <user>
##$WDW= 1
##$XDIM= 16384
##$YMAX_p= 338697008
##$YMIN_p= -545808
$$ End of Bruker specific parameters
$$ ---------------------------------
##NTUPLES= NMR SPECTRUM
##VAR_NAME=  FREQUENCY,     SPECTRUM/REAL,   SPECTRUM/IMAG
##SYMBOL=    X,             R,               I
##VAR_TYPE=  INDEPENDENT,   DEPENDENT,       DEPENDENT
##VAR_FORM=  AFFN,          ASDF,            ASDF
##VAR_DIM=   16384,         16384,           16384
##UNITS=     HZ,            ARBITRARY UNITS, ARBITRARY UNITS
##FACTOR=    0.220516191357247, 1,           1
##FIRST=     3096.07925822834, 0,            0
##LAST=      -516.637504777437, 0,           0
##MIN=       -516.637504777437, -545808,     0
##MAX=       3096.07925822834, 338697008,    0
$$ Real data points
##PAGE= N=1
##DATA TABLE= (X++(R..R)), XYDATA
$$ [...]
7593a07572L7939O7436J88356R990j27540M3749n2913j328k4918o5617K4510N3638
$$ -107572 -69633 -2197 186159 196149 68609 112358 59445 58117 33199 -32418 -7908 45730
7581D5730l5206O8948j8045M2214M8510j00710O4619Q4690N1242r4931L087m6185
$$ 45730 10524 79472 61427 103641 152151 51441 116060 200750 251992 157061 160148 113963
7569A13963j54163P4767l2804O4541R7859K6286q7809q4712P3135R9418M4457
$$ 113963 -40200 34567 1763 66304 164163 190449 102640 17928 91063 190481 234938
7558B34938p3473j36869L7279M2047O2793p745j39078J70471L7448q4360K2227
$$ 234938 161465 24596 61875 103922 166715 158970 19892 190363 227811 143451 165678
7547A65678L0050J63245o7724j30996o6024l190L1107l7954N7075L5334M8967
$$ 165678 195728 358973 291249 160253 94229 91039 122146 84192 141267 176601 225568
7536B25568j9526j54262q8453O208J33666O263r1404j00608Q6419M3434j01014
$$ 225568 206042 51780 -36673 -30465 103201 109464 18060 -82548 3871 47305 -53709
7525e3709J09762K28622k2274j38130o457O5959n641k5844K2804J07304k2249
$$ -53709 56053 284675 262401 124271 117814 183773 178132 152288 175092 282396 260147
7514B60147j35045m3253J5271p127j190l85j8101o3472J57185J3971j16809o89
$$ 260147 125102 81849 97120 89993 88803 88418 70317 6845 164030 178001 61192 60503
7502F0503N2397Q3023K9351l7603j24966Q7014R6265r0207m0758o8870O0049P8872
$$ 60503 112900 195923 225274 187671 62705 149719 245984 155777 115019 46149 106198 185070
7490A85070o8572N0132L2228j29339J00892n2893k00237M3440R0833N964r9082
$$ 185070 116498 166630 198858 69519 170411 117518 -82719 -39279 51554 57518 -41564
7479d1564J01560K6593r108m8589J82597P0414p969j44222o3597l8579J02997
$$ -41564 59996 86589 77481 28892 211489 281903 273934 129712 66115 27536 130533
7468A30533R7762j77022k552J20985N9322q7426r491l8872O4634p1573r7580J41661
$$ 130533 228295 51273 48721 169706 229028 141602 132111 93239 157873 86300 -11280 130381
7456A30381r0780J25566O8032j58482J00685J58831o7039j7563l7851P3230p7112
$$ 130381 39601 165167 233199 74717 175402 334233 267194 249631 211780 285010 207898
7445B07898M5809P9281R535j15288j02481Q12m4112O8869o2598L5406K1065r4343
$$ 207898 253707 332988 342523 227235 124754 125566 81454 150323 87725 123131 144196 49853
7433D9853j4202O1985o6540J28248O0818m2803Q3454r3449J118N5290P192J18916
$$ 49853 35651 97636 31096 159344 220162 177359 260813 167364 168482 223772 230964 349880
7421C49880r1132r2544l6253L4072m8104P6302m7406k1416O7574l5977j0954O9903
$$ 349880 258748 166204 129951 164023 115919 192221 144815 123399 190973 154996 144042 213945
7409B13945J11877n427p6343k7650n0734Q134J05303k7081l0889M0460p7507J1914
$$ 213945 325822 320395 244052 216402 165668 173802 279105 252024 221135 261595 184088 196002
7397A96002K3867r4160P4885q5698l0203Q5422Q8196J21016j00159J6619J5654
$$ 196002 219869 125709 200594 114896 84693 170115 258311 379327 279168 295787 311441
7386C11441R2791m5803l6804q230l66m3875l5265m1073L2176J16889m8332k7706
$$ 311441 404232 358429 321625 313395 313029 269154 233889 192816 224992 341881 293549 265843
7374B65843j09711j3716M6538m6558o7481o5553q5417J11754J08739l238J0157
$$ 265843 156132 142416 188954 142396 74915 9362 -76055 35699 144438 141200 151357
7363A51357n6260K5479Q8416L947j84L0055N803j1386q6206K5176J43969j08248
$$ 151357 95097 120576 208992 212939 212755 242810 248613 237227 151021 176197 320166 211918
7351B11918N872p8462p3338O6072l1990l0272O8474m5071M9884J13069J49274
$$ 211918 217790 139328 65990 132062 100072 69800 138274 93203 143087 256156 405430
7340D05430K2433l0526k6040R927j32638j88468R3977o4986r1470l1293J1565
$$ 405430 427863 397337 371297 381224 248586 60118 154095 89109 -2361 -33654 -22089
7329b2089J72954O4293j93739n1062O5319J68441P4842j1005p110o2214p8941
$$ -22089 150865 215158 21419 -29643 35676 204117 278959 267954 260844 198630 119689
7318A19689L0586P1305L8958J4439m833K02332J19342P7601m2995j55883P0714
$$ 119689 150275 221580 260538 274977 270144 472476 591818 669419 626424 470541 541255
7307E41255J33663j37958j10215j06091p9805N2821j14269P2687K4937k15839
$$ 541255 674918 536960 426745 320654 240849 293670 179401 252088 277025 61186
7297F1186K1185L0680L0280P810l7098J15158P6889p1318K4792J215j7150r5004
$$ 61186 82371 113051 143331 151141 114043 229201 306090 234772 259564 260779 243629 148625
7285A48625K5038J36915n172o9932n4835j06425P2507Q8414P4879n5032j64058
$$ 148625 173663 310578 305406 235474 180639 74214 146721 235135 310014 254982 90924
7274I0924k5677R179L6491P0794J15380r9345r6871p0689N1146M381K21476M4405
$$ 90924 65247 74426 110917 181711 297091 197746 100875 30186 81332 85713 307189 351594
7262C51594k09085J17229m5065j29596K24495J2314j65091r2856K06496j11837
$$ 351594 142509 259738 214673 85077 309572 321886 156795 63939 270435 158598
7252A58598n822n5874j30208J64353j34584J14046J12943P2122m217j17811P0695
$$ 158598 152776 96902 -33306 131047 -3537 110509 223452 295574 291357 173546 244241
7241B44241K8330Q973j74277l5246K9093L77J33064K9808r0505p065o9605M1647
$$ 244241 272571 281544 107267 72021 101114 101491 234555 264363 173858 166793 97188 138835
7229A38835M1564J83859l763j58211q4652l7020J04940P6196l639L3108N772m8434
$$ 138835 180399 364258 360495 202284 117632 80612 185552 261748 258109 291217 296989 248555
7217B48555o4017m0038k935n81O4799M9475N6969r0171J13710n3734r1142J60500
$$ 248555 184538 144500 141565 140984 205783 255258 312227 222056 335766 282032 190890 351390
7205C51390J03626k5084m5257J7485o5902j00288R8097k2424L474N9784m9629
$$ 351390 455016 429932 384675 402160 336258 235970 334067 311643 315117 374901 325272
7194C25272p0832J51241K0883r9150j89882J53878N1500j29163O4742P0099O8942
$$ 325272 254440 405681 426564 327414 137532 291410 342910 213747 278489 348588 417530
7183D17530L6897j06604P6470l8432J36764j10221p8510n008q0290J15923m1584
$$ 417530 454427 347823 424293 385861 522625 412404 333894 328886 248596 364519 322935
7172C22935n097q244J86826n1519Q34k703Q27j6471K438r7881J1663p6500p3067
$$ 322935 317838 309594 496420 444901 445735 443032 443859 427388 429826 331945 343608 267108 194041
7159A94041J73452M2328n6536P7530n1068l8922q2103M4203N6545n3229N5159
$$ 194041 367493 409821 353285 430815 379747 340825 258722 302925 359470 306241 361400
7148C61400q5487l1807Q1565J00994Q1142o5936j8063J21465J422o9983k9450
$$ 361400 275913 244106 325671 426665 507807 441871 423808 545273 546695 476712 447262
7137D47262K9461l7550J16734O0598J12037L5732J71116P6001p1292Q5885M7553
$$ 447262 476723 439173 555907 616505 728542 764274 935390 1011391 940099 1025984 1073537
7126A073537R8181K58634J61723r0098k9163Q6312J7604p6595l70568k04947J29408
$$ 1073537 1171718 1430352 1592075 1501977 1472814 1559126 1576730 1500135 1129567 924620 1054028
7115A054028o295j09950n0683l1918k47126Q649r865l5843K4743k3269p8258j54796
$$ 1054028 1047733 937783 887100 855182 608056 616705 606840 570997 595740 572471 494213 339417
7103C39417P5644K5518J4630l2338p1131n2138m1064n8921L3942J8113M6455L5165
$$ 339417 415061 440579 455209 422871 351740 299602 258538 199617 233559 251672 298127 333292
7091C33292p7741O8285L1380P5610j05892J4485J02329r1457m4809O9872o6669
$$ 333292 255551 323836 355216 430826 324934 339419 441748 350291 305482 375354 308685
7080C08685K2218q8503k606K8834L6922j14556L7887O7751m1790Q7256r4061j51883
$$ 308685 330903 242400 239794 268628 305550 190994 228881 296632 254842 342098 248037 96154
7068I6154l868M2538o8667P5168J9561m1263J69775K0395j40039L4532j44285
$$ 96154 92286 134824 66157 141325 160886 119623 289398 309793 169754 204286 60001
7057F0001J33420J18144J048J09551q0765N4779o1824j22048M1147l6416n3231
$$ 60001 193421 311565 312613 422164 341399 396178 334354 212306 253453 217037 163806
7046A63806p2082J36192J27145j47051P2188J29896p7880j228q5453r3457q653
$$ 163806 91724 227916 355061 208010 280198 410094 332214 330986 245533 152076 143423
7035A43423R845P7899k5055P4543l512O9075J167j55071Q5770M7525p1367j7096
$$ 143423 153268 231167 206112 280655 277143 346218 347385 192314 278084 325609 254242 237146
7023B37146J57508K4818k7020p7389j3616M9948N6187j11066r1434P6624o1451
$$ 237146 394654 419472 392452 315063 301447 351395 407582 296516 205082 281706 220255
7012B20255N8031l7704Q3975l8861q684k8198j1193n5056P1313Q5036q5199n4649
$$ 220255 278286 240582 324557 285696 277012 248814 237621 182565 253878 338914 253715 199066
7000A99066r823O7809j5973L8622O2211o3014j898O3398m4881M367j70836M8113
$$ 199066 189243 257052 241079 279701 341912 278898 277000 340398 295517 299884 129048 177161
6988A77161O7723P7668M9645q6055j36070P2670R9000J7588j8047K1156P0405
$$ 177161 244884 322552 372197 286142 150072 222742 321742 339330 321283 342439 412844
6977D12844m4129j82852M7452M7099r3213p7370K3488K5378k4716J6025L0776
$$ 412844 368715 185863 233315 280414 187201 109831 133319 158697 133981 150006 180782
6966A80782k6768P2574l442P2826j20816j11723R2450n2945P1851M8244N5228
$$ 180782 154014 226588 223146 295972 175156 63433 155883 102938 174789 223033 278261
6955B78261K1948m7988J0988j5723r5289O6552o7341K5253J54581J4880j9459
$$ 278261 300209 252221 263209 247486 152197 218749 151408 176661 331242 346122 326663
6944C26663L9677k2594q616R8431m2920m852j06910j1147r819L7792j2913n0646
$$ 326663 366340 343746 335130 433561 390641 385789 278879 267732 257913 295705 282792 232146
6932B32146J1667j2285m7513m4364P3882l965J13664j5098L3917j7818j62591
$$ 232146 243813 231528 184015 139651 213533 209568 323232 308134 342051 324233 161642
6921A61642r7485N9924J98073R5855j24303L0218L5178k0137r6798Q0328j9229
$$ 161642 64157 124081 322154 418009 293706 323924 359102 338965 242167 322495 303266
6910C03266n8816m1888R4875n3316j19440J82586N1401r1180L884R2216R9620
$$ 303266 244450 202562 297437 244121 124681 307267 358668 267488 271372 363588 463208
6899D63208n4121r2636n8976L6478P0016j08077n8378J51613K7294j30764r243
$$ 463208 409087 316451 257475 293953 363969 255892 197514 349127 376421 245657 236414
6888B36414M0266L0933r0072J14890J29151O5987j6691j54788M5639q7858j602
$$ 236414 276680 307613 217541 332431 461582 527569 510878 356090 401729 313871 312269
6877C12269K9849m9023O6616N1639M0060K4048q5096r58L5420j20904q0713J41803
$$ 312269 342118 293095 359711 411350 451410 475458 390362 389404 424824 303920 223207 365010
6865C65010J00507k1962N9504j11964l0095l8090Q7060m7291L945L9014j62190
$$ 365010 465517 443555 503059 391095 361000 322910 409970 362679 366624 405638 243448
6854B43448j20300J77094m3073J6960J34069q0116j15818K5758M9006O2401M6659
$$ 243448 123148 300242 257169 274129 408198 328082 212264 238022 287028 349429 396088
6843C96088M8036K6529n3524j42086o140J7305O1350k5222n3532N5678j2699n7925
$$ 396088 444124 470653 417129 275043 268903 286208 347558 322336 268804 324482 311783 253858
6831B53858J39611P1706K0339K5294j17239k7064k871R9768k1387J6620q5524
$$ 253858 393469 465175 485514 510808 393569 366505 363634 463402 442015 458635 373111
6820C73111q4126k0136Q9035k4474n0394j8121K0143K1738k5893J18809j0109
$$ 373111 288985 268849 357884 333410 283016 264895 285038 306776 280883 399692 389583
6809C89583q8412j0556K7344M0844p1089J41318j55003n5706J35848o790m7366
$$ 389583 301171 290615 317959 358803 287714 429032 274029 218323 354171 347381 300015
6798C00015J57669O6699j47206m3422M985L5549N4781J37481k1821j20056r1646
$$ 300015 457684 524383 377177 333755 338740 374289 429070 566551 544730 424674 333028
6787C33028L3328Q6765p8229J2461k7530j4178L5494R8821l6390n6199j5025l7118
$$ 333028 366356 453121 374892 387353 359823 345645 381139 479960 443570 387371 372346 335228
6775C35228J28135J71473n0912o7141L3220k22779k1778R3778j00048L0101K7864
$$ 335228 463363 634836 583924 516783 550003 327224 305446 399224 299176 329277 357141
6764C57141Q6907q0202j03713N3974P0461q7742j4297R3426m1441J5005O8161
$$ 357141 444048 363846 260133 314107 384568 296826 282529 375955 334514 349519 417680
6753D17680j32680k6605L8378J22820J16420L1276n4562m8922M3340J5152J25591
$$ 417680 285000 258395 296773 419593 536013 567289 512727 463805 507145 522297 647888
6742F47888k27862Q716j04888K22928m9403j03365J9464j14085J155o882N2117
$$ 647888 420026 428742 323854 546782 497379 394014 413478 299393 300548 293666 345783
6731C45783j6540J9472P5622O6313p0238Q0505o8736J0067k7573m8736k8615J0121
$$ 345783 329243 348715 424337 490650 420412 500917 432181 442248 414675 365939 337324 347445
6719C47445M0580l999q9339P3612J58301j38608O9813k4607N37q0690k9620l4579
$$ 347445 388025 384026 294687 368299 526600 387992 457805 433198 433735 353045 323425 288846
6707B88846J08806J01349l9860L6426q7571j51385R5219o2266L6788M7476o4748
$$ 288846 397652 499001 459141 495567 407996 256611 351830 289564 326352 373828 309080
6696C09080R3770L5952L3948r4876Q6945Q9943j02442Q8335k05319L6593P8936
$$ 309080 402850 438802 472750 377874 464819 554762 452320 540655 335336 371929 450865
6685D50865P0827k6731j32391k8438P5145J71003M5450j58819j83989O1252K9220
$$ 450865 521692 494961 362570 334132 409277 580280 625730 466911 282922 344174 373394
6674C73394K9077N7988J1953k9484P3833j63604m1205L7018Q8917o5591Q3358
$$ 373394 402471 460459 472412 442928 516761 353157 311952 348970 437887 372296 455654
6663D55654Q3169m2747K8676j11209j18040N9179J09824J01189j18002N7264l7116
$$ 455654 538823 496076 524752 413543 295503 354682 464506 565695 447693 504957 467841
6652D67841j48572j14382n176L7459k8729J14565M1293J24257O2599k2181L0990
$$ 467841 319269 204887 199711 237170 208441 323006 364299 488556 551155 528974 559964
6641E59964L3664n5961M980O2274k6282j12146k516J01128P311P5207P195j81699
$$ 559964 593628 537667 542647 604921 578639 466493 463977 565105 572416 647623 654818 473119
6629D73119m741O009l2065p9501j8092J62982j00672J07822j09350O651l0789
$$ 473119 468378 474387 442322 362821 344729 507711 407039 514861 405511 412162 381373
6618C81373o0974L7380K3596K09947p6758q7171j23020m7860J78515r0866O8136
$$ 381373 320399 357779 381375 591322 514564 427393 304373 256513 435028 344162 412298
6607D12298N303K06165N6495k6069K5664N385n4667l1218O9568J9647J13462j9637
$$ 412298 417601 623766 680261 654192 679856 685241 630574 599356 668924 688571 802033 782396
6595G82396l8112o5560l2463o8459O7651o8507j4097l0837j7756K10153R2976
$$ 782396 744284 678724 646261 577802 645453 576946 562849 532012 514256 724409 817385
6584H17385r5518R8532K3042L0252m7185k4807N311N1046j15790j38073K64541
$$ 817385 721867 820399 843441 873693 826508 801701 807012 858058 742268 604195 868736
6573H68736J11054j11046O270r657N183M7695R4195M0236k6882O8019j1024J02459
$$ 868736 979790 868744 875014 865357 870540 918235 1012430 1052666 1025784 1093803 1082779 1185238
6561A185238J08173J75474p298J08918K840M3010J88498J17282Q2084k0998J45689
$$ 1185238 1293411 1468885 1461587 1570505 1573345 1616355 1804853 1922135 2004219 1983221 2128910
6550B128910m5920k3490N4754J28322J3800O9624J87658J27078k2470L6637j68940
$$ 2128910 2082990 2059500 2114254 2242576 2256376 2326000 2513658 2640736 2618266 2654903 2485963
6539B485963j55757j18698k19595j38043j28035j97846J07950m6042j83310O1800
$$ 2485963 2330206 2211508 1991913 1853870 1725835 1527989 1635939 1589897 1406587 1468387
6529A468387j0640l57658O385o283l3142N3120j18866j612J02182L0303q3042
$$ 1468387 1457747 1100089 1106474 1100191 1067049 1120169 1001303 999691 1101873 1132176 1049134
6518A049134o7509R0646J9170N0495r3009r8728j09355M2890L14160N1227k2176
$$ 1049134 981625 1072271 1091441 1141936 1048927 950199 840844 883734 1197894 1249121 1226945
6507A226945m3285r5702m0329K9527n2816L4372j08697P6603J45412o1036k6157
$$ 1226945 1183660 1087958 1047629 1077156 1024340 1058712 950015 1026618 1172030 1110994 1084837
6496A084837O244m4831r891M6354j00770L1014P1189o6105k7784P4j678L1679
$$ 1084837 1091081 1046250 1036359 1082713 981943 1012957 1084146 1018041 990257 990331 988653 1020332
6484A020332r1688k18882P9824l7210M7314j1010n0691L1222J0339o3909J9958
$$ 1020332 928644 709762 789586 752376 799690 788680 737989 769211 779550 715641 735599
6473G35599J51346J8594j51241m3042J7119l1819j07191J19449J39474p164K6391
$$ 735599 886945 905539 754298 711256 728375 696556 589365 708814 848288 841124 867515
6462H67515j22997l945J28206r2959J0234l927N4415k4474J9081p7823O923J18846
$$ 867515 744518 740573 868779 775820 786054 782127 836542 812068 831149 753326 760249 879095
6450H79095J0438j01888L0909l3974J1745O0717L2359R4336l4908L9039M2179
$$ 879095 889533 787645 818554 784580 796325 857042 889401 983737 948829 987868 1030047
6439A030047q6237q4335J32402J1383k0922k6697j3560Q3791O2349J04446K266
$$ 1030047 943810 859475 991877 1003260 982338 955641 942081 1025872 1088221 1192667 1194933
6428A194933m0083K6091K8863K3121M2339M6571k2500R324K71471J57794O9525
$$ 1194933 1154850 1180941 1209804 1232925 1275264 1321835 1299335 1308659 1580130 1737924 1807449
6417A807449J30159M3279k018j77101L7450q8268N8234p8119j47410j58817o7317
$$ 1807449 1937608 1980887 1978869 1801768 1839218 1750950 1809184 1731065 1583655 1424838 1357521
6406A357521o0151j17821J852O8951K0721l4660r5142n9504M7841p2937m1805
$$ 1357521 1297370 1179549 1181401 1250352 1271073 1236413 1141271 1081767 1129608 1056671 1014866
6395A014866K2614j77314J3721J00219Q8455N0216j68558J38189j4630j01152
$$ 1014866 1037480 860166 873887 974106 1062561 1112777 944219 1082408 1067778 966626
6385I66626L5006N7991j15480q0308K5494J41544L5365O4062K4052o8322k2792
$$ 966626 1001632 1059623 944143 863835 889329 1030873 1066238 1130300 1154352 1086030 1063238
6374A063238r067J13151m2001l3950R8731l3017q7951j0820j6949k7219l0624
$$ 1063238 1054171 1167322 1125321 1091371 1190102 1157085 1069134 1058314 1041365 1014146 983522
6363I83522J01964N6303J1734q8846L1153M8059M109k9274k6354n4923j85656
$$ 983522 1085486 1141789 1153523 1064677 1095830 1143889 1147998 1118724 1092370 1037447 851791
6352H51791K8612J12578M5152N406N509m3981K3945P4073K340L9340j20708K1941
$$ 851791 880403 992981 1038133 1043539 1049048 1005067 1029012 1103085 1105425 1144765 1024057 1045998
6340A045998L7949L8988j29249j10591J65903K1802l4271J27286L3256j40558
$$ 1045998 1083947 1122935 993686 883095 1048998 1070800 1036529 1163815 1197071 1056513
6330A056513J58073J3920j05577q4417J08217P4596j85249J12953J37373p2159
$$ 1056513 1214586 1228506 1122929 1038512 1146729 1221325 1036076 1149029 1286402 1214243
6320A214243j6125J13152j44696j0834J03557R0628M500j4209l8211J02912Q3770
$$ 1214243 1198118 1311270 1166574 1155740 1259297 1349925 1354425 1340216 1302005 1404917 1488687
6309A488687j9121R6491O3528k4290J3247J32833p0754j05457n433N9992o8672
$$ 1488687 1469566 1566057 1629585 1605295 1618542 1751375 1680621 1575164 1569731 1629723 1561051
6298A561051N5100K42622J45951N1202P2730J95680K5329j953N3878j11923k6366
$$ 1561051 1616151 1858773 2004724 2055926 2128656 2324336 2349665 2347712 2401590 2289667 2263301
6287B263301J5543k3962K3674l461K0272n3972o7012K03413O8209j00521M4677
$$ 2263301 2278844 2254882 2278556 2275095 2295367 2241395 2174383 2377796 2446005 2345484 2390161
6276B390161K640q9455j91584l1638j0551q5633r5924q5827L060J01396r823j6663
$$ 2390161 2392801 2303346 2111762 2080124 2069573 1983940 1888016 1802189 1805249 1906645 1896822 1880159
6264A880159J32770j1276p6186j8481P4684j33473j30169n5788K7356K9771M0826
$$ 1880159 2012929 2001653 1925467 1906986 1981670 1848197 1718028 1662240 1689596 1719367 1760193
6253A760193k04097o706m1248M6012L1012k6421p7590J7227m0105n4698N3073
$$ 1760193 1556096 1549390 1508142 1554154 1585166 1558745 1481155 1498382 1458277 1403579 1456652
6242A456652j87546p5154J35129k2087m4222J3588Q1810J7822p750l5407j18167
$$ 1456652 1269106 1193952 1329081 1306994 1262772 1276360 1358170 1375992 1368242 1332835 1214668
6231A214668m7215N9975k0740q0608O4230l497k265P89q2606J72353R3133j65991
$$ 1214668 1167453 1227428 1206688 1126080 1190310 1186813 1184548 1185337 1102731 1275084 1368217 1202226
6219A202226J35766K7332n7217r0110j4161J54416n028j02151j0731R4358o3170
$$ 1202226 1337992 1365324 1308107 1217997 1203836 1358252 1353224 1251073 1240342 1334700 1271530
6208A271530k00011J8892j16954P8061J02263j2618k543J2545l7597R5810J48722
$$ 1271530 1071519 1090411 973457 1051518 1153781 1141163 1138620 1151165 1113568 1209378 1358100
6197A358100j03471N0275J09932j3064J52558o8695K7882J10981J2698p2378k3087
$$ 1358100 1254629 1304904 1414836 1401772 1554330 1485635 1513517 1624498 1637196 1564818 1541731
6186A541731j24078n8162N6397J65651o2511j24791m2033J2307J8864o2087N4678
$$ 1541731 1417653 1359491 1415888 1581539 1519028 1394237 1352204 1364511 1383375 1321288 1375966
6175A375966R2423p323p7120J04000J7070R719O3025r8282J337J8585j49217K5498
$$ 1375966 1468389 1461066 1383946 1487946 1505016 1514735 1577760 1479478 1480815 1499400 1350183 1375681
6163A375681P3137R2693R9960L6414M5534j14174k3825N3966n1711M3940j8145
$$ 1375681 1448818 1541511 1641471 1677885 1723419 1609245 1585420 1639386 1587675 1631615 1613470
6152A613470J19020M1598l9906j9510R2145j2916n7962L9448n2281q6949Q3259
$$ 1613470 1732490 1774088 1734182 1714672 1806817 1793901 1735939 1775387 1723106 1636157 1719416
6141A719416R5255P3004R8180l9540M6337J26492J64480J90862M6024P8981J98596
$$ 1719416 1814671 1887675 1985855 1946315 1992652 2119144 2283624 2474486 2520510 2599491 2798087
6130B798087J21446R3114K48528J23397J22969K33604L50195K93290M00932M59328
$$ 2798087 2919533 3012647 3261175 3384572 3507541 3741145 4091340 4384630 4785562 5244890
6120E244890L25009K46863L11693K15462O3461m4217j01992K768k43435l23683
$$ 5244890 5569899 5816762 6128455 6343917 6407378 6363161 6261169 6263937 6020502 5696819
6110E696819j80380k16871k35172r4030n4732j63318r1080L3800L1141K93674
$$ 5696819 5516439 5299568 5064396 4970366 4915634 4752316 4661236 4695036 4726177 5019851
6100E019851K61582J43520J12113J17271l778n0504m0582k48554l77562k88399
$$ 5019851 5281433 5424953 5537066 5654337 5650559 5600055 5559473 5310919 4933357 4644958
6090D644958k80991j69849k20033j09518j43666k01893j65028j00635Q9413r2347
$$ 4644958 4363967 4194118 3974085 3864567 3720901 3519008 3353980 3253345 3342758 3250411
6080C250411j24008j09416Q6690L1122r4941R941l6870n0824J81530J24082p593
$$ 3250411 3126403 3016987 3103677 3134799 3039858 3049799 3012929 2962105 3143635 3267717 3260124
6069C260124N3622J09654J10562J50773L06314K62278K36664L37828K54903P0733
$$ 3260124 3313746 3423400 3533962 3684735 3991049 4253327 4489991 4827819 5082722 5153455
6059E153455K13891L07024K55161M35976N88650L66112K51912J94801M7109j20988
$$ 5153455 5367346 5674370 5929531 6365507 6954157 7320269 7572181 7766982 7814091 7693103
6049G693103o8014j96786k41237j97698k98670m1203j40310L5692N3513J23071
$$ 7693103 7625089 7428303 7187066 6989368 6690698 6649495 6509185 6544877 6598390 6721461
6039F721461j055K2775L01736K42413J66034K48192L43281l3092q7095p9929l41731
$$ 6721461 6720406 6743181 7044917 7287330 7453364 7701556 8044837 8011745 7924650 7844721 7502990
6028G502990m95146l88238k59148l14596l76846l80809k70380l69189l64712k75655
$$ 7502990 7007844 6619606 6360458 6045862 5669016 5288207 5017827 4648638 4283926 4008271
6018D008271k98361k05315m1857j68127k47814l5685P938k38416m4017n3788j60088
$$ 4008271 3709910 3504595 3462738 3294611 3046797 3011112 3019050 2780634 2736617 2682829 2522741
6007B522741j46073o4113P831P8967P5991j56519j1197q9986k17189N6782R9138
$$ 2522741 2376668 2312555 2320386 2399353 2475344 2318825 2307628 2217642 2000453 2057235 2156373
5996B156373K8137L0284Q3609M1482K464j3218n0304j00969m9941O6230J04969
$$ 2156373 2184510 2214794 2298403 2339885 2342349 2329131 2278827 2177858 2127917 2194147 2299116
5985B299116M6100j64323P637l4268k9405o8301N8301q2545q4975L9289M1359
$$ 2299116 2345216 2180893 2188530 2154262 2124857 2056556 2114857 2032312 1947337 1986626 2027985
5974B027985Q0641r0643l3247Q9441Q6280p0023r8822J00939o9023J0683r0904
$$ 2027985 2108626 2017983 1984736 2074177 2160457 2090434 1991612 2092551 2023528 2034211 1943307
5963A943307K6865J31615k8041M3481k8179q5Q4791J02864k7561l2200J70233
$$ 1943307 1970172 2101787 2073746 2117227 2089048 2088963 2173754 2276618 2249057 2216857 2387090
5952B387090L8939q2690l979l0600o7886L6211J39383j2359j91766r283J13155
$$ 2387090 2426029 2343339 2339360 2308760 2240874 2277085 2416468 2404109 2212343 2203060 2316215
5941B316215J54169Q5384L9191O0700J77276R1234P3368j14943j5587K18464J01337
$$ 2316215 2470384 2555768 2594959 2655659 2832935 2924169 2997537 2882594 2867007 3085471 3186808
5930C186808J10260J27818K71217K60967J67182J82173M16533K89639J87578L66591
$$ 3186808 3297068 3424886 3696103 3957070 4124252 4306425 4722958 5012597 5200175 5566766
5920E566766M69752L20793J83418J1541p0382j69305j20810k21648k56657k28966
$$ 5566766 6036518 6357311 6540729 6552270 6481888 6312583 6191773 5970125 5713468 5484502
5910E484502k52683k32832j82066j35488j411N3116j98042p6819J21244R574o5582
$$ 5484502 5231819 4998987 4816921 4681433 4680022 4733138 4535096 4458277 4579521 4589095 4523513
5899D523513P3806K50202J56608J25952J50767J89657J71601K98556L05931M74532
$$ 4523513 4597319 4847521 5004129 5130081 5280848 5470505 5642106 5940662 6246593 6721125
5889F721125N10311L43109L72211M75559K59782j8637L3791l49114l01860l38922
$$ 6721125 7231436 7574545 7946756 8422315 8682097 8663460 8697251 8348137 8046277 7707355
5879G707355n48076l73643l91808m59725l57514j86890k85944l02503j49451n7997
$$ 7707355 7159279 6785636 6393828 5934103 5576589 5389699 5103755 4801252 4651801 4593804
5869D593804r8517k37978j60063n9445J5203j60746j6407Q1463j7497M5113O6023
$$ 4593804 4495287 4257309 4097246 4037801 4053004 3892258 3875851 3957314 3939817 3984930 4050953
5858D050953J09326K08292J03658j00479J36925K1018q2862Q8566j20336j57316
$$ 4050953 4160279 4368571 4472229 4371750 4508675 4529693 4446831 4535397 4415061 4257745
5848D257745m3124j29336n1404j07343K2487O9956R989n5692K0823O2933Q4398
$$ 4257745 4214621 4085285 4033881 3926538 3949025 4018981 4028970 3973278 3994101 4057034 4141432
5837D141432L6847R4185R222P5881M7444J95132R3670J07353J82637J79525K97539
$$ 4141432 4178279 4272464 4281686 4357567 4405011 4600143 4693813 4801166 4983803 5163328 5460867
5826E460867L29518L15983L74279K45656M39161N72457o101k0242j69384j68165
$$ 5460867 5790385 6106368 6480647 6726303 7165464 7737921 7731820 7711578 7542194 7374029
5816G374029j98138l39558j84200k70434l61334j59682j31986r3564l344L9589
$$ 7374029 7175891 6836333 6652133 6381699 6020365 5860683 5728697 5635133 5631789 5671378
5806E671378K2961R3025j2559k1465J91026J99005m982J12490K14196P0180J1946
$$ 5671378 5694339 5787364 5774805 5753340 5944366 6143371 6138389 6250879 6465075 6535255 6547201
5795F547201R9092r8564k0772P088J16582m3591J07795J20894J50056K12217J99069
$$ 6547201 6646293 6547729 6526957 6534045 6650627 6607036 6714831 6835725 6985781 7197998 7397067
5784G397067J47009J05354L31589L41283J65796K792K33892L35876K20665J67664
$$ 7397067 7544076 7649430 7981019 8322302 8488098 8490890 8724782 9060658 9281323 9448987
5774I448987R7353K93929K11525J40543K25992J09905M96029M82190M95676O55815
$$ 9448987 9546340 9840269 10051794 10192337 10418329 10528234 11024263 11506453 12002129 12657944
5764A2657944O28739J117200J381764J947962L186460N150530P181592Q884980
$$ 12657944 13286683 14403883 15785647 17733609 20920069 26070599 33252191 42137171
5756D2137171P031320M79958l595364n021000n591603n672949m815543l424615
$$ 42137171 49168491 49648449 46053085 41032085 35440482 29767533 24951990 21527375
5748B1527375k940886k265397j863018j158767r58088r22606o86816n62715l38227
$$ 21527375 18586489 16321092 14458074 13299307 12341219 11418613 10731797 10169082 9830855
5739I830855l40623m76126m26350m9477j81161l29492k02353l8422P26j28795
$$ 9830855 9490232 9014106 8587756 8538279 8357118 8027626 7825273 7786851 7787577 7658782
5729G658782k7543j37806j36828r3240k12436L2363r9824j37375j75670j42473
$$ 7658782 7631239 7493433 7356605 7263365 7050929 7083292 6983468 6846093 6670423 6527950
5719F527950j05595j61283j07283j39616k12250k75741k88787o6347l8067j42001
$$ 6527950 6422355 6261072 6153789 6014173 5801923 5526182 5237395 5171048 5132981 4990980
5709D990980j05776j22583n460j43611j43720m0278m7485k4110j37111r6104M0710
$$ 4990980 4885204 4762621 4757161 4613550 4469830 4429552 4382067 4357957 4220846 4124742 4165452
5698D165452M1342J13600j02065k33977k5530j09353O7107n0751p6786r1283r3767
$$ 4165452 4206794 4320394 4218329 3984352 3958822 3849469 3916576 3865825 3789039 3697756 3603989
5687C603989l01957j88365J42497l6768l7878l7364k443O2541q6252j7291J31049
$$ 3603989 3302032 3113667 3256164 3219396 3181518 3144154 3141711 3204252 3118000 3100709 3231758
5676C231758n0727P5509K1765j38111l9746R7078j7400J20760L3902k6805N1777
$$ 3231758 3181031 3256540 3278305 3140194 3100448 3197526 3180126 3300886 3334788 3307983 3359760
5665C359760J5891M5216j07002J50958Q1851j13796l4531n5110n9155o0140J07956
$$ 3359760 3375651 3420867 3313865 3464823 3546674 3432878 3398347 3343237 3284082 3223942 3331898
5654C331898k1084n0443P8592J16736j09018k80771R0003J57218J0193M0374K1080
$$ 3331898 3310814 3260371 3338963 3455699 3346681 3065910 3155913 3313131 3323324 3363698 3384778
5643C384778l6487J41342J0610n8291K8652Q3521O746j42040N2500K8537P217
$$ 3384778 3348291 3489633 3500243 3441952 3470604 3554125 3560871 3418831 3471331 3499868 3507085
5632C507085J24602K9837l0391P6553j4939J51839J7210l1558M7832p3316N4003
$$ 3507085 3631687 3661524 3631133 3707686 3692747 3844586 3861796 3830238 3878070 3804754 3858757
5621C858757J77434r0134j99881q0657l7189J84939N0353K0376j7756N541r7165
$$ 3858757 4036191 3946057 3746176 3665519 3628330 3813269 3863622 3883998 3866242 3871783 3774618
5610C774618J04838J32724L2771K8759j64632J35026J00242P3985Q2230J35156
$$ 3774618 3879456 4012180 4044951 4073710 3909078 4044104 4144346 4218331 4300561 4435717
5600D435717o213k170j2585L8443M3329q4423Q555O5711J25365N8214O827m7793
$$ 4435717 4429504 4427334 4414749 4453192 4496521 4412098 4420653 4486364 4611729 4669943 4676770 4628977
5588D628977N4986j4723O2235J018k9836L992J70261K4798M4364J10508L1327
$$ 4628977 4683963 4669240 4731475 4732493 4702657 4706649 4876910 4901708 4946072 5056580 5087907
5577E087907K828J38854j08893O8179J49538J64505O5161O0189k4515L1961J57572
$$ 5087907 5090735 5229589 5120696 5188875 5338413 5502918 5568079 5628268 5603753 5635714 5793286
5566E793286J29058K8264o3935J71985Q0658N0021j4209K89681J12610K7649J34462
$$ 5793286 5922344 5950608 5886673 6058658 6139316 6189337 6175128 6464809 6577419 6605068 6739530
5555F739530J47880L8577O0551R7197J29120J06149J72974R2604J21272K74352
$$ 6739530 6887410 6925987 6986538 7083735 7212855 7319004 7491978 7584582 7705854 7980206
5545G980206J47106J52249J84004J68038L18239L05287M29267P8038J83314L54658
$$ 7980206 8127312 8279561 8463565 8631603 8949842 9255129 9684396 9762434 9945748 10300406
5535A0300406N59845L75701K52169L91910N57709O49990O19873O73830O93105
$$ 10300406 10860251 11235952 11488121 11880031 12437740 13087730 13707603 14381433 15074538
5526A5074538P07334P83914O85197O49232R05684R77327J230285J231002J243758
$$ 15074538 15781872 16565786 17250983 17900215 18805899 19783226 21013511 22244513 23488271
5517B3488271J507192J642621J960918K306741K458330K878243L277000L687831
$$ 23488271 24995463 26638084 28599002 30905743 33364073 36242316 39519316 43207147
5509D3207147M487969N182309N955298P115850Q121815Q967719R911637J0151504
$$ 43207147 47695116 52877425 58832723 65948573 74070388 83038107 92949744 103101248
5501A03101248R958033R703947R316234R176481Q722691P644754N371262J968548
$$ 103101248 113059281 122763228 132079462 141255943 149978634 157623388 162994650 164963198
5493A64963198j806104m947844p127180q334978r122757r536625r793625j0042361
$$ 164963198 163157094 158209250 151082070 142747092 133624335 124087710 114294085 104251724
5485A04251724r825400r591068q974104q202436p260279o301853n546859m672860
$$ 104251724 94426324 84835256 75861152 67658716 60398437 54096584 48549725 43876865
5477D3876865m108624l529901k882459k649013k224106j874829j764741j411915
$$ 43876865 39768241 36238340 33355881 30706868 28482762 26607933 24843192 23431277
5469B3431277j336520j031543r38490r53785o86384o31961m36244l85684m53163
$$ 23431277 22094757 21063214 20124724 19170939 18484555 17852594 17416350 17030666 16577503
5460A6577503l47570o53618o96728o29009n67103p04562o26654m47852m67563
$$ 16577503 16229933 15576315 14879587 14250578 13683475 12978913 12352259 11904407 11436844
5451A1436844n14756k41939l66769l67642k39728l13363j21361j86044k35105
$$ 11436844 10922088 10680149 10313380 9945738 9706010 9392647 9271286 9085242 8850137
5442H850137j04639j51806j67450k55863r7662q769k39067j83599r7777j46296
$$ 8850137 8745498 8593692 8426242 8170379 8072717 8063948 7824881 7641282 7543505 7397209
5432G397209m7673j03316k0764K775j67813j82394p4941j36849j55425j34296
$$ 7397209 7349536 7246220 7225456 7228231 7060418 6878024 6803083 6666234 6510809 6376513
5422F376513k04374q1188j14227l2902k03180j35609j1415q3648J2849o1635R4290
$$ 6376513 6172139 6090951 5976724 5943822 5740642 5605033 5593618 5509970 5522819 5461184 5555474
5411E555474L8387P0657q5761j15481J27600j31515m0924j23992j87565j51284
$$ 5555474 5593861 5664518 5578757 5463276 5590876 5459361 5418437 5294445 5106880 4955596
5401D955596j09037r8365q2371j41250r2858q0405O043l8523j28855m444n716
$$ 4955596 4846559 4748194 4665823 4524573 4431715 4351310 4357353 4318830 4189975 4185531 4179815
5390D179815P8511p3091r3234m2877n9196k5836j08794k3571p4899l840m6730
$$ 4179815 4258326 4185235 4092001 4049124 3989928 3964092 3855298 3831727 3756828 3752988 3706258
5379C706258l4473K29755j3861j57005J8682l2325o6457p2955J7688m2102q0951
$$ 3706258 3671785 3901540 3887679 3730674 3749356 3717031 3650574 3577619 3595307 3553205 3472254
5368C472254K9219P17K3365k03412o5577N4929j24864M9882L9164k09468J9352
$$ 3472254 3501473 3502190 3525555 3322143 3256566 3311495 3186631 3236513 3275677 3066209 3085561
5357C085561j9097j9940M2288K571O2185J02024n7890k4631p4125r8861j1225
$$ 3085561 3066464 3046524 3088812 3091383 3153568 3255592 3197702 3173071 3098946 3000085 2988860
5346B988860N7093M9682j0411M7583Q857J60917j06133n6872R9710K43757j6824
$$ 2988860 3045953 3095635 3085224 3132807 3141664 3302581 3196448 3139576 3239286 3483043 3466219
5335C466219l781k7399J60033J70694k4466K9905O4576Q2224o2957o5028r302
$$ 3466219 3462438 3435039 3595072 3765766 3741300 3771205 3835781 3918005 3855048 3790020 3780718
5324C780718j21193o2694R0126Q2387R7223q2768l7946L9947l4321M4418Q9798
$$ 3780718 3659525 3596831 3686957 3769344 3866567 3783799 3745853 3785800 3751479 3795897 3885695
5313C885695j34808j05622j1412l1373n6051j02835p4022j07847j25958p2002
$$ 3885695 3750887 3645265 3633853 3602480 3546429 3443594 3369572 3261725 3135767 3063765
5303C063765j66739J3104J02003N0902n3472k17544M72n9165K4804r3673j4J01809
$$ 3063765 2897026 2910130 3012133 3063035 3009563 2792019 2792491 2733326 2758130 2664457 2664443 2766252
5291B766252N8507k16634r1555Q3812r6975k1715k6418q35Q9100Q4261l7605j17856
$$ 2766252 2824759 2608125 2516570 2600382 2503407 2481692 2455274 2454439 2543539 2627800 2590195 2472339
5279B472339l699J5157l0250J7409j5980L601k1531j22478k5908m9577J24641
$$ 2472339 2468640 2483797 2453547 2470956 2454976 2458577 2437046 2314568 2288660 2239083 2363724
5268B363724M1339k3151P7300J46552m3968k09819o0313J8457O3555R2537K9966
$$ 2363724 2405063 2381912 2459212 2605764 2561796 2351977 2291664 2310121 2373676 2466213 2496179
5257B496179O5095p3292o2570k1837j37953J03074R956R8833q7159Q1668m3799
$$ 2496179 2561274 2487982 2425412 2403575 2265622 2368696 2378652 2477485 2390326 2471994 2428195
5246B428195J67488q6656l3732l9034k9811j5986N4357J67750K8772j16815j45744
$$ 2428195 2595683 2509027 2475295 2436261 2406450 2390464 2444821 2612571 2641343 2524528 2378784
5235B378784N949J26650L5001l3932q1883J3137N7277r9120l6215k6291j05994
$$ 2378784 2384733 2511383 2546384 2512452 2430569 2443706 2500983 2401863 2365648 2339357 2233363
5224B233363l0316M8633K4858Q5468J73699l3122j33925Q8036k0258m1532O4363
$$ 2233363 2203047 2251680 2276538 2362006 2535705 2502583 2368658 2456694 2436436 2394904 2459267
5213B459267p023K5454j4806J54454J31994j10804j5739j11817p993J89517R639
$$ 2459267 2452244 2477698 2462892 2617346 2749340 2638536 2622797 2510980 2502987 2692504 2702143
5202B702143O6297J20163p921J2486L1619J8869M2316J50481n4784j9217J19768
$$ 2702143 2768440 2888603 2880682 2893168 2924787 2943656 2985972 3136453 3081669 3062452 3182220
5191C182220J36348r9226n8016J352k3550j0945k0667k2172r9467J3131R6402
$$ 3182220 3318568 3219342 3161326 3162678 3139128 3128183 3107516 3085344 2985877 2999008 3095410
5180C095410j52012r1713Q4555r0884K0731J2115j46801k2221J14902n2010l186
$$ 3095410 2943398 2851685 2936240 2845356 2866087 2878202 2731401 2709180 2824082 2772072 2768886
5169B768886k1465J9960R3240p7310l977k03204j05096Q5096k47m9182M8367j6806
$$ 2768886 2747421 2767381 2860621 2783311 2779334 2576130 2471034 2556130 2555883 2506701 2555068 2538262
5157B538262L7411K6486J4546j06951m413Q3807M3395r8305N5936n1701J0283
$$ 2538262 2575673 2602159 2616705 2509754 2505341 2589148 2632543 2534238 2590174 2538473 2548756
5146B548756r4761J04138l6145q7271K0008J11581L0399Q119J39131M0794J25777
$$ 2548756 2453995 2558133 2521988 2434717 2454725 2566306 2596705 2604824 2743955 2784749 2910526
5135B910526j09212n1651j42027M4346k9109Q452m2515J05468m4864J18882k2446
$$ 2910526 2801314 2749663 2607636 2651982 2622873 2631325 2588810 2694278 2649414 2768296 2745850
5124B745850j46156l4568j9541O6766p6207k0811p6468Q0902L2516o0241Q2192
$$ 2745850 2599694 2565126 2545585 2612351 2536144 2515333 2438865 2519767 2552283 2492042 2574234
5113B574234J64715l3576N688O9202K7680m1387R361j12380O4518L8736q1163
$$ 2574234 2738949 2705373 2711061 2780263 2807943 2766556 2775917 2663537 2728055 2766791 2685628
5102B685628Q1777J42186R1026L2377Q1497K3148r4887q5228J35865J20045n7822
$$ 2685628 2767405 2909591 3000617 3032994 3114491 3137639 3042752 2957524 3093389 3213434 3155612
5091C155612j95248j31813R3872k521m3525K5405M8660J23238N982O7373j7037
$$ 3155612 2960364 2828551 2922423 2919902 2876377 2901782 2950442 3073680 3079662 3147035 3129998
5080C129998j99777O2996J92204n605M4334J8623R4323j07393R9990Q5845k4310
$$ 3129998 2930221 2993217 3185421 3179816 3224150 3242773 3337096 3229703 3329693 3415538 3391228
5069C391228j04480O5035L705K8544Q9947j58576L4929K06903O0629N6407K4717
$$ 3391228 3286748 3351783 3355488 3384032 3473979 3315403 3350332 3557235 3617864 3674271 3698988
5058C698988N7910K33405l7661l3116J38757P5769P1347J01610O6375R5980j859
$$ 3698988 3756898 3990303 3952642 3919526 4058283 4134052 4205399 4307009 4373384 4469364 4467505
5047D467505J15727J9294j11159R0571N9824k24829n8912j22678l9211P4201R7074
$$ 4467505 4583232 4602526 4491367 4581938 4641762 4416933 4358021 4235343 4196132 4270333 4367407
5036D367407Q0036j6555M4848Q9709N3915j4225Q0645R9864R3671j6447L4842
$$ 4367407 4447443 4430888 4475736 4565445 4619360 4605135 4685780 4785644 4879315 4862868 4897710
5025D897710O2570J32940N3924L5470N4993o226K0218n1869M9512q7936R2063
$$ 4897710 4960280 5093220 5147144 5182614 5237607 5231381 5251599 5199730 5249242 5161306 5253369
5014E253369J73713N613j05477q2614K6595k5107R139O4983J03864L2366n7282
$$ 5253369 5427082 5432695 5327218 5244604 5271199 5246092 5255231 5320214 5424078 5456444 5399162
5003E399162k2430J35930K31636J53027o849J52866J77438J99614L26714L65734
$$ 5399162 5376732 5512662 5744298 5897325 5890476 6043342 6220780 6420394 6747108 7112842
4993G112842L37456O19994O03167N40666L46729l3497j48550l59035k56932l15603
$$ 7112842 7450298 8070292 8673459 9214125 9560854 9527357 9378807 9019772 8762840 8447237
4983H447237k37033M408q8333r7601j4884N517j0022N8894J10884J26398m2207
$$ 8447237 8210204 8214612 8126279 8028678 8013794 8019311 8009289 8068183 8179067 8305465 8263258
4972H263258K1927K60992J22830N7309L9363J28779K07896K83725K38682K89194
$$ 8263258 8285185 8546177 8669007 8726316 8765679 8894458 9102354 9386079 9624761 9913955
4962I913955J17809K17351K48486L94093L51245K01137L47283M22803L43810J73959
$$ 9913955 10031764 10249115 10497601 10891694 11242939 11444076 11791359 12214162 12557972 12731931
4952A2731931K46953M07994L27712J74788K41532J06457J46339J04250N8754M3014
$$ 12731931 12978884 13386878 13714590 13889378 14130910 14237367 14383706 14487956 14546710 14589724
4942A4589724O3218O9034J07609K00038K94024R7442J4977L08584K74639K96995
$$ 14589724 14652942 14721976 14829585 15029623 15323647 15421089 15436066 15744650 16019289 16316284
4932A6316284N07401M47991M25502N54761N53180N40480P67938P67634P05473
$$ 16316284 16823685 17271676 17697178 18251939 18805119 19345599 20113537 20881171 21586644
4923B1586644P13220Q48099R11627R32416Q31372Q20721Q53352R15655R79042
$$ 21586644 22299864 23147963 24059590 24992006 25823378 26644099 27497451 28413106 29392148
4914B9392148J031860Q48230O92906N53655N48772N53122N04745M40812O86102
$$ 29392148 30424008 31272238 31965144 32518799 33067571 33620693 34125438 34566250 35252352
4905C5252352N58436M02116N50922N04871N98468O57819P76136R48744R35833
$$ 35252352 35810788 36212904 36763826 37268697 37867165 38524984 39301120 40249864 41185697
4896D1185697J193034J176071J232992J643108J819321K000482J838779J971690
$$ 41185697 42378731 43554802 44787794 46430902 48250223 50250705 52089484 54061174
4888E4061174J984363J912184J893860J795421J740665J709143J405825Q83542
$$ 54061174 56045537 57957721 59851581 61647002 63387667 65096810 66502635 67386177
4880F7386177L67057k52873p92531j419127j585061j326017j456530j191333j129692
$$ 67386177 67753234 67500361 66707830 65288703 63703642 62377625 60921095 59729762 58600070
4871E8600070p78602n12350j68959M22897R75055J386404J663836J876065J970270
$$ 58600070 57821468 57309118 57140159 57563056 58538111 59924515 61588351 63464416 65434686
4862F5434686J720376J286440J016470O63700M3035l95263q40312j556069k046243
$$ 65434686 67155062 68441502 69457972 70121672 70164707 69769444 68929132 67373063 65326820
4853F5326820k579943k727617k589274k796057k747155k636289k487992k158256
$$ 65326820 62746877 60019260 57429986 54633929 51886774 49250485 46762493 44604237
4845D4604237j678035j272614p05481j64456P89151J796629L533103N119746O422407
$$ 44604237 42926202 41653588 40948107 40783651 41572802 43369431 46902534 52022280 58444687
4836E8444687M863124L39997j727864k388263k509034k467117j647202o71446
$$ 58444687 63307811 63647808 61919944 59531681 57022647 54555530 52908328 52236882
4828E2236882k63295K27241P67579J418207J916056K418576K860014L770671M254221
$$ 52236882 51973587 52200828 52968407 54386614 56302670 58721246 61581260 65351931 69606152
4819F9606152M518797M528208L978995L179588K071683P83728o86201j922980
$$ 69606152 74124949 78653157 82632152 85811740 87883423 88667151 87980950 86057970
4811H6057970l021640l786430l825997l773483l427400k755805k195754j440593
$$ 86057970 83036330 79249900 75423903 71650420 68223020 65467215 63271461 61830868
4803F1830868p98809l25178L66917J303919K484818L518675M543514N330619M752437
$$ 61830868 61032059 60706881 61073798 62377717 64862535 68381210 72924724 78255343 83007780
4794H3007780L475680J474354o82040k612412l873905m457160m493831m116042
$$ 83007780 86483460 87957814 87275774 84663362 80789457 76332297 71838466 67722424
4786F7722424l804286l391620k758747k553269k475934k428033k391850k257004
$$ 67722424 63918138 60526518 57767771 55214502 52738568 50310535 47918685 45661681
4778D5661681k064104k046120j740035j284906j048352q52356n11023k24489l44274
$$ 45661681 43597577 41551457 39811422 38526516 37478164 36625808 36114785 35890296 35546022
4769C5546022o81789o35643q65804r65074q69247n64889o58431q22163p21121
$$ 35546022 34864233 34228590 33362786 32397712 31528465 30963576 30305145 29482982 28761861
4760B8761861j029128j281388j310339j472844j474693j371425j420434j340394
$$ 28761861 27732733 26451345 25141006 23668162 22193469 20822044 19401610 18061216
4752A8061216j087610q22055q83341q58080o17170n28887m24316n23918l82590
$$ 18061216 16973606 16151551 15268210 14410130 13792960 13264073 12839757 12315839 11933249
4743A1933249l45681l25673k68994P018k67549k59992o8455k15909j19486l3430
$$ 11933249 11587568 11261895 10992901 10999919 10732370 10472378 10403923 10188014 10068528 10035098
4733A0035098J6857p1760Q394m8157N1709K07024J18856k2905R3182L9175m2830
$$ 10035098 10051955 9980195 9988589 9940432 9992141 10199165 10318021 10295116 10388298 10427473 10384643
4722A0384643o7622M5780m462l9949R5098j4316k8638Q5539j47678l4747o6698
$$ 10384643 10317021 10362801 10358339 10318390 10413488 10399172 10370534 10456073 10308395 10273648 10206950
4711A0206950j07541k07063k0786j43830k4024O1488K7889J45765n9948J48588
$$ 10206950 10099409 9892346 9871560 9727730 9703706 9765194 9793083 9938848 9878900 10027488
4701A0027488K02147M4246l7259K68018J82579L3813p4846j80248O0069j72281
$$ 10027488 10229635 10273881 10236622 10504640 10687219 10721032 10646186 10465938 10526007 10353726
4691A0353726r9508l75163j77754p6358k09123j6845r0672j32479J27767K9720
$$ 10353726 10254218 9879055 9701301 9624943 9415820 9398975 9308303 9175824 9303591 9333311
4681I333311j9839J12406N5884J12563J61070J71303K00209M06626M35465M46043
$$ 9333311 9313472 9425878 9481762 9594325 9755395 9926698 10126907 10533533 10968998 11415041
4671A1415041L46486L90449M78093M84330O02917O19597L12800N5984M9284N3192
$$ 11415041 11761527 12151976 12630069 13114399 13717316 14336913 14649713 14705697 14754981 14808173
4661A4808173j61078l34617q3708k56375j51044k06531j72894L5846l8681J12798
$$ 14808173 14647095 14312478 14228770 13972395 13821351 13614820 13441926 13477772 13439091 13551889
4651A3551889K73783J12478J35440M30878L24135L03131J59570O4029R3836J10413
$$ 13551889 13825672 13938150 14073590 14504468 14828603 15131734 15291304 15355333 15449169 15559582
4641A5559582j29283k92780o5552j26790j83810l42450n1887J93610K61236L07090
$$ 15559582 15430299 15137519 15071967 14945177 14761367 14418917 14367030 14560640 14821876 15128966
4631A5128966M86444P51861R69361J444678J444294P67287N8100j61820l53173
$$ 15128966 15615410 16367271 17336632 18781310 20225604 20992891 21050991 20889171 20535998
4622B0535998k86309k40579J78950L87358K84711K87275J87932K44413K71768
$$ 20535998 20249689 20009110 20188060 20575418 20860129 21147404 21335336 21579749 21851517
4613B1851517Q7102L71159L75219K84291M64351N20498J95282K70044N60063R55017
$$ 21851517 21938619 22309778 22684997 22969288 23433639 23954137 24149419 24419463 24979526 25934543
4603B5934543J166332J339907J299626O14695O05036M23454M71391J196772J436678
$$ 25934543 27100875 28440782 29740408 30355103 30960139 31383593 31854984 33051756 34488434
4594C4488434J587561J706492J175093N81933R3410j26535j60548J04191N50841
$$ 34488434 36075995 37782487 38957580 39539513 39632923 39506388 39345840 39450031 40000872
4585D0000872P88457O80106K50033J21627J49289L08038O94300J231371J649833
$$ 40000872 40789329 41469435 41719468 41841095 41990384 42298422 42992722 44224093 45873926
4576D5873926K120565K402582K290177K635204L222097L664156M173494N064097
$$ 45873926 47994491 50397073 52687250 55322454 58544551 62208707 66382201 71446298
4568G1446298N944596P000086Q302363J0149159J2476055J5760476K0405563K5922830
$$ 71446298 77390894 84390980 92693343 102842502 115318557 131079033 151484596 177407426
4560A77407426L2456551L8014976L9499396L3119475J8199184j11095j5565564
$$ 177407426 209863977 247878953 287378349 320497824 338697008 338585913 323020349
4553C23020349k5898200l1304202l2558528l0949766k7709009k3932963k0124638
$$ 323020349 297122149 265817947 233259419 202309653 174600644 150667681 130543043
4546A30543043j6395410j3516423j1093472r118761p472851o582803n695170m924552
$$ 130543043 114147633 100631210 89537738 80418977 72946126 66363323 60668153 55743601
4538E5743601m417955l933460l809087l205267k456486k340832k100719j951347
$$ 55743601 51325646 47392186 43583099 40377832 37921346 35580514 33479795 31528448
4530C1528448j626288j264126j285228j065581j048047j010182q63855o65656
$$ 31528448 29902160 28638034 27352806 26287225 25239178 24228996 23365141 22699485
4522B2699485o09371o74065o45252n54962n72340n79893k61213m50374m31184
$$ 22699485 22090114 21416049 20770797 20215835 19643495 19063602 18802389 18352015 17920831
4513A7920831j33975j73320Q144k08267r3095k95983m69876n20217n15590n98339
$$ 17920831 17786856 17613536 17621680 17413413 17320318 17024335 16554459 16034242 15518652 14920313
4503A4920313n66646n50302n99158m47735m87548m67531m05654l94489k98615
$$ 14920313 14353667 13803365 13204207 12756472 12268924 11801393 11395739 11001250 10702635
4494A0702635l02895l17073j91918l26098k48572j50274k57415j59555j13616
$$ 10702635 10399740 10082667 9890749 9564651 9316079 9165805 8908390 8748835 8635219
4485H635219k07750k01447l32703r8982j35389m23795k01242J6388p2896j25927
$$ 8635219 8427469 8226022 7893319 7794337 7658948 7235153 7033911 7050299 6977403 6851476
4475F851476j02754j46915J9558o3462j48822m0605N184p0467j26740n6471N801
$$ 6851476 6748722 6601807 6621365 6557903 6409081 6368476 6373660 6303193 6176453 6119982 6125783
4464F125783q8488j24905q9218j49579j24551k9873k08449j67640k06672o8880
$$ 6125783 6037295 5912390 5823172 5673593 5549042 5519169 5310720 5143080 4936408 4867528
4454D867528m7549n6246l9668o6107j04516j24092M7088q2852q1337p1182J08215
$$ 4867528 4819979 4763733 4724065 4657958 4553442 4429350 4476438 4393586 4312249 4241067 4349282
4443D349282m8753k02661J833l0406j58244o3882q8957k4320l5743j8956O1096
$$ 4349282 4300529 4097868 4099701 4069295 3911051 3847169 3758212 3733892 3698149 3679193 3740289
4432C740289k11567O6419O093j25128O300n2538o8455o1326J4749n4001j66630
$$ 3740289 3528722 3595141 3601234 3476106 3482406 3429868 3361413 3300087 3314836 3260835 3094205
4421C094205m3655M8851j72165j1203j291j9053R6149n8780j34940o6598m2j50835
$$ 3094205 3050550 3099401 2927236 2916033 2914742 2895689 2991838 2933058 2798118 2731520 2731478 2580643
4409B580643M287J08625J23284K05266M0384j26606Q8914K3929O2413l9828k3952
$$ 2580643 2584930 2693555 2816839 3022105 3062489 2935883 3024797 3048726 3111139 3071311 3047359
4398C047359o3593L6713J26912M4403j35732q4504j76j97122R1273j178j25916
$$ 3047359 2983766 3020479 3147391 3191794 3056062 2971558 2971382 2774260 2865533 2864355 2738439
4387B738439J23287J11721L2236L4397p6485k9209m2122R1914K28116J46113j5563
$$ 2738439 2861726 2973447 3005683 3040080 2963595 2934386 2892264 2984178 3212294 3358407 3342844
4376C342844j49130J8426N9842r8199l9367j74785K463J23710j20754J30335j5162
$$ 3342844 3193714 3212140 3271982 3173783 3134416 2959631 2962094 3085804 2965050 3095385 3080223
4365C080223j91693K5440O5229j6746n7829K7743M393O3449N1099k2879o7957
$$ 3080223 2888530 2913970 2979199 2962453 2904624 2932367 2936760 3000209 3051308 3028429 2960472
4354B960472R0832K1119n2078L4756n3784j1284N0328J11057J58672O8031K66339
$$ 2960472 3051304 3072423 3020345 3055101 3001317 2990033 3040361 3151418 3310090 3378121 3644460
4343C644460J4014L1753R0524K52946K72498K79240L53513O15659M13466M29209
$$ 3644460 3658474 3690227 3780751 4033697 4306195 4585435 4938948 5554607 5968073 6397282
4333F397282K21597o7604k86349m56742k72873l62513l24596l27228k43292j05903
$$ 6397282 6618879 6551275 6264926 5808184 5535311 5172798 4848202 4520974 4277682 4171779
4323D171779j25972k52193k6621j20752j41157L590J6387o8931j68124Q0033k006
$$ 4171779 4045807 3793614 3766993 3646241 3505084 3508674 3525061 3456130 3288006 3368039 3366033
4312C366033m8319j8155Q4796r6235j6348J52719M9835L6097O7106J43948J14372
$$ 3366033 3317714 3299559 3384355 3288120 3271772 3424491 3474326 3510423 3577529 3721477 3835849
4301C835849J05796k7501J07397N4557K48730J14211P9891n825L08955K98492
$$ 3835849 3941645 3914144 4021541 4076098 4324828 4439039 4518930 4513105 4822060 5120552
4291E120552J89500J42636j39349k32417j45778k46253j45609k83503j90224p1212
$$ 5120552 5310052 5452688 5313339 5080922 4935144 4688891 4543282 4259779 4069555 3998343
4281C998343r5674j98678j66042R6850p4863P2562o7248J56037J2255n6304L6196
$$ 3998343 3902669 3703991 3537949 3634799 3559936 3632498 3565250 3721287 3733542 3677238 3713434
4270C713434J6693P9134N2269k1643N6432J44685J70496K14904J77084P3193J18315
$$ 3713434 3730127 3809261 3861530 3839887 3896319 4041004 4211500 4426404 4603488 4676681 4794996
4259D794996K90181J94293L80712K63034L61464L12236K9433O2370L5850J47361
$$ 4794996 5085177 5279470 5660182 5923216 6284680 6596916 6626349 6688719 6724569 6871930
4249F871930J82109J37088J46882P5858P8044L00383J49638K43688L08456M20901
$$ 6871930 7054039 7191127 7338009 7413867 7491911 7792294 7941932 8185620 8494076 8914977
4239H914977K83291K26477L10039M28160M66675K83685N80514M66624M42350O26057
$$ 8914977 9198268 9424745 9734784 10162944 10629619 10913304 11493818 11960442 12402792 13028849
4229A3028849O34875O36451N06149O19807O60235P42720P45921N81120Q40655
$$ 13028849 13663724 14300175 14806324 15426131 16086366 16829086 17575007 18156127 18996782
4220A8996782O78850P07335Q52730O98406O99337Q64136R33484P42104O71830
$$ 18996782 19675632 20382967 21235697 21934103 22633440 23497576 24431060 25173164 25844994
4211B5844994Q89349P04302P34849M48126M86861N59742N16058N47145N02056
$$ 25844994 26734343 27438645 28173494 28621620 29108481 29668223 30184281 30731426 31233482
4202C1233482M73336K27555K27409J89141J74625M4188Q1099L8932o5067j29121
$$ 31233482 31706818 31934373 32161782 32350923 32525548 32569736 32650835 32689767 32624700 32495579
4192C2495579l38018n04393l88264m75053k84734n44653p22711m55279n26403
$$ 32495579 32157561 31653168 31264904 30789851 30505117 29960464 29237753 28782474 28256071
4183B8256071p10044o72634o87931q31881p82589r72035o43301q76175q88323
$$ 28256071 27546027 26873393 26185462 25353581 24570992 23598957 22955656 22079481 21191158
4174B1191158q34680q33613o75140p40655q35679p65706o78496p47597o19009
$$ 21191158 20356478 19522865 18847725 18107070 17271391 16505685 15827189 15079592 14460583
4165A4460583p03740p48553o33687m73294l70202o26108n97712o22851n26076
$$ 14460583 13756843 13008290 12374603 11901309 11531107 10904999 10307287 9684436 9158360
4156I158360k95985m88694l21618l70114l31097j79758k16618k27954m20329k86591
$$ 9158360 8862375 8373681 8052063 7681949 7350852 7171094 6954476 6726522 6306193 6019602
4146F019602n1695l53324j77466j76823j89030j41779j48359j44689j27433j47319
$$ 6019602 5967907 5614583 5437117 5260294 5071264 4929485 4781126 4636437 4509004 4361685
4136D361685k57669k14320k1415N933j39004l8277k6663j15287J17599j66721
$$ 4361685 4104016 3889696 3868281 3874214 3735210 3696933 3670270 3554983 3672582 3505861
4126C505861j98917k1066K0121M6823O8116j68053k29079r4761R5745j3919j95106
$$ 3505861 3306944 3285878 3305999 3352822 3420938 3252885 3023806 2929045 3024790 3010871 2815765
4115B815765J30170J27107p6760R9075N7047M816l1032k94265j29245J04163N4818
$$ 2815765 2945935 3073042 2996282 3095357 3152404 3157220 3126188 2831923 2702678 2806841 2861659
4104B861659J72222K6469j96550L790o1835j1232r3081J8036r4760j42089K3621
$$ 2861659 3033881 3060350 2863800 2867590 2805755 2794523 2701442 2719478 2624718 2482629 2506250
4093B506250J51796m3991L9740O7894o0432l336k779Q2820m7689j61965k1100
$$ 2506250 2658046 2614055 2653795 2721689 2661257 2657921 2655142 2737962 2690273 2528308 2507208
4082B507208Q1116J4683n423N8207j38366J6388L148j32945N5954k9988N0278
$$ 2507208 2588324 2603007 2597584 2655791 2517425 2533813 2536961 2404016 2459970 2429982 2480260
4071B480260K7360p4343L075M542m8653j5792N8912m41p4586P1156L2626l1172
$$ 2480260 2507620 2433277 2436352 2440894 2392241 2376449 2435361 2434920 2360334 2431490 2464116 2432944
4059B432944l4518k4575j54333J4378J38386K4285j2622N3801p4733j7995q6436
$$ 2432944 2398426 2373851 2219518 2233896 2372282 2396567 2383945 2437746 2363013 2345018 2258582
4048B258582o4027J14169O3043j46052O732L6531J2510K0650n3819j75050r7996
$$ 2258582 2194555 2308724 2371767 2225715 2232447 2268978 2281488 2302138 2248319 2073269 1975273
4037A975273m2351k532P7931L8524r091N4901l8617j33456J17484J30268J43784
$$ 1975273 1932922 1930390 2008321 2046845 2037754 2092655 2054038 1920582 2038066 2168334 2312118
4026B312118n7449k00347M2636n2058o5466J46758M0703l2431L9138L3203q483
$$ 2312118 2254669 2054322 2096958 2044900 1979434 2126192 2166895 2134464 2173602 2206805 2198322
4015B198322J17470k5992M557O0267J08336O6015J02320k8905n6995O4851J63786
$$ 2198322 2315792 2289800 2294357 2354624 2462960 2528975 2631295 2602390 2545395 2610246 2774032
4004B774032N3354K75214K50297J83890J66234L26717K46506J84019l1918n9730
$$ 2774032 2827386 3102600 3352897 3536787 3703021 4029738 4276244 4460263 4428345 4368615
3994D368615j02723k89316l4387k14186j54742j76323j03973O7298j79994o4454
$$ 4368615 4265892 3976576 3942189 3728003 3573261 3396938 3292965 3360263 3180269 3115815
3984C115815m1770N8718k9552J7545m4988m5639K4373j2830J68884J22165R090
$$ 3115815 3074045 3132763 3103211 3120756 3075768 3030129 3054502 3041672 3210556 3332721 3341811
3973C341811N0113O5013M3417R9936L13053K69717M47026P65738Q78149Q19856
$$ 3341811 3391924 3456937 3500354 3600290 3913343 4183060 4630086 5395824 6273973 7093829
3963G093829N08806j73435m49562o18535p70071m22583l81898k84624k29738j79150
$$ 7093829 7602635 7429200 6979638 6361103 5591032 5168449 4786551 4501927 4272189 4093039
3953D093039o8707j48636o1434M3434j29776M7331L1519O543R8789K14783j68736
$$ 4093039 4024332 3875696 3814262 3857696 3727920 3775251 3806770 3813313 3912102 4126885 3958149
3942C958149J25161K43250J65446J16404Q6443J46877M19977P08252P67910J141974
$$ 3958149 4083310 4326560 4492006 4608410 4694853 4841730 5261707 5969959 6737869 7879843
3932G879843O95780j43890l51094n01017n31524m80135m67716l07472p7646k59557
$$ 7879843 8575623 8431733 8080639 7579622 7048098 6567963 6100247 5792775 5715129 5455572
3922E455572k02073J19352K35995P4751Q3330p0198R809K35366J10886O0957L81445
$$ 5455572 5253499 5372851 5608846 5683597 5766927 5696729 5706538 5941904 6052790 6113747 6495192
3911F495192K13828Q0245J05411L7394J70296K24777K01478n1157J32963J92716
$$ 6495192 6709020 6789265 6894676 6932070 7102366 7327143 7528621 7477464 7610427 7803143
3901G803143Q9080J94261J94098J03415K80016L04677J58961R5344K72881L84798
$$ 7803143 7892223 8086484 8280582 8383997 8664013 8968690 9127651 9222995 9495876 9880674
3891I880674K11588K06978K99108K31997K18566L11402L32551R1273K13504L22805
$$ 9880674 10092262 10299240 10598348 10830345 11048911 11360313 11692864 11784137 11997641 12320446
3881A2320446K20524K93382K62248L22690L09487K27820J97179J95852K69463
$$ 12320446 12540970 12834352 13096600 13419290 13728777 13956597 14153776 14349628 14619091
3872A4619091L02203K79173K98360N8249J33914J89869L50799J79647J15638M02974
$$ 14619091 14921294 15200467 15498827 15557076 15690990 15880859 16231658 16411305 16526943 16929917
3862A6929917L67241M09861L29720M07533L17828K45285N25219M77733N69128
$$ 16929917 17297158 17707019 18036739 18444272 18762100 19007385 19532604 20010337 20579465
3853B0579465O47144M70464O66402P27278P91223Q16206J022218J126029R82454
$$ 20579465 21226609 21697073 22363475 23090753 23881976 24698182 25720400 26846429 27828883
3844B7828883J075759J137435J221429J307634J387254J400205J330608J640788
$$ 27828883 28904642 30042077 31263506 32571140 33958394 35358599 36689207 38329995
3836C8329995J639482J740134J537977J610014J754076J687521J554582J783399
$$ 38329995 39969477 41709611 43247588 44857602 46611678 48299199 49853781 51637180
3828E1637180J539820J674467J889601J696781J672197J547813J696097J506973
$$ 51637180 53177000 54851467 56741068 58437849 60110046 61657859 63353956 64860929
3820F4860929J453122J460180J241270J128775J071847P58892O67935O87077M68170
$$ 64860929 66314051 67774231 69015501 70144276 71216123 71975015 72642950 73330027 73798197
3811G3798197L54436L65364K87804K59414J61410J77299K46426j19101k41145
$$ 73798197 74152633 74517997 74805801 75065215 75226625 75403924 75650350 75531249 75290104
3802G5290104r1253j65797j91526n64157m42862k87007n88149l87171l90462j96803
$$ 75290104 75198851 75033054 74841528 74277371 73834509 73547502 72959353 72572182 72181720 71984917
3792G1984917O8692Q5183N13729O21077R65018J325883J602265J789040K027472
$$ 71984917 72053609 72138792 72652521 73273598 74238616 75564499 77166764 78955804 80983276
3783H0983276J907500K063074J793527J498195J144763O55983J59124k15568m96533
$$ 80983276 82890776 84953850 86747377 88245572 89390335 90046318 90205442 89989874 89493341
3774H9493341r16432p57281j037187j023512j091271j260982j261015j466010
$$ 89493341 88576909 87819628 86782441 85758929 84667658 83406676 82145661 80679651
3766H0679651j811332k082796k272269k873318l256854l445969l724382l669477
$$ 80679651 78868319 76785523 74513254 71639936 68383082 64937113 61212731 57543254
3758E7543254l748211l692294l450136l048917k979193k669882k262698k151017
$$ 57543254 53795043 50102749 46652613 43603696 40624503 37954621 35691923 33540906
3750C3540906j866802j715897j599982j384398j159286j161203r42644q20926
$$ 33540906 31674104 29958207 28358225 26973827 25814541 24653338 23710694 22889768
3742B2889768q40767p76692q41662p68761o41234o54518q20766n97949o31365
$$ 22889768 22049001 21272309 20430647 19661886 19020652 18366134 17545368 16947419 16316054
3733A6316054n53122m73408n15980m24928m14915n06192m12564m60275m62140
$$ 16316054 15762932 15289524 14773544 14348616 13933701 13427509 13014945 12554670 12092530
3724A2092530m04493m03117m68253k33125l86152m96972k21197j77425k31501
$$ 12092530 11688037 11284920 10816667 10583542 10197390 9700418 9479221 9301796 9070295
3715I070295l67694j80787k59025j58155j47109j85599j88634k32813m2316j80828
$$ 9070295 8702601 8521814 8262789 8104634 7957525 7771926 7583292 7350479 7308163 7127335
3705G127335k94973k60409j23221j52240k7288j15353k06509j16336k66837q1010
$$ 7127335 6832362 6571953 6448732 6296492 6269204 6153851 5947342 5831006 5564169 5483159
3695E483159J2463m1189k21462j32635k9175o7789j89545L0309j82080j69926
$$ 5483159 5495622 5454433 5232971 5100336 5071161 5003372 4813827 4844136 4662056 4492130
3685D492130q2274Q734j39318j53717k0198j42325L6604j27909j07397j20097
$$ 4492130 4409856 4418590 4279272 4125555 4105357 3963032 3999636 3871727 3764330 3644233
3675C644233j10441K078j69678j8729l2591q1303L751p4743n9517j40033j11770
$$ 3644233 3533792 3535870 3366192 3347463 3314872 3233569 3237320 3162577 3103060 2963027 2851257
3664B851257K8044O4014j413j08178j93659q2411K5408m3951n8071j50574J04336
$$ 2851257 2879301 2943315 2941902 2833724 2640065 2557654 2583062 2539111 2481040 2330466 2434802
3653B434802l6722j62706j56953q9684L1435P8597J11451m1930j30435j45691
$$ 2434802 2398080 2235374 2078421 1988737 2020172 2098769 2210220 2168290 2037855 1892164
3643A892164k7872L0213k2888j7883l1664J01116q193k73561j02379J06666M2488
$$ 1892164 1864292 1894505 1871617 1853734 1822070 1923186 1914993 1641432 1539053 1645719 1688207
3632A688207r5108P7773n5118k05715O9276J49830j35341m4363J11233j13010
$$ 1688207 1593099 1670872 1615754 1410039 1479315 1629145 1493804 1449441 1560674 1447664
3622A447664k17991M4870K4990J87354j841q3515M2636j69812j9879M4078k1661
$$ 1447664 1229673 1274543 1299533 1486887 1485046 1401531 1444167 1274355 1254476 1298554 1276893
3611A276893O1221j0084N8324j06183j25380m0407q9475k7523J18937L5841M7378
$$ 1276893 1338114 1328030 1386354 1280171 1154791 1114384 1024909 997386 1116323 1152164 1199542
3600A199542k9106n0825K0077L2218m4639m146O6949r0352j9364l2596N7287r5835
$$ 1199542 1170436 1119611 1139688 1171906 1127267 1123121 1190070 1099718 1080354 1047758 1105045 1009210
3588A009210j3520J57123k7368j47076J3544J07933R5757P2043K506n4172o8851
$$ 1009210 995690 1152813 1125445 978369 991913 1099846 1195603 1267646 1270152 1215980 1147129
3577A147129M3182P9101J41843O2638N1551K4839q8889M7163j05556K7709K3585
$$ 1147129 1190311 1269412 1411255 1473893 1525444 1550283 1461394 1508557 1403001 1430710 1454295
3566A454295J9936j8513k4814j19814J16577J9068q5424j2966J3491l8235j674
$$ 1454295 1474231 1455718 1430904 1311090 1427667 1446735 1361311 1348345 1361836 1323601 1321927
3555A321927j07280N046l4230j18351k2829K6775J30467j58887p3764L4814R5312
$$ 1321927 1214647 1219693 1185463 1067112 1044283 1071058 1201525 1042638 968874 1003688 1099000
3544A099000q0037J3527L7622p073l3204q3397j0044k5578o936N0901m5650K00580
$$ 1099000 1018963 1032490 1070112 1063039 1029835 946438 936394 910816 903880 954781 909131 1109711
3532A109711J047n8988N9643R0329r3173J39371o6019k9880k9906m5480l534M1823
$$ 1109711 1110758 1051770 1111413 1201742 1108569 1247940 1181921 1152041 1122135 1076655 1073121 1114944
3520A114944k8201o0296P6387Q8426J4037k0077P1405j60484N0079p3782n2804
$$ 1114944 1086743 1026447 1102834 1191260 1205297 1185220 1256625 1096141 1146220 1072438 1019634
3509A019634P736K579Q793j55732n4580R4380L7942Q1254l3799m9913J15862K45811
$$ 1019634 1027370 1029949 1038742 883010 828430 922810 960752 1042006 1008207 958294 1074156 1319967
3497A319967l0806Q0687Q6026j17438m9120n0125J06845J35590n9396k9161J91895
$$ 1319967 1289161 1369848 1455874 1338436 1289316 1239191 1346036 1481626 1422230 1393069 1584964
3486A584964O1313L8307N6890n0059k6756r355R5833j08644J08298J77012J52274
$$ 1584964 1646277 1684584 1741474 1691415 1664659 1655304 1751137 1642493 1750791 1927803 2080077
3475B080077q46k8814K89815m7989n1470L2791L4205n6314o5758j22950j12807
$$ 2080077 2079231 2050417 2340232 2292243 2240773 2273564 2307769 2251455 2185697 2062747 1949940
3464A949940j99804j60199j50561m6063l9153j30602o8330o6907n5060m033N5643
$$ 1949940 1750136 1589937 1439376 1393313 1354160 1223558 1155228 1088321 1033261 1029228 1084871
3453A084871m7737n5723k9031m7307n9865r3851P6267O1303j26485k01174q3001
$$ 1084871 1037134 981411 952380 905073 845208 751357 827624 888927 762442 561268 478267
3442D78267O1817m9418J19383M096K208o963J2962p3603n2983R1432j18235k1599
$$ 478267 540084 490666 610049 614145 616353 609390 622352 548749 495766 587198 468963 447364
3430D47364M9828j18753m0869P1981O3526j05626K9451o72M6703J34791N186J3832
$$ 447364 497192 378439 337570 409551 473077 367451 396902 396230 442933 577724 582910 596742
3418E96742m9117q8584M4309K9558j5314o142l9718J5108J5669p3071r0180k589
$$ 596742 547625 459041 503350 532908 517594 511452 471734 486842 502511 429440 339260 336671
3406C36671k5686j15222P0518K1662l0944O1179J1360l1544O2574K9854j3741
$$ 336671 310985 195763 266281 287943 256999 318178 329538 297994 360568 390422 376681
3395C76681j1176N8969q5950M8334J23074n0867M8228M3178k3649l430k7391q1642
$$ 376681 365505 424474 338524 386858 509932 459065 507293 550471 526822 523392 496001 414359
3383D14359M0968j5098J06545N7404l7488N2105j45548k7557J71819p952k0324
$$ 414359 455327 440229 546774 604178 566690 618795 473247 445690 617509 609557 589233
3372E89233L2098r5939J0869N9607J19607N6238L5635K50305J18502J63511K56259
$$ 589233 621331 525392 536261 595868 715475 771713 807348 1057653 1176155 1339666 1595925
3361A595925K64324L19256O0242j21666k74956k27952j51599j55377k20020j88466
$$ 1595925 1860249 2179505 2239747 2118081 1843125 1615173 1463574 1308197 1088177 899711
3351H99711J32765J33004l1236p5468M6192k361q4207j22030k9916j63340L1292
$$ 899711 1032476 1165480 1134244 1058776 1104968 1102607 1018400 896370 866454 703114 734406
3340G34406P8502P508j1489R1477J8610J26599J24785J11514M09081L42851N13862
$$ 734406 812908 820416 808927 900404 919014 1045613 1170398 1281912 1690993 2033844 2547706
3329B547706P49365L30464o8793k75402l53513o06132l36576k52353k20286j97731
$$ 2547706 3297071 3627535 3558742 3283340 2929827 2323695 1987119 1734766 1514480 1316749
3319A316749k0390q8586j63943j9711m0522j20772j36662J36923j32696N9169
$$ 1316749 1296359 1207773 1043830 1024119 983597 862825 726163 863086 730390 789559
3309G89559j65300O7241L584n8420N1436J33658Q4324m6421J3213K66545L51743
$$ 789559 624259 691500 695084 636664 688100 821758 906082 859661 872874 1139419 1491162
3298A491162J20826K72812J00219o3436k01511n6420k79380k60773k66712o9110
$$ 1491162 1611988 1884800 1985019 1921583 1720072 1663652 1384272 1123499 856787 787677
3288G87677o4387j78993p6424L1121J9731j17669N3855Q3750R1132m4029j37689
$$ 787677 723290 544297 467873 498994 518725 401056 454911 538661 629793 585764 448075
3277D48075o3427l2000j00994l5406Q3683J18041N4850m0674k19061r2784M8234
$$ 448075 384648 352648 251654 216248 299931 417972 472822 432148 213087 120303 168537
3266A68537j5896O7832M3977P1933l1401j01451J0772K4186p645Q59L74m2105
$$ 168537 152641 220473 264450 336383 304982 203531 214303 238489 230844 231703 232077 189972
3254A89972P0934M6121j8105p0483r799Q3519J4320k0945r2240J06631K6501k8818
$$ 189972 260906 307027 288922 218439 208640 292159 306479 285534 193294 299925 326426 297608
3242B97608N6981j65576P8485K5501P6994o8478M023J11591j37848l7939n7199
$$ 297608 354589 189013 267498 292999 369993 301515 305538 417129 279281 241342 184143
3231A84143J27564m522j08081P5057J92416P2006q9429l0512j59998j4060P0791
$$ 184143 311707 307185 199104 274161 466577 538583 449154 418642 258644 244584 315375
3220C15375j00999J8474N2183J42608p5208p5382j9821J20567k2215j33699J06792
$$ 315375 214376 232850 285033 427641 352433 277051 257230 377797 355582 221883 328675
3209C28675m5301M1992q3055J28070J03103m2026o1220L8777r2437p1756k8471
$$ 328675 283374 325366 242311 370381 473484 431458 370238 409015 316578 244822 216351
3198B16351J19975P0063M9982O9014K1108j13800P8612j15230J17428k523j54401
$$ 216351 336326 406389 456371 525385 546493 432693 511305 396075 513503 510980 356579
3187C56579m6528r4733J43148k7723K9312k2192j95799J1877J39976N0388P0537
$$ 356579 310051 215318 358466 330743 360055 337863 142064 153941 293917 344305 414842
3176D14842O8051j17845l1605l1683J18152k4461j32061J10569L343J29743Q758
$$ 414842 482893 365048 333443 301760 419912 395451 263390 373959 377302 507045 515803
3165E15803o7395k483J8639j7392K3728q1546P6015J07392l326p4138q5849J02564
$$ 515803 448408 445925 464564 447172 470900 389354 465369 572761 569435 495297 409448 512012
3153E12012j00170n1905P6137o4674J80814O5152J7387r3266p4704N0690j2895
$$ 512012 411842 359937 436074 371400 552214 617366 634753 541487 466783 517473 504578
3142E04578j24080P091Q507j12503r4147J43781M4070J09947o4281N2853J15472
$$ 504578 380498 387589 396096 283593 189446 333227 377297 487244 422963 475816 591288
3131E91288m1177j11416Q53r9837M2330l9627r4632J39376o7281r0713J56524
$$ 591288 550111 438695 439548 339711 382041 342414 247782 387158 319877 229164 385688
3120C85688j839L1851j30147J17922K3135k6948K137j4872j5441j31978J72406
$$ 385688 383849 415700 285553 403475 426610 399662 401799 386927 371486 239508 411914
3109D11914Q5149n7041j32213N7896p4999R0078n1289J07262j5259o034L14K3979
$$ 411914 497063 440022 307809 365705 290706 380784 329495 436757 421498 415464 415778 439757
3097D39757r2706p1551P8134n8764Q0243l5336r4406J24325R1616q6143n9365
$$ 439757 347051 275500 353634 294870 375113 339777 245371 369696 461312 375169 315804
3086C15804J6323J6858l0101j60961P1383K880k4125M0843j8507j5060j6738N0165
$$ 315804 332127 348985 318884 157923 229306 232186 208061 248904 230397 215337 198599 248764
3074B48764l7369l2812n8208o8884J16984J80450j03336n6144p3470Q5661o2390
$$ 248764 211395 178583 120375 51491 168475 348925 245589 189445 115975 201636 139246
3063A39246j00743J5800J10046O6974n5337m4217K5947j37764m3654L1654o830
$$ 139246 38503 54303 164349 231323 175986 131769 157716 19952 -23702 7952 1122
3052A122J07687K1229q6087n5258J20099l6926m6409K4220l3999J2827o706j00359
$$ 1122 108809 130038 43951 -11307 108792 71866 25457 49677 15678 28505 21799 -78560
3040g8560N4309O2742J07315J58628o8397j95606J04866p0562l8684j3361P1066
$$ -78560 -24251 38491 145806 304434 236037 40431 145297 74735 36051 22690 93756
3029I3756Q2517O4870j12414J2509M6873k1595M9940o7003l501r1685M151J46412
$$ 93756 176273 241143 128729 141238 188111 166516 216456 149453 145952 54267 58418 204830
3017B04830j0714j33784j2508Q4269j65N4017J2911l5454q7742j09292j03504
$$ 204830 194116 60332 47824 132093 131928 185945 198856 163402 75660 -33632 -137136
3006a37136Q5780Q0265r3078J7626J09804l0092m8465M7235O6335K1334q4303
$$ -137136 -51356 28909 -64169 -46543 63261 33169 -15296 31939 98274 119608 35305
2995C5305N8575P2775j47481j26573p8101J02434N5923O1546J05098J3269q0033
$$ 35305 93880 166655 19174 -107399 -185500 -83066 -27143 34403 139501 152770 72737
2984G2737J4466M0562r0717l4947J9163J34132m5521j12013n0654K00185l2463
$$ 72737 87203 127765 37048 2101 21264 155396 109875 -2138 -52792 147393 114930
2973A14930o2561q1979J19819J32286j31131m199k9781j32105j70977K00888J00581
$$ 114930 52369 -29610 90209 222495 91364 87165 57384 -74721 -245698 -44810 55771
2962E5771P1230k1939N9091k2830j65213J63033k5310L8819j31326k9189J13239
$$ 55771 127001 105062 164153 141323 -23890 139143 113833 152652 21326 -7863 105376
2951A05376L697o0625o9455L0663J08310j45005k723N7747l4643Q4576K0069n1131
$$ 105376 109073 48448 -21007 9656 117966 -27039 -29762 27985 -6658 77918 97987 46856
2939D6856j2084j07780k5796j38914J7588N0172j27018J11964J50359J24427N7278
$$ 46856 34772 -73008 -98804 -237718 -220130 -169958 -296976 -185012 -34653 89774 147052
2928A47052j70825o7104N4709L4473P3430J12503p5724p2184j1962M3746m5658
$$ 147052 -23773 -90877 -36168 -1695 71735 184238 108514 36330 24368 68114 22456
2917B2456n8154J73910q0009K1995o5040L2244M0687j52714J2033J27968K4845
$$ 22456 -35698 138212 58203 80198 15158 47402 88089 -64625 -52592 75376 100221
2906A00221R376m0133r7133l6651O0720k3005N8961q0264L3872J44753q8241l2574
$$ 100221 109597 69464 -27669 -64320 -3600 -26605 32356 -47908 -14036 130717 42476 9902
2894I902k3728N9474Q3191q7011j83338p7834L2519L8650J12027L4562R7964n6179
$$ 9902 -13826 45648 128839 41828 -141510 -219344 -186825 -148175 -36148 -1586 96378 40199
2882D0199n8021k4295O0489Q0654j84965l0747J11919Q8274J7857L1401K828j26489
$$ 40199 -17822 -42117 18372 99026 -85939 -116686 -4767 83507 101364 132765 135593 9104
2870I104n1448N0955Q351l5037L2050L3170l2682j19741J87427J07682j07675
$$ 9104 -42344 8611 16962 -18075 13975 47145 14463 -105278 82149 189831 82156
2859H2156N6253p988r131j76806M0215N3761M2410j3536j4240j24377l1650L4495
$$ 82156 138409 130421 121290 -55516 -15301 38460 80870 67334 53094 -71283 -102933 -68438
2847f8438N016L0102J21115K0354j39107Q9994K6386J0801r6707J9816J19268
$$ -68438 -63422 -33320 87795 108149 -30958 59036 85422 96223 -484 19332 138600
2836A38600M6683j23955o5004J73000p6537j18428R537J20161n3463m5077P7542
$$ 138600 185283 61328 -3676 169324 92787 -25641 -16104 104057 50594 5517 83059
2825H3059r508K19286l3971j09705j12391j03837J25796K1639n4548O772q9291
$$ 83059 73551 292837 258866 149161 36770 -67067 58729 80368 25820 32592 -56699
2814e6699M4812J12727l863J31176r5882m8436p2624J69456l8507k27959J48026
$$ -56699 -11887 100840 96977 228153 132271 83835 11211 180667 142160 -85799 62227
2803F2227J29554j27615J7791J45291M096n4348p2133j14990J7100Q7663R0305
$$ 62227 191781 64166 81957 227248 231344 176996 104863 -10127 6973 94636 184941
2792A84941r2711k1346J5005o3244J69107o2538P171o5032j0091L7676K4406j61885
$$ 184941 92230 70884 85889 22645 191752 129214 136385 71353 61262 98938 123344 -38541
2780c8541j06907Q1986J52707m7378K7609l9084J4870n9334Q2736Q9963n3550
$$ -38541 -145448 -63462 89245 41867 69476 30392 45262 -14072 68664 158627 105077
2769A05077r8104R3595J7570K9378K9367l4247O3479q2622n5659l699R0874n5892
$$ 105077 6973 100568 118138 147516 176883 142636 206115 123493 67834 64135 155009 99117
2757I9117O0257k4649K2939K6105q0313o3859M1099M399o4219M1521J03122j134
$$ 99117 159374 134725 157664 183769 103456 39597 80696 85095 20876 62397 165519 164385
2745A64385j51254n0381N6608N4742l5595j33495N0373P0168m5224J4926K8229
$$ 164385 13131 -37250 19358 74100 38505 -94990 -44617 25551 -19673 -4747 23482
2734B3482L2421J06820q7834j8013J992q494k26228J18144J86870k7494N529m7568
$$ 23482 55903 162723 74889 56876 58868 50374 -175854 -57710 129160 101666 107195 59627
2722E9627r2702j55894O6645Q2448M9427n521J070Q6548L6622q6051M3803R7107
$$ 59627 -33075 -188969 -122324 -39876 9551 4030 5100 91648 128270 42219 86022 183129
2710A83129j68159L9877M1030N0490k2200J8938P6042j68376R6075O7986m2312
$$ 183129 14970 54847 95877 146367 124167 143105 219147 50771 146846 214832 172520
2699A72520q7209K009P7462j4553J56321L4543k01892k9922l2754J5887O2113
$$ 172520 85311 87320 164782 150229 306550 341093 139201 109279 76525 92412 154525
2688A54525K596Q9100K9312j09564l9751R6989R2921j31146k4495L8478R6171
$$ 154525 157121 246221 275533 165969 126218 223207 316128 184982 160487 198965 295136
2677B95136j25890J9125k4418R0090J1146r3844P466n8673Q3185o3985J01376
$$ 295136 169246 188371 163953 254043 265189 171345 178811 120138 203323 139338 240714
2666B40714L3957k10918n9621j9126M0350l6625K8667Q9608R850q7364k1892k8334
$$ 240714 274671 63753 4132 -14994 25356 -11269 17398 107006 116856 29492 7600 -20734
2654b0734l0982K2248l5142k8007l2736J26287J9749L3275n4605p7995k7726O0245
$$ -20734 -51716 -29468 -64610 -92617 -125353 934 20683 53958 -647 -78642 -106368 -46123
2642d6123M3389Q8435l7973J25554j10059n3775J55518j0997r848M7877r5262
$$ -46123 -2734 85701 47728 173282 63223 9448 164966 153969 144121 191998 96736
2631I6736q1620j2595N6739J72298P2987l2217K2548q5095J0438M0706n4571l4809
$$ 96736 15116 2521 59260 231558 304545 272328 294876 209781 220219 260925 206354 171545
2619A71545P3179l833R964J35972J87293j5444K16393J47016k2839J87002K4430
$$ 171545 244724 240891 250855 386827 574120 558676 775069 922085 899246 1086248 1110678
2608A110678k9992j45751n6246j92548q5495O8745j22102j31020l9198j83485
$$ 1110678 1080686 934935 878689 686141 600646 669391 547289 416269 377071 193586
2598A93586Q0164P6942P177j38721j47303J89589J22102l5510j69336j60898Q2976
$$ 193586 273750 350692 357869 219148 71845 261434 383536 348026 178690 17792 100768
2587A00768J09934q954p6931Q444M6527Q3452j8322K9532j27714j20522R7947
$$ 100768 210702 201748 124817 133261 179788 263240 244918 274450 146736 26214 124161
2576A24161J7524M8018J1597L5138o2333N1157J0807p8110K4338M8663O5878R4711
$$ 124161 141685 189703 201300 236438 174105 225262 236069 157959 182297 230960 296838 391549
2564C91549j16676n4989L1100p1240p7777J43379N5818n443Q4413m4403l2021
$$ 391549 274873 219884 250984 179744 101967 245346 301164 295721 380134 335731 303710
2553C03710n041j42751m1632Q8863Q3330J16149Q2194l4449j50591J1601l0198
$$ 303710 298669 155918 114286 203149 286479 402628 484822 450373 299782 311383 281185
2542B81185Q7275n3037j43712p7720k2686J1012Q9237j29959p1568J10197o8622
$$ 281185 368460 315423 171711 93991 71305 82317 171554 41595 -29973 80224 11602
2531A1602L3448J97866Q8424R5381m3030j59766j8546M1013o9912R7567o7512
$$ 11602 45050 242916 331340 426721 383691 223925 205379 246392 176480 274047 206535
2520B06535J33501N7779j34053Q2409M0722p9408L9112j882N8384O5577n681l6600
$$ 206535 340036 397815 263762 346171 386893 307485 346597 344715 403099 468676 462995 426395
2508D26395j0923J4325R2982p6987q6458P0049J8542j06190j07801J27856j45192
$$ 426395 415472 429797 522779 445792 359334 429383 447925 341735 233934 361790 216598
2497B16598r537J35055l4855J0968k8679L3690R9863Q7636k1403o9506J33554
$$ 216598 207061 342116 307261 318229 289550 323240 423103 510739 489336 419830 553384
2486E53384J35345n9995j08073O0042R8253L210L2489n9656m607l5417q3001p323
$$ 553384 688729 628734 520661 580703 678956 682166 714655 654999 650392 614975 531974 524651
2474E24651j08192J06722n1741M0112L224j07973J49238j05914r6742J19067R210
$$ 524651 416459 523181 471440 511552 514776 406803 556041 450127 353385 472452 481662
2463D81662k0115k7135J21432P0248k6488j42108M7409Q8268m8116J3108J49232
$$ 481662 461547 434412 555844 626092 599604 457496 504905 593173 545057 558165 707397
2452G07397m8799j20015J81017O6060j29605J18816n7289p6991j55143O6827R1989
$$ 707397 658598 538583 719600 785660 656055 774871 717582 640591 485448 552275 644264
2441F44264R3003J267M8110J49296j069j54364j6543l6163n9239K02692J08808
$$ 644264 737267 738534 786644 935940 934871 780507 763964 727801 668562 871254 980062
2430I80062j22N3517J38260K7512o0954J15020P0442M6544r5094J27451l7755
$$ 980062 979940 1033457 1171717 1199229 1138275 1253295 1323737 1370281 1275187 1402638 1364883
2419A364883j0410J80909n0561q5903L8482M907r107J02315L4273L9871L8325
$$ 1364883 1354473 1535382 1484821 1398918 1437400 1442307 1433200 1535515 1569788 1609659 1647984
2408A647984Q5191J08792P5735l7701N1144q0542p6511J34112M7460P0178J86240
$$ 1647984 1733175 1841967 1917702 1880001 1931145 1850603 1774092 1908204 1955664 2025842 2212082
2397B212082j733M8407N5582J05766K46996O3284j7114K9648J19148J84702J64508
$$ 2212082 2210349 2258756 2314338 2420104 2667100 2730384 2713270 2742918 2862066 3046768 3211276
2386C211276Q1274O8536l5855j1142J17028P6840K19874L16585J50139K00006
$$ 3211276 3292550 3361086 3325231 3314089 3431117 3507957 3727831 4044416 4194555 4394561
2376D394561J68558K95506J70358L85318N13618M15490L38249N00599N64242N79099
$$ 4394561 4563119 4858625 5028983 5414301 5927919 6343409 6681658 7182257 7746499 8325598
2366H325598O79372O91426Q73799J197082J515783J669240J883788J916787J432270
$$ 8325598 9004970 9696396 10570195 11767277 13283060 14952300 16836088 18752875 20185145
2357B0185145J136580J248231J197220J777490K236627K983266M012811N893784
$$ 20185145 21321725 22569956 23767176 25544666 27781293 30764559 34777370 40671154
2349D0671154Q347022J2468115J9070949K8836068L8157676L9741298J3665506
$$ 40671154 49018176 61486291 80557240 109393308 147550984 187292282 200957788
2342B00957788j2226165k1053880k4798493k5603108k3939514j8678825j4704556
$$ 200957788 188731623 167677743 142879250 117276142 93336628 74657803 59953247
2335E9953247j1723652r287527o179014m299860l338240k304006j149604j593484
$$ 59953247 48229595 38942068 32763054 28463194 25124954 22820948 21671344 20077860
2327B0077860j958553j974809j752104j668321j188068r79636r14414q23348n47473
$$ 20077860 18119307 16144498 14392394 12724073 11536005 10556369 9641955 8818607 8271134
2318H271134o03928l99313l22165k48554k40203r8639j96075j18348k42918l51490
$$ 8271134 7667206 7267893 6945728 6697174 6456971 6358332 6162257 6043909 5800991 5449501
2308E449501j30451l41061k36018j34439k11915j45495k52023j69640k16281k29790
$$ 5449501 5319050 4977989 4741971 4607532 4395617 4250122 3998099 3828459 3612178 3382388
2298C382388j19720N3836j77004j27563j52462k7696k13475m5253n741p958o8147
$$ 3382388 3262668 3316504 3139500 3011937 2859475 2831779 2618304 2573051 2567310 2559352 2491205
2287B491205q8535R1695m9112j06969p3540r3542k44001l6967L0136j29201q3106
$$ 2491205 2402670 2494365 2445253 2338284 2264744 2171202 1927201 1890234 1920370 1791169 1708063
2276A708063q1083j09974J7826O5930p3673M7237n8373q3664l516m2032Q658j8243
$$ 1708063 1626980 1517006 1534832 1600762 1527089 1574326 1515953 1432289 1428773 1386741 1395399 1377156
2264A377156j11961p1638l3113P8598j15861j9033o8083K7190N9501K8062L6971
$$ 1377156 1265195 1193557 1160444 1239042 1123181 1104148 1036065 1063255 1122756 1150818 1187789
2253A187789m0037J26904k19276o6183J00697o3847m9121j6692j1928L5144j67319
$$ 1187789 1147752 1274656 1055380 989197 1089894 1026047 976926 960234 948306 983450 816131
2242H16131r2823R7362j59517k0164q2937J0641R6937Q6344R041q6758n9934M3047
$$ 816131 723308 820670 661153 640989 558052 568693 665630 751974 761015 674257 614323 657370
2230F57370J57091O3331j42094j29906M9826o0858j5301p1284J0620o2882o2412
$$ 657370 814461 877792 735698 605792 655618 594760 579459 508175 518795 455913 393501
2219C93501j740N9079l7948r6881N4122J5407k06622J53759J59851L081o1673
$$ 393501 391761 450840 412892 316011 370133 385540 178918 332677 492528 495609 433936
2208D33936j58416j31807o6387L3800N7925j2733N156o8205k5952n5374j35481
$$ 433936 275520 143713 77326 111126 169051 156318 161474 93269 67317 11943 -123538
2197a23538j5509J58943j3372K3328K28297J37031r9431l8439M0620m2929l6146
$$ -123538 -139047 19896 6524 29852 258149 395180 295749 257310 297930 255001 218855
2186B18855N5335j97352j04555J23432n2542o1421N2835O2285j04112N4519R0132
$$ 218855 274190 76838 -27717 95715 43173 -18248 34587 96872 -7240 47279 137411
2175A37411o8506J26532Q9731k12716p5117R4206q9205q1695n7370Q5574M8610
$$ 137411 68905 195437 285168 72452 -2665 91541 2336 -79359 -136729 -51155 -2545
2164b545R6781r320l1708M9429q0912r076J22070j5752o0233L4702R666j3424
$$ -2545 94236 84916 53208 102637 21725 12649 134719 118967 58734 93436 103102 89678
2152H9678J70919m1286r8550N911J4816l6771k3103k7793n5157L0551q6005p3910
$$ 89678 260597 219311 120761 126672 141488 104717 81614 53821 -1336 29215 -56790 -130700
2140a30700N9679Q2766J07440j03321r6591K09573L8564m9429n4594l166L2156
$$ -130700 -71021 11745 119185 15864 -80727 128846 167410 117981 63387 60221 92377
2129I2377K7673l4600P1353k4890k01584l77J11622r9520n5285n5277J08938o97
$$ 92377 120050 85450 156803 131913 -69671 -70048 41574 -57946 -113231 -168508 -59570 -60267
2117f0267j2363M5169L9918j64954N2132J02815L809J19429M9508j06p7280L7436
$$ -60267 -72630 -27461 12457 -152497 -100365 2450 6259 125688 175196 175090 97810 135246
2105A35246k4400j06027o166J22491n8330J6207r5733K6368J22001J42789M93
$$ 135246 110846 4819 -1347 121144 62814 79021 -16712 9656 131657 274446 274939
2094B74939r26o6044j16705N5792O664k5443m8306p0368J1818K6161J888J05813
$$ 274939 274013 207969 91264 147056 153720 128277 79971 9603 21421 47582 49470 155283
2082A55283m5528k810J30294Q1573P6900J67312J15560J75330O9962K6296j07931
$$ 155283 109755 106945 237239 318812 395712 563024 678584 853914 923876 950172 842241
2071H42241j30937j36836j41062j73592l8907o0882K5152l7313k9654L0617M6626
$$ 842241 711304 574468 433406 259814 220907 160025 185177 147864 118210 148827 195453
2060A95453m1458k3327M539r548r1884m333o0198M1881p9383L4569K9202K7835
$$ 195453 153995 130668 135207 125659 33775 29442 -30756 11125 -68258 -33689 -4487 23348
2048B3348M1571K5370L8104j91191j7468N3690J26986J1189m9883p3510j3522
$$ 23348 64919 90289 128393 -62798 -80266 -26576 100410 111599 61716 -11794 -25316
2037b5316M6919j15661L76n2577Q5678M4770r573L8229j95990Q0234J17183L7915
$$ -25316 21603 -94058 -93682 -146259 -60581 -15811 -25384 12845 -183145 -102911 14272 52187
2025E2187p914J70013j49354k04975K5372K0895q7225r411J69980J9293m8218
$$ 52187 44273 214286 64932 -140043 -114671 -93776 -181001 -190412 -20432 -1139 -49357
2014d9357O3255j04061m8552p064Q9763j43604k30893L8477J54062P1756n8497
$$ -49357 13898 -90163 -138715 -145779 -56016 -199620 -430513 -392036 -237974 -166218 -224715
2003b24715L595Q0263J04810k8361q5111J6111l0152m1971J5792Q2477L4582q2833
$$ -224715 -221120 -140857 -36047 -64408 -149519 -133408 -163560 -205531 -189739 -107262 -72680 -155513
1991a55513n3942J20292r8476p6728K27243M3992k10292Q6432o4160q4928O5096
$$ -155513 -209455 -89163 -187639 -264367 -37124 6868 -203424 -116992 -181152 -266080 -200984
1980b00984M0204K90450k3573k06756j27136p66L7899j0634J17979L5544J9098
$$ -200984 -160780 129670 106097 -100659 -227795 -228561 -190662 -201296 -83317 -47773 -28675
1969b8675q7916K3119L2039N2188l752r2519P34L4637L2596j18382J08030N2258
$$ -28675 -116591 -93472 -61433 -9245 -12997 -105516 -104782 -70145 -37549 -155931 -47901 4357
1957D357J8337J9567R586l9707m0392J6730o716J42162j2987l2576j80437r963
$$ 4357 22694 42261 51847 12140 -28252 -11522 -18238 123924 110937 78361 -102076 -112039
1945a12039j937O2398L975k2823J3603o444J28043n3546o6056o4262n9825J1389
$$ -112039 -113976 -51578 -47603 -70426 -56823 -63267 64776 11230 -54826 -119088 -178913 -167524
1933a67524J2713Q4588K0014l8283Q9428k5315r1310j19624J91238Q0614j20206
$$ -167524 -154811 -70223 -50209 -88492 936 -24379 -115689 -235313 -44075 36539 -83667
1922h3667J08637O5075k8319N408k17110J58142j4730j45127K0584J06471j4022
$$ -83667 24970 90045 61726 67134 -149976 8166 -6564 -151691 -131107 -24636 -38658
1911c8658j15594m0010l629k142Q3175P0056n8716m386J29891q0251j5569n6692
$$ -38658 -154252 -194262 -197891 -200033 -116858 -46802 -105518 -109904 19987 -60264 -75833 -132525
1899a32525L4924r7872j33479K20822k9513k3495K0181N8339R0243k7753j76941
$$ -132525 -97601 -195473 -328952 -108130 -137643 -161138 -140957 -82618 7625 -20128 -197069
1888a97069J25974M8095l6669K4232N2609j1664l6564O921l4481J1967J54001
$$ -197069 -71095 -23000 -59669 -35437 17172 5508 -31056 -24135 -58616 -46649 107352
1877A07352J4478N2500J1181o0157n3389j03077K6826m2139m5228n08k2684r392
$$ 107352 121830 174330 185511 125354 71965 -31112 -4286 -46425 -91653 -92161 -114845 -124237
1865a24237k244O3517Q1489j00901j950K1567o001l2084n0165M579N5207K21013
$$ -124237 -126481 -62964 18525 -82376 -84326 -62759 -68760 -100844 -151009 -146430 -91223 129790
1853A29790q1709r7738j09429j525P1481O9258J11447m5619k8309j04155J39035
$$ 129790 48081 -49657 -159086 -160611 -89130 -19872 91575 45956 17647 -86508 52527
1842E2527p442m6806K1538m133n3941J2281k3016K9925J4709n2394K685r3369
$$ 52527 45085 -1721 19817 15684 -38257 -25976 -48992 -19067 -4358 -56752 -54067 -147436
1830a47436l8953j0078P5514k5518o3419Q9657M3646J2156J7208p009n4961K9922
$$ -147436 -186389 -196467 -120953 -146471 -209890 -120233 -76587 -64431 -47223 -54232 -109193 -79271
1818g9271P534N1813O9550l8027l2668j42780M1027K4070L3271n4633J07088j711
$$ -79271 -71737 -19924 49626 11599 -21069 -163849 -122822 -98752 -65481 -120114 -13026 -14737
1806a4737l2342L6002R1559j07155q5755K4410k0328N5573j1434j04501k0446
$$ -14737 -47079 -11077 80482 -26673 -112428 -88018 -108346 -52773 -64207 -168708 -189154
1795a89154J45129j18206P111N6863m332k7816M5220K6829K9758j25522J08075
$$ -189154 -44025 -162231 -155120 -98257 -102589 -130405 -85185 -58356 -28598 -154120 -46045
1784d6045n1528j5510l19j06094J62165o2179P4069r8311l9790q8058O7290K32029
$$ -46045 -97573 -113083 -113402 -219496 -57331 -119510 -45441 -143752 -183542 -271600 -204310 27719
1772B7719q8736K1823j4228r4640p8824N1671J41765Q5423N3440r6320j39312
$$ 27719 -61017 -39194 -53422 -148062 -226886 -175215 -33450 51973 105413 9093 -130219
1761a30219J3381m9942m2267R4814j7685L7541N0869o1701R6489N7810o0577j54014
$$ -130219 -116838 -166780 -209047 -114233 -131918 -94377 -43508 -105209 -8720 49090 -11487 -165501
1749a65501J53196J5068K0223j02548k13242J40507J1317O6996Q5924m1158M4070
$$ -165501 -12305 2763 22986 -79562 -292804 -152297 -140980 -73984 11940 -29218 14852
1738A4852O818r4511P7012p3787n6688N9958j13175k4354O7765R6194N0533j87120
$$ 14852 21670 -72841 4171 -69616 -126304 -66346 -179521 -203875 -136110 -39916 10617 -176503
1726a76503Q574O2667l5242K106j2831m8280N0614M5457n0163k3335M4919l3405
$$ -176503 -167929 -105262 -140504 -138398 -151229 -199509 -148895 -103438 -153601 -176936 -132017 -165422
1714a65422o407N1361N8292J21681j65127K2420R1564n4859o1192K0900J24842
$$ -165422 -171829 -120468 -62176 59505 -105622 -83202 8362 -46497 -107689 -86789 38053
1703C8053r0230l7473M0232M5646k0588r2464j45220P1545R5483j02319K3158
$$ 38053 -52177 -89650 -49418 -3772 -24360 -116824 -262044 -190499 -95016 -197335 -174177
1692a74177p342P3887J75100p4632l5612o1407l3025O4611J58504q1847j51066
$$ -174177 -181519 -107632 67468 -7164 -42776 -104183 -137208 -72597 85907 4060 -147006
1681a47006p4430P6032M4329m1038J2833k9949R0820j6570k7705l4407p4066J1907
$$ -147006 -221436 -145404 -101075 -142113 -129280 -159229 -68409 -84979 -112684 -147091 -221157 -209250
1669b09250K06296J76028M2833j16825l426J6255j45423K5650N8821j77475L8309
$$ -209250 -2954 173074 215907 99082 95656 111911 -33512 -7862 50959 -126516 -88207
1658h8207l8822M2116M7952q4090p8020k6725P322J01282M2965j45360J57799
$$ -88207 -127029 -84913 -36961 -121051 -199071 -225796 -218474 -117192 -74227 -219587 -61788
1647f1788J2658J1318L0334j02772N0357K8213p4648Q6136n564r4622o8543L063
$$ -61788 -49130 -37812 -7478 -110250 -59893 -31680 -106328 -20192 -25756 -120378 -188921 -185858
1635a85858N1043l6952j06409J30657J58148L5549p5218J4083J3398n4440M5152
$$ -185858 -134815 -171767 -278176 -147519 10629 46178 -29040 -14957 -1559 -55999 -10847
1624a0847j19694l7876O8018O4322J25253j23687j20012L5118Q8894k9552j17545
$$ -10847 -130541 -168417 -100399 -36077 89176 -34511 -154523 -119405 -30511 -60063 -177608
1613a77608J32035K5452l6504J1004k3147r2125J12504O4199p3544k9507k8768
$$ -177608 -45573 -20121 -56625 -45621 -68768 -160893 -48389 15810 -57734 -87241 -116009
1602a16009j5344j5740N2631j3576n9507O181N8275j1009n0174N3790p7504K7039
$$ -116009 -131353 -147093 -94462 -108038 -167545 -161364 -103089 -114098 -164272 -110482 -187986 -160947
1590a60947J00591J12332n2796l2367L156k170O907p9958K7561n4860j50152J09248
$$ -160947 -60356 51976 -820 -33187 -30031 -32201 -25294 -105252 -77691 -132551 -282703 -173455
1578a73455K6847P0148o9529k2995K37372P096k09425j00229K5187J00160o2626
$$ -173455 -146608 -76460 -145989 -168984 68388 75484 -133941 -234170 -208983 -108823 -171449
1567a71449q4052Q687j00697Q0529J72661L3530J7314M5807M8572P1006p5974
$$ -171449 -255501 -246814 -347511 -266982 -94321 -60791 -43477 2330 50902 121908 45934
1556D5934j24100o79L0173Q4133J05143m6136k7624P2082J5815k27487N1336o2212
$$ 45934 -78166 -78845 -48672 35461 140604 94468 66844 138926 154741 -72746 -21410 -83622
1544h3622l0146P3335L2560N2638n8506r5198O1418R8463j61732R1797l3277p5997
$$ -83622 -113768 -40433 -7873 44765 -13741 -108939 -47521 50942 -110790 -18993 -52270 -128267
1532a28267P1898r4715O9312J07022q3666K9504J66961K8326j76376j0785J25634
$$ -128267 -56369 -151084 -81772 25250 -58416 -28912 138049 166375 -10001 -20786 104848
1521A04848O4564j5974m4939L643n6932q6528j6564K7311j77654j1393l8165J12582
$$ 104848 169412 153438 108499 112142 55210 -31318 -47882 -20571 -198225 -209618 -247783 -135201
1509a35201O8781j2672j6905J9491J7615J11761M9198L8382m8943n5132q2912
$$ -135201 -66420 -79092 -95997 -76506 -58891 52870 102068 140450 91507 36375 -46537
1498d6537M1659K4988q8769q6521o5796p119Q3998R7061l7002J33257n1650j16572
$$ -46537 -4878 20110 -68659 -155180 -220976 -228095 -144097 -47036 -84038 49219 -2431 -119003
1486a19003k1764J16963L2065j04350o6624J46436O4241o9865k5765N0789j10541
$$ -119003 -140767 -23804 8261 -96089 -162713 -16277 47964 -21901 -47666 3123 -107418
1475a07418J0792L2130k8878k4995j8120J05089o5952o1987J7480N4146m8155
$$ -107418 -96626 -64496 -93374 -118369 -136489 -31400 -97352 -159339 -141859 -87713 -135868
1464a35868P864L9365o2236l592Q42P499j72421P4665L1156K7320J9237q9319
$$ -135868 -128004 -88639 -150875 -154467 -153625 -146126 -318547 -243882 -212726 -185406 -166169 -255488
$$ [...]
##END NTUPLES=NMR SPECTRUM
##END=
