##TITLE=1H_DE-80H_X3
 200.13MHz, d2o
 8 sc
 
 19ns.26.2.2025
##JCAMPDX= 6.0         $$ Bruker NMR JCAMP-DX V2.0
##DATA TYPE= NMR SPECTRUM
##DATA CLASS= NTUPLES
##ORIGIN= UXNMR, Bruker Analytische Messtechnik GmbH
##OWNER= pz
$$ XWIN-NMR		Version 3.5
$$ Tue Mar 17 10:24:25 2026 Russian Standard Time (UT+4h)  Yarkov@DPX200
##.OBSERVE FREQUENCY= 200.1313
##.OBSERVE NUCLEUS= ^1H
##.ACQUISITION MODE= SIMULTANEOUS
##.ACQUISITION SCHEME= undefined
##.AVERAGES= 8
##.DIGITISER RES= 18
##SPECTROMETER/DATA SYSTEM= spect
##.PULSE SEQUENCE= zg30
##.SOLVENT NAME= CDCl3
##.SHIFT REFERENCE= (INTERNAL, CDCl3, 0, 15.4814)
##AUDIT TRAIL= $$ (NUMBER, WHEN, WHO, WHERE, WHAT)
$$ ##TITLE= Audit trail, XWIN-NMR		Version 3.5
$$ ##JCAMPDX= 5.01
$$ ##ORIGIN= Bruker BioSpin GmbH
$$ ##OWNER= Yarkov
$$ C:/Bruker/XWIN-NMR/data/yarkov2/nmr/H-C/1/pdata/1/auditp.txt
$$ ##AUDIT TRAIL=  $$ (NUMBER, WHEN, WHO, WHERE, WHAT)
(   1,<2026-03-17 10:23:35.18 +0400>,<Yarkov>,<DPX200>,
      <created by zg, POWCHK disabled, PULCHK disabled
       configuration hash MD5:
       00 E9 B6 7A A2 85 ED C7 34 08 36 98 17 FE 4E 26
       data hash MD5: 16K
       50 F8 5C 84 DA 41 BC 16 81 A4 68 D3 1E 62 9C AB>)
(   2,<2026-03-17 10:23:43.03 +0400>,<Yarkov>,<DPX200>,
      <Start of raw data processing
       efp BC_mod = 2 LB = 0.25 FT_mod = 6 PKNL = 1 PHC0 = -5299.148 PHC1 = 6.821927 SI = 16K 
       data hash MD5: 16K
       0E 0C 3E 90 42 D2 4A 96 49 A0 5B 74 32 AF D7 51>)
$$ ##END=
$$ 
$$ hash MD5
$$ 6C FC F5 BF 8C 85 2F 17 E9 17 AF CA 5D 3B 48 16
##$RELAX= 
##$RELAX= 
##$RELAX= 
##$RELAX= 
##$RELAX= 
##$RELAX= 
$$ Bruker specific parameters
$$ --------------------------
##$DU= <C:/Bruker/XWIN-NMR>
##$EXPNO= 1
##$NAME= <H-C>
##$PROCNO= 1
##$TYPE= <nmr>
##$USER= <yarkov2>
##$AMP= (0..31)
100 100 100 100 100 100 100 100 100 100 100 100 100 100 100 100 100 100 
100 100 100 100 100 100 100 100 100 100 100 100 100 100 
##$AQSEQ= 0
##$AQ_mod= 1
##$AUNM= <au_zg>
##$AUTOPOS= <>
##$BF1= 200.13
##$BF2= 200.13
##$BF3= 200.13
##$BF4= 200.13
##$BF5= 200.13
##$BF6= 200.13
##$BF7= 200.13
##$BF8= 200.13
##$BYTORDA= 1
##$CFDGTYP= 0
##$CFRGTYP= 5
##$CHEMSTR= <none>
##$CNST= (0..31)
1 1 145 1 1 1 1 1 1 1 1 1 1 1 1 1 1 1 1 1 1 1 1 1 1 1 1 1 1 1 1 1 
##$CPDPRG= <>
##$CPDPRG1= <>
##$CPDPRG2= <>
##$CPDPRG3= <>
##$CPDPRG4= <mlev>
##$CPDPRG5= <mlev>
##$CPDPRG6= <mlev>
##$CPDPRG7= <mlev>
##$CPDPRG8= <mlev>
##$CPDPRGB= <>
##$CPDPRGT= <>
##$D= (0..31)
0 0.7 0 0 0 0 0 0 0 0 0 0.03 0 0 0 0 0 0 0 0 0 0 0 0 0 0 0 0 0 0 0 0 
##$DATE= 1773728614
##$DBL= (0..7)
120 120 120 120 120 120 120 120 
##$DBP= (0..7)
150 150 150 150 150 150 150 150 
##$DBP07= 0
##$DBPNAM0= <>
##$DBPNAM1= <>
##$DBPNAM2= <>
##$DBPNAM3= <>
##$DBPNAM4= <>
##$DBPNAM5= <>
##$DBPNAM6= <>
##$DBPNAM7= <>
##$DBPOAL= (0..7)
0.5 0.5 0.5 0.5 0.5 0.5 0.5 0.5 
##$DBPOFFS= (0..7)
0 0 0 0 0 0 0 0 
##$DE= 6
##$DECBNUC= <off>
##$DECIM= 32
##$DECNUC= <off>
##$DECSTAT= 4
##$DIGMOD= 1
##$DIGTYP= 9
##$DL= (0..7)
0 120 120 120 120 120 120 120 
##$DP= (0..7)
$$ [...]
##$SUBNAM2= <"">
##$SUBNAM3= <"">
##$SUBNAM4= <"">
##$SUBNAM5= <"">
##$SUBNAM6= <"">
##$SUBNAM7= <"">
##$SUBNAM8= <"">
##$SUBNAM9= <"">
##$SW= 18.0517328524113
##$SWIBOX= (0..15)
0 0 2 0 0 0 0 0 0 0 0 0 0 0 0 0 
##$SW_h= 3612.71676300578
##$TD= 16384
##$TD0= 1
##$TE= 0
##$TE2= 300
##$TE3= 300
##$TEG= 300
##$TL= (0..7)
0 120 120 120 120 120 120 120 
##$TP= (0..7)
150 150 150 150 150 150 150 150 
##$TP07= 0
##$TPNAME0= <>
##$TPNAME1= <>
##$TPNAME2= <>
##$TPNAME3= <>
##$TPNAME4= <>
##$TPNAME5= <>
##$TPNAME6= <>
##$TPNAME7= <>
##$TPOAL= (0..7)
0.5 0.5 0.5 0.5 0.5 0.5 0.5 0.5 
##$TPOFFS= (0..7)
0 0 0 0 0 0 0 0 
##$TUNHIN= 0
##$TUNHOUT= 0
##$TUNXOUT= 0
##$USERA1= <user>
##$USERA2= <user>
##$USERA3= <user>
##$USERA4= <user>
##$USERA5= <user>
##$V9= 5
##$VALIST= <valist>
##$VCLIST= <CCCCCCCCCCCCCCC>
##$VD= 0
##$VDLIST= <DDDDDDDDDDDDDDD>
##$VPLIST= <PPPPPPPPPPPPPPP>
##$VTLIST= <TTTTTTTTTTTTTTT>
##$WBST= 1024
##$WBSW= 4
##$XGAIN= (0..3)
0 0 0 0 
##$XL= 0
##$YL= 0
##$YMAX_a= 30010
##$YMIN_a= -24703
##$ZGOPTNS= <>
##$ZL1= 120
##$ZL2= 120
##$ZL3= 120
##$ZL4= 120
##$ABSF1= 0
##$ABSF2= 0
##$ABSG= 0
##$ABSL= 0
##$ALPHA= 0
##$AQORDER= 0
##$ASSFAC= 0
##$ASSFACI= 0
##$ASSFACX= 0
##$ASSWID= 0
##$AUNMP= <proc_1d>
##$AZFE= 0.1
##$AZFW= 0.1
##$BCFW= 0
##$BC_mod= 2
##$BYTORDP= 0
##$COROFFS= 0
##$CY= -3
##$DATMOD= 1
##$DC= 0
##$DFILT= <>
##$DTYPP= 0
##$F1P= 0
##$F2P= 0
##$FCOR= 1
##$FTSIZE= 16384
##$FT_mod= 6
##$GAMMA= 0
##$GB= 0
##$INTBC= 1
##$INTSCL= 3.241238e-09
##$ISEN= 128
##$LB= 0.25
##$LEV0= 0
##$LPBIN= 0
##$MAXI= 10000
##$MC2= 0
##$MEAN= 0
##$ME_mod= 0
##$MI= 1.114404
##$NCOEF= 0
##$NC_proc= -9
##$NLEV= 6
##$NOISF1= 3.799351
##$NOISF2= 2.8
##$NSP= 0
##$NTH_PI= 0
##$NZP= 0
##$OFFSET= 15.48136
##$PC= 1
##$PHC0= -5299.148
##$PHC1= 6.821927
##$PH_mod= 1
##$PKNL= yes
##$PPARMOD= 0
##$PSCAL= 0
##$PSIGN= 0
##$REVERSE= no
##$SF= 200.130008073487
##$SI= 16384
##$SIGF1= 3
##$SIGF2= 2
##$SINO= 0.751879
##$SIOLD= 32768
##$SREGLST= <19F.Aceton>
##$SSB= 0
##$STSI= 16384
##$STSR= 0
##$SW_p= 3612.71676300578
##$SYMM= 0
##$S_DEV= 0
##$TDeff= 16384
##$TDoff= 0
##$TI= <>
##$TILT= no
##$TM1= 0
##$TM2= 0
##$TOPLEV= 0
##$USERP1= <user>
##$USERP2= <user>
##$USERP3= <user>
##$USERP4= <user>
##$USERP5= <user>
##$WDW= 1
##$XDIM= 16384
##$YMAX_p= 495600946
##$YMIN_p= -1265171
$$ End of Bruker specific parameters
$$ ---------------------------------
##NTUPLES= NMR SPECTRUM
##VAR_NAME=  FREQUENCY,     SPECTRUM/REAL,   SPECTRUM/IMAG
##SYMBOL=    X,             R,               I
##VAR_TYPE=  INDEPENDENT,   DEPENDENT,       DEPENDENT
##VAR_FORM=  AFFN,          ASDF,            ASDF
##VAR_DIM=   16384,         16384,           16384
##UNITS=     HZ,            ARBITRARY UNITS, ARBITRARY UNITS
##FACTOR=    0.220516191357247, 1,           1
##FIRST=     3098.28478894234, 0,            0
##LAST=      -514.431974063437, 0,           0
##MIN=       -514.431974063437, -1265171,    0
##MAX=       3098.28478894234, 495600946,    0
$$ Real data points
##PAGE= N=1
##DATA TABLE= (X++(R..R)), XYDATA
$$ [...]
5220B893190K12739O44197m35280K08012q2601n59603L6830N74853R564k17386
$$ 2893190 3105929 3750126 3314846 3522858 3440257 2880654 2917484 3492337 3501901 3284515
5210C284515L49459k33989J02141M01317n14637q9249K12755n515O32322j14497
$$ 3284515 3633974 3399985 3502126 3903443 3388806 3299557 3512312 3506797 4139119 4024622
5200D024622o20900l38566K59234j44966K27783N98851p56193k59063l06835O4075
$$ 4024622 3403722 3065156 3324390 3179424 3407207 4006058 3249865 2990802 2683967 2748042
5190B748042M88463O64786J52819n79699l43036P33324J09509L07209R9273K365
$$ 2748042 3236505 3901291 4054110 3474411 3131375 3864699 3974208 4281417 4380690 4383055
5180D383055p63896p1030J48849L03050o27291K24872J01543L26465R18195L2170
$$ 4383055 3619159 3548129 3696978 4000028 3372737 3597609 3699152 4025617 4943812 4975982
5170D975982L33258L25967j87005L89462O98635m01196k21789J63426J79490j63514
$$ 4975982 5309240 5635207 5448202 5837664 6536299 6135103 5913314 6076740 6256230 6092716
5160F092716k11482J06807l10105o1414J80917l29379k71246l21089M64810j05384
$$ 6092716 5881234 5988041 5677936 5616522 5797439 5468060 5196814 4875725 5340535 5235151
5150E235151m07288L215N60345J76838j37215p0913K57096L03729K57740j89113
$$ 5235151 4827863 4831078 5391423 5568261 5431046 5360133 5617229 5920958 6178698 5989585
5140E989585N01895O10540l67586J059350L45259l20526J58954N4311q47652m34535
$$ 5989585 6491480 7102020 6734434 7793784 8139043 7818517 7977471 8031782 7184130 6749595
5130F749595O8475q60930k46299m5143k75424K01486l19351K97186J71091l86127
$$ 6749595 6818070 5957140 5710841 5665698 5390274 5591760 5272409 5569595 5740686 5354559
5120E354559o0205L04753j36584L22355O15573m4316O46512O42719J000528J721248
$$ 5354559 5294354 5599107 5462523 5784878 6400451 6356135 7002647 7645366 8645894 10367142
5110A0367142Q28142O37241J033698m86892q14844j226748l82644j102412p59923
$$ 10367142 11195284 11832525 12866223 12379331 11564487 10337739 9955095 8852683 8092760
5101H092760k33702R110l51448k50407P1935Q4452l38912K4461N58892k30087
$$ 8092760 7859058 7868168 7516720 7266313 7338248 7422700 7083788 7108249 7667141 7437054
5091G437054j03005n37125K57470J63806m07213J23453n11443n62090L00952J43398
$$ 7437054 7334049 6796924 7054394 7218200 6810987 6934440 6422997 5860907 6161859 6305257
5081F305257k08843n19193l14620J98252K7452K40520o85295J23833N89021M38843
$$ 6305257 6096414 5577221 5262601 5460853 5488305 5728825 5043530 5167363 5756384 6195227
5071F195227p4883m76656j38319M65961M30292m90300l8126l55734k66044K91700
$$ 6195227 6120344 5643688 5505369 5971330 6401622 5911322 5873196 5517462 5251418 5543118
5061E543118K24575o54397l34879j38653L49890L19360j43125j13570M38465k0646
$$ 5543118 5767693 5113296 4778417 4639764 4989654 5309014 5165889 5052319 5490784 5470138
5051E470138m42375M27093M93066q58508J53401k03027p0880p0171M71067L04290
$$ 5470138 5027763 5454856 5947922 5089414 5242815 5039788 4968908 4898737 5369804 5674094
5041E674094q1161L96795k33450M49447l92759J39806k78481j14930P2997M98876
$$ 5674094 5592933 5989728 5756278 6205725 5812966 5952772 5674291 5559361 5632358 6131234
5031F131234o00249O6855N71905m54243K37449M99697l29290J49497j96665P4144
$$ 6131234 5530985 5597840 6169745 5715502 5952951 6452648 6123358 6272855 6076190 6150334
5021F150334l07759J39967L12286m33977J09879j58747K47928Q9637j06554q5842
$$ 6150334 5842575 5982542 6294828 5860851 5970730 5811983 6059911 6149548 6042994 5957152
5011E957152l7690R9673M2358J36103K08986L40038J27537O09759j77272l41096
$$ 5957152 5919462 6019135 6061493 6197596 6406582 6746620 6874157 7483916 7306644 6965548
5001F965548l45104K26121N79813J98298N03156k3466j68057o24719M96710N17949
$$ 6965548 6620444 6846565 7426378 7624676 8127832 8104366 7936309 7311590 7808300 8326249
4991H326249O59294l38273J12501K06312M2798n3659M72848K46997J0498Q9611
$$ 8326249 8985543 8647270 8759771 8966083 9008881 8955222 9428070 9675067 9685565 9775176
4981I775176j67233J90599K44146M3755M92653O91875M5895O91448J45478J67528
$$ 9775176 9607943 9798542 10042688 10086443 10579096 11270971 11316866 12008314 12153792 12321320
4971A2321320K04591L10633O11758L73334j81854L37773M64187J42012K88841
$$ 12321320 12525911 12836544 13448302 13821636 13639782 13977555 14441742 14583754 14872595
4962A4872595k09671K91255Q06102O67212L28638K53762P49113L74606P66307
$$ 14872595 14662924 14954179 15760281 16427493 16756131 17009893 17759006 18133612 18899919
4953A8899919P63226q6805K8603M6532j36944j27420J53788O20806J35375K47271
$$ 18899919 19663145 19576340 19604943 19651475 19514531 19387111 19540899 20161705 20297080 20544351
4943B0544351M98836Q32780O75713M09363M60698J105842J308380J426363J061449
$$ 20544351 21043187 21875967 22551680 22961043 23421741 24527583 25835963 27262326 28323775
4934B8323775Q09428N21031J223336K411096J087257R00742P27822J297613O04402
$$ 28323775 29133203 29654234 30877570 33288666 34375923 35276665 36004487 37302100 37906502
4925C7906502J11508P30284J592797J203228K008887J256082J312163O84163Q37477
$$ 37906502 38018010 38748294 40341091 41544319 43553206 44809288 46121451 46805614 47643091
4916D7643091O12680Q96107Q04319J296535J070394k44681l29177L12403R32209
$$ 47643091 48255771 49151878 49956197 51252732 52323126 52078445 51749268 52061671 52993880
4907E2993880J145621K048246J672649J805912J805374K038485O86545p29458
$$ 52993880 54139501 56187747 57860396 59666308 61471682 63510167 64196712 63467254
4899F3467254j473192l026211l967955l511016l238693l067944j657971q74979
$$ 63467254 61994062 58967851 54999896 51488880 48250187 45182243 43524272 42649293
4891D2649293n39871P95375J642586J660940K774698K146993J43847j431673k458971
$$ 42649293 42109422 42904797 44547383 46208323 48983021 51130014 51273861 49842188 47383217
4882D7383217l489084l986860l808928k841840k312958j998100j283434j357335
$$ 47383217 43894133 39907273 36098345 33256505 30943547 28945447 27662013 26304678
4874B6304678o17841o08664j084353k40075P3574J07130Q06080J148398J518160
$$ 26304678 25686837 25078173 23993820 23753745 23827319 23934449 24740529 25888927 27407087
4865B7407087J304998J456258J982946L32123M22459Q9723J65798N80638K89027
$$ 27407087 28712085 30168343 32151289 32483412 32905871 32995594 33161392 33742030 34031057
4856C4031057J140614J138018J480766J180859J200232R24145J435935J513377
$$ 34031057 35171671 36309689 37790455 38971314 40171546 41095691 42531626 44045003
4848D4045003J139009n91732j019898j496141j842707k401348k135373k654766
$$ 44045003 45184012 44592280 43572382 42076241 40233534 37832186 35696813 33042047
4840C3042047k146812j623985j953621j953157j041903j379394j562563j413830
$$ 33042047 30895235 29271250 27317629 25364472 24322569 22943175 21380612 19966782
4832A9966782l97652q92223n55307n78207p94002m81356k67724k60015n16335
$$ 19966782 19569130 18676907 18121600 17543393 16749391 16268035 16000311 15740296 15223961
4823A5223961j21872j12035k08118k37517o40683l51550n62110k1818J99506M29798
$$ 15223961 15102089 14990054 14781936 14544419 13903736 13552186 12990076 12968258 13167764 13597562
4813A3597562J25878p22843L89836o810p48075M9129R4126J91204m70125q7615
$$ 13597562 13723440 13000597 13390433 13383623 12635548 12684677 12778803 12970007 12499882 12412267
4803A2412267k66382m11187l43836K9393l21506l96492K00598J2867M60742j1890
$$ 12412267 12145885 11734698 11390862 11420255 11098749 10702257 10902855 10915722 11376464 11364574
4793A1364574J10563J31462j33479J07345M63139j67522n6955Q5900k5033k01012
$$ 11364574 11475137 11606599 11473120 11580465 12043604 11876082 11819127 11905027 11879994 11678982
4783A1678982r29990n23325P0047K32223J84710l16777k46569n74936l497J91022
$$ 11678982 10748992 10225667 10295714 10527937 10712647 10395870 10149301 9574365 9570868 9761890
4773I761890l64005j34944k79340j48576k12196o33647K15374K86854j67100K33740
$$ 9761890 9397885 9262941 8983601 8835025 8622829 7989182 8204556 8491410 8324310 8558050
4763H558050k62047L06899M02593m62601L31312o2079N30211J64916K19216n4965
$$ 8558050 8296003 8602902 9005495 8542894 8874206 8812127 9342338 9507254 9726470 9671505
4753I671505j90395j13052J14732j75964K66529K45683m48726m8271L09001l78136
$$ 9671505 9481110 9368058 9482790 9306826 9573355 9819038 9370312 9322041 9631042 9252906
4743I252906n2805k4956K15104K53987J62897n22980l1360j14321J59463k29534
$$ 9252906 9200101 9175145 9390249 9644236 9807133 9284153 9252793 9138472 9297935 9068401
4733I068401J69122M3210k84102J37837K86801P4003J91050J11950M85876k09065
$$ 9068401 9237523 9280733 8996631 9134468 9421269 9495272 9686322 9798272 10284148 10075083
4723A0075083L10509n5927K85022P288m298m62656j10000L23517M80559L63272
$$ 10075083 10385592 10329665 10614687 10621975 10617677 10155021 10045021 10368538 10849097 11212369
4713A1212369L66227M87283L00612k75107o1852p1212j55930q9366k73078j17246
$$ 11212369 11578596 12065879 12366491 12091384 12029532 11958320 11802390 11713024 11439946 11322700
4703A1322700L49192J49206O8041K18920P8160P81768M07909O06870M14704L45691
$$ 11322700 11671892 11821098 11889139 12108059 12186219 12967987 13375896 13982766 14397470 14743161
4693A4743161J73924Q84822L76202p1509J64725M73153n94753m00852j86875k47005
$$ 14743161 14917085 15801907 16178109 16106600 16271325 16744478 16149725 15748873 15561998 15314993
4683A5314993j86265P90170l57951K05145O26677k19072m42518P89481Q27983
$$ 15314993 15128728 15918898 15560947 15766092 16392769 16173697 15731179 16520660 17348643
4674A7348643N25501J092608J634860J226721R34756J399322J167565J947305
$$ 17348643 17874144 18966752 20601612 21828333 22763089 24162411 25329976 27277281
4666B7277281J774183R79593J949423J652633J670194K099481K494382L147547
$$ 27277281 29051464 30031057 31980480 33633113 35303307 37402788 39897170 43044717
4658D3044717M024044M985628O263871P293197P776722Q987253J3209648J8125789
$$ 43044717 47068761 52054389 58318260 65611457 73388179 82375432 95585080 113710869
4650A13710869J9194350J0230328l739532j4884318j7041000j5641862j2757765
$$ 113710869 132905219 143135547 139396015 124511697 107470697 91828835 79071070
4643G9071070j1055202q365392n867928l770608k243385p20522j19996K34506
$$ 79071070 68015868 59650476 53782548 50011940 47768555 47048033 46928037 47162543
4635D7162543J333333K958278M438809M909355N206556M003488K01125m272738
$$ 47162543 48495876 51454154 55892963 60802318 66008874 70012362 70213487 65940749
4627F5940749n733558o000752n537921m058331l580617l140612k276953k591459
$$ 65940749 60207191 54206439 48668518 44610187 41029570 37888958 35612005 33020546
4619C3020546j850518j318010j059939j640262l34636J22301L08495J22352J89990
$$ 33020546 31170028 29852018 28792079 27151817 26817181 26939482 27247977 27370329 27560319
4610B7560319J108729O51523k77849n36010o15335q15776m19625j34406m7859
$$ 27560319 28669048 29320571 29042722 28506712 27891377 27075601 26655976 26521570 26473711
4601B6473711L75052Q39374J561461K582640L902150M483655M705319K957868
$$ 26473711 26848763 27688137 29249598 31832238 35734388 40218043 44923362 47881230
4593D7881230M14684l058334m542696m424705m307947l514624l103154k084406
$$ 47881230 48295914 45237580 40694884 36270179 31962232 28447608 25344454 23260048
4585B3260048j672686j994387j603878p29255r34277q49156m55576l35759k42902
$$ 23260048 21587362 19592975 17989097 17259842 16325565 15476409 15020833 14685074 14442172
4576A4442172n88185j35623k2395n17403q66793J71458m36905l23458J64028j038080
$$ 14442172 13853987 13718364 13695969 13178566 12311773 12483231 12046326 11722868 11886896 10848816
4566A0848816K01181M05718m49414r2398k74931M5676r3708j08717J46759L06558
$$ 10848816 11049997 11455715 11006301 10913903 10638972 10684648 10590940 10482223 10628982 10935540
4556A0935540k9187n03272P1494L12153M38100K84896l9710J19596n88659r22427
$$ 10935540 10906353 10403081 10474575 10786728 11224828 11509724 11470014 11589610 11000951 10078524
4546A0078524j90748J82858k46631o6143k47325K39408k96044m61037l5786M35151
$$ 10078524 9887776 10070634 9824003 9757860 9510535 9749943 9453899 8992862 8957076 9392227
4536I392227K32066o56534k43074j71028l21421n250n18831k61002k84702K01094
$$ 9392227 9624293 8967759 8724685 8553657 8232236 8226986 7708155 7447153 7162451 7363545
4526G363545O24211K49429L46032J72475L11436j95529l0952k53979j13856J89157
$$ 7363545 7987756 8237185 8583217 8755692 9067128 8871599 8840647 8586668 8472812 8661969
4516H661969P8448R28263l4803O51232O28231k6280n21728o96800m94424m02766
$$ 8661969 8740417 9668680 9633877 10285109 10913340 10887060 10365332 9668532 9174108 8771342
4506H771342l55953k30189m89898k30133L23328n10191k293Q3455l93245l60450
$$ 8771342 8415389 8185200 7695302 7465169 7788497 7278306 7276013 7359468 6966223 6605773
4496F605773o8061L79035N03911k8956l24714J32151k53841M71348p1458j49064
$$ 6605773 6537712 6916747 7420658 7391702 7066988 7199139 6945298 7416646 7345188 7196124
4486G196124k41653k81225J74875P810K32052k22163M19316J18938l71986J58850
$$ 7196124 6954471 6673246 6848121 6855931 7087983 6865820 7285136 7404074 7032088 7190938
4476G190938J04645o53631J82685J11082j23482M8446J33585j39472j28830p1453
$$ 7190938 7295583 6641952 6824637 6935719 6812237 6860683 6994268 6854796 6725966 6654513
4466F654513j17941l33090J50214J30113o3920k3620O6793J12598j2287J56703
$$ 6654513 6536572 6203482 6353696 6483809 6419889 6396269 6463062 6575660 6563373 6720076
4456F720076j15306J54757l85908L2377O74881j86002n59803j37612n92049J09072
$$ 6720076 6604770 6759527 6373619 6405996 7080877 6894875 6335072 6197460 5605411 5714483
4446E714483j49780K80313p9095K21164K01423l49274K51477K26559M11420o52476
$$ 5714483 5564703 5845016 5765921 5987085 6188508 5839234 6090711 6317270 6728690 6076214
4436F076214J66705m6885q8898l0339N7230k0787N68462L0077L17961q06698J46366
$$ 6076214 6242919 6196034 6107136 6076797 6134027 6113240 6681702 6711779 7029740 6223042 6369408
4425F369408K10956R26889L92719o00634p43649k98442K80605L22464j63468K26256
$$ 6369408 6580364 7507253 7899972 7299338 6555689 6257247 6537852 6860316 6696848 6923104
4415F923104K54668j22374p442j9008K21338J55226k40563k19376j5318L00205
$$ 6923104 7177772 7055398 7047956 7028948 7250286 7405512 7164949 6945573 6930255 7230460
4405G230460L30577J73049k65594j3498J97865l07597M15222J51871K97313m1372
$$ 7230460 7561037 7734086 7468492 7454994 7652859 7345262 7760484 7912355 8209668 8168296
4395H168296j0585M34431K34933J27768N93358M29515N23802J98283N04422L25107
$$ 8168296 8157711 8592142 8827075 8954843 9548201 9977716 10501518 10699801 11204223 11529330
4385A1529330N43152P41270M89075J026862O61091O52011N16690P48280P68989
$$ 11529330 12072482 12813752 13302827 14329689 14990780 15642791 16159481 16907761 17676750
4376A7676750J601605K508435L452793M745561O010724N383567J625426j627460
$$ 17676750 19278355 21786790 25239583 29985144 35995868 41379435 43004861 41377401
4368D1377401l758639m924939m403751l636420l249029k759426k475061p81142
$$ 41377401 37618762 32693823 28290072 24653652 21404623 18645197 16170136 15388994
4360A5388994j229074o43820j204790o90436M975p2268K19467k32113m85453m21019
$$ 15388994 14159920 13516100 12311310 11620874 11625849 11553581 11773048 11540935 11055482 10634463
4350A0634463o8360L25941n05701M05100O5015l71083J45564J82217j075710J97863
$$ 10634463 10566103 10892044 10386343 10791443 10856458 10485375 10630939 10813156 9737446 9935309
4340I935309J40868J93273O72628o7628j071939m53165L60228K31783R8390j03908
$$ 9935309 10076177 10269450 10942078 10874450 9802511 9349346 9709574 9941357 10039747 9935839
4330I935839j17260J77580M72128l09906j96614l01228K5813J4650L49118K7367
$$ 9935839 9818579 9996159 10468287 10158381 9961767 9660539 9686352 9701002 10050120 10077487
4320A0077487K98402j73144M63529j22654k24785R1270J11907r1886J04611O51151
$$ 10077487 10375889 10202745 10666274 10543620 10318835 10410105 10522012 10430126 10534737 11185888
4310A1185888O32823K05235m30016j56239j61486Q7536m92011k52830R3612L18673
$$ 11185888 11818711 12023946 11593930 11437691 11276205 11363741 10871730 10618900 10712512 11031185
4300A1031185n09939J11783J106L74646K68459l71838J74033J03949l51891K10103
$$ 11031185 10521246 10633029 10634135 11008781 11277240 10905402 11079435 11183384 10831493 11041596
4290A1041596P07996M91943K74735O13260J21034n30438l798J92043K51529l73454
$$ 11041596 11749592 12241535 12516270 13129530 13250564 12720126 12716328 12908371 13159900 12786446
4280A2786446J64358L15422L35173j043o64905r12486P80212O38702k74289k40698
$$ 12786446 12950804 13266226 13601399 13600356 12935451 12022965 12803177 13441879 13167590 12926892
4270A2926892M91535j3698k17641M68060K00357M12852j27698m48990M14880J97831
$$ 12926892 13418427 13404729 13187088 13655148 13855505 14268357 14140659 13691669 14106549 14304380
4260A4304380q8261j12603K59197J48884N46306K78608O00005J61721K77173j61420
$$ 14304380 14216119 14103516 14362713 14511597 15057903 15336511 15936516 16098237 16375410 16213990
4250A6213990M08476N73354K93432O7905l33175O21387N13779N29623J45030K76479
$$ 16213990 16622466 17195820 17489252 17557157 17223982 17845369 18359148 18888771 19033801 19310280
4240A9310280N26495N51849Q34570M06820L54658r4045K29795Q21699O83562R81480
$$ 19310280 19836775 20388624 21223194 21630014 21984672 21890627 22120422 22942121 23625683 24607163
4230B4607163K04751k7446R30293J48490M83411P33669L06697R07132r569L5233
$$ 24607163 24811914 24784468 25714761 25863251 26346662 27080331 27387028 28294160 28284591 28319824
4220B8319824J55098K86239l55267K68412P08390N18877m85j60796M47526N54189
$$ 28319824 28474922 28761161 28405894 28674306 29382696 29901573 29901088 29740292 30187818 30742007
4210C0742007n19274o20535j76262N13409N5425K65112m29688p23327K71567l34991
$$ 30742007 30222733 29602198 29425936 29939345 29994770 30259882 29830194 29106867 29378434 29043443
4200B9043443J85784p2940K0339r9803n66686M94976n24614j203173k00049j41638
$$ 29043443 29229227 29156287 29176626 29076823 28510137 29005113 28480499 27277326 27077277 26935639
4190B6935639q62448p91102m83705n76385k68025n13196J77478n75894p71055
$$ 26935639 26073191 25282089 24798384 24221999 23953974 23440778 23618256 23042362 22271307
4181B2271307m07609j08987m21806r66570q18200k14254J51361o27527n75857
$$ 22271307 21863698 21754711 21332905 20366335 19548135 19333881 19485242 18857715 18281858
4172A8281858k45123p98048k28609L01831l73128l88185p60101j024007n4272
$$ 18281858 18036735 17238687 17010078 17311909 16938781 16550596 15790495 14766488 14712216
4163A4712216j71521r0074m25541J35890n07680o92047L1086m1241o0021l6727
$$ 14712216 14540695 14450621 14025080 14160970 13653290 12961243 12992329 12951088 12891067 12854340
4153A2854340N04391l65066j00669j88837n52332k88552M5359l50889j5483Q2555
$$ 12854340 13358731 12993665 12892996 12704159 12151827 11863275 11908634 11557745 11542262 11624817
4143A1624817N85954L87441j79926K73052O76775p00700n82082P99742J25285
$$ 11624817 12210771 12598212 12418286 12691338 13368113 12667413 12085331 12885073 13010358
4134A3010358J43438j97840k52528M91268o15077n45601M07106K27191l6665p42200
$$ 13010358 13153796 12955956 12703428 13194696 12579619 12034018 12441124 12668315 12631650 11889450
4124A1889450N72632j09741k43765l22397j98043r1869j52915N56327K46499k7964
$$ 11889450 12462082 12352341 12108576 11786179 11588136 11496267 11343352 11899679 12146178 12118214
4114A2118214k38917K1124m62200k15073K45626n1727m9577n61982j35308j32122
$$ 12118214 11879297 11900421 11438221 11223148 11468774 11417047 11367470 10805488 10670180 10538058
4104A0538058o00472L70522P6106K12086k63153L6993L33398M72001k27322l99387
$$ 10538058 9937586 10308108 10384214 10596300 10333147 10370140 10703538 11175539 10948217 10548830
4094A0548830J55539r0851J90963O38865N4603k98836k16661j81623j18102R03214
$$ 10548830 10704369 10613518 10804481 11443346 11497949 11199113 10982452 10800829 10682727 11585941
4084A1585941J3423j03017r8295J67623K64556L15822J29622l65641o0983J0461
$$ 11585941 11599364 11496347 11398052 11565675 11830231 12146053 12275675 11910034 11849051 11859512
4074A1859512N6908j08436j3010M49961l12491P822p3895N08844J88462l08228
$$ 11859512 11916420 11807984 11794974 12244935 11932444 11940266 11866371 12375215 12563677 12255449
4064A2255449M32731l34199N11047n50606P9793L79821K37971l04524M4467K62527
$$ 12255449 12688180 12353981 12865028 12314422 12394215 12774036 13012007 12707483 12751950 13014477
4054A3014477m6040k93573l9353l1829J89901j70837k17198p39953L31326j26567
$$ 13014477 12968437 12674864 12635511 12603682 12793583 12622746 12405548 11665595 11996921 11870354
4044A1870354J69659l5483J59512N1377j42674J604q03324R9462k34176P7173
$$ 11870354 12040013 12004530 12164042 12215419 12072745 12074349 11271025 11370487 11136311 11213484
4034A1213484m4500J13554j65296p6166j68879k07756j42406q9937O26958K77271
$$ 11213484 11168984 11282538 11117242 11041076 10872197 10664441 10522035 10432098 11059056 11336327
4024A1336327l78284J57512n92028j37746m6440J9262k8296n75038l99538j38857
$$ 11336327 10958043 11115555 10523527 10385781 10339341 10358603 10330307 9755269 9355731 9216874
4014I216874M15014L70766l3724k68615p9142L50075K4706l15083n17206J78298
$$ 9216874 9631888 10002654 9968930 9700315 9621173 9971248 9995954 9680871 9163665 9341963
4004I341963J13159J00727l41086k50490M39688K60025l23190J15116m5988j27932
$$ 9341963 9455122 9555849 9214763 8964273 9403961 9663986 9340796 9455912 9409924 9281992
3994I281992J33092N45211j46187q93344K81193M76594j19078k29684Q3328K7626
$$ 9281992 9415084 9960295 9814108 8920764 9201957 9678551 9559473 9329789 9413117 9440743
3984I440743L38136j6306q620J81999N80311k78253l89165L76831j20360J27491
$$ 9440743 9778879 9762573 9753953 9935952 10516263 10238010 9848845 10225676 10105316 10232807
3974A0232807o7180N38788j6934j62481J27682k82656L41779m0578P11819J75641
$$ 10232807 10165627 10704415 10687481 10525000 10652682 10370026 10711805 10671227 11383046 11558687
3964A1558687n10832l83865q8843K93284K19603j70032K95095j44294J8596M1634
$$ 11558687 11047855 10663990 10575147 10868431 11088034 10918002 11213097 11068803 11087399 11129033
3954A1129033j95315q1746j22976Q0M49713J51741k33262L54969l92410K23435
$$ 11129033 10933718 10851972 10728996 10729076 11178789 11330530 11097268 11452237 11059827 11283262
3944A1283262L67561j89204j19534K37135M16731l43238J6298K08967M27812M28461
$$ 11283262 11650823 11461619 11342085 11579220 11995951 11652713 11669011 11877978 12305790 12734251
3934A2734251K78808K34489L04313p9838K83122J98090m6194J23668K60404J23256
$$ 12734251 13013059 13247548 13551861 13472023 13755145 13953235 13907041 14030709 14291113 14414369
3924A4414369J34417J23525L95209L2035J16319l31765J00233O26821K39039N15517
$$ 14414369 14548786 14672311 15067520 15099555 15215874 14884109 14984342 15611163 15850202 16365719
3914A6365719j87724K14834N35497J5883K78536J14438K9052K90098L1333N39492
$$ 16365719 16177995 16392829 16928326 16944209 17222745 17337183 17366235 17656333 17687666 18227158
3904A8227158M03945J94179M02654k30396j03669N06535J17511P01182O04053
$$ 18227158 18631103 18825282 19227936 18997540 18893871 19400406 19517917 20219099 20823152
3895B0823152O09644L19554K35730K21065Q56143l7696L3028Q65236M78147O95444
$$ 20823152 21432796 21752350 21988080 22209145 23065288 23027592 23060620 23925856 24404003 25099447
3885B5099447M60366Q5679N14225R68667Q34930M61150P60036O7090N41619Q53171
$$ 25099447 25559813 25645492 26159717 27128384 27963314 28424464 29184500 29251590 29793209 30646380
3875C0646380Q43322J37587J8556J331179P31344Q43724O33483K33222P13056
$$ 30646380 31489702 31627289 31645845 32977024 33708368 34552092 35185575 35418797 36131853
3866C6131853J275270J352535N33279P08396P79813J142295N33294K92309N71968
$$ 36131853 37407123 38759658 39292937 40001333 40781146 41923441 42456735 42749044 43321012
3857D3321012O51188R11447K58614L68807O67179Q0511M19543M1595K39353P41794
$$ 43321012 43972200 44883647 45142261 45511068 46178247 46258758 46678301 46719896 46959249 47701043
3847D7701043k06268L6097L64946O17061L4162j98618J49847K67338L59493j17506
$$ 47701043 47494775 47530872 47895818 48512879 48547041 48348423 48498270 48765608 49125101 49007595
3837D9007595r2705L6133J82399r6999N56712l71183j52157M46172L08918O23844
$$ 49007595 48914890 48951023 49133422 49036423 49593135 49221952 49069795 49515967 49824885 50448729
3827E0448729P27466N28584j20451k31436R9097M12688q7331M03699L15058q3755
$$ 50448729 51176195 51704779 51584328 51352892 51451989 51864677 51777346 52181045 52496103 52412348
3817E2412348O38967O09901k33931K43028K27229N18531n0741J80245j99519J36759
$$ 52412348 53051315 53661216 53427285 53670313 53897542 54416073 54365332 54545577 54346058 54482817
3807E4482817O94987J43126o12109L48361L34769n02401K32853K3513j13661P9089
$$ 54482817 55177804 55320930 54708821 55057182 55391951 54889550 55122403 55145916 55032255 55111344
3797E5111344k11310o81443j77238N82872J57278k0914l89913j89270p80798k70607
$$ 55111344 54900034 54218591 54041353 54624225 54781503 54760589 54370676 54181406 53400608 53130001
3787E3130001n8123o48356o71273j00936m36161l52194l57152o96685o79177J09255
$$ 53130001 53071878 52423522 51752249 51651313 51215152 50862958 50505806 49809121 49129944 49239199
3777D9239199q59242j008378m43686r16533m41385j061545j036527l88294p62495
$$ 49239199 48379957 47371579 46927893 46011360 45569975 44508430 43471903 43083609 42321114
3768D2321114p84009l71285q96598j249313j063244n93865j072373j594292p48059
$$ 42321114 41537105 41165820 40269222 39019909 37956665 37362800 36290427 34696135 33948076
3759C3948076j95498q43154m00006r38627p12347l14820n89891p38931m27093
$$ 33948076 33752578 32909424 32509418 31570791 30858444 30543624 29953733 29214802 28787709
3750B8787709r57552O382m81442m47157l17756p96591j2342m80289k53157j6300
$$ 28787709 27830157 27836539 27355097 26907940 26590184 25793593 25781251 25300962 25047805 25031505
3740B5031505l47603J1410Q26223N78492q02896j09881O68158k13597M91800n45696
$$ 25031505 24683902 24695312 25521535 26100027 25297131 25187250 25855408 25641811 26133611 25587915
3730B5587915k75377J91088O41749J01696R8837L27949m03396R3608l29456o39752
$$ 25587915 25312538 25503626 26145375 26247071 26345908 26673857 26270461 26364069 26034613 25394861
3720B5394861N4759n5649M05524J78942k20075k65946m84712l2628o34143J87795
$$ 25394861 25449620 25393971 25799495 25978437 25758362 25492416 25007704 24975076 24340933 24528728
3710B4528728p15966p77601o06881p1780J5611k42063n20688m94618p34573l34824
$$ 24528728 23812762 23035161 22428280 22356500 22372111 22130048 21609360 21114742 20380169 20045345
3700B0045345o69665j26514m14391j304672n00152o169o74183p33944j31959n35715
$$ 20045345 19375680 19249166 18834775 17530103 17029951 17023782 16349599 15615655 15483696 14947981
3690A4947981k40098K86801r31622p99141n71747l66562j20570l64652l31178
$$ 14947981 14707883 14994684 14063062 13263921 12692174 12325612 12205042 11840390 11509212
3681A1509212J22974n22609j32132l99089o69543l31323M013j03275k90015J11281
$$ 11509212 11632186 11109577 10977445 10578356 9908813 9577490 9581503 9478228 9188213 9299494
3671I299494M7178J584k03260K11327k36088R014J31164J54518k90012n4707p7931
$$ 9299494 9346672 9348256 9144996 9356323 9120235 9129249 9260413 9414931 9124919 9070212 8992281
3660H992281Q4635l96330Q2198J04295N00156J48502k25927K62390L20867p63975
$$ 8992281 9076916 8680586 8762784 8867079 9367235 9515737 9289810 9552200 9873067 9109092
3650I109092J08478k96069j75009M7837K39795k72068M3740J5801m55245J23170
$$ 9109092 9217570 8921501 8746492 8794329 9034124 8762056 8805796 8821597 8366352 8489522
3640H489522Q8092J4134l8323K55791m34000R2777l28459l33607L40340l6307
$$ 8489522 8577614 8591748 8553425 8809216 8375216 8467993 8139534 7805927 8146267 8109960
3630H109960n33532k2078O00836m85941k47836k38300k43974k98938j44083k17534
$$ 8109960 7576428 7554350 8155186 7669245 7421409 7183109 6939135 6640197 6496114 6278580
3620F278580K94427K54560j15298l1936k17853k00493k54841o82660j83090n9927
$$ 6278580 6573007 6827567 6712269 6680333 6462480 6261987 6007146 5324486 5141396 5081469
3610E081469m58587N6338j8601l15400M5345m71351J24155J081868J8842K90290
$$ 5081469 4622882 4679220 4660619 4345219 4390564 3919213 4043368 5125236 5144078 5434368
3600E434368m46431l71938m35434L3657P36787L48247l25212l26434n06171K65727
$$ 5434368 4987937 4615999 4180565 4214222 4951009 5299256 4974044 4647610 4141439 4407166
3590D407166L23301k3275l49346m4678j47142N40470K04739l88607P12518M36441
$$ 4407166 4730467 4707192 4357846 4313168 4166026 4706496 4911235 4522628 5235146 5671587
3580E671587k81614o09738K2101M31494q0460n7032j5024k31051O1403k83574
$$ 5671587 5389973 4780235 4802336 5233830 5153370 5096338 5081314 4850263 4911666 4628092
3570D628092K43390J94451J0696L86446J49448O596L94977J60562m97766L40202
$$ 4628092 4871482 5065933 5076629 5463075 5612523 5619119 6014096 6174658 5676892 6017094
3560F017094J07226k50795J34748L14886J90424J84370K89781J63083J08143l87409
$$ 6017094 6124320 5873525 6008273 6323159 6513583 6697953 6987734 7150817 7258960 6871551
3550F871551J99129J78410P2767N85584m71729l1730J72576r7791J30236p009
$$ 6871551 7070680 7249090 7321857 7907441 7435712 7403982 7576558 7478767 7609003 7601994
3540G601994l90558o6710m75145k98922M12283L23727j58818j67689k885m45014
$$ 7601994 7211436 7144726 6669581 6370659 6782942 7106669 6947851 6780162 6777277 6332263
3530F332263m41406N99634k21265j11401n61784L32563Q1149m8223L10491q52445
$$ 6332263 5890857 6490491 6269226 6157825 5596041 5928604 6009753 5961530 6272021 5419576
3520E419576K10388n9350J55365j69125J74890K35120M06144k95953k26671R5367
$$ 5419576 5629964 5570614 5725979 5556854 5731744 5966864 6373008 6077055 5850384 5945751
3510E945751L62959m14962J90224J44209J03839K53276J80778N72182M84974K45234
$$ 5945751 6308710 5893748 6083972 6228181 6332020 6585296 6766074 7338256 7823230 8068464
3500H068464k17961R7289L97394j24228m43380J82998O93924N84190j96986M31095
$$ 8068464 7850503 7947792 8345186 8220958 7777578 7960576 8654500 9238690 9041704 9472799
3490I472799O95001j33038m9004N61277L07604L71322J83911M9299q36J009888
$$ 9472799 10167800 10034762 9985758 10547035 10854639 11225961 11409872 11459171 11458335 12468223
3480A2468223J004874m1074M92432N09343K13631L31433R59288Q84939O93823
$$ 12468223 13473097 13432023 13924455 14433798 14647429 14978862 15938150 16823089 17516912
3471A7516912M81757K82182k28443r8081l85039j277898j423009q81751n94752
$$ 17516912 17998669 18280851 18052408 17954327 17569288 16291390 14868381 13986630 13391878
3462A3391878n42968n4797r10218q15449j033798n64563l82377l95989p42518
$$ 13391878 12848910 12794113 11883895 11068446 10034648 9470085 9087708 8691719 7949201
3453G949201q3678J29907m01200j09437m67419l56534j27464o26217j6408L03212
$$ 7949201 7865523 7995430 7594230 7484793 7017374 6660840 6533376 5907159 5890751 6193963
3443F193963L0100p66219L7874L16697l57144L84238o79651M90787J03830o13590
$$ 6193963 6224063 5457844 5495718 5812415 5455271 5839509 5159858 5650645 5754475 5140885
3433E140885J58481M55599N2148J87360P3636n0615L07698n40293n68459J03139
$$ 5140885 5299366 5754965 5807113 5994473 6068109 6017494 6325192 5784899 5216440 5319579
3423E319579M57287J91573M8520J27372m13489j09452p22532l12072M67140K75317
$$ 5319579 5776866 5968439 6016959 6144331 5730842 5621390 4898858 4586786 5053926 5329243
3413E329243j83628J02933m57915N56707L48192n88669m65134o12757j93267L73708
$$ 5329243 5145615 5248548 4790633 5347340 5695532 5106863 4641729 4028972 3835705 4209413
3403D209413J63999j24125M50296k46805p84364q26270k16632J59756N03366O5109
$$ 4209413 4373412 4249287 4699583 4452778 3668414 2842144 2625512 2785268 3288634 3353743
3393C353743J21068j79829m13009K63348M50084l27984m12868P4463l6495J63785
$$ 3353743 3474811 3294982 2881973 3145321 3595405 3267421 2854553 2929016 2892521 3056306
3383C056306j87480k02459O711m98367J34829K5518L46275L6842n09675n00391
$$ 3056306 2868826 2666367 2673078 2174711 2309540 2335058 2681333 2718175 2208500 1708109
3373A708109J59477M71457m02758p4436J13191N95159l82224p73368j36363M11113
$$ 1708109 1867586 2339043 1936285 1861849 1975040 2570199 2187975 1414607 1278244 1689357
3363A689357K56389j12175O06208j39979K05149j12774l94827k51750l23366O17072
$$ 1689357 1945746 1833571 2439779 2299800 2504949 2392175 1997348 1745598 1422232 2039304
3353B039304m62361J80103K32914n0386m46260J68048M79429q41016O4851l3763
$$ 2039304 1576943 1757046 1989960 1939574 1493314 1661362 2140791 1299775 1364626 1330863
3343A330863P12017R3028J17888Q5290n44993P6227l5852k9685k09504K10283
$$ 1330863 2042880 2135908 2253796 2339086 1794093 1870320 1834468 1804783 1595279 1805562
3333A805562K98225l25274k60052j64686J29781O99201l2832K0313n36503j44637
$$ 1805562 2103787 1778513 1518461 1353775 1483556 2182757 2149925 2170238 1633735 1489098
3323A489098M77408p1486j16535q9408o9832m0044N27974j83838o7495k68068
$$ 1489098 1966506 1895020 1778485 1689077 1619245 1579201 2107175 1923337 1855842 1587774
3313A587774M98332P2761k11712N2528k50843j26446j15832M51513m90619k9491
$$ 1587774 2086106 2158867 1947155 1999683 1748840 1622394 1506562 1958075 1467456 1437965
3303A437965L14772Q5749k73633l14134M11555K3607j69585J06086k31685n39071
$$ 1437965 1752737 1838486 1564853 1250719 1662274 1685881 1516296 1622382 1390697 851626
3293H51626N4097L98746O62827p08225l82411m97928M05027J61572O22388O53123
$$ 851626 905723 1304469 1967296 1259071 876660 378732 783759 945331 1567719 2220842
3283B220842r52719k39137M39479l23527K16452K24719J71412o1759j06559J65359
$$ 2220842 1268123 1028986 1468465 1144938 1361390 1586109 1757521 1695762 1589203 1754562
3273A754562J1183p57474j12981K72090m60733M29442j69238K02555j23291M00716
$$ 1754562 1765745 1008271 895290 1167380 706647 1136089 966851 1169406 1046115 1446831
3263A446831L2539M66456m27040p17225M78659L58773J5119l46370m8770k57215
$$ 1446831 1479370 1945826 1518786 801561 1280220 1638993 1654112 1307742 1258972 1001757
3253A001757O35648M14575n91779p57063j07769N34754l23955K01600M94169k3526
$$ 1001757 1637405 2051980 1460201 703138 595369 1130123 806168 1007768 1501937 1478411
3243A478411n63668M4069N67748K62410j83269J69367N1442m36134M61052J72771
$$ 1478411 914743 958812 1526560 1788970 1605701 1775068 1826510 1390376 1851428 2024199
3233B024199o78576j68520L13829L56781n55921J99191K74572l25429o2348j85322
$$ 2024199 1345623 1177103 1490932 1847713 1291792 1490983 1765555 1440126 1377778 1192456
3223A192456k47565L72125J33167l28443n8207K75187J08611l76949K0471K77875
$$ 1192456 944891 1317016 1450183 1121740 1063533 1338720 1447331 1070382 1090853 1368728
3213A368728q9916L41409O28815Q9494l53548J35113p86811j9810J58908J21725
$$ 1368728 1278812 1620221 2249036 2338530 1984982 2120095 1333284 1313474 1472382 1594107
3203A594107J96878j79645K15368K19780j17110l69031j03182q110j92495n6265
$$ 1594107 1790985 1611340 1826708 2046488 1929378 1560347 1457165 1449055 1256560 1200295
3193A200295L07190N96718m21137j41096J92323p9629M97567L77322M5001J70296
$$ 1200295 1507485 2104203 1683066 1541970 1734293 1654664 2152231 2529553 2574554 2744850
3183B744850J66512q8808k86921J09572o46004l55683k04906m15795M97248L01859
$$ 2744850 2911362 2822554 2535633 2645205 1999201 1643518 1438612 1022817 1520065 1821924
3173A821924q1492L40101M77350L49975J06931l02476L33026m97768L671N35732
$$ 1821924 1740432 2080533 2557883 2907858 3014789 2712313 3045339 2547571 2551242 3086974
3163C086974j06402L2879N2887j51746M60343j66564j93835L3848J42732j02998
$$ 3086974 2980572 3013451 3066338 2914592 3374935 3208371 3014536 3048384 3191116 3088118
3153C088118J37862J63900J70987l86319L8642K45235k65899L42822q3094k67235
$$ 3088118 3225980 3389880 3560867 3174548 3213190 3458425 3192526 3535348 3452254 3185019
3143C185019Q1464k71946K16447K89327K23596o08557P61436L61557n90973o875
$$ 3185019 3266483 2994537 3210984 3500311 3723907 3115350 3876786 4238343 3647370 3640495
3133C640495J93060J00441J67710J26206k07309k74906l53588j20318r3565J20740
$$ 3640495 3833555 3933996 4101706 4227912 4020603 3745697 3392109 3271791 3178226 3298966
3123C298966J33143L1855o7435n7502o0831j32850L21704J12978K12842M6096
$$ 3298966 3432109 3463964 3396529 3339027 3278196 3145346 3467050 3580028 3792870 3838966
3113C838966k78254P44633J93421m15229k38513o3611M77369p82460j54909J43539
$$ 3838966 3560712 4305345 4498766 4083537 3845024 3781413 4258782 3476322 3321413 3464952
3103C464952r2395K4685Q296K28357K70320K86769n37560N7347m0266j88996O44897
$$ 3464952 3372557 3397242 3405538 3633895 3904215 4190984 3653424 3710771 3670505 3481509 4126406
3092D126406j74494q9843k14373l64630L38399L46308j13807j55947j18932R2134
$$ 4126406 3951912 3862069 3647696 3283066 3621465 3967773 3853966 3698019 3579087 3671221
3082C671221j43069l99065O3790J00643l50822k8151l5039k49298J06236k45177
$$ 3671221 3528152 3129087 3192877 3293520 2942698 2914547 2879508 2630210 2736446 2491269
3072B491269L0097K58389J78464n93611j28740K32604M1905k68031l48709J77956
$$ 2491269 2521366 2779755 2958219 2364608 2235868 2468472 2510377 2242346 1893637 2071593
3062B071593O3586p8325j81286J22038Q0825j45524k38321J41733j8001j03744
$$ 2071593 2135179 2056854 1875568 1997606 2078431 1932907 1694586 1836319 1818318 1714574
3052A714574K08062j87399R4861K08404K41075m32096j28784K782l7718J20760
$$ 1714574 1922636 1735237 1830098 2038502 2279577 1847481 1718697 1721479 1683761 1804521
3042A804521M21420J5914o86090k34646L22626N9992m58614m28968N28613k05224
$$ 1804521 2225941 2241855 1555765 1321119 1643745 1703737 1245123 816155 1344768 1139544
3032A139544j78895j9312K45494k67721K79054n1973J8461J61279J78002l58741
$$ 1139544 960649 941337 1186831 919110 1198164 1146191 1164652 1325931 1503933 1145192
3022A145192J31320J64163n23795l08093M88293k9940J93301K76294l10861k75550
$$ 1145192 1276512 1440675 916880 608787 1097080 1067140 1260441 1536735 1225874 950324
3012I50324J35736K15530n73589j90109K99907k7948j83913J47569j69765J32286
$$ 950324 1086060 1301590 728001 537892 837799 809851 625938 773507 603742 736028
3002G36028k58383k71830J66552N66067L86665l95847k08904P35735L03373j42287
$$ 736028 477645 205815 372367 938434 1325099 929252 720348 1456083 1759456 1617169
2992A617169o36596J34482k00300l13233M45384j82105k53743p1004k48751M7112
$$ 1617169 980573 1115055 914755 601522 1046906 864801 611058 540054 291303 338415
2982C38415M5275M62193m9168N52687m13430m63814j27684M17816P76126K97767
$$ 338415 383690 845883 796715 1349402 935972 472158 344474 762290 1538416 1836183
2972A836183m51523r81173J58990k4808R7753k07006K83892N37097j24004o22779
$$ 1836183 1384660 403487 562477 537669 635422 428416 712308 1249405 1125401 502622
2962E02622L23393J01801J86545o32544q3437K32618J09818n9666j38881L41778
$$ 502622 826015 927816 1114361 481817 398380 630998 740816 681150 542269 884047
2952H84047m61511J08953J6815O8705j29801l779m5039K10627j47984M33052L7596
$$ 884047 422536 531489 548304 617009 487208 483429 438390 649017 501033 934085 971681
2941I71681j402k90337O1295k2187j02837l3540j33746K39568P892j95607K70462
$$ 971681 970279 679942 741237 719050 616213 582673 448927 688495 696387 500780 771242
2930G71242M21764p4070n18525J77033k64094j00846L61252J19824M9719k56883
$$ 771242 1193006 1118936 600411 777444 513350 412504 773756 893580 943299 686416
2920F86416K67497l23986j23694R5643l58441J39874J00300m71193O68679J48967
$$ 686416 953913 629927 506233 601876 243435 383309 483609 12416 681095 830062
2910H30062q0278m96251J37829M02683k12155M01563q5613l50393l55935j58862
$$ 830062 749784 253533 391362 794045 581890 983453 897840 547447 191512 32650
2900C2650J92487O45189j06907l104o551m18724K5502J33569j1294k89656J06310
$$ 32650 225137 870326 763419 760315 753764 335040 360542 494111 482817 193161 299471
2889B99471j21566j61172J22357M39380j77743N2666J31031J99671n7786j35597
$$ 299471 177905 16733 139090 578470 400727 453393 584424 784095 726309 590712
2879E90712K12795J96313p49970m68317O86619o16112M3601K25556K88235K49458
$$ 590712 803507 999820 249850 -218467 468152 -147960 -104359 121197 409432 658890
2869F58890j3754o09983K4507Q77642P4m25362j73528L27309o57468L7546L66017
$$ 658890 645136 35153 59660 937302 937376 512014 338486 665795 8327 45873 411890
2858D11890l30238K1929L24072L52720J26818j79722m48054O7671k98208J56111
$$ 411890 81652 103581 427653 780373 907191 727469 279415 347086 48878 204989
2848B04989q5471n72675J89949L4246K03412M48767M87172J35677j97414K44201
$$ 204989 119518 -453157 -263208 -228962 -25550 423217 910389 1046066 848652 1092853
2838A092853m23959m7734N0589J37863m36232K81591n45329k0248L11443n66064
$$ 1092853 668894 621160 671749 809612 373380 654971 109642 89394 400837 -165227
2828a65227M67849J95654M16043k55691J44215P903p11896k91712K27549L65727
$$ -165227 302622 498276 914319 658628 802843 810746 98850 -192862 34687 400414
2818D00414j10209J16838O4080j09141K10413M88103J11466k82342K18806o673
$$ 400414 290205 407043 471123 361982 572395 1060498 1171964 889622 1108428 1101755
2808A101755l44179n96671p9361j01792M15460k88539N7373j91779p0045R3683
$$ 1101755 757576 160905 81544 -20248 395212 106673 164046 -27733 -97778 -4095
2798d095M27196L10012l04013j21128L15341J99978r1418l56603J82213l0796
$$ -4095 423101 733113 429100 307972 623313 823291 731873 375270 557483 526687
2788E26687n30729M28142M96907n6645j56657l142m07804j63661J9499l27822
$$ 526687 -4042 424100 921007 864362 707705 704563 296759 133098 152597 -175225
2778a75225o0300K28665K35257J57910M42225m19669n01086M17149K95053j22685
$$ -175225 -235525 -6860 228397 386307 828532 408863 -92223 324926 619979 497294
2768D97294M20188j03247r18597K2743P96021l04n15852r9526N885R2455M11294
$$ 497294 917482 814235 -104362 -81619 714402 714098 198246 98720 104605 197060 608354
2757F08354K98518m40486j0634J85300l6559M40363p8487j61481j76969n79120
$$ 608354 906872 466386 455752 641052 604493 1044856 966369 804888 627919 48799
2747D8799k05824l74193N41240J18409L87091r9341j44914P5378r7820j71832
$$ 48799 -157025 -531218 10022 128431 515522 416181 271267 346645 248825 76993
2737G6993l87409k71276m3212M23298M01242r8095l28557M54443L59321N4817
$$ 76993 -310416 -581692 -624904 -201606 199636 101541 -227016 227427 586748 641565
2727F41565o60561m21042K67370P18748K99386L23718o32923o02185J89867k39541
$$ 641565 -18996 -440038 -172668 546080 845466 1169184 536261 -65924 123943 -115598
2717a15598m90569L36239O76698M60472o92854j044807o0032N43215L80501j45040
$$ -115598 -606167 -269928 406770 867242 174388 -870419 -930451 -387236 -6735 -151775
2707a51775M72358L00087k29523J07699p23091K59819R9287j59622k34895M38425
$$ -151775 320583 620670 391147 498846 -224245 35574 134861 -24761 -259656 178769
2697A78769J52155J25812K61393n20625L20056l67929L6342J05864K2843j99332
$$ 178769 330924 456736 718129 197504 517560 149631 185973 291837 314680 115348
2687A15348r9025l11844K09522L71683j0104J75291K80363k61351J16833j66713
$$ 115348 16323 -295521 -85999 285684 275580 450871 731234 469883 586716 420003
2677D20003n00398k40006R69879J04277j97752O6551m8845l15531P42040n78665
$$ 420003 -80395 -320401 649478 753755 556003 622554 573709 258178 1000218 421553
2667D21553K0059J09118m5180j96095J50726j84092l39660K83637O07768L94852
$$ 421553 441612 550730 505550 309455 460181 276089 -63571 220066 827834 1222686
2657A222686m81833m18926M1695P6681l25493l12453j5118M59152Q40697J22187
$$ 1222686 740853 321927 363622 440303 114810 -197643 -212761 246391 1087088 1209275
2647A209275n42208k66906J51669m27906J52707n999J82410J7914m85727m96039
$$ 1209275 667067 400161 551830 123924 276631 270632 453042 470956 -14771 -510810
2637e10810K70780K56949K47149M93612K78915j22923k3041K29766m40495J63613
$$ -510810 -240030 16919 264068 757680 1036595 913672 890631 1120397 679902 843515
2627H43515L54636J579l99638K83064j8271J22359o46128m05940j50124N45349
$$ 843515 1198151 1199730 800092 1083156 1064885 1187244 541116 135176 -14948 530401
2617E30401N3735n9542M34059q8498k83240n8369o61205N99220K77348J27431
$$ 530401 584136 524594 958653 870155 586915 528546 -132659 466561 743909 871340
2607H71340L32520L671o4586N79747L3872q2290J64049L79756L18154N0511j41242
$$ 871340 1203860 1207531 1142945 1722692 1756564 1674274 1838323 2218079 2536233 2586744 2445502
2596B445502m52325n95062k17011k57992o5366m29489L44184l70906j7945M40915
$$ 2445502 1993177 1398115 1181104 923112 857746 428257 772441 401535 383590 824505
2586H24505K40040R8536j21616r359r1446n41628L71612L6940L30239Q2635o62375
$$ 824505 1064545 1163081 1041465 1032106 940660 399032 770644 807584 1137823 1220458 558083
2575E58083o0780M23354M9980l29023j02310j09901J04932l97268l20154J07899
$$ 558083 497303 920657 970637 641614 539304 429403 534335 137067 -183087 -75188
2565g5188k71389N61775K80315J57461j81701n14831j42449K6230Q85035M2483
$$ -75188 -346577 215198 495513 652974 471273 -43558 -186007 -159777 725258 767741
2555G67741l75241n7201J43747j39947n1776O4092N24338l18595j71240k50860
$$ 767741 392500 335299 479046 339099 287323 351415 875753 557158 385918 135058
2545A35058J29454j46057K55931m27923j00381L5277R32338N0928q57414O02480
$$ 135058 264512 118455 374386 -53537 -153918 -118641 813697 864625 7211 609691
2535F09691P5970j64082J80133k10735J83938R8723o80806K19468L21799M39575
$$ 609691 685661 521579 701712 490977 674915 773638 92832 312300 634099 1073674
2525A073674j26669O0988n6571l12775j63191L08422k35314m24144J27440j07797
$$ 1073674 947005 1007993 951422 638647 475456 783878 548564 124420 251860 144063
2515A44063J71613L7682J21562K17080o1040m95510L09195J34321L88574j16093
$$ 144063 315676 353358 474920 692000 630960 135450 444645 578966 967540 851447
2505H51447K89885L56548l12675l8531l81790K65284J40718m8629k46341J45864
$$ 851447 1141332 1497880 1185205 1146674 764884 1030168 1170886 1122257 875916 1021780
2495A021780j6538j06566O0817N27459n62974j36332K56939j76709P4033n51254
$$ 1021780 1005242 898676 959493 1486952 923978 787646 1044585 867876 941909 390655
2485C90655m9636O14735r600N59114Q1536l01245j90256p34544M96378N2545o2818
$$ 390655 341019 955754 946154 1505268 1586804 1285559 1095303 360759 857137 909682 846864
2474H46864J94812P2634l03129J69944K78716M37261n17809j14132l10218L6217
$$ 846864 1041676 1114310 811181 981125 1259841 1697102 1179293 1065161 754943 791160
2464G91160K13019j48719J18219P11018K98643l43859k90927l6114j84725K22780
$$ 791160 1004179 855460 973679 1684697 1983340 1639481 1348554 1312440 1127715 1350495
2454A350495Q3825J69033k11056N02144l28691L12092P5039O0545l96984j95883
$$ 1350495 1434320 1603353 1392297 1894441 1565750 1877842 1952881 2013426 1616442 1420559
2444A420559O39085J01021k41133k12723J53707N82958j10082n6687k4523o11368
$$ 1420559 2059644 2160665 1919532 1706809 1860516 2443474 2333392 2276705 2252182 1640814
2434A640814K81463l11700m49466L88871M68037J05112k85637l45696M98593L41623
$$ 1640814 1922277 1610577 1161111 1549982 2018019 2123131 1837494 1491798 1990391 2332014
2424B332014k45543n40458P57451l0705n9391k9146K17052L86981j68843m06695
$$ 2332014 2086471 1546013 2303464 2272759 2213368 2184222 2401274 2788255 2619412 2212717
2414B212717K90003L28204L56373l22108K1213J87492N76866K17629l8757l46560
$$ 2212717 2502720 2830924 3187297 2865189 2886402 3073894 3650760 3868389 3829632 3483072
2404C483072r50250J4241Q00406M90112M64554o6902l0368l40091l29881N45396
$$ 3483072 2532822 2547063 3347469 3837581 4302135 4235233 4204865 3864774 3534893 4080289
2394D080289k78046M36433J38808N13176l87732K77675M86909l29344k86333j27909
$$ 4080289 3802243 4238676 4377484 4890660 4502928 4780603 5267512 4938168 4651835 4523926
2384D523926L78801K44052M56916J31709l68899L91325J5295J96590L12384J08241
$$ 4523926 4902727 5146779 5603695 5735404 5366505 5757830 5773125 5969715 6282099 6390340
2374F390340Q49482J99194M95270r0237R34258K78011L33432L09513M50659M06926
$$ 6390340 7239822 7439016 7934286 7844049 8778307 9056318 9389750 9699263 10149922 10556848
2364A0556848J271782O17199N35779N10390L25035k53601O06786Q02053J196904
$$ 10556848 11828630 12445829 12981608 13491998 13817033 13563432 14170218 14972271 16169175
2355A6169175J704179J721183J729205K266487K270844L578015M650488M940536
$$ 16169175 17873354 19594537 21323742 23590229 25861073 29439088 34089576 39030112
2347C9030112K621092K280277J186271L171708M587943O655561Q705357J2382720
$$ 39030112 41651204 43931481 45117752 48289460 52877403 59532964 68238321 80621041
2339H0621041J3909882K0838380K9731453M8374639P7387401J19095248R7827672
$$ 80621041 94530923 115369303 145100756 193475395 270862796 389958044 487785716
2332D87785716P815230o2417517q9969933p0140790n6943016m6644618l7370714
$$ 487785716 495600946 433183429 343213496 273072706 216129690 169485072 132114358
2325A32114358k6403914j9174072j4219707j0057270o603820m374083j557105
$$ 132114358 105710444 86536372 72316665 62259395 55655575 51281492 49724387
2318D9724387j574740l105075l553602m083052l427527l245877k814254k359763
$$ 49724387 48149647 45044572 41490970 37407918 33980391 30734514 27920260 25560497
2310B5560497k094211j402263j623154n08266j163237j367179r97192r66936o53755
$$ 25560497 23466286 22064023 20440869 19932603 18769366 17402187 16404995 15438059 14784304
2301A4784304k10033n31876j11206n90586j036281r34123k85447M23978j60228
$$ 14784304 14574271 14042395 13931189 13340603 12304322 11370199 11084752 11508730 11348502
2292A1348502o2270k68245o83863q03731o18155p13782k78173m60125J14546M50476
$$ 11348502 11286232 11017987 10334124 9530393 8912238 8198456 7920283 7460158 7574704 8025180
2282H025180j71239p31850k67421k68607j55924J64639o67048k2679k7379n1305
$$ 8025180 7853941 7122091 6854670 6586063 6430139 6594778 5927730 5905051 5877672 5826367
2272E826367K27489l51269r72767K64124j03320m39873j85650Q58559k28533l7790
$$ 5826367 6053856 5702587 4729820 4993944 4890624 4450751 4265101 5123660 4895127 4857337
2262D857337k65952J2826m65424k30076L0595p59273j0555k22838L35487p4076
$$ 4857337 4591385 4604211 4138787 3908711 3939306 3180033 3169478 2946640 3282127 3208051
2252C208051l1577K9540j18389j73977R1494J85600M75495j41692k08003m85377
$$ 3208051 3176474 3206014 3087625 2913648 3005142 3190742 3666237 3524545 3316542 2831165
2242B831165o45952O8651J84771k93621N83835l63049M91466j58344m95292k61745
$$ 2831165 2185213 2253864 2438635 2145014 2728849 2365800 2857266 2698922 2203630 1941885
2232A941885K11994l86398l07193L63436L42598K81120j24434o6610k2421o57358
$$ 1941885 2153879 1767481 1460288 1823724 2166322 2447442 2323008 2256398 2233977 1576619
2222A576619k23846M30912k0065l27338J35829l44635l9430R4926J1910M82853
$$ 1576619 1352773 1783685 1763620 1436282 1572111 1227476 1188046 1282972 1294882 1777735
2212A777735p4108m9581o7529j87046K18652M5773l41124k54394M51764J44108
$$ 1777735 1703627 1654046 1586517 1399471 1618123 1663896 1322772 1068378 1520142 1664250
2202A664250l36953j54705K08968l78932L15349J21649L20349k54810m58913O08827
$$ 1664250 1327297 1172592 1381560 1002628 1317977 1439626 1759975 1505165 1046252 1655079
2192A655079k75266K12149n37033k06782K46822L50621m26064k20950M84095K17721
$$ 1655079 1379813 1591962 1054929 848147 1094969 1445590 1019526 798576 1282671 1500392
2182A500392P0624m32801J19572l71169N0011J34415L1546o2794M35746k91799
$$ 1500392 1571016 1138215 1257787 886618 936629 1071044 1102590 1039796 1475542 1183743
2172A183743p88504J2730J35488j75377M11084k18349j73442J8855j42212J96852
$$ 1183743 395239 407969 543457 368080 779164 560815 387373 406228 264016 460868
2162D60868K18494L84727j37624j6312p30910k36024J32057K81218N33411j06907
$$ 460868 679362 1064089 926465 910153 179243 -56781 75276 356494 889905 782998
2152G82998L52990M3174j25866k04674j2850K24039K04524R5223k21351Q976k81507
$$ 782998 1135988 1179162 1053296 848622 835772 1059811 1264335 1359558 1138207 1147183 865676
2141H65676n0985o3138k74430O7504K37982K41737J36420j08620L19428J408n86724
$$ 865676 814691 751553 477123 544627 782609 1024346 1160766 1052146 1371574 1372982 786258
2130G86258J61912j74468j42899r9832L13431K360m57505M11359l8655M8972j78247
$$ 786258 948170 773702 630803 530971 844402 846762 389257 800616 761961 810933 632686
2119F32686k24084j94068k13784M07522J18897J7294J33091L79517K2387j12959
$$ 632686 408602 214534 750 408272 527169 544463 677554 1057071 1079458 966499
2109I66499K71496n58927j85761N7482k22695j29763L2464Q20452j70520m34744
$$ 966499 1237995 679068 493307 550789 328094 198331 230795 1051247 880727 445983
2099D45983J11455q97471M9299M43147j79412J64935J50843l44647O1754k18388
$$ 445983 557438 -340033 -290734 152413 -26999 137936 288779 -55868 5886 -212502
2089b12502O45869m39622j40733O16351k64147k16010l3414k4307L46807o2166
$$ -212502 433367 -6255 -146988 469363 205216 -10794 -44208 -68515 278292 216126
2079B16126M34589k8257n9348N41088K71241j28279n3265m94849J1568N57392
$$ 216126 650715 622458 563110 1104198 1375439 1247160 1193895 699046 710614 1268006
2069A268006j82957l04811O86860M51314N57402J48319K59649k92016k45884n10986
$$ 1268006 1085049 780238 1467098 1918412 2475814 2624133 2883782 2591766 2345882 1834896
2059A834896J12875j232700J48190N07936j018779J01622l96305L55027J2314
$$ 1834896 1947771 715071 863261 1371197 352418 454040 57735 412762 425076
2050D25076j26010k36180q1374k26459M96756k67158k3323l28095J40520K17693
$$ 425076 299066 62886 -18488 -244947 251809 -15349 -38672 -366767 -226247 -8554
2040h554J02435o1945k27207K10414k22705o8169L49457j30266L25170m2954L14857
$$ -8554 93881 31936 -195271 15143 -207562 -275731 73726 -56540 268630 225676 540533
2029E40533j40456j48626K09142K98008j00424j10927k5345n16370N98080l09451
$$ 540533 400077 251451 460593 758601 658177 547250 521905 5535 603615 294164
2019B94164q3531K44069k18596L2697L58052J40888n65595l17246j79578M64698
$$ 294164 210633 454702 236106 268803 626855 767743 202148 -115098 -294676 170022
2009A70022J28357P6616k4817j46517o4136j6452M5093k50550M08652L51426m22511
$$ 170022 298379 374995 350178 203661 139525 123073 168166 -82384 326268 677694 255183
1998B55183K28579M02084M228m9511m23481j2187j473m0101n88235q7479k54887
$$ 255183 483762 885846 890074 840563 417082 404895 403422 363321 -224914 -312393 -567280
1987e67280j11095O98344l06731m7593L74272K36379n57911K89409k33659k76272
$$ -567280 -678375 19969 -286762 -334355 39917 276296 -281615 7794 -225865 -502137
1977e02137O52554K39568l55140J54503J55740n2467O8020J57690n26456k35576
$$ -502137 150417 389985 34845 189348 345088 292621 360641 518331 -8125 -243701
1967b43701L40497J52724k55287j15958L41566J23237j04067J11281J40852k43873
$$ -243701 96796 249520 -5767 -121725 219841 343078 239011 350292 491144 247271
1957B47271n96917K80653M19103K85059J14884k84723m84510J87734l288m63031
$$ 247271 -349646 -68993 350110 635169 750053 465330 -19180 168554 165266 -297765
1947b97765Q95680K4224k00390l36912N6649K39631J62746Q1654l73430n02606
$$ -297765 597915 622139 421749 84837 141486 381117 543863 625517 252087 -250519
1937b50519K86455P27279K71544k12972l92697j122L63919n19739K69133j51596
$$ -250519 35936 763215 1034759 821787 429090 427968 791887 272148 541281 389685
1927C89685n2558M7567L7212L28302j1476m40071m41920L81390J73618k24573
$$ 389685 337127 384694 421906 750208 738732 298661 -143259 238131 411749 187176
1917A87176L8049R750m19280l1011m65789K26750K46923J7201j9601p2036O69975
$$ 187176 225225 234975 -184305 -215316 -681105 -454355 -207432 -190231 -209832 -281868 388107
1906C88107J87590m53890q9189j10172M39730J26636N1521J44331L36936j49708
$$ 388107 575697 121807 32618 -77554 362176 488812 540333 684664 1021600 871892
1896H71892j83134n86487k34943K6600M13428L4864k62959j62796J63501P69833
$$ 871892 688758 102271 -132672 -106072 307356 342220 79261 -83535 79966 849799
1886H49799l14923l05618P6938L78394l48872l58961j74645J76127J14584p9761
$$ 849799 534876 229258 306196 684590 335718 -23243 -197888 -21761 92823 13062
1876A3062N87419K29287m98152m03428o36475N69100N39863K27213j96669N82495
$$ 13062 600481 829768 331616 -71812 -708287 -139187 400676 627889 431220 1013715
1866A013715o43927m87484n24412M69525M15769k54119J46410k54369j46847J62444
$$ 1013715 369788 -117696 -642108 -172583 243186 -10933 135477 -118892 -265739 -103295
1856a03295O6256L27008J39072L9854k64595L68035L08933k51221l59162q2167
$$ -103295 -37039 289969 429041 468895 204300 572335 881268 630047 270885 188718
1846A88718K49976k89303j29590k05827L24990Q549l27229K67701K98651m44845
$$ 188718 438694 149391 19801 -186026 138964 147513 -179716 87985 386636 -58209
1836e8209k20182k25078O35401k11096l00018L25329M79714l51333q31589L86608
$$ -58209 -278391 -503469 131932 -79164 -379182 -53853 425861 74528 -757061 -370453
1826c70453N61672o01369j30690o9677m45761K58125R78636l92109l35875L89788
$$ -370453 191219 -410150 -540840 -610517 -1056278 -798153 180483 -211626 -547501 -157713
1816a57713j32101m91690l93473O85661L74773k35721K35558L04087l19943j97011
$$ -157713 -289814 -781504 -1174977 -489316 -114543 -350264 -114706 189381 -130562 -327573
1806c27573J34856K88328L12343r4905q0409R7230o260k66273J85157K634k30836
$$ -327573 -192717 95611 407954 313049 232640 329870 323610 57337 242494 245128 14292
1795A4292J11821Q1771J14494L19805K6175o5248r93559L29636L13548l286K2338
$$ 14292 126113 207884 322378 642183 668358 603110 -390449 -60813 252735 249449 271787
1784B71787k88043j08721M3375J30812j43625o3104j86623L96175P60076l69651
$$ 271787 -16256 -124977 -81602 49210 -94415 -157519 -344142 52033 812109 442458
1774D42458j30330k6404m84678P4148o7240K01233N4395J59938J93509k70339
$$ 442458 312128 285724 -198954 -124806 -192046 9187 63582 223520 417029 146690
1764A46690M5184j54757J59730O4404J64535J4711n28205m37260J21024O81205
$$ 146690 191874 37117 196847 261251 425786 440497 -87708 -524968 -403944 277261
1754B77261k51758K33761p50484M72958L92192O4213j66936L9273J27237K19109
$$ 277261 25503 259264 -491220 -18262 373930 438143 271207 310480 437717 656826
1744F56826k11816k56093N1223l68940K58522k23198K53672L72209J15105j15977
$$ 656826 445010 188917 240140 -128800 129722 -93476 160196 532405 647510 531533
1734E31533k58371k17785Q8888o4352n96070N50519L45783m13801n39965L25891
$$ 531533 273162 55377 144265 79913 -516157 34362 380145 -33656 -573621 -247730
1724b47730L12808M87350J60977n45743J12052J67095n503l98608K0139k01339
$$ -247730 65078 552428 713405 167662 279714 446809 441306 42698 62837 -138502
1714a38502q4852n08508J031202l1621m07094P4295m37092R81032L91964l84265
$$ -138502 -223354 -731862 299340 267719 -139375 -65080 -502172 478860 870824 486559
1704D86559R7538j02418q3992L9824l7285l17599J19272j81194J05812J35054
$$ 486559 584097 481679 397687 437511 400226 82627 201899 20705 126517 261571
1694B61571K34404m654m10401m11671K06155Q8179k10251J39933P7470k61269
$$ 261571 495975 491321 80920 -330751 -124596 -36417 -246668 -106735 -29265 -290534
1684b90534l8788O16853J17450K06696l03676L52880L56010m92106l1604j71830
$$ -290534 -329322 287531 404981 611677 308001 660881 1016891 524785 493181 321351
1674C21351q17242L73880L41836L2370j86008j59359J74299J75626L29939m61068
$$ 321351 -495891 -122011 219825 252195 66187 -93172 81127 256753 586692 125624
1664A25624J16456k47257L56040k15385q26448J12736L65599L33856k17872J09846
$$ 125624 242080 -5177 350863 135478 -690970 -578234 -212635 121221 -96651 13195
1654A3195K94038n847l87454Q11851j08068L30275j92673n92813K02477L24036
$$ 13195 307233 301386 -86068 725783 617715 947990 755317 162504 364981 689017
1644F89017r4639n3547L42105o05246p39470M31539K20386l91970P4648M78220
$$ 689017 594378 540831 882936 277690 -461780 -30241 190145 -201825 -127177 351043
1634C51043J27454l38629l46587Q51122K45847j012570k14438J76509M00399m45969
$$ 351043 478497 139868 -206719 644403 890250 -122320 -336758 -160249 240150 -205819
1624b05819P3884M6506J23869L25240j43653k6299p9217n9079Q1332L08486J18883
$$ -205819 -131935 -85429 38440 363680 220027 193728 114511 55432 136764 445250 564133
1613E64133n92492l92907M01529K3057N28097l3006m08855J31238n8501K50631
$$ 564133 -28359 -421266 -19737 3320 531417 498411 89556 220794 162293 412924
1603D12924o85372j51006O97335J65814l71263j56493n8823l51528N63551K44114
$$ 412924 -272448 -423454 273881 439695 68432 -88061 -146884 -498412 65139 309253
1593C09253J93901N3744L08972j59419j67775l85149K27753p4551M9030o54555
$$ 309253 503154 556898 865870 706451 538676 153527 381280 306729 355759 -298796
1583b98796j86396N89256P2374J10247k39938k20974L9480j16268k63722M89955
$$ -298796 -485192 104064 176438 286685 46747 -174227 -134747 -251015 -514737 -24782
1573b4782j2876k59331K24616q1160j89637M56276M93306j60461l82147J88550
$$ -24782 -37658 -296989 -72373 -153533 -343170 113106 606412 445951 63804 252354
1563B52354l30854L54514J97693K59505l8535K47485o17267L3600M02768o25774
$$ 252354 -78500 276014 473707 733212 694677 942162 324895 358495 761263 135489
1553A35489m49871P9463K02903Q51566j78757n03876M19636j70404k20530j81925
$$ 135489 -314382 -234919 -32016 819550 640793 136917 556553 386149 165619 -16306
1543a6306R9082L42795l84373J36255O20165K98870k72072J75750j030975l31324
$$ -16306 82776 425571 41198 177453 797618 1096488 824416 1000166 -30809 -362133
1533c62133M85465j20458L21992j67442o5007N90975j75681m56446l53904L29345
$$ -362133 123332 2874 324866 157424 92417 683392 507711 51265 -302639 26706
1523B6706K51281j25390m50752q9162M04355j3846L40069L08129j0500l65165
$$ 26706 277987 152597 -298155 -387317 17038 3192 343261 651390 640890 275725
1513B75725k13110j43554K42246R618j96439K07626J57658o0558M81967m74632
$$ 275725 62615 -80939 161307 170925 -25514 182112 339770 279212 761179 286547
1503B86547l05200K71512j50755l58239L79048L80840n36353J1706P9077K81768
$$ 286547 -18653 252859 102104 -256135 122913 503753 -32600 -20894 58183 339951
1493C39951M9515n16806j9663L11221J01926k73194l86678n13140L44509O56644
$$ 339951 389466 -127340 -147003 164218 266144 -7050 -393728 -906868 -562359 94285
1483I4285m72814J40602K94166K55863J48809o45373L23564K45397q098l49529
$$ 94285 -378529 -237927 56239 312102 460911 -184462 139102 384499 376401 26872
1473B6872L74792Q8659L11860n46221n66312N4242J64406M17453r5920L88602
$$ 26872 401664 490323 802183 255962 -310350 -256108 -91702 325751 229831 618433
1463F18433j78640J20241J78401k99896l28865O3279K91298p1495m30717L03255
$$ 618433 439793 560034 738435 438539 109674 172953 464251 392756 -37961 265294
1453B65294N05167k18148l78256n17782J73546j88853j31060K53526M8283j23224
$$ 265294 770461 552313 174057 -343725 -170179 -359032 -490092 -236566 -188283 -311507
1443c11507O37863j15034K23357o56181o62406L29177j40515J81361k43739p4749
$$ -311507 326356 211322 434679 -221502 -883908 -554731 -695246 -513885 -757624 -832373
1433h32373K35841j88386J43508J48875J87248L96334j2187J81928j58543m49958
$$ -832373 -596532 -784918 -641410 -492535 -305287 91047 78860 260788 102245 -347713
1423c47713k6035O5194L21803M5758N69577Q3335l61437O19138m01400p30024
$$ -347713 -373748 -308554 13249 59007 628584 711919 350482 969620 568220 -161804
1413a61804P3648K2854m29344J59245K99923K40743j05044j35920k55160R0090
$$ -161804 -88156 -65302 -494646 -335401 -35478 205265 100221 -35699 -290859 -200769
1403b00769M77862j08837j75328Q8849L9336p13448N89792l21897j7574N45738
$$ -200769 277093 168256 -7072 81777 121113 -592335 -2543 -324440 -342014 203724
1393B03724j22135N41917j14839j98596Q4052m49037M0658N33061k19067k51748
$$ 203724 81589 623506 508667 310071 394123 -54914 -14256 518805 299738 47990
1383D7990R8368J05855K11194J01015m7098j77162n75035j2072J55942J08312
$$ 47990 146358 252213 463407 564422 517324 340162 -234873 -246945 -91003 17309
1373A7309l10903k47137J5722M1587j28956K79442O03481l22979l3168N52061
$$ 17309 -293594 -540731 -525009 -483422 -612378 -332936 270545 -52434 -85602 466459
1363D66459j28167K41867k45310k92024j87306L61425J4572k9116k3140m40346
$$ 466459 338292 580159 334849 42825 -144481 216944 231516 202400 179260 -261086
1353b61086j89144l55691r1466M01924m7539r7829K4561M46673j58885M86730
$$ -261086 -450230 -805921 -897387 -495463 -543002 -640831 -616270 -169597 -328482 158248
1343A58248j31940N44250L16134q20057m3122J06590L03804m7691J16880l36920
$$ 158248 26308 570558 886692 66635 23513 130103 433907 386216 503096 166176
1333A66176l21059M97247K84861L6537J8255m22636j86398M92988o09013k25944
$$ 166176 -154883 342364 627225 663762 682017 259381 72983 565971 -43042 -268986
1323b68986q5992K06856K2072j17816P788M13698J85235n95776k50868p2040K43464
$$ -268986 -354978 -148122 -126050 -243866 -236078 177620 362855 -232921 -483789 -555829 -312365
1312c12365K12932L73570q4308k80209l56597P1240J44590J29601K86711R3167
$$ -312365 -99433 274137 189829 -90380 -446977 -375737 -231147 -101546 185165 278332
1302B78332P4984m70735m89226l59691J73809L33957O16691L60773J37176l9437
$$ 278332 353316 -117419 -606645 -966336 -792527 -458570 158121 518894 656070 616633
1292F16633q330m26018m10917O13789j2201K62148l26083l08422j59458L98496
$$ 616633 608303 182285 -228632 385157 372956 635104 309021 599 -158859 239637
1282B39637P5228n75913j7359L20175j67006m89356m5196L50750k38025N51374
$$ 239637 314865 -261048 -278407 41768 -125238 -614594 -659790 -309040 -547065 4309
1272D309j89302N90904O35992k89617k86201q529j72927M51836p81990l58795
$$ 4309 -184993 405911 1041903 752286 466085 457556 284629 736465 -45525 -404320
1262d04320k74549N02344N52008m4735L65717l72657o08447P7543J17922j00726
$$ -404320 -678869 -176525 375483 330748 696465 323808 -284639 -207096 -89174 -189900
1252a89900j01930K86030J65069R8247o9277k2946J37553J28767n54006j79555
$$ -189900 -291830 -5800 159269 257516 188239 165293 302846 431613 -122393 -301948
1242c01948K49016j22126M63370k10861k55284K71999J39879p4617K00209n49687
$$ -301948 -52932 -175058 288312 77451 -177833 94166 234045 159428 359637 -190050
1232a90050N51907m6672J61291m54979l17289K18170K60817J78850n22926m82456
$$ -190050 361857 315185 476476 21497 -295792 -77622 183195 362045 -160881 -643337
1222f43337m9015M15258M51478J79876l27054m6153m26985L28443M98647n06107
$$ -643337 -692352 -277094 174384 354260 27206 -18947 -445932 -117489 381158 -124949
1212a24949j30901L27631l71252j54556M93001L91600j19005m90126k23385k41452
$$ -124949 -255850 71781 -299471 -454027 38974 430574 311569 -178557 -401942 -643394
1202f43394M03963J78527L96571J23901J35668k44924k65458k11782J50742J39100
$$ -643394 -239431 -60904 335667 459568 595236 350312 84854 -126928 23814 162914
1192A62914p992N289L00282M25303o05267n04651M16886M42896J8642l76010L37467
$$ 162914 154922 160211 460493 885796 280529 -224122 192764 635660 654302 278292 615759
1181F15759L12258j8442n40606k01436k89123n8753J65207L78623Q0181o6002
$$ 615759 928017 909575 368969 167533 -121590 -180343 -15136 363487 443668 377666
1171C77666J11024n11176l05300j82286M30324K81829O8162L30990k46580k61981
$$ 377666 488690 -22486 -327786 -510072 -79748 202081 270243 601233 354653 92672
1161I2672J2132k54059L19826j48152M9488j27790K89753j37758j20324M0990
$$ 92672 104804 -149255 170571 22419 71907 -55883 233870 96112 -24212 16778
1151A6778J85737j82220Q6635M4074j79237O2436M74422m8039m01160M14736l22157
$$ 16778 202515 20295 106930 151004 -28233 34203 508625 460586 59426 474162 152005
1140A52005N3970R972j16222L06319K42819m63596L6113p2098Q9241n7252o48975
$$ 152005 205975 215947 99725 406044 648863 185267 221380 149282 238523 181271 -467704
1129d67704J99073L95688M51280Q7563m84696M3862N33067l57713m40044L29231
$$ -467704 -268631 127057 578337 665900 181204 225066 758133 400420 -39624 289607
1119B89607J50221j51352N4437j4830J83303J23688m95873L50115l33885j2828
$$ 289607 439828 288476 342913 328083 511386 635074 139201 489316 155431 142603
1109A42603K56782k38777J42062k02708l76326L71223J35448m693J12827K2835
$$ 142603 399385 160608 302670 99962 -276364 94859 230307 225614 338441 361276
1099C61276j26676J23157K62560m42435m76767K7477O10243j32341J74493J29850
$$ 361276 234600 357757 620317 177882 -298885 -271408 338835 206494 380987 510837
1089E10837j98953j58807k77047r573K73962Q1073M60625M5172l25297l10875
$$ 510837 311884 153077 -123970 -133543 140419 221492 682117 727289 401992 91117
1079I1117J54638J25397k54566j25965k16970R0035J08781K48223k98925j33745
$$ 91117 245755 371152 116586 -9379 -226349 -136314 -27533 220690 -78235 -211980
1069b11980J83219j22818k32151L60289J88521k74851k9832j48880L97098r2148
$$ -211980 -28761 -151579 -383730 -23441 165080 -109771 -139603 -288483 108615 16467
1059A6467m22797J78871J4486J88467O02720o01117m33801N37702j15592K72145
$$ 16467 -406330 -227459 -212973 -24506 578214 -22903 -456704 80998 -34594 237551
1049B37551K90507m10888j64846M81292m04355j10184K02830J73406R942j00666
$$ 237551 528058 117170 -47676 433616 29261 -80923 121907 295313 305255 204589
1039B04589k94101l60738O1041M7508o5303k55153O03466J95474q3372j6289J48699
$$ 204589 -89512 -450250 -389209 -341701 -407004 -662157 -58691 136783 53411 37122 185821
1028A85821L00163N80j10583l04892m44316K9997O10794O42164l00333k55529
$$ 185821 485984 486564 375981 71089 -373227 -343230 267564 909728 609395 353866
1018C53866l88781o2657m17540K47918J14466N3060M68834p6270o4615L67791
$$ 353866 -34915 -97572 -515112 -267194 -152728 -99668 369166 292896 228281 596072
1008E96072m5470o13227j68553K66651q0002L64173L20662K123J16148m64306
$$ 596072 550602 -62625 -231178 35473 -44529 319644 640306 642429 758577 294271
998B94271j49128L8470L19177j9394K29824k17144p50969j07762O23714J31972
$$ 294271 145143 183613 502790 483396 713220 496076 -254893 -362655 261059 393031
988C93031n46514Q8880N01107o6845j03564k28787J87003k73830J7820r2402l6366
$$ 393031 -153483 -64603 436504 369659 266095 37308 224311 -49519 -31699 -124101 -160467
977a60467P92116M8057m59141j69714J75701l8872J72103k89885J92109j503L53110
$$ -160467 631649 679706 220565 50851 226552 187680 359783 69898 262007 260504 613614
966F13614j17421o3774n61855Q2810J64584J50300L94962m82873j72576P8377
$$ 613614 496193 432419 -129436 -46626 117958 268258 663220 180347 7771 86148
956H6148P566J3002K22636J5340J19505k50781K8888m5204J33561k41856l189
$$ 86148 93714 106716 329352 344692 464197 213416 242304 197100 330661 88805 85616
945H5616L03142K34479n99873L4494K52912o2532k21335k0596l24368p102M51588
$$ 85616 388758 623237 23364 57858 310770 248238 26903 6307 -318061 -325163 126425
934A26425P85516n30092l66471O29612K37597J60984M2928l00358m79350N6222
$$ 126425 911941 381849 15378 644990 882587 1043571 1086499 786141 306791 363013
924C63013L0959J61569L19789N2704o2182j98867N421n17996n14432M04339m47089
$$ 363013 393972 555541 875330 928034 865852 666985 672406 154410 -360022 44317 -402772
913d02772q4935M79324K83170K15030l74392M2651j43933L95689L689j05321O48369
$$ -402772 -487707 -8383 274787 489817 115425 158076 14143 409832 413521 308200 956569
902I56569K03845o61719J7751q1014l63907L34024J8884p66871r5138L14570k3866
$$ 956569 1160414 498695 516446 435432 71525 405549 424433 -342438 -437576 -123006 -146872
891a46872N79475K69930k95934k28605L11175j85991k37137l33972L14899J55323
$$ -146872 432603 702533 406599 177994 489169 303178 66041 -267931 46968 202291
881B02291o01018P26758j09503m78656o308J52248J46278j4067n3942q288L29501
$$ 202291 -398727 328031 218528 -260128 -266436 -114188 32090 18023 -35919 -44207 285294
870B85294k01904P2054o3785k0571m6119k34676K16399Q58019p33758P633O2694
$$ 285294 83390 155444 91659 71088 24969 -209707 6692 864711 130953 138586 201280
859B01280n31535K43463M81761m21981j71562J98436K23745k71918j18865k11040
$$ 201280 -330255 -86792 394969 -27012 -198574 -138 223607 -48311 -167176 -378216
849c78216J27592K95303q3142p4983L27586Q75206n54214k22338K54836k62461
$$ -378216 -250624 44679 -38463 -113446 214140 1089346 535132 312794 567630 305169
839C05169p267k42482J07308P03744J02309m91751j83987q22967R7082L05620
$$ 305169 297902 55420 162728 866472 968781 477030 293043 -529924 -432842 -127222
829a27222L05760l5929j76716l95410l36952j32017M65736R66936M74562j03218
$$ -127222 178538 142609 -34107 -429517 -766469 -898486 -432750 534186 1008748 905530
819I05530l43258K07953m77435j4890l42728j20528k51249J52398L60244o3174
$$ 905530 562272 770225 292790 277900 -64828 -185356 -436605 -284207 76037 12863
809A2863j74273J98573K77437r9283r6705R0555R0021K7623K18050l84561O76789
$$ 12863 -161410 37163 314600 215317 118612 209167 299188 326811 544861 160300 837089
798H37089k37908o92586J10671m03928N40467P901k91029j95567J78535K9180
$$ 837089 599181 -93405 17266 -386662 153805 161706 -129323 -324890 -146355 -117175
788a17175K18347j34099j50679M67890o62486j28205O62390R5163K7230r7897
$$ -117175 101172 -32927 -183606 284284 -378202 -506407 155983 251146 278376 180479
778A80479l83336j16108J54049n0771J0072n1266K62165J00588k44238j48030
$$ 180479 -202857 -318965 -164916 -215687 -205615 -256881 5284 105872 -138366 -286396
768b86396Q70263l29136k98209K74183j79293k08745O13310K04639n72916n27632
$$ -286396 583867 254731 -43478 230705 51412 -157333 455977 660616 87700 -439932
758d39932M97066N26564l25864j9456n13166j94414K01063j42995N76891N94520
$$ -439932 57134 583698 257834 238378 -274788 -469202 -268139 -411134 165757 760277
748G60277K10904j73339k22521Q3488m50276l9008k7967K29159j41136q6238K43088
$$ 760277 971181 797842 575321 658809 208533 169525 141558 370717 229581 143343 386431
737C86431J01556l9003K16292k96099K08342j30207p48950o01643R9554P03312
$$ 386431 487987 448984 665276 369177 577519 447312 -301638 -903281 -803727 -100415
727a00415M45536J23666j14503l99473Q1153l93875m04839K56183M56004j65850
$$ -100415 345121 468787 354284 -45189 35964 -357911 -762750 -506567 -50563 -216413
717b16413Q1072O3438j81555P1409j05566K13426o50013l28674K54964K1842M68144
$$ -216413 -135341 -71903 -253458 -182049 -287615 -74189 -724202 -1052876 -797912 -776070 -307926
706c07926N61396J72238N9707l99533l92072j46438K73755N72779O35048n80405
$$ -307926 253470 425708 485415 85882 -306190 -452628 -178873 393906 1028954 448549
696D48549k92518n86337K3594K68803L02430J63064q8865J92454j83239J3703
$$ 448549 156031 -430306 -406712 -137909 164521 327585 238720 431174 247935 261638
686B61638J69952l3657k90043l7111K57501l29881P2641K10444k33857n1360j45202
$$ 261638 431590 397933 107890 70779 328280 -1601 71040 281484 47627 -3733 -148935
675a48935l18315p0416M85437M83613j00237k41592l11815k72521K63725J29052
$$ -148935 -467250 -537666 -52229 431384 331147 89555 -222260 -494781 -231056 -102004
665a02004L07225Q1817j90712J33226J94709l22280L4239k99848J92307K58993
$$ -102004 205221 287038 96326 229552 424261 101981 136220 -163628 28679 287672
655B87672L49685n0060k12768m34991J49811N28432l15068k98019m66699L19538
$$ 287672 637357 587297 374529 -60462 89349 617781 302713 4694 -462005 -142467
645a42467K65989j25154M6416m93729l26046K91448O7013M59829O34410o87472
$$ -142467 123522 -1632 44784 -448945 -774991 -483543 -416530 43299 677709 -9763
635i763k87558j13443k8147M44194m7943J15778j36241K60529L4960k65720K94045
$$ -9763 -297321 -410764 -438911 5283 -42660 73118 -63123 197406 232366 -33354 260691
624B60691m30074O14718o2819J43744l94272o41802L17240m13090M22805J22921
$$ 260691 -169383 445335 382516 526260 131988 -509814 -192574 -605664 -182859 -59938
614e9938j41970j56006M44061K2774L58163K65221k40459q47487J07711M45791
$$ -59938 -201908 -357914 86147 108921 467084 732305 491846 -355641 -247930 197861
604A97861j33333K34488n33589k5258j96320J09399K62064J39429m3046j54249
$$ 197861 64528 299016 -234573 -259831 -456151 -346752 -84688 54741 11695 -142554
594a42554k99837N24554L42741l95404K17613K16008j14636J61293l74209K27622
$$ -142554 -442391 82163 424904 29500 247113 463121 348485 509778 135569 363191
584C63191k53010m40129K24444k75375O57825J8510r9741p06745R3451K75578
$$ 363191 110181 -329948 -105504 -380879 276946 295456 195715 -511030 -417579 -142001
574a42001K37181p6624J3970k28085R8793L52703m31626J005705K57816j038669
$$ -142001 95180 18556 32526 -195559 -96766 255937 -175689 830016 1087832 49163
564D9163k7208l9671M8601M8591j70740l1964J30544L05082M34020l98432l08216
$$ 49163 21955 -17716 30885 79476 -91264 -123228 7316 312398 746418 347986 39770
553C9770k8185m02486M990K82493j14087k60338m54859J10601R03630M04681j22558
$$ 39770 11585 -390901 -385911 -103418 -217505 -477843 -932702 -822101 81529 486210 363652
542C63652m28269L33901l70805P9701J92325K2348j82764K73904K95447J81685
$$ 363652 -64617 269284 -101521 -21820 170505 192853 10089 283993 579440 761125
532G61125K51964n28161m09695J94043k37241j08785J42735K26134N8894J40254
$$ 761125 1013089 484928 75233 269276 32035 -76750 65985 292119 351013 491267
522D91267k88344k89140L57546k64956J68093J46341L75595k65037o47269k7664
$$ 491267 202923 -86217 271329 6373 174466 320807 696402 431365 -215904 -243568
512b43568M18230q27016k50666N46029P803O68496J19934p539k61991K56673M6302
$$ -243568 174662 -652354 -903020 -356991 -349188 319308 439242 431703 169712 426385 472687
501D72687k59412K76104j54791p1764l32101k38398M1227J82267o51J02439j94643
$$ 472687 213275 489379 334588 262824 -69277 -307675 -266448 -84181 -84832 17607 -177036
490a77036N6310M02786k83224O3860k1150J8141M77962r8474m63031r1539M11392
$$ -177036 -120726 282060 -1164 62696 41546 59687 537649 439175 -23856 -115395 295997
479B95997j1252r4154K46611j69541M6216J69858J50320J76264k59940n73197
$$ 295997 284745 190591 437202 267661 313877 483735 634055 810319 550379 -22818
469b2818J51606r9843J39490m4459m49961l99083N52870K45938J16728m40412
$$ -22818 128788 28945 168435 123976 -325985 -725068 -172198 73740 190468 -249944
459b49944l20098J388158p42794q6613K1402n85006L10686K60488L55935j7886
$$ -249944 -570042 818116 75322 -11291 10111 -574895 -264209 -3721 352214 334328
449C34328K32852K42597l59933l65386J71323j52859j09005K67795j2378k05674
$$ 334328 567180 809777 449844 84458 255781 102922 -6083 261712 249334 43660
439D3660o4277l74986L01983N58579L69m22661j01378N05649l78374m67080J70767
$$ 43660 -20617 -395603 -93620 464959 465328 42667 -58711 446938 68564 -398516 -227749
428b27749J00711K57843J49146p6391k04243m87496L84281k3499R60292K17475
$$ -227749 -127038 130805 279951 203560 -683 -488179 -103898 -127397 832895 1050370
418A050370r37531m16400K91664J97722j21926J58199j37599J54171O8008K14898
$$ 1050370 112839 -303561 -11897 185825 63899 222098 84499 238670 306678 521576
408E21576P117k06370J15157o04806K15644l4083J00788o04424N3107M31654k18253
$$ 521576 528693 322323 437480 -167326 48318 14235 115023 -489401 -436294 -4640 -222893
397b22893m76291m07178N27869M78505l17900N7477K33966m6269O96141l5559
$$ -222893 -699184 -1106362 -578493 -99988 -417888 -360411 -126445 -172714 523427 487868
387D87868L09601k05663m64937l19381l4810K13064L65471J88679N8960n39417
$$ 487868 797469 591806 126869 -192512 -227322 -14258 351213 539892 598852 59435
377E9435l69123L78224j17322L33242K11608m84519J42734n62569O51847k18854
$$ 59435 -309688 68536 -48786 284456 496064 11545 154279 -408290 243557 24703
367B4703K7643N68711m19155m43261m10370K28028P27249J03489l84013L7235
$$ 24703 52346 621057 201902 -241359 -651729 -423701 303548 407037 23024 60259
357F0259L93996K15049r8374m6258l19597K52065j79156l08309p0295j45779M01492
$$ 60259 454255 669304 570930 524672 205075 457140 277984 -30325 -100620 -246399 155093
346A55093q4053K33641P7955n85454J30718M80215l44147k4245J07850J28258
$$ 155093 71040 304681 382636 -202818 -72100 408115 63968 39723 147573 275831
336B75831Q1900K4051J63586L8362K59935m5676n67533K9632j91888K23728k52404
$$ 275831 357731 381782 545368 583730 843665 797989 230456 260088 68200 291928 39524
325C9524m38869K93840L39590J40575m27089K81112l84105L01016L07318L17015
$$ 39524 -399345 -105505 234085 374660 -52429 228683 -155422 145594 452912 769927
315G69927j37795p28898l64322K04202J43134k32744L01827K20320m42572M60338
$$ 769927 632132 -96766 -461088 -256886 -113752 -346496 -44669 175651 -266921 193417
305A93417k77470M36343m64971k51050o7123M57337m9312l20272R8403J33218
$$ 193417 -84053 352290 -112681 -363731 -430854 26483 -22829 -343101 -244698 -111480
295a11480Q08689n10811m98347N6821L4024j18452L98006L43752j38295k7844
$$ -111480 697209 186398 -311949 -255128 -221104 -339556 58450 402202 263907 236063
285B36063M67o34476K97588R6453m6686M15751M8636r54197O5542J46771L21695
$$ 236063 236530 -397946 -100358 -3905 -50591 365160 413796 -540401 -474859 -328088 -6393
274f393J68477O8955l80443K50591k92508k05755L38626L74603o5389j23897O6466
$$ -6393 162084 231039 -149404 101187 -191321 -397076 -58450 316153 250764 126867 193333
263A93333J84100L604m3515n477l40528K42006m28434j72402J82537R8529n8244
$$ 193333 377433 381037 337522 332045 -8483 233523 -194911 -367313 -184776 -86247 -144491
252a44491m8777j21147L04697p8220j88147P59927l13978n3227l6148p4634q118
$$ -144491 -193268 -314415 -9718 -87938 -276085 483842 169864 116637 80489 5855 -2263
241b263J5735O58268m09373k08787M474j1356k23441j41171n6432J46571n0786
$$ -2263 13472 671740 262367 53580 58054 46698 -176743 -317914 -374346 -227775 -278561
230b78561K92749Q7311m91084J32294P20703m224L53842q1153l66910q20571N75780
$$ -278561 14188 101499 -389585 -257291 463412 459188 813030 731877 364967 -455604 120176
219A20176M06924M7131l86536q7110j36717r5398L73759j82724k99867l37635
$$ 120176 527100 574231 187695 100585 -36132 -131530 242229 59505 -240362 -577997
209e77997L67845J7656K6072L60456m14337k81446O2988j95875J78938L99624
$$ -577997 -210152 -192496 -166424 194032 -220305 -501751 -438763 -634638 -455700 -56076
199e6076L26024p46257N66081K06149j88038k65603l67165J28073q0111L88337
$$ -56076 269948 -476309 89772 295921 107883 -157720 -524885 -396812 -476923 -88586
189h8586J09529L40353M7452j82945l76853l26554K80337p1491N82512m44896
$$ -88586 20943 361296 408748 225803 -151050 -477604 -197267 -268758 313754 -131142
179a31142k2547j8218N8011M73300K58253l74073n29511k38568K89137M52701
$$ -131142 -153689 -171907 -113896 359404 617657 243584 -285927 -524495 -235358 217343
169B17343k81120k3149L39342j51940n37228J32084j25142l9683K49008K64971
$$ 217343 -63777 -86926 252416 100476 -436752 -304668 -429810 -469493 -220485 44486
159D4486L05268m6344K3456N1205l94723L37574M38267k44720N897n13207k80321
$$ 44486 349754 303410 326866 378071 -16652 320922 759189 514469 520366 7159 -273162
148b73162K31662J15566m21044K32364Q1520k7346L0610k71918q8469k17233O32400
$$ -273162 -41500 74066 -346978 -114614 -33094 -60440 -29830 -301748 -390217 -607450 24950
137B4950P0344l52903l7236q3194n9129J78831j51903M3006M69387n66801j01638
$$ 24950 95294 -257609 -294845 -378039 -437168 -258337 -410240 -367234 102153 -464648 -566286
126e66286K23965L23309J82643L20858J06267o16572l67082l18658L27465l5704
$$ -566286 -342321 -19012 163631 484489 590756 -25816 -392898 -711556 -384091 -419795
116d19795K21183n1512l47657J25873N00620j91527J91297J83655J73599J15534
$$ -419795 -198612 -250124 -597781 -471908 28712 -162815 28482 212137 385736 501270
106E01270m23558p8093l19130j48168M02913l92217K12026L78564M204j909R2394
$$ 501270 77712 -381 -319511 -467679 -64766 -456983 -244957 133607 137811 135902 228296
95B28296l51042J00499L37122n3660K662m06215J04476l01409k33900L8137J86396
$$ 228296 -122746 -22247 314875 261215 263877 -142338 -37862 -339271 -573171 -535034 -348638
84c48638j53826j3238K39717M35040l70274J7581L04957l12803l35821N59488
$$ -348638 -502464 -515702 -275985 159055 -211219 -193638 111319 -201484 -537305 22183
74B2183l48941k58071M92322j1852J82592J9229n98214k8464M53630Q0756k50605
$$ 22183 -326758 -584829 -92507 -104359 78233 97462 -500752 -529216 -75586 5170 -245435
63b45435o2819L00642J96778q8798N1500k89688J6744j54286k36454K32234K23513
$$ -245435 -308254 -7612 189166 100368 151868 -137820 -121076 -275362 -511816 -279582 -56069
52e6069K25276K3721r7567j5097M4247o16378k27508K03713M17072P9957k09272
$$ -56069 169207 192928 95361 80264 124511 -491867 -719375 -515662 -98590 -18633 -227905
41b27905j85772N46021j16943l36702j66510M72089M869j68968K82761j83404
$$ -227905 -413677 132344 15401 -321301 -487811 -15722 -10853 -179821 102940 -80464
31h0464k02262k50255L81872k46613j97588L6900L99408Q4076k67356q1536M5032
$$ -80464 -282726 -532981 -151109 -397722 -595310 -558410 -159002 -74926 -342282 -423818 -378786
20c78786J30363l88488m8140J03212J49814j09894K28987j69905J07441J06043
$$ -378786 -248423 -636911 -685051 -581839 -432025 -541919 -312932 -482837 -375396 -269353
10b69353k12821P6159J08252J79240Q4285n3918J85267m61293P9777K23641
$$ -269353 -482174 -406015 -297763 -118523 -34238 -88156 97111 -364182 -284405 -60764
0f0764
$$ -60764
$$ Imaginary data points
##PAGE= N=2
##DATA TABLE= (X++(I..I)), XYDATA
16383a051819k39240J04545J33405j91358n2887K30069r410O3251J52301J75435
$$ -1051819 -1291059 -1186514 -1053109 -1244467 -1297354 -1067285 -1076695 -1013444 -861143 -685708
16373f85708J1335K95402j53420m38408K46656j32773q5043k58527M8013J6619
$$ -685708 -674373 -378971 -532391 -970799 -724143 -856916 -941959 -1200486 -1152473 -1135854
16363a135854j45586n1214J18642M2775L1964J67186K6417R1099J32223k81868
$$ -1135854 -1281440 -1332654 -1214012 -1171237 -1139273 -972087 -945670 -854571 -722348 -1004216
16353a004216k60990q2856K58403M62870K63569p6168j26832n9391o9122l0687
$$ -1004216 -1265206 -1348062 -1089659 -626789 -363220 -439388 -566220 -625611 -694733 -725420
16343g25420Q6075P5994m15846M0504n179M5098L20740J28706L14716J84574m01069
$$ -725420 -639345 -563351 -979197 -938693 -943872 -898774 -578034 -449328 -134612 49962 -351107
16332c51107K8384K04118K82793m58266k33773K92775l2971p1147K31752o0838
$$ -351107 -322723 -118605 164188 -294078 -527851 -235076 -268047 -339194 -107442 -168280
16322a68280N3086l16755l5532L4348J26750L28859j17286k8446L21891M18188
$$ -168280 -115194 -431949 -467481 -433133 -306383 22476 -94810 -123256 198635 616823
16312F16823Q5041J34953l18927m21899p9278K64294k48221J67596O6282J30739
$$ 616823 701864 836817 517890 95991 16713 281007 32786 200382 266664 397403
16302C97403l1464m68443q1519L61421J1575l43611K52735N50914q7999m14095
$$ 397403 365939 -102504 -184023 177398 188973 -154638 98097 649011 561012 146917
16292A46917J53071L07335J06120l49465L6214k55940j49023O33876k47114J31610
$$ 146917 299988 607323 713443 363978 400192 144252 -4771 629105 381991 513601
16282E13601j43595j20218J37438l43648J73597M66377Q4593n7484l62724q302
$$ 513601 370006 249788 387226 43578 217175 683552 768145 710661 347937 339635
16272C39635N14026l45884J30658M0507J9352j80162O1314o2371M99928j24719
$$ 339635 853661 507777 638435 678942 698294 518132 579446 517075 1017003 892284
16262H92284m19025M15800K50200M0962o062l16333J13420O8073j40454J74370
$$ 892284 473259 889059 1139259 1180221 1174159 857826 971246 1039319 898865 1073235
16252A073235l3497O7243l61019K31337N54160Q5933j85473Q4096m38331Q2206
$$ 1073235 1039738 1106981 745962 977299 1531459 1617392 1431919 1516015 1077684 1159890
16242A159890J8778l31393r5691M63797k8203O9788M0798n32161K1260q6741k2182
$$ 1159890 1178668 847275 751584 1215381 1187178 1256966 1297764 765603 786863 700122 677940
16231F77940J24895r4931L63103J39967Q2556K12491n65588j23351O4486M56296
$$ 677940 802835 707904 1071007 1210974 1293530 1506021 940433 817082 881568 1337864
16221A337864Q0142k66555O17231J70015l93904j75017K07039o88065n51638J98149
$$ 1337864 1418006 1151451 1768682 1938697 1544793 1369776 1576815 888750 337112 535261
16211E35261M71041l24918K43101L68678m32479j55716J54510K74744o7880l44771
$$ 535261 1006302 681384 924485 1293163 860684 704968 859478 1134222 1066342 721571
16201G21571j2758J62129j7961N98202k64969O4967O08028J37277J60691l15144
$$ 721571 708813 870942 852981 1451183 1186214 1251181 1859209 1996486 2157177 1842033
16191A842033l89412J95647K20429K8889m76691J8926k02344J70143K29039n18341
$$ 1842033 1452621 1648268 1868697 1897586 1420895 1439821 1237477 1407620 1636659 1118318
16181A118318k99621k08365Q41299J29507L40483n37234l37350J86831N30927
$$ 1118318 818697 610332 1451631 1581138 1921621 1384387 1047037 1233868 1764795
16172A764795j34078J1345j82482K93433k4989r8551k79245m39367L16690k0067
$$ 1764795 1630717 1642062 1459580 1753013 1728024 1629473 1350228 910861 1227551 1207484
16162A207484N39356M89411L2273p19508j73240K12063M9483j71100L70652j49028
$$ 1207484 1746840 2236251 2268524 1549016 1375776 1587839 1637322 1466222 1836874 1687846
16152A687846J14930l60873l14248j34837L87615O33598m26039k24994J00020
$$ 1687846 1802776 1441903 1127655 992818 1380433 2014031 1587992 1362998 1463018
16143A463018N7009R5663L23842L3757q01193L02929K59951m4235Q7674K95919
$$ 1463018 1520027 1615690 1939532 1973289 1172096 1475025 1734976 1690741 1778415 2074334
16133B074334j44438l23704L15341j56377R2630j01345k15445j57415J63994N98677
$$ 2074334 1929896 1606192 1921533 1765156 1857786 1756441 1540996 1383581 1547575 2146252
16123B146252r2925l22254n49531M00789j65348k47074P8579O8637j16027K03865
$$ 2146252 2053327 1731073 1181542 1582331 1416983 1169909 1248488 1317125 1201098 1404963
16113A404963L49580N7026r7597j77274n96614K99967L71654k46492N39539J29402
$$ 1404963 1754543 1811569 1713972 1536698 940084 1240051 1611705 1365213 1904752 2034154
16103B034154r9202J73055k19480m4748k20636q67296Q241P59426K57058J08926
$$ 2034154 1934952 2108007 1888527 1843779 1623143 755847 764088 1523514 1780572 1889498
16093A889498k57484k7000J18788k63742J04425N64995K6824p9326r0477k8008
$$ 1889498 1632014 1605014 1723802 1460060 1564485 2129480 2156304 2076978 1986501 1958493
16083A958493j54135m49292L28497J08354P3912j38114n6944m85616o5465R84416
$$ 1958493 1804358 1355066 1683563 1791917 1865829 1727715 1670771 1185155 1119690 2104106
16073B104106l40789o78857L78843n6144j13989M21766k80368l95700K64857L77234
$$ 2104106 1763317 1084460 1463303 1407159 1293170 1714936 1434568 1038868 1303725 1680959
16063A680959j40089k46670N11870J26079o13027o4397L20980n81190M38890O42041
$$ 1680959 1540870 1294200 1806070 1932149 1319122 1254725 1575705 994515 1433405 2075446
16053B075446j45516m09914j003j02972j08050O9570l03381O4439K95993k22461
$$ 2075446 1929930 1520016 1519013 1416041 1307991 1377561 1074180 1138619 1434612 1212151
16043A212151Q30649M13105k94791l55740m04373J33015n9358M0691k22903o5372
$$ 1212151 2042800 2455905 2161114 1805374 1401001 1534016 1474658 1515349 1292446 1227074
16033A227074L72282P3774j67816K80076j45653l75346K42101j83091k85174J82327
$$ 1227074 1599356 1673130 1505314 1785390 1639737 1264391 1506492 1323401 1038227 1220554
16023A220554K35189K14580j4186m36679K68407M92295k30729L56621k0321n68866
$$ 1220554 1455743 1670323 1656137 1219458 1487865 1980160 1749431 2106052 2085731 1516865
16013A516865M30290J14276o2580l21269o6805O20596K66425j097632P2397r7710
$$ 1516865 1947155 2061431 1998851 1677582 1610777 2231373 2497798 1400166 1472563 1374853
16003A374853L12955N09206l80156l46752k75835j03919j26862L10222J6163L24201
$$ 1374853 1687808 2197014 1816858 1470106 1194271 1090352 963490 1273712 1289875 1614076
15993A614076k82913j98904N97448P29572J33930j001002n6265j15828K91024
$$ 1614076 1331163 1132259 1729707 2459279 2593209 1592207 1535942 1420114 1711138
15984A711138K34166l61194J00079k57092L97942j02383k82117J01048j27620
$$ 1711138 1945304 1584110 1684189 1427097 1825039 1722656 1440539 1541587 1413967
15975A413967L42578L48342m13194Q4651O5073J68553j26117l11354k53163Q1879
$$ 1413967 1756545 2104887 1691693 1776344 1841417 2009970 1883853 1572499 1319336 1401215
15965A401215o994k08108n0237K585Q67198N28282m25783k25963n554j55089J12983
$$ 1401215 1394221 1186113 1135876 1138461 2005659 2533941 2108158 1882195 1876641 1721552 1834535
15954A834535k25411J25850k49261q8285P22696k65232k36108o5938n4945j37201
$$ 1834535 1609124 1734974 1485713 1397428 2120124 1854892 1618784 1552846 1497901 1360700
15944A360700M55189j90621j44251K39811j81869k94739M70751M34238k62340
$$ 1360700 1815889 1625268 1481017 1720828 1538959 1244220 1714971 2149209 1886869
15935A886869q8975r4827k33310n373p4494L28966N8602j09104m192J74341j33993
$$ 1886869 1797894 1703067 1469757 1464384 1389890 1718856 1777458 1668354 1664162 1838503 1704510
15924A704510j6709J29260n24872K09321J97993J49849j23255j86141L26565J29782
$$ 1704510 1687801 1817061 1292189 1501510 1699503 1849352 1726097 1539956 1866521 1996303
15914A996303J71483n36854n04343K06288M28976K92414l54702P7010M16061n03638
$$ 1996303 2167786 1630932 1126589 1332877 1761853 2054267 1699565 1776575 2192636 1688998
15904A688998k48641K81345n49702j0875M76690Q16k93234N8931J65205J5520
$$ 1688998 1440357 1721702 1172000 1161125 1637815 1638631 1345397 1404328 1569533 1585053
15894A585053L0872j95461L4403L75741K35272P9470j09269j46105L36919J21377
$$ 1585053 1615925 1420464 1454867 1830608 2065880 2145350 2036081 1889976 2226895 2348272
15884B348272l59823K7571K73221k48350l18344k43001j48899p8532K19801k39563
$$ 2348272 1988449 2016020 2289241 2040891 1722547 1479546 1330647 1252115 1471916 1232353
15874A232353K63197N73434O71097k59406k62628l3299r5493n74999m83001L35864
$$ 1232353 1495550 2068984 2740081 2480675 2218047 2184748 2089255 1514256 1031255 1367119
15864A367119N4119L64112K08651j71489m05893L40991N18602j91281l96544K0490
$$ 1367119 1421238 1785350 1994001 1822512 1416619 1757610 2276212 2084931 1688387 1708877
15854A708877l16097j97485M04306j63524o4095L62485k68386K29182k99070L3601
$$ 1708877 1392780 1195295 1599601 1436077 1371982 1734467 1466081 1695263 1396193 1429794
15844A429794L17843N15705j40687r49445L50317M0107J79264N26470k28881K40998
$$ 1429794 1747637 2263342 2122655 1173210 1523527 1563634 1742898 2269368 2040487 2281485
15834B281485Q6089m78500j28024J47084n01954K33720L62333K13034m2339n60979
$$ 2281485 2367574 1889074 1761050 1908134 1406180 1639900 2002233 2215267 2172928 1611949
15824A611949K88430N67253m83156j46498L60013j12940j73317l80731l21473
$$ 1611949 1900379 2467632 1984476 1837978 2197991 2085051 1911734 1531003 1209530
15815A209530m30163P8668N88217M04727L06131k97317L39825p7001k07973m81288
$$ 1209530 779367 858035 1446252 1850979 2157110 1859793 2199618 2122617 1914644 1433356
15805A433356m9765k18978K53415N31558l11533j29694r8681k01056L0895q1079
$$ 1433356 1383591 1164613 1418028 1949586 1638053 1508359 1409678 1208622 1239517 1158438
15795A158438M25159N48520k13117j53333N8097m30892K643p332l67678L20644
$$ 1158438 1583597 2132117 1919000 1765667 1823764 1392872 1395515 1388183 1020505 1341149
15785A341149k93762j28378K54799R53417j17005j19893J79804k15615j37734
$$ 1341149 1047387 919009 1173808 2127225 2010220 1890327 2070131 1854516 1716782
15776A716782L50407J278K22307k98396j34467l97693m74835P97916J9794L11670
$$ 1716782 2067189 2068467 2290774 1992378 1857911 1460218 985383 1783299 1803093 2114763
15766B114763p45907j16749N14712M38404k7201j85483N176j57285k94221J52644
$$ 2114763 1368856 1252107 1766819 2205223 2178022 1992539 1997715 1840430 1546209 1698853
15756A698853K08625n86955l5220j58963N58284J13143j27301J87800l73320J01074
$$ 1698853 1907478 1320523 1285303 1126340 1684624 1797767 1670466 1858266 1484946 1586020
$$ [...]
##END NTUPLES=NMR SPECTRUM
##END=
