##TITLE=1H_DE-80H_X3
 200.13MHz, d2o
 8 sc
 
 19ns.26.2.2025
##JCAMPDX= 6.0         $$ Bruker NMR JCAMP-DX V2.0
##DATA TYPE= NMR SPECTRUM
##DATA CLASS= NTUPLES
##ORIGIN= UXNMR, Bruker Analytische Messtechnik GmbH
##OWNER= pz
$$ XWIN-NMR		Version 3.5
$$ Thu Oct  9 12:26:18 2025 Russian Standard Time (UT+4h)  Yarkov@DPX200
##.OBSERVE FREQUENCY= 200.1313
##.OBSERVE NUCLEUS= ^1H
##.ACQUISITION MODE= SIMULTANEOUS
##.ACQUISITION SCHEME= undefined
##.AVERAGES= 8
##.DIGITISER RES= 18
##SPECTROMETER/DATA SYSTEM= spect
##.PULSE SEQUENCE= zg30
##.SOLVENT NAME= CDCl3
##.SHIFT REFERENCE= (INTERNAL, CDCl3, 0, 15.5056)
##AUDIT TRAIL= $$ (NUMBER, WHEN, WHO, WHERE, WHAT)
$$ ##TITLE= Audit trail, XWIN-NMR		Version 3.5
$$ ##JCAMPDX= 5.01
$$ ##ORIGIN= Bruker BioSpin GmbH
$$ ##OWNER= Yarkov
$$ C:/Bruker/XWIN-NMR/data/yarkov2/nmr/H-C/1/pdata/1/auditp.txt
$$ ##AUDIT TRAIL=  $$ (NUMBER, WHEN, WHO, WHERE, WHAT)
(   1,<2025-10-09 12:25:36.98 +0400>,<Yarkov>,<DPX200>,
      <created by zg, POWCHK disabled, PULCHK disabled
       configuration hash MD5:
       00 E9 B6 7A A2 85 ED C7 34 08 36 98 17 FE 4E 26
       data hash MD5: 16K
       07 CC DA BB 05 D3 17 71 3C 86 A0 95 8D 8F 88 5C>)
(   2,<2025-10-09 12:25:42.34 +0400>,<Yarkov>,<DPX200>,
      <Start of raw data processing
       efp BC_mod = 2 LB = 0.25 FT_mod = 6 PKNL = 1 PHC0 = -2432.963 PHC1 = 8.79097 SI = 16K 
       data hash MD5: 16K
       5F A0 BE C4 ED 1D 64 2F B1 2E A2 57 E3 F1 B4 1F>)
(   3,<2025-10-09 12:25:47.15 +0400>,<Yarkov>,<DPX200>,
      <abs ABSG = 5 
       data hash MD5: 16K
       DA 26 02 6A EF AC 54 4C 10 FF E0 5E E5 B4 92 16>)
$$ ##END=
$$ 
$$ hash MD5
$$ 50 F1 F0 4C 86 CD 4A A1 5F DC C5 65 97 2B AE 10
##$RELAX= 
##$RELAX= 
##$RELAX= 
##$RELAX= 
##$RELAX= 
##$RELAX= 
$$ Bruker specific parameters
$$ --------------------------
##$DU= <C:/Bruker/XWIN-NMR>
##$EXPNO= 1
##$NAME= <H-C>
##$PROCNO= 1
##$TYPE= <nmr>
##$USER= <yarkov2>
##$AMP= (0..31)
100 100 100 100 100 100 100 100 100 100 100 100 100 100 100 100 100 100 
100 100 100 100 100 100 100 100 100 100 100 100 100 100 
##$AQSEQ= 0
##$AQ_mod= 1
##$AUNM= <au_zg>
##$AUTOPOS= <>
##$BF1= 200.13
##$BF2= 200.13
##$BF3= 200.13
##$BF4= 200.13
##$BF5= 200.13
##$BF6= 200.13
##$BF7= 200.13
##$BF8= 200.13
##$BYTORDA= 1
##$CFDGTYP= 0
##$CFRGTYP= 5
##$CHEMSTR= <none>
##$CNST= (0..31)
1 1 145 1 1 1 1 1 1 1 1 1 1 1 1 1 1 1 1 1 1 1 1 1 1 1 1 1 1 1 1 1 
##$CPDPRG= <>
##$CPDPRG1= <>
##$CPDPRG2= <>
##$CPDPRG3= <>
##$CPDPRG4= <mlev>
##$CPDPRG5= <mlev>
##$CPDPRG6= <mlev>
##$CPDPRG7= <mlev>
##$CPDPRG8= <mlev>
##$CPDPRGB= <>
##$CPDPRGT= <>
##$D= (0..31)
0 0.7 0 0 0 0 0 0 0 0 0 0.03 0 0 0 0 0 0 0 0 0 0 0 0 0 0 0 0 0 0 0 0 
##$DATE= 1759998336
##$DBL= (0..7)
120 120 120 120 120 120 120 120 
##$DBP= (0..7)
150 150 150 150 150 150 150 150 
##$DBP07= 0
##$DBPNAM0= <>
##$DBPNAM1= <>
##$DBPNAM2= <>
##$DBPNAM3= <>
##$DBPNAM4= <>
##$DBPNAM5= <>
##$DBPNAM6= <>
##$DBPNAM7= <>
##$DBPOAL= (0..7)
0.5 0.5 0.5 0.5 0.5 0.5 0.5 0.5 
##$DBPOFFS= (0..7)
0 0 0 0 0 0 0 0 
##$DE= 6
$$ [...]
##$SUBNAM3= <"">
##$SUBNAM4= <"">
##$SUBNAM5= <"">
##$SUBNAM6= <"">
##$SUBNAM7= <"">
##$SUBNAM8= <"">
##$SUBNAM9= <"">
##$SW= 18.0517328524113
##$SWIBOX= (0..15)
0 0 2 0 0 0 0 0 0 0 0 0 0 0 0 0 
##$SW_h= 3612.71676300578
##$TD= 16384
##$TD0= 1
##$TE= 0
##$TE2= 300
##$TE3= 300
##$TEG= 300
##$TL= (0..7)
0 120 120 120 120 120 120 120 
##$TP= (0..7)
150 150 150 150 150 150 150 150 
##$TP07= 0
##$TPNAME0= <>
##$TPNAME1= <>
##$TPNAME2= <>
##$TPNAME3= <>
##$TPNAME4= <>
##$TPNAME5= <>
##$TPNAME6= <>
##$TPNAME7= <>
##$TPOAL= (0..7)
0.5 0.5 0.5 0.5 0.5 0.5 0.5 0.5 
##$TPOFFS= (0..7)
0 0 0 0 0 0 0 0 
##$TUNHIN= 0
##$TUNHOUT= 0
##$TUNXOUT= 0
##$USERA1= <user>
##$USERA2= <user>
##$USERA3= <user>
##$USERA4= <user>
##$USERA5= <user>
##$V9= 5
##$VALIST= <valist>
##$VCLIST= <CCCCCCCCCCCCCCC>
##$VD= 0
##$VDLIST= <DDDDDDDDDDDDDDD>
##$VPLIST= <PPPPPPPPPPPPPPP>
##$VTLIST= <TTTTTTTTTTTTTTT>
##$WBST= 1024
##$WBSW= 4
##$XGAIN= (0..3)
0 0 0 0 
##$XL= 0
##$YL= 0
##$YMAX_a= 698809
##$YMIN_a= -640257
##$ZGOPTNS= <>
##$ZL1= 120
##$ZL2= 120
##$ZL3= 120
##$ZL4= 120
##$ABSF1= 15.52432
##$ABSF2= -2.52753
##$ABSG= 5
##$ABSL= 3
##$ALPHA= 0
##$AQORDER= 0
##$ASSFAC= 0
##$ASSFACI= 0
##$ASSFACX= 0
##$ASSWID= 0
##$AUNMP= <proc_1d>
##$AZFE= 0.1
##$AZFW= 0.1
##$BCFW= 0
##$BC_mod= 2
##$BYTORDP= 0
##$COROFFS= 0
##$CY= -3
##$DATMOD= 1
##$DC= 0
##$DFILT= <>
##$DTYPP= 0
##$F1P= 0
##$F2P= 0
##$FCOR= 1
##$FTSIZE= 16384
##$FT_mod= 6
##$GAMMA= 0
##$GB= 0
##$INTBC= 1
##$INTSCL= 3.241238e-09
##$ISEN= 128
##$LB= 0.25
##$LEV0= 0
##$LPBIN= 0
##$MAXI= 10000
##$MC2= 0
##$MEAN= 0
##$ME_mod= 0
##$MI= 1.114404
##$NCOEF= 0
##$NC_proc= -6
##$NLEV= 6
##$NOISF1= 3.799351
##$NOISF2= 2.8
##$NSP= 0
##$NTH_PI= 0
##$NZP= 0
##$OFFSET= 15.5056
##$PC= 1
##$PHC0= -2432.963
##$PHC1= 8.79097
##$PH_mod= 1
##$PKNL= yes
##$PPARMOD= 0
##$PSCAL= 0
##$PSIGN= 0
##$REVERSE= no
##$SF= 200.130003222712
##$SI= 16384
##$SIGF1= 3
##$SIGF2= 2
##$SINO= 0.751879
##$SIOLD= 32768
##$SREGLST= <19F.Aceton>
##$SSB= 0
##$STSI= 16384
##$STSR= 0
##$SW_p= 3612.71676300578
##$SYMM= 0
##$S_DEV= 0
##$TDeff= 16384
##$TDoff= 0
##$TI= <>
##$TILT= no
##$TM1= 0
##$TM2= 0
##$TOPLEV= 0
##$USERP1= <user>
##$USERP2= <user>
##$USERP3= <user>
##$USERP4= <user>
##$USERP5= <user>
##$WDW= 1
##$XDIM= 16384
##$YMAX_p= 268268808
##$YMIN_p= -280900
$$ End of Bruker specific parameters
$$ ---------------------------------
##NTUPLES= NMR SPECTRUM
##VAR_NAME=  FREQUENCY,     SPECTRUM/REAL,   SPECTRUM/IMAG
##SYMBOL=    X,             R,               I
##VAR_TYPE=  INDEPENDENT,   DEPENDENT,       DEPENDENT
##VAR_FORM=  AFFN,          ASDF,            ASDF
##VAR_DIM=   16384,         16384,           16384
##UNITS=     HZ,            ARBITRARY UNITS, ARBITRARY UNITS
##FACTOR=    0.220516191357247, 1,           1
##FIRST=     3103.1357730841, 0,             0
##LAST=      -509.580989921683, 0,           0
##MIN=       -509.580989921683, -280900,     0
##MAX=       3103.1357730841, 268268808,     0
$$ Real data points
##PAGE= N=1
##DATA TABLE= (X++(R..R)), XYDATA
$$ [...]
5779A1953433n02356n51679m79940m12632l62438l22684l16460l42784j82217
$$ 11953433 11451077 10899398 10419458 10006826 9644388 9321704 9005244 8662460 8480243
5770H480243k31289k53784j90078j44024j82519k18952j06555n1230j42310k46259
$$ 8480243 8248954 7995170 7805092 7661068 7478549 7259597 7153042 7101812 6959502 6713243
5760F713243j24402j47308q9077o4870j24208j32181p3731K797j37467j24302
$$ 6713243 6588841 6441533 6352456 6287586 6163378 6031197 5957466 5960263 5822796 5698494
5750E698494j01575n9843k6551j902j412k9085j4750k0981l8447n5088M2824k6718
$$ 5698494 5596919 5537076 5510525 5508623 5507211 5478126 5463376 5442395 5403948 5348860 5391684 5364966
5738E364966k8995k7916p555M5394j2421o0899n1624K1557L7933N8692j8542p216
$$ 5364966 5335971 5308055 5300500 5345894 5333473 5272574 5220950 5242507 5280440 5339132 5320590 5313374
5726E313374N2669J2047Q2865l315O3108K5158j1916N5664O9898Q404K9087Q3479
$$ 5313374 5366043 5378090 5460955 5457640 5520748 5545906 5533990 5589654 5659552 5667956 5697043 5780522
5714E780522p37L5486L3223M4101J04843Q8384J25467l587Q6071P2266O4898J37541
$$ 5780522 5779785 5815271 5848494 5892595 5997438 6085822 6211289 6207702 6293773 6366039 6430937 6568478
5702F568478L9208O8383Q1986P8010p005L7929Q4802L0196m9545j590k684j2620
$$ 6568478 6607686 6676069 6758055 6836065 6829060 6866989 6951791 6981987 6932442 6930852 6928168 6915548
5690F915548N781J03076J23859L5028J18770Q3550J18380J00175J42654J28323
$$ 6915548 6921329 7024405 7148264 7183292 7302062 7385612 7503992 7604167 7746821 7875144
5680G875144O7888J65424O5738N7177L2242O1926K1751m5481M3122N5075J03914
$$ 7875144 7943032 8108456 8174194 8231371 8263613 8325539 8347290 8301809 8344931 8400006 8503920
5669H503920J26117P0002P6529J76920J18885K03202K90266K91528K34169K48778
$$ 8503920 8630037 8700039 8776568 8953488 9072373 9275575 9565841 9857369 10091538 10340316
5659A0340316J94968O2079J442k7671j46626j15388m3906q3678o8915n7887O4222
$$ 10340316 10535284 10597363 10598805 10571134 10424508 10309120 10265214 10181536 10112621 10054734 10118956
5648A0118956N7798N0946J54754P0117M8161J59776K00822J99652K05298J99220
$$ 10118956 10176754 10227700 10382454 10452571 10500732 10660508 10861330 11060982 11266280 11465500
5638A1465500K64614L43021M25535L65885M70624N78932Q44363Q68598R41066
$$ 11465500 11730114 12073135 12498670 12864555 13335179 13914111 14758474 15627072 16568138
5629A6568138J045662J016308J043746Q45348P53692N95278M99292N62134P17116
$$ 16568138 17613800 18630108 19673854 20519202 21272894 21868172 22367464 22929598 23646714
5620B3646714Q79488J044138J340983J543376J818517K036939K231315K575382
$$ 23646714 24526202 25570340 26911323 28454699 30273216 32310155 34541470 37116852
5612C7116852K856425L006077L182573L369963L446318L466722L193612K890531
$$ 37116852 39973277 42979354 46161927 49531890 52978208 56444930 59638542 62529073
5604F2529073K413660J927794J112643L86585m24993j132543j745251k171157
$$ 62529073 64942733 66870527 67983170 68369755 67944762 66812219 65066968 62895811
5596F2895811k393546k686281k913030l218963l261658l348570l280320k932245
$$ 62895811 60502265 57815984 54902954 51683991 48422333 45073763 41793443 38861198
5588C8861198k713349k447976k119384j945150j837693j574475j377798j264753
$$ 38861198 36147849 33699873 31580489 29635339 27797646 26223171 24845373 23580620
5580B3580620j218634j071020r36060q88327p58620o79053o72336n07370m95903
$$ 23580620 22361986 21290966 20354906 19466579 18707959 18028906 17356570 16849200 16353297
5571A6353297m70387l99052l78336l33202k63998k62060j47530j79644k51847
$$ 16353297 15882910 15483858 15105522 14772320 14508322 14246262 14098732 13919088 13667241
5562A3667241k91003k68169m16047n16928m04263m00550k95691l04098k84419
$$ 13667241 13376238 13108069 12692022 12175094 11770831 11370281 11074590 10770492 10486073
5553A0486073k24436k07494k62879l04353k61086j79730k54189j81779j36557
$$ 10486073 10261637 10054143 9791264 9486911 9225825 9046095 8791906 8610127 8473570
5544H473570j98227k00179j63737k11239j58349j25083j64248q8525j17222r0147
$$ 8473570 8275343 8075164 7911427 7700188 7541839 7416756 7252508 7163983 7046761 6956614
5534F956614j30817o9543r2557j16481j02195o2063l2829j30792q4577o9193K984
$$ 6956614 6825797 6756254 6663697 6547216 6445021 6382958 6350129 6219337 6134760 6065567 6068551
5523F068551l0099r1559r5241k1781j5760j9534L1132l0286l6811M3151Q6728
$$ 6068551 6038452 5946893 5851652 5829871 5814111 5794577 5825709 5795423 5758612 5801763 5888491
5512E888491R5727j0835J5754J24835Q1721M0641J27273J03328K03991K39655
$$ 5888491 5984218 5973383 5989137 6113972 6195693 6236334 6363607 6466935 6670926 6910581
5502F910581L17760K52788L28207L18161K63970K75853J16475o732j99369l44334
$$ 6910581 7228341 7481129 7809336 8127497 8391467 8667320 8783795 8777063 8577694 8233360
5492H233360l72499k57769k62292k37578k23319j83600j92579r1176j69294m4038
$$ 8233360 7860861 7603092 7340800 7103222 6879903 6696303 6503724 6412548 6243254 6199216
5482F199216K1133l9540J7622J47043J18792J19084K20678J54144J49049N5617
$$ 6199216 6220349 6180809 6198431 6345474 6464266 6583350 6804028 6958172 7107221 7162838
5472G162838N6010l6894j07124j50766k59105k75731l20908l03004k67195j75158
$$ 7162838 7218848 7181954 7074830 6924064 6664959 6389228 6068320 5765316 5498121 5322963
5462E322963j07750j79397j26315j62677j11007j21663m1783k1922j30978m6621
$$ 5322963 5215213 5035816 4909501 4746824 4635817 4514154 4472371 4450449 4319471 4272850
5452D272850m9448j09679j75040l6619j9757j50299j6892L6344J715k0m2568k8779
$$ 4272850 4223402 4113723 3938683 3902064 3882307 3732008 3715116 3751460 3753175 3753155 3710587 3681808
5440C681808q1225j6291m977l0413m367l7526j6436k2111K1336j4496L4239j1801
$$ 3681808 3600583 3584292 3579315 3548902 3544535 3507009 3490573 3468462 3489798 3475302 3509541 3497740
5428C497740M0768l3936q2415J01469l156L3520N605q2054O5691P2226m8478o551
$$ 3497740 3538508 3504572 3422157 3523626 3520470 3553990 3559595 3477541 3543232 3615458 3566980 3560429
5416C560429Q1591J1989L6435l409R3641M8726O8965O7180Q8102q151k365M9842
$$ 3560429 3642020 3654009 3690444 3687035 3780676 3829402 3898367 3965547 4053649 4045498 4043133 4092975
5404D092975P7010Q9174J51910J30438J51026J53530J05088K09486K79303J70526
$$ 4092975 4169985 4259159 4411069 4541507 4692533 4846063 4951151 5160637 5439940 5610466
5394E610466K02331L44450K59607K93378L86304L40971L16484M06107L91362M80219
$$ 5610466 5812797 6157247 6416854 6710232 7096536 7437507 7753991 8160098 8551460 9031679
5384I031679N88969O16786O90268Q49446Q73731R97045J090780J335934J483292
$$ 9031679 9620648 10237434 10927702 11777148 12650879 13647924 14738704 16074638 17557930
5375A7557930J620103J800520K084657K507563L138233L771066M910210O634224
$$ 17557930 19178033 20978553 23063210 25570773 28709006 32480072 37390282 44024506
5367D4024506Q013356Q089359P787055P717078O058588K451283o7523m268251
$$ 44024506 52037862 60127221 67914276 75631354 81689942 84141225 84073702 79805451
5359G9805451p938532q183459p377586o277352m920547l938594l480446k999031
$$ 79805451 71866919 63683460 56305874 50028522 45107975 41169381 37688935 34689904
5351C4689904k772528k619685k258624j839599j633381j376074j174349j047228
$$ 34689904 31917376 29297691 27039067 25199468 23566087 22190013 21015664 19968436
5343A9968436j066432q98194q85455q33976p65911o55790n37929m80771n01169
$$ 19968436 18902004 18003810 17118355 16284379 15518468 14862678 14324749 13843978 13342809
5334A3342809m70871m19765l01045k95088k53592k79245k57170k46470k26658
$$ 13342809 12871938 12452173 12151128 11856040 11602448 11323203 11066033 10819563 10592905
5325A0592905j54854j60651j79254j46123j82877j31377k20428k31644j54517
$$ 10592905 10438051 10277400 10098146 9952023 9769146 9637769 9417341 9185697 9031180
5316I031180j72127k04165j95331j78335r7743j07047j66464q4866k5170j11620
$$ 9031180 8859053 8654888 8459557 8281222 8183479 8076432 7909968 7825102 7799932 7688312
5306G688312j23503l3258m3739q2925J0828n4824n573J4828j15395o9445K7518
$$ 7688312 7564809 7531551 7487812 7404887 7415715 7360891 7355318 7370146 7254751 7185306 7212824
5295G212824j31108k7564J02123n6681r6317k1500p2992m3027M8834n7253l3626
$$ 7212824 7081716 7054152 7156275 7099594 7003277 6981777 6908785 6865758 6914592 6857339 6823713
5284F823713n9787l1080M1506J2766j3560J8764O9095K2029M7564J16632O1229
$$ 6823713 6763926 6732846 6774352 6787118 6773558 6792322 6861417 6883446 6931010 7047642 7108871
5273G108871R3549R0048k9077N6004l8667r0173j00145j01524r0960q7661q4160
$$ 7108871 7202420 7292468 7263391 7319395 7280728 7190555 7090410 6988886 6897926 6810265 6726105
5262F726105k5918j8270q5913K5797l5893l0801m8802o8344n6383q0896j0979
$$ 6726105 6700187 6681917 6596004 6621801 6585908 6555107 6506305 6437961 6381578 6300682 6289703
5251F289703p2543j06348J9287k8189m2466n7975r3610j7517m0225k3915O5496
$$ 6289703 6217160 6110812 6130099 6101910 6059444 6001469 5907859 5890342 5850117 5826202 5891698
5240E891698N6197j8739k4824o36k3732l8896l0362J7813k1249n2751q150K7048
$$ 5891698 5947895 5929156 5904332 5903696 5879964 5841068 5810706 5828519 5807270 5754519 5746369 5773417
5228E773417j3561j1147k684Q224M4607J25141N0654J01698O6649J21512O8537
$$ 5773417 5759856 5748709 5746025 5754249 5798856 5923997 5974651 6076349 6142998 6264510 6333047
5217F333047L1932j11176m0857j44971q1837o1827o7633m9253p0758l1033l2374
$$ 6333047 6364979 6253803 6212946 6067975 5986138 5924311 5856678 5807425 5736667 5705634 5673260
5206E673260k671r1699p4693k2948l1706k9729j8169o6721M894r705L707p8990
$$ 5673260 5670589 5578890 5504197 5481249 5449543 5419814 5401645 5334924 5339818 5330113 5333820 5254830
5194E254830K5264p143L3337l9988j1525l8771q807L3795l3640k1031K7589L8049
$$ 5254830 5280094 5272951 5306288 5266300 5254775 5216004 5207197 5240992 5207352 5186321 5213910 5251959
5182E251959m2960L4478Q4438m696m3782P713l0017P7523N9686l0965O0532o666
$$ 5251959 5208999 5243477 5327915 5323219 5279437 5287150 5257133 5334656 5394342 5363377 5423909 5417243
5170E417243J078N7725Q2235k3656O4188Q9476k6922J9184N2392k2604R4400J41285
$$ 5417243 5418321 5476046 5558281 5534625 5598813 5688289 5661367 5680551 5732943 5710339 5804739 5946024
5158E946024K1486O1439O2097Q5907N4778j7100R7186J45026Q4308J61370J43452
$$ 5946024 5967510 6028949 6091046 6176953 6231731 6214631 6311817 6456843 6541151 6702521 6845973
5147F845973J36508J71476K20058J56375J87570K86575J76478J72753R9773N8646
$$ 6845973 6982481 7153957 7374015 7530390 7717960 8004535 8181013 8353766 8453539 8512185
5137H512185N3828Q4088J35935P7398J50553J36964J49593L00478K51360L01378
$$ 8512185 8566013 8650101 8786036 8863434 9013987 9150951 9300544 9601022 9852382 10153760
5127A0153760L54863L20593L38190K40222K73648J77117J74620P4596q971L0140
$$ 10153760 10508623 10829216 11167406 11407628 11681276 11858393 12033013 12107609 12098638 12128778
5117A2128778P0226J71424K11191K70426L43726L88506M23791L57321L06965K21561
$$ 12128778 12199004 12370428 12581619 12852045 13195771 13584277 14008068 14365389 14672354 14893915
5107A4893915J24725q106l4776Q408O63M1583o4Q2433J73453L08116K71971K49698
$$ 14893915 15018640 15010534 14975758 14984166 14984829 15026412 15026348 15108781 15282234 15590350 15862321 16112019
5095A6112019J66104J67380J08912R098j33989k95879k69570k14295j54568j22934
$$ 16112019 16278123 16445503 16554415 16563513 16429524 16133645 15864075 15649780 15495212 15372278
5085A5372278m875J36012J25953K00143J58145J53819L2436q1777j41022k53824
$$ 15372278 15367403 15503415 15629368 15829511 15987656 16141475 16173911 16092134 15951112 15697288
5075A5697288k73229k02150k29500k26298j80632j50500j09544p6082k405J397
$$ 15697288 15424059 15221909 14992409 14766111 14585479 14434979 14325435 14249353 14246948 14248345
5065A4248345j9232k7748N4566j1275j16423k12905j19097j49638j29400j41643
$$ 14248345 14229113 14201365 14255931 14244656 14128233 13915328 13796231 13646593 13517193 13375550
5055A3375550j38686o6406R402J9055k5342o2438k0276r197Q660K1324Q108j2819
$$ 13375550 13236864 13170458 13179860 13198915 13173573 13111135 13090859 13081662 13090322 13111646 13119754 13106935
5043A3106935K5608J7070M255k0177j9009k9704q7893q3165j43490n2097o6121
$$ 13106935 13132543 13149613 13153868 13133691 13114682 13084978 12997085 12913920 12770430 12718333 12652212
5032A2652212j56830p3443m9445o5444j21737r4426N2694l4343M147P4348N5833
$$ 12652212 12495382 12421939 12372494 12307050 12185313 12090887 12143581 12109238 12113385 12187733 12243566
5021A2243566M5176l7624J3390K8191k7355J8336M8747J18381O9357N2449J27618
$$ 12243566 12288742 12251118 12264508 12292699 12265344 12283680 12332427 12450808 12520165 12572614 12700232
5010A2700232R0627J21992J19125J30021J83691J40621K36122L47106L06485L50370
$$ 12700232 12790859 12912851 13031976 13161997 13345688 13486309 13722431 14069537 14376022 14726392
5000A4726392L64937L82957L99710N07369N06659N34924O30607O41142O62236
$$ 14726392 15091329 15474286 15873996 16381365 16888024 17422948 18053555 18694697 19356933
4991A9356933P26451P91489Q65054R12344R65431J082098J192419J260851J451517
$$ 19356933 20083384 20874873 21739927 22652271 23617702 24699800 25892219 27153070 28604587
4982B8604587J776145K019537K275091K533643K729683L196919L639237M114057
$$ 28604587 30380732 32400269 34675360 37209003 39938686 43135605 46774842 50888899
4974E0888899M527035N160494N876760P002258Q331015J0353202J3313976J6599970
$$ 50888899 55415934 60576428 66453188 73455446 81786461 92139663 105453639 122053609
4966A22053609J9264907K1200296K1985873K0270244J6080911J0997261K393192
$$ 122053609 141318516 162518812 184504685 204774929 220855840 231853101 234246293
4959B34246293p345239j3541132j8684963j9749535j7445369j4726696j2232163
$$ 234246293 226901054 213359922 194674959 174925424 157480055 142753359 130521196
4952A30521196j0145558q971940q031804p261014o392775n551332m609521l807483
$$ 130521196 120375638 111403698 103371894 96110880 89718105 84166773 79557252 75749769
4944G5749769l123916k535000k225092k063742j864839j702879j553314j478434
$$ 75749769 72625853 70090853 67865761 65802019 63937180 62234301 60680987 59202553
4936E9202553j323852j051491r22784o77462l88336j83416m859K37468L97040
$$ 59202553 57878701 56827210 55904426 55226964 54838628 54655212 54650353 54887821 55284861
4927E5284861O75952R84703J304172J698902K041970K469486K989286L532385
$$ 55284861 55960813 56945516 58249688 59948590 61990560 64460046 67449332 70981717
4919G0981717M103554M878037N889094P036685Q816685J1425335J4599930J6869182
$$ 70981717 75085271 79963308 85852402 92889087 101705772 113131107 127731037 144600219
4911A44600219J8634392K0658941K0550173J6478004J2264037O832205k776213
$$ 144600219 163234611 183893552 204443725 220921729 233185766 240017971 237241758
4904B37241758r098098j2953276j7473420j7828505j5758429j3673951j1649561
$$ 237241758 228143660 215190384 197716964 179888459 164130030 150456079 138806518
4897A38806518j0069473q959044p999815p242851o352997n495394m462311l632286
$$ 138806518 128737045 119778001 111778186 104535335 98182338 92686944 88224633 84592347
4889H4592347l010015k499989k216594k095815j824592j694548j692740j756582
$$ 84592347 81582332 79082343 76865749 74769934 72945342 71250794 69558054 67801472
4881F7801472j739214j761387j804490j721345j635671j321893j232838j203683
$$ 67801472 66062258 64300871 62496381 60775036 59139365 57817472 56584634 55380951
4873E5380951r70534r24165q19107p70364p57059p18056o32838o30697o40389
$$ 55380951 54410417 53486252 52667145 51896781 51139722 50421666 49788828 49158131 48517742
4864D8517742o09294p48892p19967n57361m10788m68732l80563j71259N5609Q5722
$$ 48517742 47908448 47159556 46439589 45882228 45471440 45002708 44622145 44450886 44506495 44592217
4854D4592217J79260L91042N19303O07163Q27586R55984J000122R39036J053339
$$ 44592217 44771477 45162519 45681822 46288985 47116571 48072555 49072677 50011713 51065052
4845E1065052J033619Q53438N57356L85228J91325J61994K76763L97865N68956
$$ 51065052 52098671 52952109 53509465 53894693 54086018 54248012 54524775 54922640 55491596
4836E5491596R23398J173308J429146J749282K002538K413661K749011L107585
$$ 55491596 56414994 57588302 59017448 60766730 62769268 65182929 67931940 71039525
4828G1039525L587684L857707M169546M520408M750744N164802N511273N975884
$$ 71039525 74627209 78484916 82654462 87174870 91925614 97090416 102601689 108577573
4820A08577573O350280O493769O466631O382665N995299N146021L986897K610371
$$ 108577573 114927853 121421622 127888253 134270918 140266217 145412238 149399135 152009506
4812A52009506J148760m36958j880007l182681m090545m916340n361975n671787
$$ 152009506 153158266 152721308 150841301 147658620 143568075 138651735 133289760 127617973
4804A27617973n801375n797463n813710n834900n752383n513265n068709m578671
$$ 127617973 121816598 116019135 110205425 104370525 98618142 93104877 88036168 83457497
4796H3457497m333861l872148l550534l132586k880914k631493k391804k193066
$$ 83457497 79123636 75251488 71700954 68568368 65687454 63055961 60664157 58471091
4788E8471091j979914j731957j621236j514985j533938j329929j264777j187247
$$ 58471091 56491177 54759220 53137984 51622999 50089061 48759132 47494355 46307108
4780D6307108j148113j155853j038052j039227j013073q52287q16953p08954p00624
$$ 46307108 45158995 44003142 42965090 41925863 40912790 40060503 39243550 38534596 37833972
4771C7833972p02062o57680o19247o10681n30921m29090m30452l97101m29205
$$ 37833972 37131910 36474230 35854983 35244302 34713381 34284291 33853839 33456738 33027533
4762C3027533m42200l66881m02930m10792l83720m08321l12827k46617k62065
$$ 33027533 32585333 32218452 31815522 31404730 31021010 30612689 30299862 30053245 29791180
4753B9791180j79202j70572q1321j39417j49110m1835j73270k17782j74788k81761
$$ 29791180 29611978 29441406 29360085 29220668 29071558 29029723 28856453 28638671 28463883 28182122
4743B8182122l97939k47433k15257k79029k83015k38397k55992k46525j52417
$$ 28182122 27784183 27536750 27321493 27042464 26759449 26521052 26265060 26018535 25866118
4734B5866118o1846j27199o1797j00755p6583K6792M181Q392J80923J65408J64530
$$ 25866118 25804272 25677073 25615276 25514521 25437938 25464730 25468911 25477303 25658226 25823634 25988164
4723B5988164K65184K88968M08541M18208M73784N55821M99874P15307Q18218
$$ 25988164 26253348 26542316 26950857 27369065 27842849 28398670 28898544 29613851 30432069
4714C0432069R09124R00662Q99150O97005N68834L36443N3379j58213l48446m72040
$$ 30432069 31341193 32241855 33141005 33838010 34406844 34743287 34796666 34638453 34290007 33817967
4704C3817967n20709l03811j51830r8647j7714l332R3877K30929K00367J81083
$$ 33817967 33297258 32993447 32841617 32742970 32725256 32721924 32815801 33046730 33247097 33428180
4694C3428180J95617K63367K75761J84684K63297K99140L67977M54832O52825
$$ 33428180 33623797 33887164 34162925 34347609 34610906 34910046 35278023 35732855 36385680
4685C6385680Q20990R27818J079514J044271R01181P89239L48448O6926k69855
$$ 36385680 37206670 38134488 39214002 40258273 41159454 41948693 42297141 42364067 42094212
4676D2094212o46595q96040r81636o81157m46852q0403K05237L44620M70033M74441
$$ 42094212 41447617 40551577 39569941 38888784 38441932 38361529 38566766 38911386 39381419 39855860
4666C9855860M79755L37747J83776K4338K3155J40517L34596N14775P51901Q15650
$$ 39855860 40335615 40673362 40857138 40881476 40904631 41045148 41379744 41894519 42646420 43462070
4656D3462070N89909M61403J12897k01555o13507p96699p64537m87874j97506
$$ 43462070 44051979 44513382 44626279 44424724 43811217 43014518 42249981 41762107 41564601
4647D1564601O9520J92396L47276K50357J86944K8770k37498m20532n12977m28602
$$ 41564601 41634121 41826517 42173793 42424150 42611094 42639864 42402366 41981834 41468857 41040255
4637D1040255l49591j53501J01002L07555N08688O17931P59800Q88508R13390
$$ 41040255 40690664 40537163 40638165 40945720 41454408 42072339 42832139 43720647 44634037
4628D4634037J016271J151676J229648J306462J409390J529776J644168J785446
$$ 44634037 45650308 46801984 48031632 49338094 50747484 52277260 53921428 55706874
4620E5706874J980122K261440K570271K853784L308472L903614M623660N745556
$$ 55706874 57686996 59948436 62518707 65372491 68680963 72584577 77208237 82953793
4612H2953793O920761P991287Q650560Q708205Q076084O863185M544861J496213
$$ 82953793 89874554 97865841 106516401 115224606 123300690 130163875 134708736 136204949
4604A36204949j782029m952148p230703q228961q212379p578001o743811n886671
$$ 136204949 134422920 129470772 122240069 114011108 105798729 98220728 91476917 85590246
4596H5590246n275109m655173m156227l799263l390707l083707k758009k534287
$$ 85590246 80315137 75659964 71503737 67704474 64313767 61230060 58472051 55937764
4588E5937764k216703k129560k021403j870848j738294j605585j475042j419683
$$ 55937764 53721061 51591501 49570098 47699250 45960956 44355371 42880329 41460646
4580D1460646j253041j138288j098365r32590q36098p33269o92154n33430n04122
$$ 41460646 40207605 39069317 37970952 37038362 36202264 35468995 34776841 34243411 33739289
4571C3739289m16022m06561l69952k71494l28718l20084k67296k58602l32958
$$ 33739289 33323267 32916706 32546754 32275260 31946542 31626458 31359162 31100560 30767602
4562C0767602k69717k70242l43999k80087k52124k08620j26475j24172r7171j12184
$$ 30767602 30497885 30227643 29883644 29603557 29351433 29142813 29016338 28892166 28794995 28682811
4552B8682811n8390o8077L2448L7998K8245P8017K41955J64813K57178L89186
$$ 28682811 28624421 28556344 28588792 28626790 28655035 28733052 28975007 29139820 29396998 29786184
4542B9786184L22306M30931N40988N69415N92862P28071P39700Q09846R35879
$$ 29786184 30108490 30539421 31080409 31649824 32242686 32970757 33710457 34520303 35456182
4533C5456182R09129R09040R72863J055699J075435J161445J265194J393839J343576
$$ 35456182 36365311 37274351 38247214 39302913 40378348 41539793 42804987 44198826 45542402
4524D5542402J458025J547452J668295J732476J872019K126095K441548K871219
$$ 45542402 47000427 48547879 50216174 51948650 53820669 55946764 58388312 61259531
4516F1259531L385600L739703M188961M588433M838510N053649N010516M743094
$$ 61259531 64645131 68384834 72573795 77162228 82000738 87054387 92064903 96807997
4508I6807997M537497M432212M369212M694021N254463N918210O684104P199220
$$ 96807997 101345494 105777706 110146918 114840939 120095402 126013612 132697716 139896936
4500A39896936P195638O538081N093682K945039L39768k401090m896546o880388
$$ 139896936 147092574 153630655 158724337 161669376 162009144 159608054 154711508 147831120
4492A47831120q116240q679808q740640q209549p381902o650830o039407n400895
$$ 147831120 139714880 131035072 122294432 114084883 106702981 100052151 94012744 88611849
4484H8611849m953943m451769l992809l622428l235003k775714k435466k296796
$$ 88611849 83657906 79206137 75213328 71590900 68355897 65580183 63144717 60847921
4476F0847921k025928j736034j683175j575378j542955j544813j497392j415491
$$ 60847921 58821993 57085959 55402784 53827406 52284451 50739638 49242246 47826755
4468D7826755j397223j449851j416912j371232j291857j181501j091094j001671
$$ 47826755 46429532 44979681 43562769 42191537 40899680 39718179 38627085 37625414
4460C7625414q56200q06839p22202o10296n49720n39009n04445m50283l87687
$$ 37625414 36769214 35962375 35240173 34629877 34080157 33541148 33036703 32586420 32198733
4451C2198733l60949m21275m69982n05445n00548m77276n16531n87550n57888
$$ 32198733 31837784 31416509 30946527 30441082 29940534 29463258 28946727 28359177 27801289
4442B7801289n41073m06598l88919m05353l91845k78124j93127k24661j92952
$$ 27801289 27260216 26853618 26464699 26059346 25667501 25389377 25196250 24971589 24778637
4433B4778637j03925j29394k5656L5440L3147N3733J33771J95662K56237K36266
$$ 24778637 24674712 24545318 24519662 24555102 24588249 24641982 24775753 24971415 25227652 25463918
4423B5463918K25162J63768K23909J67418J74583K75200K34018K49338K88651
$$ 25463918 25689080 25852848 26076757 26244175 26418758 26693958 26927976 27177314 27465965
4414B7465965K72054K24167L86316L57730K72747K07063J94449J14191J47288
$$ 27465965 27738019 27962186 28348502 28706232 28978979 29186042 29380491 29494682 29641970
4405B9641970K09626J68293J94080K05658K68861L43609M00133M17902M89001
$$ 29641970 29851596 30019889 30213969 30419627 30688488 31032097 31432230 31850132 32339133
4396C2339133N81039P16327Q05881Q70019J021721J145956J442166J678208J735488
$$ 32339133 32920172 33636499 34442380 35312399 36334120 37480076 38922242 40600450 42335938
4387D2335938J772934J759085J514494J077787N59252L758o66023j343322j849634
$$ 42335938 44108872 45867957 47382451 48460238 49019490 49023248 48357225 47013903 45164269
4378D5164269k019438j912756j927275j715680j653177j490863j330533j306863
$$ 45164269 43144831 41232075 39304800 37589120 35935943 34445080 33114547 31807684
4370C1807684j120004r56023q75685p08080o93309n64528m72320m27250l62203
$$ 31807684 30687680 29731657 28855972 28147892 27454583 26890055 26417735 25990485 25628282
4361B5628282l42890l43448l90643k91372k67022k21037k47082j21753k96120
$$ 25628282 25285392 24941944 24551301 24259929 23992907 23771870 23524788 23403035 23106915
4352B3106915l16221k54278k26792j80512k04889k82568k03148l48632m39719
$$ 23106915 22790694 22536416 22309624 22129112 21924223 21641655 21438507 21089875 20650156
4343B0650156k80132k85687k56572j84615k29973k75941k27019k10601k02667
$$ 20650156 20370024 20084337 19827765 19643150 19413177 19137236 18910217 18699616 18496949
4334A8496949j72424k54802j43255j18079k46707k25973k52633j75897k07762
$$ 18496949 18324525 18069723 17926468 17808389 17561682 17335709 17083076 16907179 16699417
4325A6699417j28591j07961p2420j21487r626K2142k9573L2464m8905R535J56956
$$ 16699417 16570826 16462865 16390445 16268958 16259332 16281474 16251901 16284365 16235460 16244995 16401951
4314A6401951J05868N6668J40648M3027J15179J03439R5117O9510R4287J09379
$$ 16401951 16507819 16564487 16705135 16748162 16863341 16966780 17061897 17131407 17225694 17335073
4304A7335073J16329M0311P9637J64425J10708M5962R2638N2537P0410J58673
$$ 17335073 17451402 17491713 17571350 17735775 17846483 17892445 17985083 18037620 18108030 18266703
4294A8266703K6019L3638Q4365n933N1781Q5687J19529N8574K0659L8285R1108
$$ 18266703 18292722 18326360 18410725 18404792 18456573 18542260 18661789 18720363 18741022 18779307 18870415
4283A8870415R9458P7290J25789J28681O5294J24743K05678K17431K30411K24385
$$ 18870415 18969873 19047163 19172952 19301633 19366927 19491670 19697348 19914779 20145190 20369575
4273B0369575K66773K45138K64850K19215K74746K68102K02317J20569J84606
$$ 20369575 20636348 20881486 21146336 21365551 21640297 21908399 22110716 22231285 22415891
4264B2415891K29516K45049L40992M39780L93725N06824M03345L47810K31570
$$ 22415891 22645407 22890456 23231448 23671228 24064953 24571777 24975122 25322932 25554502
4255B5554502K04780K44030J25575J39727J75390K79867L21132L50068M50347
$$ 25554502 25759282 26003312 26128887 26268614 26444004 26723871 27045003 27395071 27845418
4246B7845418M68251M20172M84104M52142K98840J86670J09900k3092j03783j16302
$$ 27845418 28313669 28733841 29217945 29670087 29968927 30155597 30265497 30242405 30138622 30022320
4236C0022320j07699n8053J5535O8445J07721J73696K50923P7469L4331j43466
$$ 30022320 29914621 29856568 29872103 29940548 30048269 30221965 30472888 30550357 30584688 30441222
4226C0441222j69710k81242m22276l75417m98152m12392m81339m52798l78811
$$ 30441222 30271512 29990270 29567994 29192577 28694425 28282033 27800694 27347896 26969085
4217B6969085l20245k80078k65077l45346l32475m39730n18785n41350o28978
$$ 26969085 26648840 26368762 26103685 25758339 25425864 24986134 24467349 23925999 23297021
4208B3297021n73589n53149o25237o52194n48417n45455n34967n02885n28632
$$ 23297021 22723432 22170283 21545046 20892852 20344435 19798980 19264013 18761128 18232496
4199A8232496n03499l91004m49621m57020m04387m83371l79966l46917l89947
$$ 18232496 17728997 17337993 16888372 16431352 16026965 15543594 15163628 14816711 14426764
4190A4426764l58025l22211l02141l51705l10646k96682l14168k98427k22480
$$ 14426764 14068739 13746528 13444387 13092682 12782036 12485354 12171186 11872759 11650279
4181A1650279k85092j92836j85251k56627j87140j90404j94014j61287k61741
$$ 11650279 11365187 11172351 10987100 10730473 10543333 10352929 10158915 9997628 9735887
4172I735887k07950j33123j14240j80038j97252k8260j55230j50252j31643j45130
$$ 9735887 9527937 9394814 9280574 9100536 8903284 8875024 8719794 8569542 8437899 8292769
4162H292769q3500j28283j14596j02433k02622j11540j27138o2532j29093k16780
$$ 8292769 8209269 8080986 7966390 7863957 7661335 7549795 7422657 7360125 7231032 7014252
4152G014252j20010m7996q2091j13442j2625j56508k00793j00496p8133r3017
$$ 7014252 6894242 6846246 6764155 6650713 6638088 6481580 6280787 6180291 6102158 6009141
4142F009141p2428q1073n7391j9212j56566o5574q030n7478p9241r5635l6151
$$ 6009141 5936713 5855640 5798249 5779037 5622471 5556897 5548867 5491389 5412148 5316513 5280362
4131E280362r5239n903k3487j20882m8593j37212K7734R13n557m9626j9261k5580
$$ 5280362 5185123 5179220 5155733 5034851 4986258 4849046 4876780 4877693 4872136 4822510 4803249 4777669
4119D777669r8792R339J691o721o4071j4318r6881j492O5068m7300j28602p7382
$$ 4777669 4678877 4688216 4689907 4683186 4619115 4604797 4507916 4506424 4571492 4524192 4395590 4318208
4107D318208J7168n5233n4394m5941m5526k3177n2225o3663N051P034o1101k9451
$$ 4318208 4335376 4280143 4225749 4179808 4134282 4111105 4058880 3995217 4000268 4007302 3946201 3916750
4095C916750K4735j5160p8808N6387K9976l9547n4230O7306j6188m9368L3370
$$ 3916750 3941485 3926325 3847517 3903904 3933880 3894333 3840103 3907409 3891221 3841853 3875223
4084C875223K3055M8784L8934j02062m5004P422o3849k6029Q544o4499j43167
$$ 3875223 3898278 3947062 3985996 3883934 3838930 3846352 3782503 3756474 3765018 3700519 3557352
4073C557352l096M922p6903m6064m6769j1710m4019j5684p5987j1014J1552r3856
$$ 3557352 3554256 3559178 3482275 3436211 3389442 3377732 3333713 3318029 3242042 3231028 3242580 3148724
4061C148724m4456n290m4262k6922n3784j0575J2655K3216q134m8024m0133L0232
$$ 3148724 3104268 3098978 3054716 3027794 2974010 2963435 2976090 2999306 2991172 2943148 2903015 2933247
4049B933247m3006m596L3109l6584L9025k679n4110n9127K7574m8075j9938o1660
$$ 2933247 2890241 2885645 2918754 2882170 2921195 2918516 2864406 2805279 2832853 2784778 2764840 2703180
4037B703180n1351M5189j10494O1084P6468p1728o4082N149L4523n9461R573l1328
$$ 2703180 2651829 2697018 2586524 2647608 2724076 2652348 2588266 2593415 2627938 2568477 2578050 2546722
4025B546722L1130j4586k2333j5351p8626K7142K166k4270M0493n885Q036m6945
$$ 2546722 2577852 2563266 2540933 2525582 2446956 2474098 2476264 2451994 2492487 2486602 2494638 2447693
4013B447693j7989j8362o8532K6985L9293k338n6691p6493N5663o9025K8355Q927
$$ 2447693 2429704 2411342 2342810 2369795 2409088 2406750 2350059 2273566 2329229 2260204 2288559 2297486
4001B297486J5054l5391p5579K6969p1316K456k662J4213L8143N8698p2126P534
$$ 2297486 2312540 2277149 2201570 2228539 2157223 2159679 2157017 2171230 2209373 2268071 2195945 2203479
3989B203479M2084o3364k1930J4857M6046P305L7231q4283j06938l6068L376K7163
$$ 2203479 2245563 2182199 2160269 2175126 2221172 2228477 2265708 2181425 2074487 2038419 2041795 2068958
3977B068958N2653L1413L5951m3292o6628J0462K4446k5221k4457m897J84N2767
$$ 2068958 2121611 2153024 2188975 2145683 2079055 2089517 2113963 2088742 2064285 2059388 2059572 2112339
3965B112339l6822m0493M4244p186J244j8309r715j903R923N9767o2756k1977
$$ 2112339 2075517 2035024 2079268 2072082 2073326 2055017 2045302 2043399 2053322 2113089 2050333 2028356
3953B028356Q478J01150N2588r1766m5653O8612L4391n1584o616l5040P0121P894
$$ 2028356 2036834 2137984 2190572 2098806 2053153 2121765 2156156 2104572 2097956 2062916 2133037 2140931
3941B140931N421L4389m3946j6091m9241N6773Q434l6041L105k574N2479M1982
$$ 2140931 2146352 2180741 2136795 2120704 2071463 2128236 2136670 2100629 2103734 2101160 2153639 2195621
3929B195621l428k2553N0784m3610j5398P1843J55360O9383o4954j5968J9271
$$ 2195621 2192193 2169640 2220424 2176814 2161416 2233259 2388619 2458002 2393048 2377080 2396351
3918B396351J2390k940M1476Q1239K4820l2811Q8927P5648n60J9350N8392J04480
$$ 2396351 2408741 2405801 2447277 2528516 2553336 2520525 2609452 2685100 2684540 2703890 2762282 2866762
3906B866762J31775O0054J0281Q6851L9296M1776J32418K7782J01144J5519O3331
$$ 2866762 2998537 3058591 3068872 3155723 3195019 3236795 3369213 3396995 3498139 3513658 3576989
3895C576989J3542L1504Q9299N9662M2900O0598M1705n153k137N154M1887l759
$$ 3576989 3590531 3622035 3711334 3770996 3813896 3874494 3916199 3911046 3908909 3914063 3955950 3952191
3883C952191J05432L3438L1869J0272m4174Q2081J8947m3084K2692j6723r494
$$ 3952191 4057623 4091061 4122930 4133202 4089028 4171109 4190056 4146972 4169664 4152941 4143447
3872D143447j4376n5499j2470M2771K6308K7666L7124o106l2629q3131k6419O4382
$$ 4143447 4129071 4073572 4061102 4103873 4130181 4157847 4194971 4188865 4156236 4073105 4046686 4111068
3860D111068N2971J6228k9067O0239O9266J4582L5792J3106R7886O1380L6086
$$ 4111068 4164039 4180267 4151200 4211439 4280705 4295287 4331079 4344185 4442071 4503451 4539537
3849D539537P0473J47537J45682J11180J56062J20698J38395J64520J74454L12715
$$ 4539537 4610010 4757547 4903229 5014409 5170471 5291169 5429564 5594084 5768538 6081253
3839F081253K19791K45750K20657K98478M28552M00177M12432M62501N23617N36409
$$ 6081253 6301044 6546794 6767451 7065929 7494481 7894658 8307090 8769591 9293208 9829617
3829I829617O01000O00706O37151N83485O42099N68891N21887N36459L94018L47958
$$ 9829617 10430617 11031323 11668474 12251959 12894058 13462949 13984836 14521295 14915313 15263271
3819A5263271K75462K29620K12515J32108J30440J36375P1386N7495Q688k4737
$$ 15263271 15538733 15768353 15980868 16112976 16243416 16379791 16451177 16508672 16517360 16492623
3809A6492623n5630j02555j52840l22576k80203l83672m94696m90919n29614m75954
$$ 16492623 16436993 16334438 16181598 15859022 15578819 15195147 14700451 14209532 13679918 13203964
3799A3203964m96466n35216n68667n13798m46162m31995m84131m02353l87154
$$ 13203964 12707498 12172282 11603615 11089817 10643655 10211660 9727529 9325176 8938022
3790H938022l75939l17274l61190l12658j90451j94838k67197j69553j86685j89604
$$ 8938022 8562083 8244809 7883619 7570961 7380510 7185672 6918475 6748922 6562237 6372633
3780F372633k01658p7244n2295j29313j06861o4797m0218p9296m8719n0471p8232
$$ 6372633 6170975 6093731 6041436 5912123 5805262 5740465 5700247 5620951 5572232 5521761 5443529
3769E443529m5979J3816n1638L8184M2267M5636J891Q616M3309J9671Q6818L0617
$$ 5443529 5397550 5411366 5359728 5397912 5440179 5485815 5487706 5496322 5539631 5559302 5646120 5676737
3757E676737M3389O8480J13226L5320M5477J389J03424J02775N3516P5545R4138
$$ 5676737 5720126 5788606 5901832 5937152 5982629 5984018 6087442 6190217 6243733 6319278 6413416
3746F413416P8518J18758M2255j774O9859J22515M1631P2473L1001k1290L5868
$$ 6413416 6491934 6610692 6652947 6651173 6721032 6843547 6885178 6957651 6988652 6967362 7003230
3735G003230N0658Q1856J18515O8118M6251J12698K944O7569Q2173J20407P5489
$$ 7003230 7053888 7135744 7254259 7322377 7368628 7481326 7484270 7551839 7634012 7754419 7829908
3724G829908J14400J37065Q8576J55436J65717J62360J83776K88024K28376L67653
$$ 7829908 7944308 8081373 8169949 8325385 8491102 8653462 8837238 9125262 9353638 9721291
3714I721291L26291L08620L50237L44209L65888L35235L24630K74721L47040L94937
$$ 9721291 10047582 10356202 10706439 11050648 11416536 11751771 12076401 12351122 12698162 13093099
3704A3093099K33822L18784L46449K32442K07739K79071L46072K26442K18497
$$ 13093099 13326921 13645705 13992154 14224596 14432335 14711406 15057478 15283920 15502417
3695A5502417K69246K41971J94339K56429J81569J72743J67026J53447J19724
$$ 15502417 15771663 16013634 16207973 16464402 16645971 16818714 16985740 17139187 17258911
3686A7258911J93919J41043N1089P6231M1160J6773K1784j7548j6454q0325p3767
$$ 17258911 17452830 17593873 17644962 17721193 17762353 17779126 17800910 17783362 17766908 17686583 17612816
3675A7612816n3542o1383p1613n1418k06353q8243p3511j19657n4292P291m4132
$$ 17612816 17559274 17497891 17426278 17374860 17168507 17080264 17006753 16887096 16832804 16840095 16795963
3664A6795963m3594k1962J01038J01382O8474J36164J33198J74196L14001L11065
$$ 16795963 16752369 16730407 16831445 16932827 17001301 17137465 17270663 17444859 17758860 18069925
3654A8069925L51475M27685N87748O51818P00484Q57934R25430J099934J265061
$$ 18069925 18421400 18849085 19436833 20088651 20789135 21647069 22572499 23672433 24937494
3645B4937494J302384J499485J784229J918545K091219K355979K513013K571502
$$ 24937494 26239878 27739363 29523592 31442137 33533356 35889335 38402348 40973850
3637D0973850K646242K690966K653733K575162K494208K274350K127672J954328
$$ 40973850 43620092 46311058 48964791 51539953 54034161 56308511 58436183 60390511
3629F0390511J964650J854163J784053J830465J779654J794691J754089J617640
$$ 60390511 62355161 64209324 65993377 67823842 69603496 71398187 73152276 74769916
3621G4769916J358205J013054Q96645O06123J43913j68398m31067p80154j058786
$$ 74769916 76128121 77141175 78037820 78643943 78787856 78619458 78188391 77408237 76349451
3612G6349451j302262j402975j527784j666708j667650j767839j691058j797182
$$ 76349451 75047189 73644214 72116430 70449722 68782072 67014233 65323175 63525993
3604F3525993j663890j672876j694385j689692j635090j582007j586260j540304
$$ 63525993 61862103 60189227 58494842 56805150 55170060 53588053 52001793 50461489
3596E0461489j665053j562932j502569j499839j510520j408848j369147j257983
$$ 50461489 48796436 47233504 45730935 44231096 42720576 41311728 39942581 38684598
3588C8684598j145437j011304j024540r53755q90625q89293p87409q21742p64342
$$ 38684598 37539161 36527857 35503317 34549562 33658937 32769644 31982235 31160493 30396151
3579C0396151o57066p15270n04802m95234n47152m30293l54053l37254k12665
$$ 30396151 29739085 29023815 28519013 28023779 27476627 27046334 26692281 26355027 26142362
3570B6142362k18738o0494l0091M1804P9652O6502J72459K65057L03128L60487
$$ 26142362 25923624 25863130 25833039 25874843 25954495 26020997 26193456 26458513 26761641 27122128
3560B7122128L92551M53277M37937M14382N21567N66489N84723O54342O53719
$$ 27122128 27514679 27967956 28405893 28820275 29341842 29908331 30493054 31147396 31801115
3551C1801115P57840P18639Q08355Q94982Q09025Q73431J008052R94344R32321
$$ 31801115 32558955 33277594 34085949 34980931 35789956 36663387 37671439 38665783 39598104
3542C9598104R98598R75104Q46589Q53776Q28376Q28524Q69077P72507P73112
$$ 39598104 40596702 41571806 42418395 43272171 44100547 44929071 45798148 46570655 47343767
3533D7343767P35241P21760N95077N56583N77638N86386L70126L50183K27342
$$ 47343767 48079008 48800768 49395845 49952428 50530066 51116452 51486578 51836761 52064103
3524E2064103J33545K0365k2163Q4631K42l1605P901J18080J23507R2088K41176
$$ 52064103 52197648 52218013 52195850 52280481 52280723 52249118 52257019 52375099 52498606 52590694 52831870
3513E2831870J92015K80846M21163M36756N14373N84955O83503P17096Q71102
$$ 52831870 53023885 53304731 53725894 54162650 54677023 55261978 55945481 56662577 57533679
3504E7533679J005592J024510J204280J287529J318911J352010J438336J684596
$$ 57533679 58539271 59563781 60768061 62055590 63374501 64726511 66164847 67849443
3496F7849443J760488J761623J941637K094823K253177K551775K793163L059457
$$ 67849443 69609931 71371554 73313191 75408014 77661191 80212966 83006129 86065586
3488H6065586L489607L787002M101796M376970M578156M718325M744517M476023
$$ 86065586 89555193 93342195 97443991 101820961 106399117 111117442 115861959 120337982
3480A20337982M321083M094433L840894L607709L370205L276566L416841L389121
$$ 120337982 124659065 128753498 132594392 136202101 139572306 142848872 146265713 149654834
3472A49654834L460185L523811L555199L293464K923166K405754J848217J199138
$$ 149654834 153115019 156638830 160194029 163487493 166410659 168816413 170664630 171863768
3464A71863768N08178j35840o51340j064127j353783j440989j486129j382118
$$ 171863768 172371946 172236106 171584766 170520639 169166856 167725867 166239738 164857620
3456A64857620j335609j303768j276781j218472j299165j386242j483218j373718
$$ 164857620 163522011 162218243 160941462 159722990 158423825 157037583 155554365 154180647
3448A54180647j341671j292512j224968j193441j202373j116181j108486j099738
$$ 154180647 152838976 151546464 150321496 149128055 147925682 146809501 145701015 144601277
3440A44601277j090668j025164r62787r19029q63324q10745p10262p18463p07707
$$ 144601277 143510609 142485445 141522658 140603629 139740305 138929560 138219298 137500835 136793128
3431A36793128o16268p24733p10399q06953q88727j067188j230419j452833j584390
$$ 136793128 136176860 135452127 134741728 133934775 133046048 131978860 130748441 129295608 127711218
3422A27711218j700915j969963k142985k357351k616801k811403k923130l221983
$$ 127711218 126010303 124040340 121897355 119540004 116923203 114111800 111188670 107966687
3414A07966687l373986l317235l150078k865099k653795k464668k238833k053467
$$ 107966687 104592701 101275466 98125388 95260289 92606494 90141826 87902993 85849526
3406H5849526j895908j839908j779368j655914j608480j574677j512474j492832
$$ 85849526 83953618 82113710 80334342 78678428 77069948 75495271 73982797 72489965
3398G2489965j453053j423929j439700j361165j125750q83502o85549m87506k41306
$$ 72489965 71036912 69612983 68173283 66812118 65686368 64802866 64117317 63629811 63388505
3389F3388505p5497K942R2157p0295l99623p01163j127701j386364j291087j127887
$$ 63388505 63313008 63315950 63408107 63337812 62938189 62237026 61109325 59722961 58431874 57303987
3379E7303987p58522n24295m03803j73321L7081O0668J79278L08239M20910N23850
$$ 57303987 56545465 56021170 55617367 55444046 55481127 55541795 55721073 56029312 56450222 56974072
3369E6974072N45313M97783M57538M29126K65855J28473k06o2079k21136l58198
$$ 56974072 57519385 58017168 58474706 58903832 59169687 59298160 59297954 59235875 59014739 58656541
3359E8656541l25500l67439m62872o20550p33897q77536j070941j177725j388768
$$ 58656541 58331041 57963602 57500730 56880180 56146283 55268747 54197806 53020081 51631313
3350E1631313j491111j494301j400504j281742j193081j105731r48621r04648
$$ 51631313 50140202 48645901 47245397 45963655 44770574 43664843 42716222 41811574
3342D1811574q13505p53943p32789n52428m65851l78713l22554j02840q6333k5939
$$ 41811574 40998069 40244126 39511337 38958909 38493058 38114345 37791791 37688951 37602618 37576679
3332C7576679Q5307J69977L95080M86185O49420Q85433R61355J075169J246804
$$ 37576679 37661986 37831963 38227043 38713228 39362648 40248081 41209436 42284605 43531409
3323D3531409J448677J456910J576611J702803J708093J706585J886676J848638
$$ 43531409 44980086 46436996 48013607 49716410 51424503 53131088 55017764 56866402
3315E6866402J790955J760490J724090J639532J464751J336071J309982J314128
$$ 56866402 58657357 60417847 62141937 63781469 65246220 66582291 67892273 69206401
3307F9206401J183835J077768J052235Q98889O18542N33426J89539n5849l56062
$$ 69206401 70390236 71468004 72520239 73419128 74037670 74571096 74760635 74704786 74348724
3298G4348724n68098q15951r13428j102040j183129j281713j334617j429527j413630
$$ 74348724 73780626 72964675 72051247 70949207 69766078 68484365 67149748 65720221 64306591
3289F4306591j379455j564561j595663j631222j749705j786955j824627j892717
$$ 64306591 62927136 61362575 59766912 58135690 56385985 54599030 52774403 50881686
3281E0881686j813364j737788j773065j649374j577423j540136j403625j283099
$$ 50881686 49068322 47330534 45557469 43908095 42330672 40790536 39386911 38103812
3273C8103812j233246j156049j012751r63359p97147p77952p28995o05197o16688
$$ 38103812 36870566 35714517 34701766 33738407 32941260 32163308 31434313 30829116 30212428
3264C0212428m72339m75121m12031m84453m31307m50522l88501l47665l54238
$$ 30212428 29740089 29264968 28852937 28368484 27937177 27486655 27098154 26750489 26396251
3255B6396251m12101l17353l22066k98581l45361l08947k75153k45533k79589
$$ 26396251 25984150 25666797 25344731 25046150 24700789 24391842 24116689 23871156 23591567
3246B3591567l02579k40853k54617j58851k21997k51449k74053j59975k11208
$$ 23591567 23288988 23048135 22793518 22634667 22412670 22161221 21887168 21727193 21515985
3237B1515985k09738j58331j94401j93548j43799j95423k00660k28421k05051
$$ 21515985 21306247 21147916 20953515 20759967 20616168 20420745 20220085 19991664 19786613
3228A9786613k10440j66105l82656k36402k51906j99718k82355k67616j95770
$$ 19786613 19576173 19410068 19027412 18791010 18539104 18339386 18057031 17789415 17593645
3219A7593645k11173j69102k48639k32028j42116j20868j66687j47419j53106
$$ 17593645 17382472 17213370 16964731 16732703 16590587 16469719 16303032 16155613 16002507
3210A6002507j35902j21144k06343k08798j71322r0033j66721k37846m4316q8110
$$ 16002507 15866605 15745461 15539118 15330320 15158998 15068965 14902244 14664398 14620082 14531972
3200A4531972k37176j57808j34231j21338j86211j91949q6900l6683r3846p2935
$$ 14531972 14294796 14136988 14002757 13881419 13695208 13503259 13416359 13379676 13285830 13212895
3190A3212895j3871q3517p7425n0573M3214L8435K7742J08001J64682J86287Q9374
$$ 13212895 13199024 13115507 13038082 12987509 13030723 13069158 13096900 13204901 13369583 13555870 13645244
3179A3645244J70285J09472J73883J54675R6035J06657P2775J28712R667N1411
$$ 13645244 13815529 13925001 14098884 14253559 14349594 14456251 14529026 14657738 14667405 14718816
3169A4718816M5176K9548Q7268O7080O4911P8776K9088J47719J17238L0000L2921
$$ 14718816 14763992 14793540 14880808 14947888 15012799 15091575 15120663 15268382 15385620 15415620 15448541
3158A5448541K06498J15528J66116K13508K72499L69258L73851L14918L77001
$$ 15448541 15655039 15770567 15936683 16150191 16422690 16791948 17165799 17480717 17857718
3149A7857718N26930N02387N31907N13393O30449O65156P69690P57264O89742
$$ 17857718 18384648 18887035 19418942 19932335 20562784 21227940 21997630 22754894 23444636
3140B3444636Q25957R47973R82113J073229J097390J222711J501022J597368J670015
$$ 23444636 24270593 25218566 26200679 27273908 28371298 29594009 31095031 32692399 34362414
3131C4362414J839401K007481K113458K195946K371817K472549K677155K903789
$$ 34362414 36201815 38209296 40322754 42518700 44890517 47363066 50040221 52944010
3123E2944010L209042L564411L857967M211774M458890M427887M230692L613283
$$ 52944010 56153052 59717463 63575430 67787204 72246094 76673981 80904673 84517956
3115H4517956K611061J495104J32730j138086k197591k960856l252072l291647
$$ 84517956 87129017 88624121 88756851 87618765 85421174 82460318 79208246 75916599
3107G5916599l235704k879784k550238k269539j855857j487066j175181q46531
$$ 75916599 72680895 69801111 67250873 64981334 63125477 61638411 60463230 59616699
3099E9616699m67114j47212K44913O47766R69544J424564J793826K165528K609921
$$ 59616699 59149585 59002373 59247286 59895052 60864596 62289160 64082986 66248514 68858435
3090F8858435L084535L598918M163258M674781N163159N870656O476445O931239
$$ 68858435 71942970 75541888 79705146 84379927 89543086 95413742 101890187 108821426
3082A08821426P402692P538636P766668P761412P737414P930503Q483081R599737
$$ 108821426 116224118 123762754 131529422 139290834 147028248 154958751 163441832 173041569
3074A73041569J1434849J3265347J4480063J4889575J4394743J2381203Q982601
$$ 173041569 184476418 197741765 212221828 227111403 241506146 253887349 262869950
3067B62869950M908809M90049l084475m638702m493525l651704l022125l017606
$$ 262869950 267778759 268268808 265184333 260545631 256052106 252400402 249378277 246360671
3059B46360671l904743n397938p254893r046907j0159089j0918197j0975916j0676041
$$ 246360671 242455928 237057990 229803097 220756190 210597101 199678904 188702988 178026947
3051A78026947j0158131r548918r138402q665191q295980p817379p194846o533960
$$ 178026947 167868816 158319898 149181496 140516305 132220325 124402946 117208100 110674140
3043A10674140n921175n368323m898779m505221m050527l696769l432576l060154
$$ 110674140 104752965 99384642 94485863 89980642 85930115 82233346 78800770 75740616
3035G5740616k752833k507334k209073k038594j806345j604261j443703j338519
$$ 75740616 72987783 70480449 68271376 66232782 64426437 62822176 61378473 60039954
3027F0039954j189130j066712r67157j058076j018614j045692r34161r89282j048854
$$ 60039954 58850824 57784112 56816955 55758879 54740265 53694573 52760412 51771130 50722276
3018E0722276j000390r96722j043657j112609j171136j152548j254048j334414
$$ 50722276 49721886 48725164 47681507 46568898 45397762 44245214 42991166 41656752
3010D1656752j257833j354415j289210j265772j152723j112554j098484j025886
$$ 41656752 40398919 39044504 37755294 36489522 35336799 34224245 33125761 32099875
3002C2099875j024445q84558q43025q19847q22418p68439o60206o71788o23261
$$ 32099875 31075430 30190872 29347847 28528000 27705582 26937143 26276937 25605149 24981888
2993B4981888n97187n72810n29640n81089o04942n53088n85464n15753m73042
$$ 24981888 24384701 23811891 23282251 22701162 22096220 21543132 20957668 20441915 19968873
2984A9968873m14505m78754m34996l89154l66225l29770m18620l68488l80445
$$ 19968873 19554368 19075614 18640618 18251464 17885239 17555469 17136849 16768361 16387916
2975A6387916k42589k90508l57026k88180k59201k20205j33067l01030k21384
$$ 16387916 16145327 15854819 15497793 15209613 14950412 14730207 14597140 14296110 14074726
2966A4074726k11176j99762j65532k07490k34612k25546k09418j29642j36040
$$ 14074726 13863550 13663788 13498256 13290766 13056154 12830608 12621190 12491548 12355508
2957A2355508j91317j70005j77118j21486j82723j42737j65777k12995j18353
$$ 12355508 12164191 11994186 11817068 11695582 11512859 11370122 11204345 10991350 10872997
2948A0872997j27701j63561j25650j40555j48702j22257j27464j63833l1519j44089
$$ 10872997 10745296 10581735 10456085 10315530 10166828 10044571 9917107 9753274 9721755 9577666
2938I577666j89577k3960r2341j14002j62339j31929j41450q2520n4126j34684
$$ 9577666 9388089 9364129 9271788 9157786 8995447 8863518 8722068 8639548 8585422 8450738
2928H450738j10736o7480l9724j11936j03309j59459K571o0515r8140j00619n4260
$$ 8450738 8340002 8272522 8232798 8120862 8017553 7858094 7860665 7800150 7702010 7601391 7547131
2917G547131Q978j8729n4576j61135J2041k890j5435m3989j31131j30580j18105
$$ 7547131 7556109 7537380 7482804 7321669 7333710 7330820 7315385 7271396 7140265 7009685 6891580
2906F891580n5024n4101j7734j13420p5000k9555o1797q0484J217o8481k6324
$$ 6891580 6836556 6782455 6764721 6651301 6576301 6546746 6484949 6404465 6405682 6337201 6310877
2895F310877j45439r4839o1177m0012j2653n8474r8441p3604r065o3339J4056
$$ 6310877 6165438 6070599 6009422 5969410 5956757 5898283 5799842 5726238 5717173 5653834 5667890
2884E667890n0358j06653q2612k3520l5433J341K7373m3617n6881K3348n3358
$$ 5667890 5617532 5510879 5428267 5404747 5369314 5370655 5398028 5354411 5297530 5320878 5267520
2873E267520n4485j05534J4702J20548m0011m9803n8762O7027J1792M838p1335
$$ 5267520 5213035 5107501 5122203 5242751 5202740 5152937 5094175 5161202 5172994 5177832 5106497
2862E106497j7526l9502O377j2860L8757j22892m4810k391j3688P0473r748k4874
$$ 5106497 5088971 5049469 5055846 5042986 5081743 4958851 4914041 4911650 4897962 4968435 4958687 4933813
2850D933813p4797l9795r5131M8433l3485l0625j6886K0595j9189q8428m3811
$$ 4933813 4859016 4819221 4724090 4772523 4739038 4708413 4691527 4712122 4692933 4604505 4560694
2839D560694P4620L450o754k5505N0725q199O7200P3031m6336o4188P728o7949
$$ 4560694 4635314 4638764 4632010 4606505 4657230 4649031 4716231 4789262 4742926 4678738 4686466 4618517
2827D618517O321J8184m7343j9970k2243p446j3345o7812J8510K1218J1054q4226
$$ 4618517 4624838 4643022 4595679 4575709 4553466 4546020 4532675 4464863 4483373 4504591 4515645 4431419
2815D431419k0595l3916j4092L4859J8008L5204k817l8588M9109K2932n6261O1119
$$ 4431419 4410824 4376908 4362816 4397675 4415683 4450887 4448070 4409482 4458591 4481523 4425262 4486381
2803D486381R2068O8715j7456J33824Q8772k0896m425K5331M5818P5698l6281
$$ 4486381 4578449 4647164 4629708 4763532 4852304 4831408 4826983 4852314 4898132 4973830 4937549
2792D937549K3336l4144N3964M5527K1363P970O3529M5007K4151l9534m0149o5519
$$ 4937549 4960885 4926741 4980705 5026232 5047595 5055565 5119094 5164101 5188252 5148718 5108569 5043050
2780E043050m3547l4773l7651n9955k1576j7581j05532j4081q7595j15231j6574
$$ 5043050 4999503 4964730 4927079 4867124 4845548 4827967 4722435 4708354 4620759 4505528 4488954
2769D488954n9365p9443k2593k7811q335k5217o3714j02233n8623p3561m2655
$$ 4488954 4429589 4350146 4327553 4299742 4291407 4266190 4202476 4100243 4041620 3968059 3925404
2758C925404p1802m9266j21394k7408k3268l7927j31074n9953r069K325j286m2817
$$ 3925404 3853602 3804336 3682942 3655534 3632266 3594339 3463265 3403312 3394243 3396568 3395282 3352465
2746C352465n0285P865o7601j6729N6606n7810p8862q1541n5839o7828K3825r697
$$ 3352465 3302180 3310045 3242444 3225715 3282321 3224511 3145649 3064108 3008269 2940441 2964266 2954569
2734B954569K7480o8424j4542r374p4715l9679J4584k5801p247l8143j9394N7178
$$ 2954569 2982049 2913625 2899083 2889709 2814994 2775315 2789899 2764098 2756851 2718708 2699314 2756492
2722B756492n2879J464p1003K6827p6839j4180N457k3018p7361K0554n566k7342
$$ 2756492 2703613 2705077 2634074 2660901 2584062 2569882 2575339 2552321 2474960 2495514 2489948 2462606
2710B462606p5025j599K3808P311K5205n9531k7562j3725Q18q8145M8395n1875
$$ 2462606 2387581 2385982 2409790 2417101 2442306 2382775 2355213 2341488 2342306 2254161 2302556 2250681
2698B250681l0173m9196K4976q332J1466K3131j9346n6043j8219j4098J1992K2571
$$ 2250681 2220508 2171312 2196288 2187956 2199422 2222553 2203207 2147164 2128945 2114847 2126839 2149410
2686B149410J3139n3320p154J5213l524k5446K900p165j9856q6812l2852J7627
$$ 2149410 2162549 2109229 2102075 2117288 2113764 2088318 2091218 2084053 2064197 1977385 1944533 1962160
2674A962160R9983l4792m0634J7321k6573J8594O359M6014n6526n4246m6023m8624
$$ 1962160 2062143 2027351 1986717 2004038 1977465 1996059 2002418 2048432 1991906 1937660 1891637 1843013
2662A843013K9177L4639l5091n452M3016L2142M1687r864m1850o806l4584J3109
$$ 1843013 1872190 1906829 1871738 1866286 1909302 1941444 1983131 1973267 1931417 1924611 1890027 1903136
2650A903136k8780m7327m2051k2832l659k13K2542l7377K8901l7420l5703p712
$$ 1903136 1874356 1827029 1784978 1762146 1758487 1758274 1780816 1743439 1772340 1734920 1699217 1691505
2638A691505O8695L4624q901j18878o6188N9672M9667J623J5140j3501n3911R494
$$ 1691505 1760200 1794824 1785923 1667045 1600857 1660529 1710196 1711819 1726959 1713458 1659547 1669041
2626A669041Q49l3935m0615O1194m6103m0465K7473M4206l3098l2092j2853P444
$$ 1669041 1669890 1635955 1595340 1656534 1610431 1569966 1597439 1641645 1608547 1576455 1563602 1571046
2614A571046L3798L4849l6833n6999j0786J1981k2287L6485k2977R381l2826l6885
$$ 1571046 1604844 1639693 1602860 1545861 1535075 1547056 1524769 1561254 1538277 1547658 1514832 1477947
2602A477947J1710M330J4839M74p6149j9112J1708N6661j02418l8982N5126J211
$$ 1477947 1489657 1493987 1508826 1509300 1433151 1414039 1425747 1482408 1379990 1341008 1396134 1397345
2590A397345m7404K2608K1895N1887M1506k3172l5502K3279J6591L0250k3623
$$ 1397345 1349941 1372549 1394444 1446331 1487837 1464665 1429163 1452442 1469033 1499283 1475660
2579A475660j5239J8017L2068l6267p9376L3297N9486o2604o0020Q2012n868m0428
$$ 1475660 1460421 1478438 1510506 1474239 1394863 1428160 1487646 1425042 1365022 1447034 1441166 1400738
2567A400738l0026m2309P365M1964r0273L8269l437k1345J9304N1319j4382m1061
$$ 1400738 1370712 1328403 1335768 1377732 1287459 1325728 1322291 1300946 1320250 1371569 1357187 1316126
2555A316126j7426m4228J5600K6049l9611j3070L0380K8246O616n8514k8649K5542
$$ 1316126 1298700 1254472 1270072 1296121 1256510 1243440 1273820 1302066 1308682 1250168 1221519 1247061
2543A247061m9681k2938J1632L5896L1323j2127k5064l1238M7705P485l1925J2613
$$ 1247061 1197380 1174442 1186074 1221970 1253293 1241166 1216102 1184864 1232569 1240054 1208129 1220742
2531A220742J3442l8977k2175j3196o5217R6975J2105p3200M017L7066L0995o403
$$ 1220742 1234184 1195207 1173032 1159836 1094619 1191594 1203699 1130499 1134516 1171582 1202577 1196174
2519A196174q6361l7889j2586J12212R430r157P188n0825k7038l3800M950J0853
$$ 1196174 1109813 1071924 1059338 1171550 1180980 1171823 1179011 1128186 1101148 1067348 1072298 1083151
2507A083151M3412M3415K2529q8428l1519Q6964n1556k300j3613R434P9716q3944
$$ 1083151 1126563 1169978 1192507 1104079 1072560 1159524 1107968 1105668 1092055 1101489 1181205 1097261
2495A097261j2799L0496n0197k9018Q932p019L0437o0419K7144L0112k1899M5463
$$ 1097261 1084462 1114958 1064761 1035743 1044675 1037656 1068093 1007674 1034818 1064930 1043031 1088494
2483A088494o774N4041k4379n078o1912n4938K6782M8898k7501o3650k3635J0336
$$ 1088494 1081720 1135761 1111382 1106304 1044392 989454 1016236 1065134 1037633 973983 950348 960684
2471I60684O6958K1586l708n3804p699M977K3735j7613N0552J2286r5778J2709
$$ 960684 1027642 1049228 1045520 991716 984017 988994 1012729 995116 1045668 1057954 962176 974885
2459I74885l1481l7187K4690j465K5695O2201K9751l7600m6750J0957l178k2083
$$ 974885 943404 906217 930907 929442 955137 1017338 1047089 1009489 962739 973696 970518 948435
2447I48435M4518R1943M9098p6367r9958j7296j10K3116P0974K3181l9644k1910
$$ 948435 992953 1084896 1133994 1057627 957669 940373 940263 963379 1034353 1057534 1017890 995980
2435I95980l7687l5970q765l682K3963j9567N3032p1632q002L8654n1382K6796
$$ 995980 958293 922323 913558 909876 933839 914272 967304 895672 887670 926324 874942 901738
2423I01738Q080r208P6386P494l3873l5661J2181K6802m1913j5671J4490j9520
$$ 901738 909818 900610 976996 984490 950617 914956 927137 953939 912026 896355 910845 891325
2411H91325J4065O5520r923l834M0680o4084m2524M628k3776O255N9831K7664
$$ 891325 905390 970910 960987 957153 997833 933749 891225 895853 872077 878332 938163 965827
2399I65827Q324K2691j5998l5461L9605m7913k2408K3152O0179k7391K7421L2811
$$ 965827 974151 996842 980844 945383 984988 937075 914667 937819 997998 970607 998028 1030839
2387A030839o4362j8997k6052M4679K6028K8358J8345p1714j9412O0507R915j0182
$$ 1030839 966477 947480 921428 966107 992135 1020493 1038838 967124 947712 1008219 1018134 1007952
2375A007952L7364J3085p3849K3322J06794n370n1690Q0611q6226K33N754L6839
$$ 1007952 1045316 1058401 984552 1007874 1114668 1109298 1057608 1138219 1051993 1052226 1057980 1094819
2363A094819N0871k6746k6870P0054k5190N9320J04841O3097J5403K635n464j3587
$$ 1094819 1145690 1118944 1092074 1162128 1136938 1196258 1301099 1364196 1379599 1382234 1376770 1363183
2351A363183J11368O4122J8840R657Q7258M9698O1815O8139J10599K7883J12176
$$ 1363183 1474551 1538673 1557513 1567170 1654428 1704126 1765941 1834080 1944679 1972562 2084738
2340B084738J23186J00208J25236J37084J43422J80219J80469K28985K52754K84542
$$ 2084738 2207924 2308132 2433368 2570452 2713874 2894093 3074562 3303547 3556301 3840843
2330C840843L04280L65889M67192M79457M76586M93922N09467N39366P43650Q02062
$$ 3840843 4145123 4511012 4978204 5457661 5934247 6428169 6937636 7477002 8220652 9022714
2320I022714R68397J239819J746891K339344K921091K923245K791353K918956
$$ 9022714 9991111 11230930 12977821 15317165 18238256 21161501 23952854 26871810
2312B6871810K351135Q21758Q237j548862l075356k926279k696932k251904j797047
$$ 26871810 29222945 30044703 30052940 28504078 25428722 22502443 19805511 17553607 15756560
2303A5756560j360788j112389j045419r81659q60104p35645o44593o55736m54646
$$ 15756560 14395772 13283383 12237964 11256305 10396201 9660556 9015963 8360227 7905581
2294G905581m25477l96924m23618m12159l22968l98420l03803k80845k36578k14075
$$ 7905581 7480104 7083180 6659562 6247403 5924435 5526015 5222212 4941367 4704789 4490714
2284D490714k20996j78764j20600j40881j74801j16711j26008j12885r9410r7695
$$ 4490714 4269718 4090954 3970354 3829473 3654672 3537961 3411953 3299068 3199658 3101963
2274C101963o1695m4946j95592j06643l1832n8513o7619p1222q6970p0511l0215
$$ 3101963 3040268 2995322 2799730 2693087 2661255 2602742 2535123 2463901 2376931 2306420 2276205
2263B276205j30625m3768j4048k4758o0881m8536j8497p9524o9976q7450L1627
$$ 2276205 2145580 2101812 2087764 2063006 2002125 1953589 1935092 1855568 1785592 1698142 1729769
2252A729769o519l7682N8406J0723l3910p4540m1767p2042l8014L4734J9418q0424
$$ 1729769 1723250 1685568 1743974 1754697 1720787 1646247 1604480 1532438 1494424 1529158 1548576 1468152
2240A468152j2105J8409n8796n5019K3288m9402L5322K5899j1418n4965p3561
$$ 1468152 1456047 1474456 1415660 1360641 1383929 1334527 1369849 1395748 1384330 1329365 1255804
2229A255804L372n9738K4383O299j7624o9461j0895O0739M3230J6903m3973j13674
$$ 1255804 1259176 1199438 1223821 1230120 1212496 1143035 1132140 1192879 1236109 1253012 1209039 1095365
2217A095365m7749n3852L135M9127k737j1466M796L6410J3230J9275p3396p66
$$ 1095365 1047616 993764 996899 1046026 1043289 1031823 1036619 1073029 1086259 1105534 1032138 1031372
2205A031372N0228j9941K9531r893j0307o5310J4951n1018M7639K7276k7421n1525
$$ 1031372 1081600 1061659 1091190 1081297 1070990 1005680 1020631 969613 1017252 1044528 1017107 965582
2193I65582O052p111r292j2744n2484J1509o7189K953P1575j0942j06106M0318
$$ 965582 971634 964523 955231 942487 890003 901512 834323 837276 908851 897909 791803 832121
2181H32121j9375k9748N4584L0210l2802k7269r566K6635j9387n068l591K2002
$$ 832121 812746 782998 837582 867792 834990 807721 798155 824790 805403 800335 796744 818746
2169H18746J6673j5931n1306k6506K2202p5453K9413J3241M6989O0927o3774o3701
$$ 818746 835419 819488 768182 741676 763878 688425 717838 731079 778068 838995 775221 711520
2157G11520K7177L8658j5671l204m6255N7518m1018K4373N6430o7334M6611q897
$$ 711520 738697 777355 761684 758480 712225 769743 728725 753098 809528 742194 788805 779908
2145G79908r56n2511k953m7139L02l3985n4996P3355k8849Q373k7065q742O3333
$$ 779908 778952 726441 723488 676349 676651 642666 587670 661025 632176 640549 613484 604742 668075
2132F68075Q8114o1505r825o249l5655O2767k575l0489K9674j0805p03m8464M4721
$$ 668075 756189 694684 684859 678610 642955 705722 703147 672658 702332 691527 690824 642360 687081
2119F87081K1900q8725M2971L586k6025L5971o0870J2183L64M6384J8954o6266
$$ 687081 708981 620256 663227 666813 640788 676759 615889 628072 628436 674820 693774 627508
2107F27508m726J5752k7830r134m9834O215j6506q576L1030n418j150p1817N0161
$$ 627508 622782 638534 610704 601570 551736 557951 541445 532869 563899 558481 557331 485514 535675
2094E35675N2538L26l0548m0848l6219M1034M3973L4651Q014j4850m8031o1983
$$ 535675 588213 588539 557991 517143 480924 521958 565931 600582 608596 593746 545715 483732
2082D83732J1057P726l941K4919k5659J8346M2176k9562p1007N6892k1788J3335
$$ 483732 494789 502515 498574 523493 497834 516180 558356 528794 457787 514679 492891 506226
2070E06226j6955O6562m27l0337k1400j9944M6450k0058J7898l9355N179j9782
$$ 506226 489271 555833 555406 525069 503669 483725 530175 510117 528015 488660 493839 474057
2058D74057J6094M7821k3751m6903j2940K8237L7383j4149M5258M9733l4218j2516
$$ 474057 490151 537972 514221 467318 454378 482615 519998 505849 551107 600840 566622 554106
2046E54106J4878j9337N2007M4081O450N6406p4875o3522k4095j62m125J752j8660
$$ 554106 568984 549647 601654 645735 652185 708591 633716 570194 546099 545937 541812 543564 524904
2033E24904m6208N5194k3501N101J1135J2848K8570k3335j3982n5844m0334M5872
$$ 524904 478696 533890 510389 515490 526625 539473 568043 544708 530726 474882 434548 480420
2021D80420n0743K792J0539k4530L1926r262K9422K7885J0357j0458L994j6875
$$ 480420 429677 432469 443008 418478 450404 441142 470564 498449 508806 498348 502342 485467
2009D85467K0122q3349M3553J810p1217O5800j4283k5463M8555J6735j2733k135
$$ 485467 505589 422240 465793 467603 396386 462186 447903 422440 470995 487730 474997 472862
1997D72862q8124K8226N8136n3257M017L909J8070k9160o898M7618k3733k4151
$$ 472862 384738 412964 471100 417843 421860 425769 443839 414679 407781 455399 431666 407515
1985D07515O0914m3747k9410L7405L18L210l3878M659n4808m4007L7158m186l6297
$$ 407515 468429 424682 395272 432677 432995 436205 402327 406986 352178 308171 345329 341143 304846
1972C04846N3553K3482O2884O219o367m3673l2191l168K262M7893j1770m3156
$$ 304846 358399 381881 444765 450984 444617 400944 368753 365585 367847 415740 403970 360814
1960C60814k0749K2382m9835P543N7443k6559j5809L2385P8449P0169r2807j43344
$$ 360814 340065 362447 312612 320155 377598 351039 335230 367615 446064 516233 423426 280082
1948B80082N116Q2048Q742l6589K995k6145M1308K6090M467o4823O416P7475K6392
$$ 280082 285198 367246 375988 339399 342394 316249 357557 383647 388114 323291 329707 407182 433574
1935D33574n4711j5676l5375M1083N6778j9536m0366O921k6875R59j3243L2710
$$ 433574 378863 363187 327812 368895 425673 406137 365771 372692 345817 346776 333533 366243
1923C66243K7298o7558O6364m0460O467j2916J7854m6228p2309O92L0928J3860
$$ 366243 393541 325983 392347 351887 358354 345438 363292 317064 244755 245447 276375 290235
1911B90235l1513M2399j6897k2140J3265P650K6500l7272J1726k86N9866N85k9796
$$ 290235 258722 301121 284224 262084 275349 282999 309499 272227 283953 283667 343533 344118 314322
1898C14322j8033K1112R758j5714J0002l8261K5531L2234M6237N8411o1800j1894
$$ 314322 296289 317401 327159 311445 321447 283186 308717 340951 387188 445599 383799 371905
1886C71905M1939p642m5022p21M2027j24851N0572k2964q3379M28M1100M7577
$$ 371905 413844 406202 361180 360459 402486 277635 328207 305243 221864 222292 263392 310969
1874C10969n8149L4289o3561J6018L9584n8896Q4702j5105O341N1729k3857j9088
$$ 310969 252820 287109 223548 239566 279150 220254 304956 289851 296192 347921 324064 304976
1862C04976R131r664K8403J8929l0852M2934k2350r5423M501K0549l178P0384
$$ 304976 314107 304443 332846 351775 320923 363857 341507 246084 250585 271134 267956 338340
1850C38340j3121m9054K1694K3368k2740J7665k2200l9926K8030O2651j18789
$$ 338340 325219 276165 297859 321227 298487 316152 293952 254026 282056 344707 225918
1839B25918o1626M7909q431Q383K6803M3950L2319J2289k6278p4176l4534L5043
$$ 225918 164292 212201 203770 212153 238956 282906 315225 327514 301236 227060 192526 227569
1827B27569m2200O728m584K2184L9271R29k0982j8660K5120j5065j4500P0411
$$ 227569 185369 192097 187513 209697 248968 249897 228915 210255 235375 220310 205810 276221
1815B76221L1122l9728J9269l243j5052m3261N5415K1515K1752l3700J6839K2918
$$ 276221 307343 267615 286884 283641 268589 225328 280743 302258 324010 290310 307149 330067
1803C30067m6956q2088N5454M4223j6334M8467l527o3628m6925n667m3061L6087
$$ 330067 283111 201023 256477 300700 284366 332833 329306 265678 218753 213086 170025 206112
1791B06112O7005K9357J8299p810n1030k3892l9007K2245k4100K4766j660l1618
$$ 206112 273117 302474 320773 312963 261933 238041 199034 221279 197179 221945 220285 188667
1779A88667k58P1746k1014r4703M1330J3358N1505r483Q862l1733p1757K5950
$$ 188667 188409 260155 239141 144438 185768 199126 250631 241148 250010 218277 146520 172470
1767A72470K3937k9856K9417N5649j6648O6558l0560l2225K412m868k657l0256
$$ 172470 196407 166551 195968 251617 234969 301527 270967 238742 241154 236286 233629 203373
1755B03373n3563O0405K6988j404j2910L0789J6065O476m8175l8937K784L8466
$$ 203373 149810 210215 237203 235799 222889 253678 269743 276219 228044 189107 191891 230357
1743B30357M056Q864q3284N731K0224J3564j9268J6365L5876j4648J837k2453
$$ 230357 234413 243277 159993 165724 185948 199512 180244 196609 232485 217837 219674 197221
1731A97221L6487m2368k2417O2966k8175l6428O0409n5673J9229l2132O0501P0893
$$ 197221 233708 191340 168923 231889 203714 167286 227695 172022 191251 159119 219620 290513
1719B90513n1082o2794q365P464J18890l0021m6013r507j9325k3550N689L3701
$$ 290513 239431 176637 168272 175736 294626 264605 218592 209085 189760 166210 171899 205600
1707B05600L2785J6015k8738j0125J80J2592k0208m3965M940L5300L7308J3572
$$ 205600 238385 254400 225662 215537 215717 228309 208101 164136 169076 204376 241684 255256
1695B55256o9615n8613J2637K7681O9777l0434k219N0286k1536o6293L4222M8426
$$ 255256 185641 127028 139665 167346 237123 206689 204470 254756 233220 166927 201149 249575
1683B49575m0754k2276n9130K325L912m1148r953N4518l841R622J150N3985n9955
$$ 249575 208821 186545 127415 129740 133652 92504 82551 137069 133228 142850 144000 197985 138030
1670A38030k5321P219j1836P0555k2272M1915K5038o7000k4008N9584k8283N5169
$$ 138030 112709 119928 108092 178647 156375 198290 223328 156328 132320 191904 163621 218790
1658B18790o1147p7840n189q366L815N296O532K778M5602k1090M7475P774J6973
$$ 218790 157643 79803 74614 66248 70063 75359 81891 84669 130271 109181 156656 164430 181403
1645A81403k076N42L648r978J9893K2712L8260K484q8981k4777N1124P9692j17616
$$ 181403 179327 179869 183517 173539 193432 216144 254404 256888 167907 143130 194254 273946 156330
1632A56330m1669J8736p33l0497k3429O6298l3178m5544N9656L9620m7508N2901
$$ 156330 114661 133397 132664 102167 78738 145036 111858 66314 125970 165590 118082 170983
1620A70983k5217M6635J0414m2918j4887k4000J4347K2920n342q8315O6215K0057
$$ 170983 145766 192401 202815 159897 145010 121010 135357 158277 152935 64620 130835 150892
1608A50892J176j0547m7334M5108L4970n0226j674M5421m49j5465k5529L5496
$$ 150892 152068 141521 94187 139295 174265 124039 122365 167786 167337 151872 126343 161839
1596A61839J6429J0541l0935j2379Q881j5880k0110O1193J4627p6996Q178L8645
$$ 161839 178268 188809 157874 145495 154376 138496 118386 179579 194206 117210 125388 164033
1584A64033q7401J3129N6361p213O3541j5472M538j3507j1862l737m2931l1287
$$ 164033 76632 89761 146122 138909 202450 186978 191516 178009 166147 162410 119479 88192
1572H8192L7954j3149m2779L8085Q400l0913k4685M1858o483K1467P006M1648
$$ 88192 126146 112997 70218 108303 116703 85790 61105 102963 96480 117947 124953 166601
1560A66601L3048l7823K7933l3885l0915n4875O8711K4308q0464R6949N840n2317
$$ 166601 199649 161826 189759 155874 124959 70084 138795 163103 82639 179588 185428 133111
1548A33111l2929L6260R988k0924L8000j5131j5927q122m8538R3500k0325m2211
$$ 133111 100182 136442 146430 125506 163506 148375 132448 124326 75788 169288 148963 106752
1536A06752K1355n4265J2941k2188Q7932J7491l6435N0466J3523Q523j01656l2581
$$ 106752 128107 73842 86783 64595 152527 170018 133583 184049 197572 206095 104439 71858
1524G1858R202j1232l7632j1474Q2780p7519k338N9863k3309j954j5476K017l014
$$ 71858 81060 69828 32196 20722 103502 25983 23645 83508 60199 58245 42769 44786 41772
1511D1772l2178P1012M1749n2693o193k6671L5884m3018k9233M3917l5710Q3188
$$ 41772 9594 80606 122355 69662 63469 36798 72682 29664 431 44348 8638 91826
1499I1826M1499J2611q0845n3899Q0173O375k138l1056N5566m0297n9817J2023
$$ 91826 133325 145936 65091 11192 91365 97740 95602 64546 120112 79815 19998 32021
1487C2021J6369K3355k5980l4017K7913n651K710J1403J9032m0290l3723N2539
$$ 32021 48390 71745 45765 11748 39661 34010 36720 48123 67155 26865 -6858 45681
1475D5681k9025o887P0659J3735k3836N7691J1141J7614k8722l323k884n8982
$$ 45681 16656 9769 80428 94163 70327 128018 139159 156773 128051 124728 121844 62862
1463F2862K9644j9537l7168R4355m595q1276J3065O863L7181P166J3346M0583
$$ 62862 92506 72969 35801 130156 125561 44285 57350 64213 101394 108560 121906 162489
1451A62489l0557n019m4150J4871k0858p921m1121j6601J4264m1626K9953J5945
$$ 162489 131932 126913 82763 97634 76776 68855 27734 11133 25397 -16229 13724 29669
1439B9669J4499K2223M0137n217l941n7903j2636L644q653K283n4611K7408n062
$$ 29669 44168 66391 106528 101311 97370 39467 26831 30475 21822 24105 -30506 -3098 -8160
1426h160N4207N1466q381k9287O526j1223j2803K3087J2996N5130L2887r2925
$$ -8160 46047 97513 89132 59845 66371 55148 42345 65432 78428 133558 166445 73520
1414G3520K0612l6889Q2252k1120q1637j3153M0782k7183l6272K9993k8732J3070
$$ 73520 94132 57243 139495 118375 36738 23585 64367 37184 912 30905 2173 15243
1402A5243M0770J9926k5990N3812l9967L9027n5381o0852K1471n159K7960O1481
$$ 15243 56013 75939 49949 103761 63794 102821 47440 -13412 8059 2900 30860 92341
1390I2341J556r840o1440N0531P6122m9067l2886J7588k2603K2158o635K4868
$$ 92341 93897 84057 22617 73148 149270 100203 67317 84905 62302 84460 77825 102693
1378A02693n5895j8991O292K0808N155J5176j5787m2811k1707l2372K9942k7541
$$ 102693 46798 27807 34099 54907 60062 75238 59451 16640 -5067 -37439 -7497 -35038
1366c5038l0796O5130J05861P310k0953p2925J876k1256l5590R8734k2236m004
$$ -35038 -65834 -704 105157 112467 91514 18589 20465 -791 -36381 62353 40117 36113
1354C6113L1039N7055K0293j8765l4055o005K9322k3985l9227k7482j2978J9887
$$ 36113 67152 124207 144500 125735 91680 85675 114997 91012 51785 24303 11325 31212
1342C1212N9309q2703Q576N0638N044j0325k2231l8320M8328K1075N483k7288
$$ 31212 90521 7818 16394 67032 72076 61751 39520 1200 49528 70603 76086 48798
1330D8798q9216M2687L3898k2362J2103Q862o656o2849K1105M5558P362M6923
$$ 48798 -40418 2269 36167 13805 25908 34770 28114 -34735 -13630 31928 39290 86213
1318H6213n7188l8065l4671p432J0895l463N9284J7148p037N4642m086j7283M200
$$ 86213 29025 -9040 -43711 -51143 -40248 -43711 15573 32721 25684 80326 76240 58957 63157
1305F3157j033N801l2629n5248j2634K1978J8082K9888J3467l9436J4812q508
$$ 63157 62124 67925 35296 -19952 -32586 -10608 7474 37362 50829 11393 26205 17697
1293A7697J3397N1075m4586k3624K0736j776K8724m5210k0707J5067L9580k3047
$$ 17697 31094 82169 37583 13959 34695 32919 61643 16433 -4274 10793 50373 27326
1281B7326n7188m3781L0558J3296J8800L5069p2522J08302l9560o3118O8959m3248
$$ 27326 -29862 -73643 -43085 -29789 -10989 24080 -48442 59860 20300 -42818 26141 -17107
1269a7107J9162K2493J2944k4975n748K6200r133P858l6389r182Q7522n729q1153
$$ -17107 2055 24548 37492 12517 6769 32969 23836 31694 -4695 -13877 73645 67916 -13237
1256a3237j2824J1174P605l0148O8177m2717q1651L4250N4739O5667N79l2238
$$ -13237 -26061 -14887 -7282 -37430 30747 -11970 -93621 -59371 -4632 61035 61614 29376
1244B9376j4373J3012k3174k5349M2534n4010n400O7487M7851m4473j1660k4996
$$ 29376 15003 28015 4841 -20508 22026 -31984 -37384 30103 77954 33481 21821 -3175
1232c175O9229r5504N7664P155J539p3819j4164j9111J4848O0352l4695J5233
$$ -3175 66054 -29450 28214 35369 36908 -36911 -51075 -70186 -55338 5014 -29681 -14448
1220a4448P960M5557k058J6803m1075p862l5808O5828q754J2118l9818K711n0225
$$ -14448 -6488 39069 37011 53814 12739 4877 -30931 34897 26143 38261 -1557 1154 -49071
1207d9071J9853L3988J4543L4209m8755j7741N9889m2979N690K4031k01M67J3682
$$ -49071 -29218 4770 19313 53522 4767 -12974 46915 3936 9626 33657 33456 33923 47605
1194D7605k4664q424R450l5588p3724M0185N4752k7545M4650L7022k7329l4653
$$ 47605 22941 14517 23967 -11621 -85345 -45160 9592 -17953 26697 63719 36390 1737
1182A737j4557m5824J2971O522K4042J9048m6692N637L2544m5316J2690K5535
$$ 1737 -12820 -58644 -45673 -39151 -15109 3939 -42753 -37116 -4572 -49888 -37198 -11663
1170a1663L7930o812k4394J4203m240j9608R1686n033n3932l7669k7614P0789
$$ -11663 26267 19455 -4939 9264 5024 -14584 77102 72069 18137 -19532 -47146 23643
1158B3643k3090k0985n486m613K6144L155m0269n845m7123j2768J19149L7473
$$ 23643 553 -20432 -25918 -30531 -4387 -1232 -41501 -47346 -94469 -107237 11912 49385
1146D9385m7639P501k1063k5291j7401k7547N7418Q0255n735k7247J463k3250
$$ 49385 1746 9247 -11816 -37107 -54508 -82055 -24637 55618 49883 22636 24099 849
1134H49k5215L1853P772k8255R7034K3693m8016q5967m7155M9034L0573j8261
$$ 849 -24366 7487 15259 -12996 84038 107731 59715 -26252 -73407 -24373 6200 -12061
1122a2061j9768K6033m3674L468j2720J3824K0358P657m36R1046K1107j786p4496
$$ -12061 -31829 -5796 -49470 -46002 -58722 -44898 -24540 -16883 -17319 73727 94834 93048 18552
1109A8552J1173j4108l9286j6811M3259J3804p394r233M2578l1090p4483L3173
$$ 18552 29725 15617 -23669 -40480 2779 16583 9189 -44 42534 11444 -63039 -29866
1097b9866r655J5089p0631O8511K2348q219m3289J2279K3362N4866L587k2768
$$ -29866 -39521 -24432 -95063 -26552 -4204 -12423 -55712 -43433 -20071 34795 38382 15614
1085A5614l001p6616l7367j3843K1442j0581M7331p0418j3023P2329J4395J094
$$ 15614 12613 -64003 -101370 -115213 -93771 -104352 -57021 -127439 -140462 -68133 -53738 -52644
1073e2644p3178K6713j2713Q6422L6178j23j4485m5424k9103N6690L3532n6264
$$ -52644 -125822 -99109 -111822 -25400 10778 10655 -3830 -49254 -78357 -21667 11865 -44399
1061d4399M510l91O970O221k8089J491o262k0227J5567J812P3087m3851m5676
$$ -44399 -39889 -40280 -33310 -27089 -55178 -53687 -59949 -80176 -64609 -62797 10290 -33561 -79237
1048g9237J5202J3313K6375J4926k6414r780L1552K2734j7783l9171K0557o814
$$ -79237 -64035 -50722 -24347 -9421 -35835 -45615 -14063 8671 -9112 -48283 -27726 -34540
1036c4540K0462K9771n034k3672O9670N588K1479p5208p4993k0104K3647L192
$$ -34540 -14078 15693 10659 -13013 56657 62245 83724 8516 -66477 -86581 -62934 -59742
1024e9742J1494M1761p397L7622k4668K6674K4034j8758m1676m8045K8810O1852
$$ -59742 -48248 -6487 -13884 23738 -930 25744 49778 31020 -10656 -58701 -29891 31961
1012C1961p5093k9293K8651M8287n666m7034j7313L755p780K5880J74K0800K7498
$$ 31961 -43132 -72425 -43774 4513 -1153 -48187 -65500 -61745 -69525 -43645 -43471 -22671 4827
999D827l2540k3851l5067K7019J6148M6742K3070L9068q6126k724R06N5029L9942
$$ 4827 -27713 -51564 -86631 -59612 -43464 3278 26348 65416 -20710 -23434 -22528 32501 72443
986G2443m2163j1232j0456l0782k6122l1148J8487K8259M3871j4790k2429R550
$$ 72443 30280 19048 8592 -22190 -48312 -79460 -60973 -32714 11157 -3633 -26062 -16512
974a6512K356M7069j6591J3l6152n61J97J2892j613J8620l972n8602l0993r054
$$ -16512 -14156 32913 16322 16335 -19817 -20378 -20181 -7289 -8902 9718 5746 -52856 -83849 -92903
960i2903l8816M1476M5072J03393J1143l7772K6253l7954O0792k3917k7593k6873
$$ -92903 -131719 -90243 -45171 58222 69365 31593 57846 19892 80684 56767 29174 2301
948B301l0749N461l3450L9245n3792J0915N8220L8582n9742j968l673K5342L5904
$$ 2301 -28448 -22987 -56437 -17192 -70984 -60069 -1849 36733 -23009 -24977 -28650 -3308 32596
935C2596n2505j608K4080k7391L4627Q150n0965j1146j7969M0991L3963l0452
$$ 32596 -19909 -21517 2563 -24828 9799 17949 -33016 -44162 -62131 -21140 12823 -17629
923a7629Q652k2749j7671L2497o027m7572o655L8530k6500M2471K7824r2536j750
$$ -17629 -8977 -31726 -49397 -16900 -22927 -70499 -77154 -38624 -65124 -22653 5171 -87365 -89115
910h9115K5872j2293J9117L6303l1510l2204J6862P798j3052K9666N398m902L0543
$$ -89115 -63243 -75536 -56419 -20116 -51626 -83830 -66968 -59170 -72222 -42556 -37158 -42060 -11517
897a1517k9483J0171k7921K1263L1843l7454j6238r41O2282L83m7423p3502Q4597
$$ -11517 -41000 -30829 -58750 -37487 -5644 -43098 -59336 -60277 2005 2388 -45035 -118537 -33940
884c3940J3091k3507L8892J6976j5523j9584K042m1615m4111M2113j2970N4055
$$ -33940 -20849 -44356 -5464 11512 -4011 -23595 -21553 -63168 -107279 -65166 -78136 -24081
872b4081J10332p8573k2600o8960p184K1010l4579n9917Q8439Q8240o8946J4843
$$ -24081 86251 7678 -14922 -83882 -91066 -70056 -104635 -164552 -76113 12127 -56819 -41976
860d1976j554m7952m83J8364M8762Q820J4556k4280j8411K7735j182n0724k6835
$$ -41976 -43530 -91482 -91965 -73601 -24839 -16019 -1463 -25743 -44154 -16419 -17601 -68325 -95160
847i5160o338n8080k8440O2723K2531O6771K3575q4145n512O985k1066N5666J3991
$$ -95160 -101498 -159578 -188018 -125295 -102764 -35993 -12418 -96563 -102075 -95090 -116156 -60490 -46499
834d6499o7685M0742J1363j9369l2195J6330P7800k5657j3170j6422l3433j8186
$$ -46499 -114184 -73442 -62079 -81448 -113643 -97313 -19513 -45170 -58340 -74762 -108195 -126381
822a26381P2507J2711M6727K9625m61m251n9309p929M4318m8313K1804m362m5633
$$ -126381 -53874 -41163 5564 35189 34728 30477 -28832 -36761 7557 -40756 -18952 -23314 -68947
809f8947N8891o495j8937l0298k0418O6620l7934j3225K9016N1078p0396L3571
$$ -68947 -10056 -16551 -35488 -65786 -86204 -19584 -57518 -70743 -41727 9351 -61045 -27474
797b7474J2928q154K647k2224m4098j26145O1139K1504M4043N6962o817m5651
$$ -27474 -14546 -22700 -20053 -42277 -86375 -212520 -151381 -129877 -85834 -28872 -35689 -81340
785h1340n582p860J2242N2830N6301K1195n8598o8101K4591k5166L4560l5072
$$ -81340 -86922 -94782 -82540 -29710 26591 47786 -10812 -78913 -54322 -79488 -44928 -80000
773h0000M5909N0716n3379k9632J4468q143p499L9569J0212n2197K1380p815r483
$$ -80000 -34091 16625 -36754 -66386 -51918 -60061 -67560 -27991 -17779 -69976 -48596 -56411 -65894
760f5894L4255l7976j3119J11031n0747n5126M6274M4844r751m4229m3279m817
$$ -65894 -31639 -69615 -82734 28297 -22450 -77576 -31302 13542 3791 -40438 -83717 -88534
748h8534J2033l0750n5128P1137Q5868L245n0015R640L9084o3617K5131J5855
$$ -88534 -76501 -107251 -162379 -91242 -5374 -2129 -52144 -42504 -3420 -67037 -41906 -26051
736b6051K2029m0751m581k8445J09965K6527p2729j4781N7770l8093o136l7063
$$ -26051 -4022 -44773 -49354 -77799 32166 58693 -14036 -28817 28953 -9140 -15276 -52339
724e2339M2334L6703l7539n110j9753l5829M2980J0415K2299O63J2928j8067j06382
$$ -52339 -10005 26698 -10841 -15951 -35704 -71533 -28553 -18138 4161 4824 17752 -315 -106697
711a06697K0489K4034M7248N462J1221m7107M6036P0524k5799m5031O048J1808
$$ -106697 -86208 -62174 -14926 -9464 1757 -45350 686 71210 45411 380 6428 18236
699A8236l5792L608L2679M0825j8028k9478k730j6109K3660n939r340l8422o2003
$$ 18236 -17556 -13948 18731 59556 41528 12050 9320 -6789 16871 10932 1592 -36830 -98833
686i8833n1623P5632O3119o798K6139J663J1277k6377p8027L8013M0828r03n7603
$$ -98833 -150456 -74824 -11705 -18503 7636 9299 20576 -5801 -83828 -45815 -4987 -5890 -63493
673f3493Q336k5466o2189P7528J3957m7144J7274K4474R607j7433l91p5940O2176
$$ -63493 -55157 -80623 -142812 -65284 -51327 -98471 -81197 -56723 -47116 -64549 -64940 -140880 -78704
660g8704j9009P508N5529m3156J0884M9408k1768m154k259l1960n8825K7121N6502
$$ -78704 -97713 -90205 -34676 -77832 -66948 -17540 -39308 -43462 -45721 -77681 -136506 -109385 -52883
647e2883K3227K6962J4029J0318k4201l4664j319K1043l7196r6992P916j8759
$$ -52883 -29656 -2694 11335 21653 -2548 -37212 -38531 -17488 -54684 -151676 -143760 -162519
635a62519R3039K0652k0357m2361K5085K5488j2847R717o946K9323o6121N3927
$$ -162519 -69480 -48828 -69185 -111546 -86461 -60973 -73820 -64103 -71049 -41726 -107847 -53920
623e3920k7965R1525p238l8472k8070o105K251N9360J2248l6260l0509Q1035J6936
$$ -53920 -81885 9640 2402 -36070 -64140 -70245 -67994 -8634 3614 -32646 -63155 17880 34816
610C4816m8308M459m9930o2903J04856K6946P371O001m7047o2856L9728j0121
$$ 34816 -13492 -9033 -58963 -121866 -17010 9936 17307 23308 -23739 -86595 -46867 -56988
598e6988k4390L0355K352K3485J2700r411m8049M391M9340J5011N2598n1554q0441
$$ -56988 -81378 -51023 -48671 -25186 -12486 -21897 -69946 -65555 -16215 -1204 51394 -160 -80601
585h0601M5418j4719l628K2205o3242K8417L8733m255M8658p8774j9803K0771
$$ -80601 -35183 -49902 -53530 -31325 -94567 -66150 -27417 -31672 16986 -61788 -81591 -60820
573f0820M575L5587K3770k4390k9675J2668K0003j4140L9451k817r4759j7041
$$ -60820 -56245 -20658 3112 -21278 -50953 -38285 -18282 -32422 7029 4212 -90547 -107588
561a07588N461m3154M4823p095Q2140M4407q3494k932o9248N2985k3653j9474
$$ -107588 -102127 -145281 -100458 -107553 -25413 18994 -64500 -67432 -136680 -83695 -107348 -126822
549a26822O3337K3638J3648j9405o752J0491J2347K881n3531n456k5670K7182
$$ -126822 -63485 -39847 -26199 -45604 -52356 -41865 -29518 -26637 -80168 -85624 -111294 -84112
537h4112m0458M5363L2192L1907L2429m3027L3084k9823p232M3428R112j18881
$$ -84112 -124570 -79207 -47015 -15108 17321 -25706 7378 -22445 -29677 13751 22863 -96018
525i6018l3278J1394N1257p1849M7994O0800n5724J6757N3401O27j2663O909o275
$$ -96018 -129296 -117902 -66645 -138494 -90500 -29700 -85424 -68667 -15266 -14639 -27302 -20393 -26668
512b6668M148J931j0726J2287o0833P5178M5745l9312j2152R175n6059o3395N9228
$$ -26668 -22520 -20589 -31315 -19028 -79861 -4683 41062 1750 -10402 -1227 -57286 -120681 -61453
499f1453j4698k6000M1073k1523q981L0994N8039J7396r2328n1095K7641K6201
$$ -61453 -76151 -102151 -61078 -82601 -91582 -60588 -2549 14847 -77481 -128576 -100935 -74734
487g4734l0634L2782N3554L7192k7149L5093k8009l7228j0371o1192N4185K4570
$$ -74734 -105368 -72586 -19032 18160 -8989 26104 -1905 -39133 -49504 -110696 -56511 -31941
475c1941P309k8891L0860j4671N931n181l0558l4072J0253O2752P5629M207n2127
$$ -31941 -24632 -53523 -22663 -37334 -31403 -36584 -67142 -101214 -90961 -28209 47420 51627 -500
462e00n4607n1451K9223Q073L435J154n763j9173J3952R5344l360J8268k1148
$$ -500 -55107 -106558 -77335 -69262 -65827 -64673 -70436 -89609 -75657 19687 16327 34595 13447
449A3447J5746o2957j9179K3792K4783O6709k9703m4051j00662k4361N5195N1592
$$ 13447 29193 -33764 -52943 -29151 -4368 62341 32638 -11413 -112075 -136436 -81241 -29649
437b9649J1500n828m1856L9175N1149o8669o8220l9146Q094P585L3234m4741K3020
$$ -29649 -18149 -23977 -65833 -26658 24491 -44178 -112398 -151544 -143450 -135865 -102631 -147372 -124352
424a24352M8724n7625R2132K4301n5414o318m793N9509J4746p478p4477Q793N5992
$$ -124352 -75628 -133253 -41121 -16820 -72234 -78552 -83345 -23836 -9090 -16568 -91045 -82252 -26260
411b6260J8607M2129j0211j5136l6250n789K585L4293k316K790l4678l2352R049
$$ -26260 -7653 34476 24265 9129 -27121 -32910 -30325 3968 1652 4442 -30236 -62588 -53539
398e3539N9618n9607M3238l3586J4175j0517K9145K9309O163l6220l4780K55k3607
$$ -53539 6079 -53528 -10290 -43876 -29701 -40218 -11073 18236 24399 -11821 -46601 -46346 -69953
385f9953J4544J11324K0491K6492n2355p191R313o717n9167j4522J0935m9901
$$ -69953 -55409 55915 76406 102898 50543 43352 52665 45948 -13219 -27741 -16806 -66707
373f6707O7037N977l4911m2351n153m6859N6838k7495L0147l518k2499L0548N1329
$$ -66707 330 6307 -28604 -70955 -76108 -122967 -66129 -93624 -63477 -66995 -89494 -58946 -7617
360g617q110k5559L0625m2516M0166j5333J4576o0367k2357P590N1443R9709m9416
$$ -7617 -15727 -41286 -10661 -53177 -13011 -28344 -13768 -74135 -96492 -88902 -37459 62250 12834
347A2834P35k3590L8000l7723k1968M1165K1546k772j0363R423j6473l3127k5321
$$ 12834 13569 -10021 27979 -9744 -31712 9453 30999 28227 17864 27287 10814 -22313 -47634
334d7634l525J4860M4226m9485m8067M9054K3939K5443j6096k253j9912L1851
$$ -47634 -51159 -36299 7927 -41558 -89625 -40571 -16632 8811 -7285 -9538 -29450 2401
322B401N4476j0735l7810M6555n8328o4201K4987P0802k1324j17549n192k6543
$$ 2401 56877 46142 8332 54887 -3441 -67642 -42655 28147 6823 -110726 -115918 -142461
310a42461P976N0659J00185l9164L930M4297m0279L2493k0752j5036j8379j3131
$$ -142461 -134485 -83826 16359 -22805 -18875 25422 -14857 17636 -3116 -18152 -36531 -49662
298d9662k2783K2098p931L6066j7516j5059O2618p828n5090L0578L9430q3882
$$ -49662 -72445 -50347 -58278 -22212 -39728 -54787 7831 3 -55087 -24509 14921 -68961
286f8961N0203P600k4492O6457j8303l3327O3316J9065l6629K0974J0874l3930
$$ -68961 -18758 -11158 -35650 30807 12504 -20823 42493 61558 24929 45903 56777 22847
274B2847m3228N3245p8850L8773k0156j6953K2365Q44K3492n5055L8218L97K0130
$$ 22847 -20381 32864 -45986 -7213 -27369 -44322 -21957 -21113 2379 -52676 -14458 -14061 6069
261F069J8220p5562M3324k2511n3089Q6444J9290m5901k0925J4728K7866r296
$$ 6069 24289 -51273 -7949 -30460 -83549 2895 22185 -23716 -44641 -29913 -2047 -11343
249a1343n6342L7253k2374L6286p857n0206J6317K4432k1084N6430J1589r111
$$ -11343 -67685 -30432 -52806 -16520 -24377 -74583 -58266 -33834 -54918 1512 13101 3990
237C990k7248j3467L739K1967j5554k2035L4470M9316l9895L2330o462k4959m0004
$$ 3990 -23258 -36725 -32986 -11019 -26573 -48608 -14138 35178 -4717 27613 21151 -3808 -43812
224d3812m2656M3251M334M7527q1742J4761j4406L2048l280J0471n8902k1010
$$ -43812 -86468 -43217 -38883 8644 -73098 -58337 -72743 -40695 -43975 -33504 -92406 -113416
212a13416M5494J9638j641L7803o7872j2446R0681j9379j7582O9213J7564r2453
$$ -113416 -67922 -48284 -49925 -12122 -79994 -92440 -1759 -21138 -38720 30493 48057 -44396
200d4396R759k9060J059R2692M4837p5860q8268N94j096K4033J4801o1604O1487
$$ -44396 -34637 -63697 -62638 30054 74891 -969 -89237 -88643 -89739 -65706 -50905 -112509 -51022
187e1022k5930K6590M124K9992O5627l3166m628l4722j6020K4116K3729J5167
$$ -51022 -76952 -50362 -46238 -16246 49381 16215 11587 -23135 -39155 -15039 8690 23857
175B3857o8280J9488K4515J4769l2134o8661K1505Q0740L1474o865p3191m2881
$$ 23857 -44423 -24935 -420 14349 -17785 -86446 -64941 15799 47273 40408 -32783 -75664
163g5664R0981L6177M660k3353K3834l199n4606j66J59K3945l9763J5154n5211
$$ -75664 15317 51494 56154 32801 56635 53436 -1170 -1336 -1177 22768 -16995 -1841 -57052
150e7052o403P1331m1138J3217l409m9558K3055K9610k2607M4806j0479n7433
$$ -57052 -63455 7876 -33262 -20045 -23454 -73012 -49957 -20347 -42954 1852 -8627 -66060
138f6060j3479k7587R015L7973j8156J8790K6753R8214k2858j1655k8149o0696
$$ -66060 -79539 -107126 -98111 -60138 -78294 -59504 -32751 65463 42605 30950 2801 -57895
126e7895L3609r005k6639K3519J9469K9207m6837J6747J6834R39K2795q0742k2266
$$ -57895 -24286 -33291 -59930 -36411 -16942 12265 -34572 -17825 -991 -52 22743 -57999 -80265
113h0265K2460p760J0075K9154M680l136k0629K2484K2503J3666n0098l3363J5953
$$ -80265 -57805 -65565 -55490 -26336 -21656 -24792 -45421 -22937 -434 13232 -36866 -70229 -54276
100e4276N0216m4362k0140j7500J5216O797J9643r526K4444k8574O18M1802j8498
$$ -54276 -4060 -48422 -68562 -86062 -70846 -64049 -44406 -53932 -29488 -58062 -57444 -15642 -34140
87c4140O131K5488K2383J8421j5060n1324R02j8079j622O529m071k2663l9205
$$ -34140 -28009 -2521 19862 38283 23223 -28101 -27199 -45278 -46900 -40371 -44442 -67105 -106310
74a06310K4485L2262J4247j5282J7364J3244l4587P836L8206K814o209N597J2063
$$ -106310 -81825 -49563 -35316 -50598 -33234 -19990 -54577 -46741 -8535 -5721 -11930 -6333 5730
61E730j5441k4079K6414J9234K3731n6891m533k7725K8155J9957j4597j295l4043
$$ 5730 -9711 -33790 -7376 11858 35589 -21302 -25835 -53560 -25405 -5448 -20045 -21340 -55383
48e5383l049L7930L2559P992n0449j3561p532O1287J2634j0820o271o997m5496
$$ -55383 -58432 -20502 12057 20049 -30400 -43961 -51493 9794 22428 11608 5337 -1660 -47156
35d7156j3196K2555k8853K823K7702j866k686l5189J6054m317M1535m231J643
$$ -47156 -60352 -37797 -66650 -63827 -36125 -37991 -40677 -75866 -59812 -64129 -22594 -26825 -25182
22b5182j0312Q596P9734n3091m7199o336J9661n134j0535j2770N7815o116m0746
$$ -25182 -35494 -26898 52836 -255 -47454 -53790 -34129 -39263 -49798 -62568 -4753 -10869 -51615
9e1615k7956L0312O1041j057m8383j9377k891L0562M177
$$ -51615 -79571 -49259 11782 10725 -37658 -57035 -59926 -29364 -25187
0b5187
$$ -25187
$$ Imaginary data points
##PAGE= N=2
##DATA TABLE= (X++(I..I)), XYDATA
16383b648521M3218P0177M0713J8394J2371N2146O9333J6894Q120M9645J6483
$$ -2648521 -2605303 -2535126 -2494413 -2476019 -2463648 -2411502 -2342169 -2325275 -2317155 -2267510 -2251027
16372b251027N7275J0571K9768O9484O6040O5368J3037N9672k1177N8974M4969
$$ -2251027 -2193752 -2183181 -2153413 -2083929 -2017889 -1952521 -1939484 -1879812 -1900989 -1842015 -1797046
16361a797046K5996L3888J3441M6178R9620j1679Q562N9964J5390j930P8237O5682
$$ -1797046 -1771050 -1737162 -1723721 -1677543 -1577923 -1589602 -1581040 -1521076 -1505686 -1507616 -1429379 -1363697
16349a363697J2361J6289M8329N9895O3381N7970J5307K1572L7372L7546Q349
$$ -1363697 -1351336 -1335047 -1286718 -1226823 -1163442 -1105472 -1090165 -1068593 -1031221 -993675 -985326
16338i85326k942N4197J14876K3217K627o319L2653M946N8042Q6883O7736L5976
$$ -985326 -988268 -934071 -819195 -795978 -793351 -799670 -767017 -762071 -704029 -617146 -549410 -513434
16326e13434Q898L0675L1302K1336O7701L7063q446K9438M3621R1073m992J550
$$ -513434 -504536 -473861 -442559 -421223 -353522 -316459 -324905 -295467 -251846 -160773 -165765 -164215
16314a64215O6112L8083J2527J3861L140L6917m182P057O0976N4183L3357L6840
$$ -164215 -98103 -60020 -47493 -33632 -30492 6425 2243 9300 70276 124459 157816 194656
16302A94656O4139K7623Q61M1644O8815P3608j5830N746l576K8939P1109Q457
$$ 194656 258795 286418 287279 328923 397738 471346 455516 461262 457686 486625 557734 566191
16290E66191J2160N9828K6027K508L7145P7054K8198l0656N8666K3206M1500j1740
$$ 566191 578351 638179 664206 666714 703859 780913 809111 778455 837121 860327 901827 890087
16278H90087L3374M6640L2886l78N1020K4566M3686K2909m6823N1713N8430K0808
$$ 890087 923461 970101 1002987 1002609 1053629 1078195 1121881 1144790 1097967 1149680 1208110 1228918
16266A228918J3909O7320L4396L0814M1116l2500N0368J5586M8993M9215L4953
$$ 1228918 1242827 1310147 1344543 1375357 1416473 1383973 1434341 1449927 1498920 1548135 1583088
16255A583088n9965L5237M2033J36N8850K6705k7022K2956O1438l8195k6033k67
$$ 1583088 1523123 1558360 1600393 1600529 1659379 1686084 1659062 1682018 1743456 1705261 1679228 1678961
16243A678961M6454l6023N1481N6264J1186R8205M5456j4530k2936M3015L5888
$$ 1678961 1725415 1689392 1740873 1797137 1808323 1906528 1951984 1937454 1914518 1957533 1993421
16232A993421m827l4558j4586Q6123n635J0399K7366J8722J7823J4271M825K3122
$$ 1993421 1988594 1954036 1939450 2025573 2019938 2030337 2057703 2076425 2094248 2108519 2113344 2136466
16220B136466K6395R5796o0604o43K6008L7598K3838Q0109M6349K7021j1101n381
$$ 2136466 2162861 2258657 2198053 2197410 2223418 2261016 2284854 2364963 2411312 2438333 2427232 2421851
16208B421851O5546j07032p498Q397N6187N4234k3701P163K979J6436j3706M907
$$ 2421851 2487397 2380365 2372867 2381264 2437451 2491685 2467984 2475147 2478126 2494562 2480856 2485763
16196B485763J4152J2873K2829r431J3754N2826O7398m8678N4219J1124l5275
$$ 2485763 2499915 2512788 2535617 2526186 2539940 2592766 2660164 2611486 2665705 2676829 2641554
16185B641554l9590L9847k4862P3492L3631j4447J1209J6714K9302O2129j492
$$ 2641554 2601964 2641811 2616949 2690441 2724072 2709625 2720834 2737548 2766850 2828979 2827487
16174B827487J4164o823L6566P3214K730N936n3085R584k2769q2198J4293N5818
$$ 2827487 2841651 2834828 2871394 2944608 2947338 2953274 2900189 2909773 2887004 2804806 2819099 2874917
16162B874917M7388k4384K9436N5689l2420j3704K20M604p380M509O2919m3173
$$ 2874917 2922305 2897921 2927357 2983046 2950626 2936922 2937142 2941746 2934366 2938875 3001794 2958621
16150B958621L8367R189l1347O1282L4025K1949l6403n3236L4118J1306p5197
$$ 2958621 2996988 3006177 2974830 3036112 3070137 3092086 3055683 3002447 3036565 3047871 2972674
16139B972674j3394J02787Q0426m6375n481o7768N3090l6886N104M7927J1825
$$ 2972674 2959280 3062067 3142493 3096118 3090637 3022869 3075959 3039073 3044177 3092104 3103929
16128C103929K7578N1491j02246j4223L0293M1128K5731j8115l1979J2450J7832
$$ 3103929 3131507 3182998 3080752 3066529 3096822 3137950 3163681 3145566 3113587 3126037 3143869
16117C143869P5126m8126l3747K3590N6054K389p5168l3107o336N0019R301M3717
$$ 3143869 3218995 3170869 3137122 3160712 3216766 3219155 3143987 3110880 3104544 3154563 3163864 3207581
$$ [...]
##END NTUPLES=NMR SPECTRUM
##END=
