##TITLE=1H_DE-80H_X3
 200.13MHz, d2o
 8 sc
 
 19ns.26.2.2025
##JCAMPDX= 6.0         $$ Bruker NMR JCAMP-DX V2.0
##DATA TYPE= NMR SPECTRUM
##DATA CLASS= NTUPLES
##ORIGIN= UXNMR, Bruker Analytische Messtechnik GmbH
##OWNER= pz
$$ XWIN-NMR		Version 3.5
$$ Tue Oct  7 12:25:51 2025 Russian Standard Time (UT+4h)  Yarkov@DPX200
##.OBSERVE FREQUENCY= 200.1313
##.OBSERVE NUCLEUS= ^1H
##.ACQUISITION MODE= SIMULTANEOUS
##.ACQUISITION SCHEME= undefined
##.AVERAGES= 8
##.DIGITISER RES= 18
##SPECTROMETER/DATA SYSTEM= spect
##.PULSE SEQUENCE= zg30
##.SOLVENT NAME= CDCl3
##.SHIFT REFERENCE= (INTERNAL, CDCl3, 0, 15.4759)
##AUDIT TRAIL= $$ (NUMBER, WHEN, WHO, WHERE, WHAT)
$$ ##TITLE= Audit trail, XWIN-NMR		Version 3.5
$$ ##JCAMPDX= 5.01
$$ ##ORIGIN= Bruker BioSpin GmbH
$$ ##OWNER= Yarkov
$$ C:/Bruker/XWIN-NMR/data/yarkov2/nmr/H-C/1/pdata/1/auditp.txt
$$ ##AUDIT TRAIL=  $$ (NUMBER, WHEN, WHO, WHERE, WHAT)
(   1,<2025-10-07 12:25:02.10 +0400>,<Yarkov>,<DPX200>,
      <created by zg, POWCHK disabled, PULCHK disabled
       configuration hash MD5:
       00 E9 B6 7A A2 85 ED C7 34 08 36 98 17 FE 4E 26
       data hash MD5: 16K
       17 09 C1 B4 29 C0 A2 91 E8 01 B6 D7 68 FB 1A 42>)
(   2,<2025-10-07 12:25:10.35 +0400>,<Yarkov>,<DPX200>,
      <Start of raw data processing
       efp BC_mod = 2 LB = 0.25 FT_mod = 6 PKNL = 1 PHC0 = -2281.05 PHC1 = 12.99097 SI = 16K 
       data hash MD5: 16K
       FB AE 77 21 DB 61 60 E3 1A AB 6F 26 4B 16 4C 67>)
(   3,<2025-10-07 12:25:16.17 +0400>,<Yarkov>,<DPX200>,
      <abs ABSG = 5 
       data hash MD5: 16K
       51 6E 94 C7 5C A6 49 4B E9 F5 E6 83 24 48 9D 89>)
$$ ##END=
$$ 
$$ hash MD5
$$ AF 87 69 B0 14 B7 25 A7 8D 9A B6 B5 CB 2B 90 12
##$RELAX= 
##$RELAX= 
##$RELAX= 
##$RELAX= 
##$RELAX= 
##$RELAX= 
$$ Bruker specific parameters
$$ --------------------------
##$DU= <C:/Bruker/XWIN-NMR>
##$EXPNO= 1
##$NAME= <H-C>
##$PROCNO= 1
##$TYPE= <nmr>
##$USER= <yarkov2>
##$AMP= (0..31)
100 100 100 100 100 100 100 100 100 100 100 100 100 100 100 100 100 100 
100 100 100 100 100 100 100 100 100 100 100 100 100 100 
##$AQSEQ= 0
##$AQ_mod= 1
##$AUNM= <au_zg>
##$AUTOPOS= <>
##$BF1= 200.13
##$BF2= 200.13
##$BF3= 200.13
##$BF4= 200.13
##$BF5= 200.13
##$BF6= 200.13
##$BF7= 200.13
##$BF8= 200.13
##$BYTORDA= 1
##$CFDGTYP= 0
##$CFRGTYP= 5
##$CHEMSTR= <none>
##$CNST= (0..31)
1 1 145 1 1 1 1 1 1 1 1 1 1 1 1 1 1 1 1 1 1 1 1 1 1 1 1 1 1 1 1 1 
##$CPDPRG= <>
##$CPDPRG1= <>
##$CPDPRG2= <>
##$CPDPRG3= <>
##$CPDPRG4= <mlev>
##$CPDPRG5= <mlev>
##$CPDPRG6= <mlev>
##$CPDPRG7= <mlev>
##$CPDPRG8= <mlev>
##$CPDPRGB= <>
##$CPDPRGT= <>
##$D= (0..31)
0 0.7 0 0 0 0 0 0 0 0 0 0.03 0 0 0 0 0 0 0 0 0 0 0 0 0 0 0 0 0 0 0 0 
##$DATE= 1759825501
##$DBL= (0..7)
120 120 120 120 120 120 120 120 
##$DBP= (0..7)
150 150 150 150 150 150 150 150 
##$DBP07= 0
##$DBPNAM0= <>
##$DBPNAM1= <>
##$DBPNAM2= <>
##$DBPNAM3= <>
##$DBPNAM4= <>
##$DBPNAM5= <>
##$DBPNAM6= <>
##$DBPNAM7= <>
##$DBPOAL= (0..7)
0.5 0.5 0.5 0.5 0.5 0.5 0.5 0.5 
##$DBPOFFS= (0..7)
0 0 0 0 0 0 0 0 
##$DE= 6
$$ [...]
##$SUBNAM3= <"">
##$SUBNAM4= <"">
##$SUBNAM5= <"">
##$SUBNAM6= <"">
##$SUBNAM7= <"">
##$SUBNAM8= <"">
##$SUBNAM9= <"">
##$SW= 18.0517328524113
##$SWIBOX= (0..15)
0 0 2 0 0 0 0 0 0 0 0 0 0 0 0 0 
##$SW_h= 3612.71676300578
##$TD= 16384
##$TD0= 1
##$TE= 0
##$TE2= 300
##$TE3= 300
##$TEG= 300
##$TL= (0..7)
0 120 120 120 120 120 120 120 
##$TP= (0..7)
150 150 150 150 150 150 150 150 
##$TP07= 0
##$TPNAME0= <>
##$TPNAME1= <>
##$TPNAME2= <>
##$TPNAME3= <>
##$TPNAME4= <>
##$TPNAME5= <>
##$TPNAME6= <>
##$TPNAME7= <>
##$TPOAL= (0..7)
0.5 0.5 0.5 0.5 0.5 0.5 0.5 0.5 
##$TPOFFS= (0..7)
0 0 0 0 0 0 0 0 
##$TUNHIN= 0
##$TUNHOUT= 0
##$TUNXOUT= 0
##$USERA1= <user>
##$USERA2= <user>
##$USERA3= <user>
##$USERA4= <user>
##$USERA5= <user>
##$V9= 5
##$VALIST= <valist>
##$VCLIST= <CCCCCCCCCCCCCCC>
##$VD= 0
##$VDLIST= <DDDDDDDDDDDDDDD>
##$VPLIST= <PPPPPPPPPPPPPPP>
##$VTLIST= <TTTTTTTTTTTTTTT>
##$WBST= 1024
##$WBSW= 4
##$XGAIN= (0..3)
0 0 0 0 
##$XL= 0
##$YL= 0
##$YMAX_a= 418744
##$YMIN_a= -556136
##$ZGOPTNS= <>
##$ZL1= 120
##$ZL2= 120
##$ZL3= 120
##$ZL4= 120
##$ABSF1= 15.68078
##$ABSF2= -2.371073
##$ABSG= 5
##$ABSL= 3
##$ALPHA= 0
##$AQORDER= 0
##$ASSFAC= 0
##$ASSFACI= 0
##$ASSFACX= 0
##$ASSWID= 0
##$AUNMP= <proc_1d>
##$AZFE= 0.1
##$AZFW= 0.1
##$BCFW= 0
##$BC_mod= 2
##$BYTORDP= 0
##$COROFFS= 0
##$CY= -3
##$DATMOD= 1
##$DC= 0
##$DFILT= <>
##$DTYPP= 0
##$F1P= 0
##$F2P= 0
##$FCOR= 1
##$FTSIZE= 16384
##$FT_mod= 6
##$GAMMA= 0
##$GB= 0
##$INTBC= 1
##$INTSCL= 3.241238e-09
##$ISEN= 128
##$LB= 0.25
##$LEV0= 0
##$LPBIN= 0
##$MAXI= 10000
##$MC2= 0
##$MEAN= 0
##$ME_mod= 0
##$MI= 1.114404
##$NCOEF= 0
##$NC_proc= -7
##$NLEV= 6
##$NOISF1= 3.799351
##$NOISF2= 2.8
##$NSP= 0
##$NTH_PI= 0
##$NZP= 0
##$OFFSET= 15.47585
##$PC= 1
##$PHC0= -2281.05
##$PHC1= 12.99097
##$PH_mod= 1
##$PKNL= yes
##$PPARMOD= 0
##$PSCAL= 0
##$PSIGN= 0
##$REVERSE= no
##$SF= 200.130009176333
##$SI= 16384
##$SIGF1= 3
##$SIGF2= 2
##$SINO= 0.751879
##$SIOLD= 32768
##$SREGLST= <19F.Aceton>
##$SSB= 0
##$STSI= 16384
##$STSR= 0
##$SW_p= 3612.71676300578
##$SYMM= 0
##$S_DEV= 0
##$TDeff= 16384
##$TDoff= 0
##$TI= <>
##$TILT= no
##$TM1= 0
##$TM2= 0
##$TOPLEV= 0
##$USERP1= <user>
##$USERP2= <user>
##$USERP3= <user>
##$USERP4= <user>
##$USERP5= <user>
##$WDW= 1
##$XDIM= 16384
##$YMAX_p= 474189924
##$YMIN_p= -2774864
$$ End of Bruker specific parameters
$$ ---------------------------------
##NTUPLES= NMR SPECTRUM
##VAR_NAME=  FREQUENCY,     SPECTRUM/REAL,   SPECTRUM/IMAG
##SYMBOL=    X,             R,               I
##VAR_TYPE=  INDEPENDENT,   DEPENDENT,       DEPENDENT
##VAR_FORM=  AFFN,          ASDF,            ASDF
##VAR_DIM=   16384,         16384,           16384
##UNITS=     HZ,            ARBITRARY UNITS, ARBITRARY UNITS
##FACTOR=    0.220516191357247, 1,           1
##FIRST=     3097.18202358237, 0,            0
##LAST=      -515.53473942341, 0,            0
##MIN=       -515.53473942341, -2774864,     0
##MAX=       3097.18202358237, 474189924,    0
$$ Real data points
##PAGE= N=1
##DATA TABLE= (X++(R..R)), XYDATA
$$ [...]
$$ plain form
5783 26411029 26006797 25643434 25114381 24654314 24170642 24007098 23847686 23281991 22975657
5774 22975657 22646808 22245356 22011153 21643251 21097823 20805395 20485233 19974687 19656259
5765 19656259 19726136 19510289 19137212 18819539 18746628 18442508 18152616 18204923 18071399 17788612
5755 17788612 17700849 17545755 17338066 17373977 17225049 17231045 17170297 16961205 16650244 17000258
5745 17000258 16870560 16947050 16792148 16648338 16704909 16425352 16376257 16530171 16543848 16821901
5735 16821901 16881071 17009996 16967464 17151604 17075275 17227323 17351276 17443857 17691535 17709581
5725 17709581 17768607 17884978 18138119 18104384 18181123 18566522 18883981 18830883 19021750 19318024
5715 19318024 19597302 20059842 20371481 20964657 21578810 21959959 22467126 22803025 23193736
$$ packed form
5783B6411029m04232l63363n29053m60067m83672j63544j59412n65695l06334
5774B2975657l28849m01452k34203l67902n45428k92428l20162n10546l18428
5765A9656259O9877k15847l73077l17673p2911l04120k89892N2307j33524k82787
5755A7788612q7763j55094k07689L5911j48928N996o0748k09092l10961L50014
5745A7000258j29698P6490j54902j43810N6571k79557m9095J53914J3677K78053
5735A6821901N9170J28925m2532J84140p6329J52048J23953R2581K47678J8046
5725A7709581N9026J16371K53141l3735P6739L85399L17459n3098J90867K96274
5715A9318024K79278M62540L11639N93176O14153L81149N07167L35899L90711
$$ plain form
5706 23193736 23498323 24291343 24453418 24714367 24852065 24799643 24516520 24544059 24440814 24618997
5696 24618997 24845488 24947289 24913563 24820580 24698785 24677694 24749872 24722515 24909984 25245985
5686 25245985 25490310 25911426 26475176 27004887 27305279 28131161 28992388 30000495 31095712
5677 31095712 32364571 33649714 35312376 37457205 39605791 40804541 41267585 41387342
5669 41387342 41305394 40610430 39864067 39654200 39254644 39098136 39263606 39317221 39326448 39698505
5659 39698505 40409912 40994064 41299949 41507505 42041576 42829338 43474857 44081792 44556970
5650 44556970 45125234 46075935 46671525 47772591 48840497 49709214 50939125 52525664 54375690
5641 54375690 55755343 56445127 56727324 56929145 56501546 55919435 55425205 55304439 55424270
$$ packed form
5706B3193736L04587P93020J62075K60949J37698n2422k83123K7539j03245J78183
5696B4618997K26491J01801l3726r2983j21795k1091P2178k7357J87469L36001
5686B5245985K44325M21116N63750N29711L00392Q25882Q61227J008107J095217
5677C1095712J268859J285143J662662K144829K148586J198750M63044J19757
5669D1387342q1948o94964p46363k09867l99556j56508J65470N3615R227L72057
5659C9698505P11407N84152L05885K07556N34071P87762O45519O06935M75178
5650D4556970N68264R50701N95590J101066J067906Q68717J229911J586539J850026
5641E4375690J379653O89784K82197K01821m27599n82111m94230j20766J19831
$$ plain form
5632 55424270 56050635 56929201 58151392 59299408 60725406 62773639 64872791 67438529
5624 67438529 70358723 73106479 75970486 79242372 82413592 85532618 88797787 91769431
5616 91769431 94332702 96265012 97729618 98318104 98699312 98385933 98203199 97408335 96491682
5607 96491682 95460120 94426845 93526866 92765260 92561557 92469459 92369086 92834743 93157353
5598 93157353 93654932 94337141 94195855 93896367 93897465 93210998 92560016 91844521 90705213 89905444
5588 89905444 88977842 88283018 87496451 86775568 86175141 85540566 85159178 84423791 83889184
5579 83889184 83245636 82366494 80768848 79005876 76943522 74481732 71961614 69210353
5571 69210353 66130025 63119339 60016453 56956925 54348763 51564227 48889665 46228640
$$ packed form
5632E5424270O26365Q78566J222191J148016J425998K048233K099152K565738
5624F7438529K920194K747756K864007L271886L171220L119026L265169K971644
5616I1769431K563271J932310J464606N88486L81208l13379j82734p94864r16653
5607I6491682j031562j033275q99979p61606k03703r2098j00373M65657L22610
5598I3157353M97579O82209j41286k99488J098o86467o50982p15495j139308p99769
5588H9905444r27602o94824p86567p20883o00427o34575l81388p35387n34607
5579H3889184o43548q79142j597646j762972k062354k461790k520118k751261
5571F9210353l080328l010686l102886l059528k608162k784536k674562k661025
$$ plain form
5563 46228640 43764203 41681160 39710578 37756336 35803189 34562420 33105679 31713078
5555 31713078 30607236 29424066 28647999 27568102 26726829 25862326 25081552 24419795 23869574
5546 23869574 23255405 22776072 22492187 22085506 21466110 21010460 20896187 20674650 20183953
5537 20183953 19967892 19723619 19320249 19079378 18879265 18957418 18768601 18879386 18815553 18560832
5527 18560832 18783885 19037190 19240982 19289516 19285734 19431533 20028934 20279556 20343201 20452822
5517 20452822 20724748 20730501 20685692 20419807 20519607 20550532 20235253 19962318 19705659 19272218
5507 19272218 19042621 18521688 18264641 17944932 17786643 17502831 17237863 17289192 17159953 16683336
5497 16683336 16539652 16494254 16275340 16093306 16117853 16038606 16309752 16407105 16362728 16189809
$$ packed form
5563D6228640k464437k083043j970582j954242j953147j240769j456741j392601
5555C1713078j105842j183170p76067j079897q41273q64503p80774o61757n50221
5546B3869574o14169m79333k83885m06681o19396m55650j14273k21537m90697
5537B0183953k16061k44273m03370k40871k00113P8153j88817J10785o3833k54721
5527A8560832K23053K53305K03792M8534l782J45799N97401K50622O3645J09621
5517B0452822K71926N753m4809k65885R9800L0925l15279k72935k56659m33441
5507A9272218k29597n20933k57047l19709j58289k83812k64968N1329j29239m76617
5497A6683336j43684m5398k18914j82034K4547p9247K71146R7353m4377j72919
$$ plain form
5487 16189809 16057857 16239590 16207628 15877310 15550788 15173321 14991396 14846383 14710889 14617849
5477 14617849 14328131 14082597 13825892 13631643 13316883 13036927 12891339 12585677 12582513 12776128
5467 12776128 12696354 12643073 12661670 12566284 12341571 12351957 12356011 12476392 12512230 12313407 12394732
5456 12394732 12576632 12451879 12539171 12887220 13015365 12823568 12633260 12896314 13225590 13250574
5446 13250574 13407463 13329144 13598702 13807689 14359256 14448018 14509684 14852992 15248842 15650693
5436 15650693 15969354 16333613 16803091 17411308 17807163 18118185 18956534 19686187 20472759
5427 20472759 21441119 22730403 23814422 25319969 27153358 29065691 31611383 34891626
5419 34891626 39017024 44005336 46807936 46356148 45413617 43534802 39870577 35441034
$$ packed form
5487A6189809j31952J81733l1962l30318l26522l77467j81925j45013j35494r3040
5477A4617849k89718k45534k56705j94249l14760k79956j45588l05662l164J93615
5467A2776128p9774n3281J8597r5386k24713J0386M054J20381L5838j98823Q1325
5456A2394732J81900j24753Q7292L48049J28145j91797j90308K63054L29276K4984
5446A3250574J56889p8319K69558K08987N51567Q8762O1666L43308L95850M01851
5436A5650693L18661L64259M69478O08217L95855L11022Q38349P29653P86572
5427B0472759R68360J289284J084019J505547J833389J912333K545692L280243
5419C4891626M125398M988312K802600m51788r42531j878815l664225m429543
$$ plain form
5411 35441034 31812794 29459831 27074689 24929868 23034493 21132075 19610413 18167513
5403 18167513 17262746 16309062 15278078 14501297 14019279 13358393 12893123 12738870 12480493
5394 12480493 12284703 12103835 12119087 12011403 11856056 11564541 11330531 11398475 11623208 11603242
5384 11603242 11671956 11916330 11670273 11827946 11954753 12090873 12332115 12626063 12991743 13030402
5374 13030402 13712758 14395406 14582658 14428661 14046672 13506002 13130366 12782447 12401595
5365 12401595 11775176 11187085 10985461 10867514 10285311 10067604 9864359 9646631 9841011
5356 9841011 9433607 9258625 9290856 9152854 9122721 8995275 8858059 8877772 9066347 8723332
5346 8723332 8552654 8538828 8495277 8504056 8506160 8645052 8375278 8272477 7952884 8137221 7955322
$$ packed form
5411C5441034l628240k352963k385142k144821j895375j902418j521662j442900
5403A8167513r04767r53684j030984p76781m82018o60886m65270j54253k58377
5394A2480493j95790j80868J5252j07684j55347k91515k34010O7944K24733j9966
5384A1603242O8714K44374k46057J57673J26807J36120K41242K93948L65680L8659
5374A3030402O82356O82648J87252j53997l81989n40670l75636l47919l80852
5365A2401595o26419n88091k01624j17947n82203k17707k03245k17728J94380
5356I841011m07404j74982L2231j38002l0133j27446j37216J9713J88575l43015
5346H723332j70678j3826m3551Q779K104J38892k69774j02801l19593J84337j81899
$$ plain form
5335 7955322 8072982 8080436 8198467 8192841 8259915 8286708 8028067 8113416 8014856 8044367 7971313
5324 7971313 7913473 7845322 7918035 8143711 8031023 7957355 8065155 8024446 7973333 8269969 8440910
5313 8440910 8421327 8383668 8478781 8191148 8073108 8133686 8170023 8169265 7968472 8240809 8320838
5302 8320838 8413058 8346593 8180582 8213434 7973694 7946256 8073727 8118542 8311823 8348650 8439184
5291 8439184 8299317 7971074 8066573 8144768 7873667 7953876 8103140 8144607 8052461 7992105 8039347
5280 8039347 7982085 8074578 8172396 8023752 8110988 8070339 8005338 8125991 7918712 8204890 8256861
5269 8256861 8334505 8294228 8140247 8103896 7806481 8052560 8296767 8385368 8270823 8234811
5259 8234811 8401258 8112444 7984970 8019999 8078226 8116126 8277887 8104923 7955640 8078375
$$ packed form
5335G955322J17660P454J18031n626O7074K6793k58641Q5349r8560K9511p3054
5324G971313n7840o8151P2713K25676j12688p3668J07800m0709n1113K96636J70941
5313H440910j9583l7659R5113k87633j18040O0578L6337p58k00793K72337Q0029
5302H320838R2220o6465j66011L2852k39740k7438J27471M4815J93281L6827R0534
5291H439184j39867l28243R5499P8195k71101Q0209J49264M1467r2146o0356M7242
5280H039347n7262R2493R7818j48644Q7236m0649o5001J20653k07279K86178N1971
5269H256861P7644m0277j53981l6351k97415K46079K44207Q8601j14545l6012
5259H234811J66447k88814j27474L5029N8227L7900J61761j72964j49283J22735
$$ plain form
5249 8078375 8004182 7809642 7775267 7707817 7811377 8114456 7984137 7996416 7964651 7953583 8065852
5238 8065852 8254132 8154263 8309511 8464953 8385972 8313776 8283498 8163400 8300172 8168461
5228 8168461 7986876 7879277 7823129 8156517 8200767 8321875 8129575 8154681 8182063 8380319
5218 8380319 8388598 8368122 8491620 8289345 8276641 8479242 8700574 8771528 8878207 9045235
5208 9045235 9169487 8847319 8724591 8940596 8996306 8842543 8965365 8870967 8858904 8954066
5198 8954066 8846863 8687253 8875350 8982611 8973371 9284751 9328954 9481790 9514058 9287042
5188 9287042 9315781 9262960 9393780 9786863 9965829 9873666 9897831 10062510 10045359 9925502
5178 9925502 10031914 10410879 10317595 10193154 10390982 10272759 10272521 10483274 10146085 10229810
$$ packed form
5249H078375p4193j94540l4375o7450J03560L03079j30319J2279l1765j1068J12269
5238H065852J88280r9869J55248J55442p8981p2196l0278j20098J36772j31711
5228H168461j81585j07599n6148L33388M4250J21108j92300K5106K7382J98256
5218H380319Q279k0476J23498k02275j2704K02601K21332P0954J06679J67028
5208I045235J24252l22168j22728K16005N5710j53763J22822r4398j2063R5162
5198H954066j07203j59610J88097J07261r240L11380M4203J52836L2268k27016
5188I287042K8739n2821J30820L93083J78966r2163K4165J64679j7151j19857
5178I925502J06412L78965r3284j24441J97828j18223k38K10753l37189Q3725
$$ plain form
5168 10229810 10528950 10302733 10421413 10126221 9869673 9652749 9913900 10232162 10215160 10230875
5158 10230875 10179359 10191794 10344739 10460808 10561601 10419419 10341495 10696061 10743169 11018358
5148 11018358 10956338 10705272 10836317 11056505 11039551 11322415 11031138 10821817 11279703 11638601
5138 11638601 11693956 11681142 11893937 11973194 11844449 11700879 11600747 11706165 11850430 11718629
5128 11718629 11512540 11807926 11775838 11755569 11749311 11548375 11568745 11627201 11420376 11388289 11429402
5117 11429402 11582475 11614859 11712518 11840356 11694781 11753244 11387963 11246937 11391730 11715279
5107 11715279 11882183 11809250 11814272 11705834 11624907 11475636 11629223 11717799 11466925 11696644
5097 11696644 11695669 11590577 11468303 11571922 11571004 11815209 11965689 11936161 11862286 11802243 11743247
$$ packed form
5168A0229810K99140k26217J18680k95192k56548k16924K61151L18262j7002J5715
5158A0230875n1516J2435J52945J16069J00793j42182p7924L54566M7108K75189
5148A1018358o2020k51066J31045K20188j6954K82864k91277k09321M57886L58898
5138A1638601N5355j2814K12795P9257j28745j43570j00132J05418J44265j31801
5128A1718629k06089K95386l2088k0269o258k00936K0370N8456k06825l2087M1113
5117A1429402J53073L2384R7659J27838j45575N8463l65281j41026J44793L23549
5107A1715279J66904p2933N022j08438q0927j49271J53587Q8576k50874K29719
5097A1696644r75j05092j22274J03619r18K44205J50480k9528p3875o0043n8996
$$ plain form
5086 11743247 11733936 11626641 11880879 11650874 11491982 11607879 11748740 11814199 11615511 11818046
5076 11818046 11834545 12232069 12330446 12148417 12356769 12717164 12641246 12614637 12387409 12457714
5066 12457714 12745091 12706971 12758103 12641422 12739285 12786141 13121941 12898763 12814604 13090341
5056 13090341 13035624 13190945 13286241 13389648 13371652 13540614 13638304 13643038 13694870 13835674 13887041
5045 13887041 14185767 14316128 14435102 14445215 14658769 14863743 14938923 15298632 15520289 15622402
5035 15622402 15758245 16101963 16365799 16550354 16606551 16685557 16758686 16668982 17263268 17675115
5025 17675115 17920540 18289433 18566849 18694753 19208374 19962487 20595517 20985490 21390947
5016 21390947 21655190 22250019 22912345 23761791 24590857 25244686 26255323 27460831 28748191
$$ packed form
5086A1743247r311j07295K54238k30005j58892J15897J40861O5459j98688K02535
5076A1818046J6499L97524R8377j82029K08352L60395p5918k6609k27228P0305
5066A2457714K87377l8120N1132j16681R7863M6856L35800k23178q4159K75737
5056A3090341n4717J55321R5296J03407j7996J68962R7690M734N1832J40804N1367
5045A3887041K98726J30361J18974J0113K13554K04974P5180L59709K21657J02113
5035A5622402J35843L43718K63836J84555N6197P9006P3129q9704N94286M11847
5025A7675115K45425L68893K77416J27904N13621P54113O33030L89973M05457
5016B1390947K64243N94829O62326Q49446Q29066O53829J010637J205508J287360
$$ plain form
5007 28748191 30301073 32163929 34042545 35411380 36275505 36302386 35643795 34426483 32905615
4998 32905615 31548076 30340777 29408873 28386065 27581240 27183537 26642843 25973184 25663099
4989 25663099 25379127 25260851 25073415 25145066 25083865 25444852 25735792 25945187 26064362 26174978
4979 26174978 26700847 27029084 27054477 27199409 27284123 27617345 27842220 28136170 28591665 28971314
4969 28971314 29395809 29969700 30516535 30663976 30926271 31507592 32040943 32702950 33230566
4960 33230566 33781091 34314752 35022574 35603066 36003896 36872345 37770714 38360227 39081152
4951 39081152 39798756 40679671 42205272 43965808 45852948 47469828 48612098 49676027
4943 49676027 50220076 49842850 48521086 47468997 46381736 44910819 44059701 43276322 42555716
$$ packed form
5007B8748191J552882J862856J878616J368835Q64125K6881o58591j217312j520868
4998C2905615j357539j207299r31904j022808q04825l97703n40694o69659l10085
4989B5663099k83972j18276j87436P1651o1201L60987K90940K09395J19175J10616
4979B6174978N25869L28237K5393J44932Q4714L33222K24875K93950M55495L79649
4969B8971314M24495N73891N46835J47441K62295N81321N33351O62007N27616
4960C3230566N50525N33661P07822N80492M00830Q68449Q98369N89513P20925
4951C9081152P17604Q80915J525601J760536J887140J616880J142270J063929
4943D9676027N44049l77226j321764j052089j087261j470917q51118p83379p20606
$$ plain form
4934 42555716 41901578 41575934 41163779 40977741 40528082 40283467 40073201 40219046 40319420
4925 40319420 40418956 40823191 41132632 41508798 41672929 42104259 42298892 42567617 43022547 43305531
4915 43305531 43531782 43896969 44146776 44354948 44530608 44585533 44594134 44847334 45273084 45460991
4905 45460991 45491920 45674472 45881173 46017598 46372363 46962756 47491344 47985420 48477397 48981487
4895 48981487 49698243 50653171 51240838 51954649 52771444 53482575 54313197 54869199 55407597
4886 55407597 56028840 56494753 57001104 57121637 57130765 57136974 57108109 56706083 56464979 56106840
4876 56106840 55794550 55724378 55338894 55128775 54833982 54656743 54622400 54629901 54567697 54710596
4866 54710596 54961420 55142875 55433453 55684539 56093623 56941193 57394409 58201016 58984928
$$ packed form
4934D2555716o54138l25644m12155j86038m49659k44615k10266J45845J00374
4925D0319420R9536M04235L09441L76166J64131M31330J94633K68725M54930K82984
4915D3305531K26251L65187K49807K08172J75660N4925Q601K53200M25750J87907
4905D5460991L0929J82552K06701J36425L54765N90393N28588M94076M91977N04090
4895D8981487P16756R54928N87667P13811Q16795P11131Q30622N56002N38398
4886E5407597O21243M65913N06351J20533R128O209k8865m02026k41104l58139
4876E6106840l12290p0172l85484k10119k94793j77239l4343P501o2204J42899
4866E4710596K50824J81455K90578K51086M09084Q47570M53216Q06607P83912
$$ plain form
4857 58984928 59411426 60018153 60897986 61948097 62337919 62971829 63486025 64096373 64856503
4848 64856503 65636602 66309568 66887838 67650298 68415074 69321122 70457750 71376370 72707417
4839 72707417 74429742 76021475 77987373 80322550 82935055 85567002 88654270 92195787
4831 92195787 96276439 100681026 105280918 110264689 115414658 120601935 125586836 130050312
4823 130050312 134831902 138935591 142455690 144985737 146920160 148002545 147712061 145785129
4815 145785129 142888060 139176443 134700956 129988335 125069092 120250074 115302337 110166944
4807 110166944 105652435 101480583 97489296 94053136 90892875 87602073 84839931 82566444
4799 82566444 80700009 78308433 76035225 73977251 71985320 70145870 68448104 66624962
$$ packed form
4857E8984928M26498O06727Q79833J050111L89822O33910N14196O10348P60130
4848F4856503P80099O72966N78270P62460P64776R06048J136628R18620J331047
4839G2707417J722325J591733J965898K335177K612505K631947L087268L541517
4831I2195787M080652M404587M599892M983771N149969N187277M984901M463476
4823A30050312M781590M103689L520099K530047J934423J082385k90484j926932
4815A45785129k897069l711617m475487m712621m919243m819018m947737n135393
4807A10166944m514509m171852l991287l436160l160261l290802k762142k273487
4799H2566444j866435k391576k273208k057974j991931j839450j697766j823142
$$ plain form
4791 66624962 65094877 63767280 62346664 60929911 59588055 58679369 57501942 56560375
4783 56560375 55465169 54813653 54165962 53698248 53324783 53021447 52574835 52423766 52430695 52524736
4773 52524736 52619940 52615188 52462391 52541545 52477486 52711245 52976981 53275221 53700181 54337864
4763 54337864 54859890 55503283 56391384 56978998 58019223 59248546 60393574 61679840 62700452
4754 62700452 64028378 65097591 65916029 66731126 67825089 68430101 69527333 70479300 71521499
4745 71521499 72611450 73604948 74671539 75161082 75892071 75924339 76136767 76109363 75647591
4736 75647591 74965616 74093093 73291491 72779217 72057726 71659343 71306678 71214739 71292695 71175403
4726 71175403 71188233 71670266 72112988 72684993 73561517 74381668 75009420 76124054 77176239
$$ packed form
4791F6624962j530085j327597j420616j416753j341856r08686j177427r41567
4783E6560375j095206o51516o47691m67714l73465l03336m46612j51069O929R4041
4773E2524736R5204m752j52797P9154o4059K33759K65736K98240M24960O37683
4763E4337864N22026O43393Q88101N87614J040225J229323J145028J286266J020612
4754F2700452J327926J069213Q18438Q15097J093963O05012J097232R51967J042199
4745G1521499J089951R93498J066591M89543P30989L2268K12428k7404m61772
4736G5647591o81975q72523q01602n12274p21491l98383l52665r1939P7956j17292
4726G1175403J2830M82033M42722N72005Q76524Q20151O27752J114634J052185
$$ plain form
4717 77176239 77950218 78968071 79840991 80797100 81969795 83042711 84287954 85299341 86339128
4708 86339128 87416809 88369626 89178547 89880889 90585186 91064554 91434259 91419138 91604437
4699 91604437 91182415 90546375 89750076 89457847 89076251 88366701 87737886 87648069 87437596 86778527
4689 86778527 86195359 85458937 84650106 83716624 82828187 81745943 80723091 79834899 79102367
4680 79102367 78329402 77549125 76656965 75315033 74357772 73320003 72088786 70872080 69739131
4671 69739131 68465990 67574006 66946289 65998174 65400315 65119998 65047201 65152203 65441501
4662 65441501 65442563 66005303 66767067 67552899 68605830 69962961 71505297 73007191 74331682
4653 74331682 75611929 77138417 78421086 79460055 80789100 82097080 83993964 85914446
$$ packed form
4717G7176239P73979J017853Q72920R56109J172695J072916J245243J011387J039787
4708H6339128J077681R52817Q08921P02342P04297M79368L69705j5121J85299
4699I1604437m22022o36040p96299k92229l81596p09550o28815q9817k10473o59069
4689H6778527n83168p36422q08831r33482q88437j082244j022852q88192p32532
4680G9102367p72965p80277q92160j341932r57261j037769j231217j216706j132949
4671F9739131j273141q91984o27717r48115n97859k80317p2797J05002K89298
4662F5441501J062N62740P61764P85832J052931J357131J542336J501894J324491
4653G4331682J280247J526488J282669J038969J329045J307980J896884J920482
$$ plain form
4645 85914446 87969170 90323767 92631202 95010938 97256761 99323965 101112841 102895309
4637 102895309 104593508 105795222 106836272 107709798 108706460 109711553 110479676 111575361
4629 111575361 113340587 115124569 117421829 120529184 123716660 127369368 131733199 136958587
4621 136958587 143397817 150603177 157308500 161825176 162649011 160544519 156079141 149318250
4613 149318250 140961364 133002199 126002840 119595016 113937169 108940654 104281734 100327298
4605 100327298 97143941 94266295 91528428 88856494 86901142 84869321 83040205 81264943
4597 81264943 79862134 78606379 77476836 76498855 75712965 75308180 74954451 74965425 75125012
4588 75125012 75409636 75796949 76139610 76545525 77014996 77350807 78101920 78942547 79994516
$$ packed form
4645H5914446K054724K354597K307435K379736K245823K067204J788876J782468
4637A02895309J698199J201714J041050Q73526R96662J005093P68123J095685
4629A11575361J765226J783982K297260L107355L187476L652708M363831N225388
4621A36958587O439230P205360O705323M516676Q23835k104492m465378o760891
4613A49318250q356886p959165o999359o407824n657847m996515m658920l954436
4605A00327298l183357k877646k737867k671934j955352k031821j829116j775262
4597H1264943j402809j255755j129543r77981p85890m04785l53729J0974J59587
4588G5125012K84624L87313L42661M05915M69471L35811P51113Q40627J051969
$$ plain form
4579 79994516 80988263 82446377 83875865 85242100 87036406 88883568 90673332 92545244
4571 92545244 94821113 97135621 99599292 102233112 105066175 108187315 111305116 114916687
4563 114916687 118695486 122934285 127274526 131939803 137426479 143437269 149914838 157056915
4555 157056915 164394438 172283972 181259718 190813251 200424698 211074594 222437230 234604836
4547 234604836 247759404 261873343 277774207 294754547 312800451 330797259 347778608
4540 347778608 362883842 374782329 382133625 384746436 382850892 376476886 366506165 353797644
4532 353797644 338598747 322462446 306006020 290207177 275862011 263349973 252953475
4525 252953475 244723381 238774746 235112503 233448863 233494876 235450743 239121823 244337723
$$ packed form
4579G9994516R93747J458114J429488J366235J794306J847162J789764J871912
4571I2545244K275869K314508K463671K633820K833063L121140L117801L611571
4563A14916687L778799M238799M340241M665277N486676O010790O477569P142077
4555A57056915P337523P889534Q975746R553533R611447J0649896J1362636J2167606
4547B34604836J3154568J4113939J5900864J6980340J8045904J7996808J6981349
4540C47778608J5105234J1898487P351296K612811j895544o374006r970721j2708521
4532C53797644j5198897j6136301j6456426j5798843j4345166j2512038j0396498
4525B52953475q230094n948635l662243j663640M6013J955867L671080N215900
$$ plain form
4517 244337723 250619485 257151752 262963958 265816943 264914877 260098755 251796241 240229850
4509 240229850 226744563 212604009 198513797 184956001 172176047 160025642 148436980
4502 148436980 138039865 128409943 119580635 111670444 104223997 97695515 91593873 86602397
4494 86602397 82330890 78183933 74561634 71360862 68312714 65554784 62944015 60888717
4486 60888717 59150421 57172941 55511893 53797804 52522953 50716012 49226133 47635435
4478 47635435 46374381 44958283 43593952 42198915 40772183 39360546 37758079 36498320
4470 36498320 35340747 34384719 33477831 32636416 31705345 30683727 30024485 29347240 28603494
4461 28603494 27944830 27480350 27064302 26743200 26278299 25829016 25389730 25240845 25197471 24794988
$$ packed form
4517B44337723O281762O532267N812206K852985r02066m816122q302514j1566391
4509B40229850j3485287j4140554j4090212j3557796j2779954j2150405j1588662
4502A48436980j0397115r629922q829308p910191p446447o528482o101642m991476
4494H6602397m271507m146957l622299l200772l048148k757930k610769k055298
4486F0888717j738296j977480j661048j714089j274851j806941j489879j590698
4478D7635435j261054j416098j364331j395037j426732j411637j602467j259759
4470C6498320j157573r56028r06888q41415r31071j021618o59242o77245p43746
4461B8603494o58664m64480m16048l21102m64901m49283m39286j48885m3374m02483
$$ plain form
4451 24794988 24420903 24225387 23991399 23934255 23619328 23461935 23644063 23573802 23562945 23410372
4441 23410372 23651629 23364466 23210333 23258106 22902360 22773517 22492146 22405562 22134056 21866837
4431 21866837 21981505 21756894 21699775 21558314 21319280 21178514 21103853 20866380 20617117 20538295
4421 20538295 20192590 19807954 19686269 19399541 19267961 19207333 19045542 18970730 19004881 19030190
4411 19030190 18991044 19013843 18994296 18939110 19081688 19635620 19986171 19901560 19742040 19710066
4401 19710066 19605992 19299426 19127536 18844844 18421039 18192901 17971304 17737829 17727190 17598172
4391 17598172 17413623 17225535 16994186 16889569 17019721 17164687 17032140 16577500 16296190
4382 16296190 15777598 15611236 15861999 15649928 15569111 15520091 15180530 15115003 15378315 15335411
$$ packed form
4451B4794988l74085j95516k33988n7144l14927j57393J82128p0261j0857j52573
4441B3410372K41257k87163j54133M7773l55746j28843k81371q6584k71506k67219
4431B1866837J14668k24611n7119j41461k39034j40766p4661k37473k49263p8822
4421B0538295l45705l84636j21685k86728j31580o0628j61791p4812L4151K5309
4411A9030190l9146K2799j9547n5186J42578N53932L50551q4611j59520l1974
4401A9710066j04074l06566j71890k82692m23805k28138k21597k33475j0639j29018
4391A7598172j84549j88088k31349j04617J30152J44966j32547m54640k81310
4382A6296190n18592j66362K50763k12071q0817m9020l39561o5527K63312m2904
$$ plain form
4372 15335411 15422542 15485848 15543168 15563118 15557299 15601602 15479828 15299536 15243640 14952602 14298189
4361 14298189 13802358 13847234 13686284 13519366 13285071 12986685 12893433 12646506 12818078 12808767
4351 12808767 12865372 12927656 13091338 13240272 13348532 13185263 13310395 13505558 13537256 13427218
4341 13427218 13648516 13691633 13757917 13697360 13536244 13597150 13873877 13703383 13359600 13511812
4331 13511812 13488524 13435688 13368063 13494449 13563531 13455716 13377430 13531637 13323925 13347691
4321 13347691 13524196 13697677 13803468 13832149 14089045 14354213 14452179 14351839 14409259 14690984
4311 14690984 14838785 14899280 14824874 14928725 15140828 15252446 15295127 15348749 15423164 15521217
4301 15521217 15934323 16251621 16351804 16474595 16514574 16672770 16845728 17376929 17420630 17653935
$$ packed form
4372A5335411Q7131O3306N7320J9950n819M4303j21774j80292n5896k91038o54413
4361A4298189m95831M4876j60950j66918k34295k98386r3252k46927J71572r311
4351A2808767N6605O2284J63682J48934J08260j63269J25132J95163L1698j10038
4341A3427218K21298M3117O6284o0557j61116O0906K76727j70494l43783J52212
4331A3511812k3288n2836o7625J26386O9082j07815p8286J54207k07712K3766
4321A3347691J76505J73481J05791K8681K56896K65168R7966j00340N7420K81725
4311A4690984J47801O0495p4406J03851K12103J11618M2681N3622P4415R8053
4301A5521217M13106L17298J00183J22791L9979J58196J72958N31201M3701K33305
$$ plain form
4291 17653935 17972914 18432525 18376408 18632100 18927267 19159957 19510214 19759872 19734991 19940172
4281 19940172 20684639 20689648 21015366 21403230 21589520 21972823 22292670 22383669 22904679 23462987
4271 23462987 23691175 23686256 23967837 24655380 24995883 25164779 25656965 26037893 26375661 26607768
4261 26607768 26837818 27190130 27509480 27722026 28012175 28559559 29033661 29134259 29419727
4252 29419727 29725628 29814988 30051526 30388124 30769490 31082247 31361913 31779735 32158480 32470865
4242 32470865 32740842 33324389 33910174 34447417 34813573 35338657 36092312 36581811 37241525
4233 37241525 37874167 38631309 39438482 40305482 40887116 41565425 42562573 43480662 44335482
4224 44335482 45017336 45233033 45516764 45970410 46474440 46895775 47362577 47701992 48061738
$$ packed form
4291A7653935L18979M59611n6117K55692K95167K32690L50257K49658k4881K05181
4281A9940172P44467N009L25718L87864J86290L83303L19847R0999N21010N58308
4271B3462987K28188m919K81581O87543L40503J68896M92186L80928L37768K32107
4261B6607768K30050L52312L19350K12546K90149N47384M74102J00598K85468
4252B9419727L05901Q9360K36538L36598L81366L12757K79666M17822L78745L12385
4242C2470865K69977N83547N85785N37243L66156N25084P53655M89499O59714
4233C7241525O32642P57142Q07173Q67000N81634O78309R97148R18089Q54820
4224D4335482O81854K15697K83731M53646N04030M21335M66802L39415L59746
$$ plain form
4215 48061738 48510972 48595736 49007721 49164019 49293359 48960687 48403394 47775394 47223555 46630763
4205 46630763 45861536 44912378 44163752 43304017 42687756 41940412 40987241 40383716 39682520
4196 39682520 38649152 37399437 36256471 35057608 33645812 32452159 31645223 30379739
4188 30379739 29154372 27760054 27193360 26380293 25463357 24673124 23934516 22992018 22027387
4179 22027387 21329148 20219605 19514477 18700408 18230718 17762170 17055464 16291024 15752538
4170 15752538 15085244 14273519 13813808 13416216 13064802 12852554 12235512 11627142 11453744
4161 11453744 11093865 11059999 10736049 10367895 9987634 9518431 9225507 9050061 8829949 8621839
4151 8621839 8585035 8313008 7923963 8095039 7947164 8033261 7856496 7523698 7392265 7437582
$$ packed form
4215D8061738M49234Q4764M11985J56298J29340l32672n57293o28000n51839n92792
4205D6630763p69227r49158p48626q59735o16261p47344r53171o03525p01196
4196C9682520j033368j249715j142966j198863j411796j193653q06936j265484
4188C0379739j225367j394318n66694q13067r16936p90233p38608r42498r64631
4179B2027387o98239j109543p05128q14069m69690m68548p06706p64440n38486
4170A5752538o67294q11725m59711l97592l51414k12248o17042o08370j73398
4161A1453744l59879l3866l23950l68154l80261m69203k92924j75446k20112k08110
4151H621839l6804k72027l89045J71076j47875Q6097j76765l32798j31433M5317
$$ plain form
4141 7437582 7218611 6945890 6959506 6796735 6655930 6403306 6539594 6491391 6467248 6260140
4131 6260140 6175700 6218355 5725330 5493817 5367817 5276617 5361909 5463790 5520560 5571546 5562483
4120 5562483 5486409 5574607 5178402 5009184 4959160 5089380 4843447 4715016 4679275 4353748
4110 4353748 4293376 4455199 4681548 4766968 4566410 4568404 4317702 4361975 4354890 4223236 4132585
4099 4132585 4285766 4200753 4212564 4462112 4471574 4236846 4081621 4066332 4109676 3882570 3728808
4088 3728808 3626219 3638567 3636574 3618568 3801862 3861365 3733135 3681249 3649117 3712597 3912214
4077 3912214 3788575 3609464 3430587 3328279 3399832 3646310 3418263 3412496 3646200 3743324
4067 3743324 3589526 3534936 3462783 3566668 3505757 3329038 3120379 3151621 3104291 3290245
$$ packed form
4141G437582k18971k72721J3616j62771j40805k52624J36288m8203k4143k07108
4131F260140q4440M2655m93025k31513j26000r1200Q5292J01881N6770N0986r063
4120E562483p6074Q8198l96205j69218n0024J30220k45933j28431l5741l25527
4110D353748o0372J61823K26349Q5420k00558J994k50702M4273p085j31654r0651
4099D132585J53181q5013J1811K49548R462k34728j55225j5289M3344k27106j53762
4088C728808j02589J2348j993j8006J83294N9503j28230n1886l2132O3480J99617
4077C912214j23639j79111j78877j02308P1553K46478k28047n767K33704R7124
4067C743324j53798n4590p2153J03885o0911j76719k08659L1242m7330J85954
$$ plain form
4057 3290245 3078218 3077483 3032097 3239529 3178878 3219570 3173287 3020776 3003146 3190335 3269057
4046 3269057 3164977 3359584 3272893 3516092 3512289 3396441 3221627 3252017 3286162 3005187
4036 3005187 2989311 2848565 2876762 3161093 3049859 2862196 3057464 3221407 3044609 2895723
4026 2895723 2897744 2837551 2942812 3186920 3170783 3028689 3018623 3249353 2927680 2890003 2773737
4015 2773737 2680754 2752289 2841691 2866911 2987444 3117107 2929211 2742073 2959352 2994831
4005 2994831 2713709 2614555 2837983 3080096 3034832 2892883 2852890 2770610 2626682 3075848
3995 3075848 3152091 2779911 2719762 3038374 3090194 2991409 3222032 3305872 2979080 3058020 3184390
3984 3184390 3087900 2928375 2762929 2891999 3048954 2854242 2948562 2850025 2887930 3004734
$$ packed form
4057C290245k12027p35m5386K07432o0651M0692m6283j52511j7630J87189P8722
4046C269057j04080J94607q6691K43199l803j15848j74814L0390L4145k80975
4036C005187j5876j40746K8197K84331j11234j87663J95268J63943j76798j48886
4026B895723K021o0193J05261K44108j6137j42094j0066K30730l21673l7677j16266
4015B773737r2983P1535Q9402K5220J20533J29663j87896j87138K17279L5479
4005B994831k81122r9154K23428K42113m5264j41949l9993q2280j43928M49166
3995C075848P6243l72180o0149L18612N1820r8785K30623Q3840l26792P8940J26370
3984C184390r6490j59525j65446J29070J56955j94712R4320r8537L7905J16804
$$ plain form
3974 3004734 2992081 3104569 2901991 2730464 2739672 2925217 2812237 2626102 2692013 2853923
3964 2853923 2878711 2890248 2987510 2962059 3080512 2948009 2862994 3130235 2937742 2829995
3954 2829995 2839989 2720578 2847960 2891472 2839304 3285452 3446482 3048076 3078014 3276575
3944 3276575 3073309 3400476 3311839 3176232 3249864 3052816 3012039 2930665 2929579 3266933 3476722
3933 3476722 3404781 3510309 3567256 3218497 3203961 3321109 3381389 3366956 3262364 3156987
3923 3156987 3128382 3221075 3216736 3348779 3370432 3265232 3200913 3352804 3384577 3129824 3069904
3912 3069904 3353237 3538945 3402191 3307973 3407190 3645137 3662108 3408079 3452443 3644229
3902 3644229 3484980 3382832 3462582 3562819 3416949 3433758 3387088 3544734 3540683 3655132
$$ packed form
3974C004734j2653J12488k02578j71527R208J85545j12980j86135O5911J61910
3964B853923K4788J1537R7262k5451J18453j32503q5015K67241j92493j07747
3954B829995R994j19411J27382M3512n2168M46148J61030l98406K9938J98561
3944C276575k03266L27167q8637j35607P3632j97048m0777q1374j086L37354K09789
3933C476722p1941J05528N6947l48759j4536J17148O0280j4433j04592j05377
3923C156987k8605R2693m339J32043K1653j05200o4319J51891L1773k54753n9920
3912C069904K83333J85708j36754r4218R9217K37947J6971k54029M4364J91786
3902C644229j59249j02148P9750J00237j45870J6809m6670J57646m051J14449
$$ plain form
3892 3655132 3663345 3480624 3692054 3677872 3576336 3549441 3688085 3480587 3290081 3452602
3882 3452602 3799812 3759734 3615367 3501543 3272855 3712286 3817842 3682053 3802885 3892769
3872 3892769 3914764 3801621 4001855 4097970 3934697 4000566 3869950 3542178 3878711 3853722
3862 3853722 3698850 3870957 4091556 4287123 4181254 3968225 3844794 3841038 4007499 3743864
3852 3743864 3766944 4008383 4162170 4253364 4289054 4183699 4205213 3959049 4094257 4198370
3842 4198370 3998015 4053865 4175428 4333875 4210694 4033879 4325488 4482785 4530083 4609380
3832 4609380 4601236 4806527 4976007 5096157 4780157 4566420 4808344 4868827 4625738 4908498
3822 4908498 4959223 4841208 4838426 4813609 4972230 5187364 5454366 5677520 5301835 5131153
$$ packed form
3892C655132Q213j82721K11430j4182j01536k6895J38644k07498j90506J62521
3882C452602L47210m0078j44367j13824k28688M39431J05556j35789J20832Q9884
3872C892769K1995j13143K00234R6115j63273O5869j30616l27772L36533k4989
3862C853722j54872J72107K20599J95567j05869k13029j23431l756J66461k63635
3852C743864K3080K41439J53787R1194L5690j05355K1514k46164J35208J04113
3842D198370k00355N5850J21563J58447j23181j76815K91609J57297M7298P9297
3832D609380q144K05291J69480J20150l16000k13737K41924O0483k43089K82760
3822D908498N0725j18015k782k4817J58621K15134K67002K23154l75685j70682
$$ plain form
3812 5131153 5315239 5334620 5153825 5189359 5215565 5282047 5291865 5260084 5534233 5581887 5478504
3801 5478504 5487555 5612527 5802617 5630946 5651391 5907232 5951026 5928035 5776960 5690281 6019131
3790 6019131 6384372 6105573 6173945 6225768 6367047 6504422 6492437 6654593 6720674 6608661
3780 6608661 6653479 6887446 6980984 6809321 6727914 6859113 6957862 7259204 7457044 7529550
3770 7529550 7532990 7587877 7456943 7503423 7495077 7155683 7112699 7322637 7514756 7511541 7619506
3759 7619506 7695953 7603892 7599003 7745866 7915254 7861451 7856435 7950813 8019233 8099530 8109580
3748 8109580 8301604 8451969 8447677 8115766 8144643 8199259 8410445 8421270 8217318 8071263
3738 8071263 8300725 8410800 8394746 8614207 8564506 8482946 8306637 8375917 8631163 8615754
$$ packed form
3812E131153J84086J9381j80795L5534K6206O6482R818l1781K74149M7654j03383
3801E478504R051J24972J90090j71671K0445K55841M3794k2991j51075q6679L28850
3790F019131L65241k78799O8372N1823J41279J37375j1985J62156O6081j12013
3780F608661M4818K33967R3538j71663q1407J31199R8749L01342J97840P2506
3770G529550L440N4887j30934M6480q346l39394m2984K09938J92119l215J07965
3759G619506P6447r2061m889J46863J69388n3803n016R4378O8420Q0297J0050
3748H109580J92024J50365m292l31911K8877N4616K11186J0825k03952j46055
3738H071263K29462J10075j6054K19461m9701q1560j76309O9280K55246j5409
$$ plain form
3728 8615754 8664456 8706025 8646088 8607962 8556826 8746749 8787709 8731947 8713595 8794726 8969600
3717 8969600 8831440 8784347 9150767 9398889 9360722 9467774 9488752 9422434 10050089 10121920
3707 10121920 10022494 10223348 10225859 10447463 10640203 10712258 10937491 11063350 11183239 11460391
3697 11460391 11756074 11737159 11683511 12144387 12502280 12459892 12661827 12853144 13260096 13300406
3687 13300406 13471856 13726832 14077768 14293381 14425919 14597042 15042606 15109554 15246092 15496697
3677 15496697 15675060 15832588 16082486 16342218 16692164 16873795 17185990 17332003 17531177
3668 17531177 17968602 18176764 18570093 18814627 19069661 19230567 19458974 19770417 19948951
3659 19948951 20294385 20482308 20427468 20745313 20797009 20843398 20979363 21368666 21496162 21420346
$$ packed form
3728H615754M8702M1569n9937l8126n1136J89923M0960n5762j8352Q1131J74874
3717H969600j38160m7093L66420K48122l8167J07052K0978o6318O27655P1831
3707A0121920r9426K00854K511K21604J92740P2055K25233J25859J19889K77152
3697A1460391K95683j8915n3648M60876L57893m2388K01935J91317M06952M0310
3687A3300406J71450K54976L50936K15613J32538J71123M45564O6948J36538K50605
3677A5496697J78363J57528K49898K59732L49946J81631L12195J46013J99174
3668A7531177M37425K08162L93329K44534K55034J60906K28407L11443J78534
3659A9948951L45434J87923n4840L17845N1696M6389J35965L89303J27496p5816
$$ plain form
3649 21420346 21495044 21667825 21484266 21623169 22014837 22230641 22165675 22003895 22045523 22204559
3639 22204559 21994671 22167849 22161002 22026979 21875378 21651427 21868030 21819227 21815574 21885356
3629 21885356 21967131 21881286 21684621 21703409 21536115 21473089 21725607 21795591 21634623 21615649
3619 21615649 21383332 21495825 21646962 21440203 21575313 21564804 21483306 21361392 21465545 21243037
3609 21243037 20990230 21028094 20855377 21108885 21065330 21194137 21259935 21325742 21232831 21327882
3599 21327882 21613562 21553634 21644806 21997330 22419285 22682180 22697870 22971070 23225746 23228829
3589 23228829 23661772 24020006 23978918 24233040 24570109 24943121 24985441 25315243 25638726 25635715
3579 25635715 25994675 26244747 26422901 26467068 26893754 27124465 27409135 27903135 28220725 28543090
$$ packed form
3649B1420346P4698J72781j83559J38903L91668K15804o4966j61780M1628J59036
3639B2204559k09888J73178o847j34023j51601k23951K16603m8803l653O9782
3629B1885356Q1775q5845j96665J8788j67294o3026K52518O9984j60968j8974
3619B1615649k32317J12493J51137k06759J35110j0509q1498j21914J04153k22508
3609B1243037k52807L7864j72717K53508m3555J28807O5798O5807r2911R5051
3599B1327882K85680n9928R1172L52524M21955K62895J5690K73200K54676L083
3589B3228829M32943L58234m1088K54122L37069L73012M2320L29802L23483l011
3579B5635715L58960K50072J78154M4167M26686K30711K84670M94000L17590L22365
$$ plain form
3569 28543090 28728429 29400077 29748952 30055298 30495824 30925726 31574792 32111808 32533573
3560 32533573 33089542 33710121 34344936 34986418 35632350 36295194 37147560 37842639 38334121
3551 38334121 38957455 39466862 40270899 41109187 41924400 42603400 43737993 44757294 45730597
3542 45730597 46522147 47345952 48648760 49892547 51145224 52782860 54339767 55922966
3534 55922966 57461122 59181119 60954978 62969971 65113143 67438351 69908832 72589706
3526 72589706 75571942 78581030 81670407 85109558 88978190 92956155 97123646 101382453
3518 101382453 106066144 110281964 114739118 119824201 124333112 129214974 133841499 138271806
3510 138271806 142703156 147025287 150524155 154007926 157513019 160558220 163326188 165813838
$$ packed form
3569B8543090J85339O71648L48875L06346M40526M29902O49066N37016M21765
3560C2533573N55969O20579O34815O41482O45932O62844Q52366O95079M91482
3551C8334121O23334N09407Q04037Q38288Q15213O79000J134593J019301R73303
3542D5730597P91550Q23805J302808J243787J252677J637636J556907J583199
3534E5922966J538156J719997J773859K014993K143172K325208K470481K680874
3526G2589706K982236L009088L089377L439151L868632L977965M167491M258807
3518A01382453M683691M215820M457154N085083M508911M881862M626525M430307
3510A38271806M431350M322131L498868L483771L505093L045201K767968K487650
$$ plain form
3502 165813838 168071911 170193349 172425897 174766663 176541748 178027856 179515501 180756899
3494 180756899 182120120 183192830 183746312 184403273 185076114 185618140 185999925 186381348 186937871
3485 186937871 187641595 188786657 190092007 191826240 194138952 196737638 199982683 203405383
3477 203405383 207242860 211644053 216363323 221606986 227110951 233046180 239472111 245763476
3469 245763476 252146138 258470689 264270495 269419759 273793477 277178628 279484109 281132668
3461 281132668 281919343 282116356 281962628 281222131 278980468 276576317 273688511 269681825 264882852
3452 264882852 260122557 254522093 248390603 241025756 233019826 224403181 215422830 206318338
3444 206318338 197008509 187452226 178465657 169790740 161956595 154640229 147498571 141182195
$$ packed form
3502A65813838K258073K121438K232548K340766J775085J486108J487645J241398
3494A80756899J363221J072710N53482O56961O72841N42026L81785L81423N56523
3485A86937871P03724J145062J305350J734233K312712K598686L245045L422700
3477B03405383L837477M401193M719270N243663N503965N935229O425931O291365
3469B45763476O382662O324551N799806N149264M373718L385151K305481J648559
3461B81132668P86675J97013j53728p40497k241663k404151k887806m006686m798973
3452B64882852m760295n600464o131490p364847q005930q616645q980351r104492
3444B06318338r309829r556283q986569q674917p834145p316366p141658o316376
$$ plain form
3436 141182195 135296703 130147628 125583861 121836681 118502464 115559332 113407540 112389722
3428 112389722 111707002 111949206 110982675 108234250 105580940 102121125 97801369 93230209
3420 93230209 89355544 85983686 83008755 80681211 78351882 76194151 74322455 72691252
3412 72691252 71595788 70166286 69234311 68592012 68042053 67788705 67542995 67481489 67438711
3403 67438711 67935925 68338515 68860317 69631817 70632475 71454078 72740353 74550323 76127880
3394 76127880 76599897 76515616 76178295 75263174 73864169 72427661 70772200 69175975 68373817
3385 68373817 67490439 66358216 65000051 63950067 63143638 62621501 62068023 61391942 60942372
3376 60942372 60923072 60913835 60743643 60912576 61023473 61129313 61663984 62698244 63512259 64150653
$$ packed form
3436A41182195n885492n149075m563767l747180l334217k943132k151792j017818
3428A12389722o82720K42204r66531k748425k653310l459815m319756m571160
3420I3230209l874665l371858k974931k327544k329329k157731j871696j631203
3412G2691252j095464j429502r31975o42299n49959k53348k45710o1506m2778
3403F7438711M97214M02590N21802P71500J000658Q21603J286275J809970J577557
3394G6127880M72017q4281l37321r15121j399005j436508j655461j596225q02158
3385F8373817q83378j132223j358165j049984q06429n22137n53478o76081m49570
3376F0942372j9300r237j70192J68933J10897J05840N34671J034260Q14015O38394
$$ plain form
3366 64150653 65164436 66076422 66978852 68445378 69705578 70752095 72028629 73679067
3358 73679067 74725256 76207612 77647443 79090021 80617581 82315493 83915685 85612823
3350 85612823 87647085 89886494 91863233 94239913 96615890 98906505 101275043 103625639
3342 103625639 106032355 108436319 110586697 112292172 113755842 115294119 116812421 118048670
3334 118048670 119080702 120103269 120984182 121863550 122573056 123426312 124204344 125320381 126977969
3325 126977969 128538192 130573893 132893181 135275440 138380291 142500740 146725627 151400536
3317 151400536 156292659 161846881 167982996 174749133 181748637 189160779 196239565 203463424
3309 203463424 210182797 216133801 221203037 225271954 228316573 229740275 230424726 229988562
$$ packed form
3366F4150653J013783R11986R02430J466526J260200J046517J276534J650438
3358G3679067J046189J482356J439831J442578J527560J697912J600192J697138
3350H5612823K034262K239409J976739K376680K375977K290615K368538K350596
3342A03625639K406716K403964K150378J705475J463670J538277J518302J236249
3334A18048670J032032J022567Q80913Q79368P09506Q53256P78032J116037J657588
3325A26977969J560223K035701K319288K382259L104851M120449M224887M674909
3317A51400536M892123N554222O136115O766137O999504P412142P078786P223859
3309B03463424O719373N951004N069236M068917L044619J423702O84451m36164
$$ plain form
3301 229988562 228377674 225984426 222600470 218532147 213977434 209546938 204785623 200063633
3293 200063633 195442539 190881715 186018069 181563494 176986993 172237903 167390274 162399960
3285 162399960 157353520 151795952 146336574 140476892 134457823 128646373 122961297 117302448
3277 117302448 111697611 106361425 101160883 95957794 91494665 87299873 83249837 79536826
3269 79536826 76215444 73012851 69702914 67103762 64884481 62551174 60341241 58717754
3261 58717754 56965538 55190237 53697970 52767354 51484921 50097544 48955124 47915884
3253 47915884 47219883 46731560 46306156 45498636 44900002 44890565 44587278 44332306 44160046 43936896
3243 43936896 43734359 43705489 43735442 43895901 44046566 43884192 43895600 43838990 44031961 43785104
$$ packed form
3301B29988562j610888k393248l383956m068323m554713m430496m761315m721990
3293B00063633m621094m560824m863646m454575m576501m749090m847629m990314
3285A62399960n046440n557568n459378n859682o019069n811450n685076n658849
3277A17302448n604837n336186n200542n203089m463129m194792m050036l713011
3269G9536826l321382l202593l309937k599152k219281k333307k209933j623487
3261E8717754j752216j775301j492267r30616j282433j387377j142420j039240
3253D7915884o96001m88323m25404q07520n98634r437l03287k54972j72260k23150
3243D3936896k02537k8870K9953J60459J50665j62374J1408n6610J92971k46857
$$ plain form
3233 43785104 43260489 42506723 41921321 41435347 40720747 40035668 38738104 37415959 36199750
3224 36199750 35088093 34182075 33321048 32281298 30887507 29632772 28641653 27813189 26989341
3215 26989341 26481582 25656277 24846741 24214768 23590182 23096348 22844096 22192284 21620874
3206 21620874 21262211 20919965 20567096 20567655 20508392 20165162 19663636 19451362 19469485 19336954
3196 19336954 19126433 18952748 18851981 18976903 19049349 18857298 18524302 18350364 18682899 18656989
3186 18656989 18368365 18306828 18160499 18215390 18200965 18254238 18334531 18293460 18614549 18802363
3176 18802363 18905783 18947103 18834946 18938915 19093651 19188237 19268302 19462855 19758682 19999048
3166 19999048 20040430 20246929 20335674 20627952 20815685 20975086 21451441 21670018 21759294 21871905
$$ packed form
3233D3785104n24615p53766n85402m85974p14600o85079j297564j322145j216209
3224C6199750j111657r06018q61027j039750j393791j254735r91119q28464q23848
3215B6989341n07759q25305q09536o31973o24586m93834k52252o51812n71410
3206B1620874l58663l42246l52869N59n9263l43230n01526k12274J8123j32531
3196A9336954k10521j73685j00767J24922P2446j92051l32996j73938L32535k5910
3186A8656989k88624o1537j46329N4891j4425N3273Q0293m1071L21089J87814
3176A8802363J03420M1320j12157J03969J54736R4586Q0065J94553K95827K40366
3166A9999048M1382K06499Q8745K92278J87733J59401M76355K18577Q9276J12611
$$ plain form
3156 21871905 22279791 22983495 23139926 23316811 23520103 24058544 24578012 24808913 25094341
3147 25094341 25784798 26780176 27356061 27926098 28614371 29200419 29768403 30592160 31337758
3138 31337758 32032993 32678578 33845047 35100139 36237619 37363931 38725744 40075181
3130 40075181 41526874 42719851 44623252 46480228 48247199 50200450 52345603 54639082
3122 54639082 57002719 59848408 62509377 65628067 69068585 72599412 76087099 79536237
3114 79536237 82721706 85828802 88637768 91532641 94545646 97652068 101141925 104903393
3106 104903393 108839572 112754522 116674529 120595111 124652518 128473921 132573661 136687582
3098 136687582 141536542 146547064 152036887 157622798 163224762 169090136 174535762 180134442
$$ packed form
3156B1871905M07886P03704J56431J76885K03292N38441N19468K30901K85428
3147B5094341O90457R95378N75885N70037O88273N86048N67984Q23757P45598
3138C1337758O95235O45585J166469J255092J137480J126312J361813J349437
3130D0075181J451693J192977J903401J856976J766971J953251K145153K293479
3122E4639082K363637K845689K660969L118690L440518L530827L487687L449138
3114G9536237L185469L107096K808966K894873L013005L106422L489857L761468
3106A04903393L936179L914950L920007L920582M057407L821403M099740M113921
3098A36687582M848960N010522N489823N585911N601964N865374N445626N598680
$$ plain form
3090 180134442 185413203 190542204 195762486 201244566 206952561 212551679 219083029 226585516
3082 226585516 234694843 243241805 252585319 262805600 274214963 286774402 300768232
3075 300768232 316234447 333417963 352816209 374842096 398689842 423324855 446421979
3068 446421979 464356888 474027958 474189924 464948684 447179078 423517145 396671892 368510666
3060 368510666 340950537 315095833 290535410 267162124 245414402 225406644 207350621
3053 207350621 190829511 175800729 162131821 149582341 138752069 129071409 120827877
3046 120827877 113077313 106155863 100033454 94452842 89108907 84561123 80207382 76312364
3038 76312364 72742425 69618208 66601892 63647375 60848223 58168220 55968176 53938555
$$ packed form
3090A80134442N278761N129001N220282N482080N707995N599118O531350P502487
3082B26585516Q109327Q546962R343514J0220281J1409363J2559439J3993830
3075C00768232J5466215J7183516J9398246K2025887K3847746K4635013K3097124
3068D46421979J7934909R671070J61966r241240j7769606k3661933k6845253k8161226
3060C68510666k7560129k5854704k4560423k3373286k1747722k0007758j8056023
3053B07350621j6521110j5028782j3668908j2549480j0830272r680660q243532
3046A20827877p750564o921450o122409n580612n343935m547784m353741l895018
3038G6312364l569939l124217l016316k954517k799152k680003k200044k029621
$$ plain form
3030 53938555 52005149 50047172 48273633 46561798 44759993 43137170 42029047 40640071
3022 40640071 39384255 38121479 36585390 35351687 34166657 32939195 31780124 30613349
3014 30613349 29666186 28776864 27789968 26570293 25872074 25066891 24127555 23700920 22863879
3005 22863879 22079243 21534348 21034211 20570416 19902088 19157399 18626750 17912681 17358507
2996 17358507 17009056 16455184 15957127 15421026 15019288 14751053 14444821 14034458 13391949
2987 13391949 13160967 12876011 12468979 12240857 12088357 11721287 11418952 11241780 11056119
2978 11056119 10551939 10155300 9961861 9824253 9573630 9457286 9393585 9262096 9202387 9196708
2968 9196708 9258522 9307780 9264721 9196408 9433604 9328146 9168410 9105119 9227100 9357214
$$ packed form
3030E3938555j933406j957977j773539j711835j801805j622823j108123j388976
3022D0640071j255816j262776j536089j233703j185030j227462j159071j166775
3014C0613349r47163q89322r86896j219675o98219q05183r39336m26635q37041
3005B2863879p84636n44895n00137m63795o68328p44689n30649p14069n54174
2996A7358507l49451n53872m98057n36101m01738k68235l06232m10363o42509
2987A3391949k30982k84956m07032k28122j52500l67070l02335j77172j85661
2978A1056119n04180l96639j93439j37608k50623j16344o3701j31489n9709n679
2968I196708O1814M9258m3059o8313K37196j05458j59736o3291J21981J30114
$$ plain form
2958 9357214 9331389 9283501 9466011 9435242 9140346 9101347 8814673 8560828 8465335 8205821
2948 8205821 7956329 7946344 7640902 7370439 7110194 6908087 6965518 6748006 6688339 6548180
2938 6548180 6715632 6637041 6500768 6379728 6257944 6298904 6424160 6598280 6543050 6511477
2928 6511477 6418528 6328311 6088317 5637408 5276894 5199261 5034115 4693730 4534305 4239311
2918 4239311 3956718 4077377 3890241 3425189 3335068 3342339 3162276 3125057 3022861 3080664
2908 3080664 2935558 2412368 2493029 2515783 2438085 2344090 2361945 2288513 2204012 2333588 2340514
2897 2340514 2320413 2150642 1898265 1901703 1914851 1819841 2059954 2032204 2020686 2046495 1966010
2886 1966010 2198543 2349692 2044253 1829533 1772356 1858276 1979278 1657755 1604855 1645165
$$ packed form
2958I357214k5825m7888J82510l0769k94896l8999k86674k53845r5493k59514
2948H205821k49492r985l05442k70463k60245k02107N7431k17512n9667j40159
2938F548180J67452p8591j36273j21040j21784M0960J25256J74120n5230l1573
2928F511477r2949r0217k39994m50909l60514p7633j65146l40385j59425k94994
2918D239311k82593J20659j87136m65052r0121P271j80063l7219j02196N7803
2908C080664j45106n23190Q0661K2754p7698r3995J7855p3432q4501J29576O926
2897B340514k0101j69771k52377L438J3148r5010K40113k7750j1518K5809q0485
2886A966010K32533J51149l05439k14720n7177Q5920J21002l21523n2900M0310
$$ plain form
2876 1645165 1890506 1661048 1588651 1592827 1656961 1621777 1561512 1515395 1515950 1412600 1318996
2865 1318996 1366593 1464963 1408908 1458263 1364250 1282930 1161450 1273335 1342255 1482093 1515208
2854 1515208 1434939 1482728 1452651 1569956 1423276 1293046 1507504 1382676 1281423 1480156
2844 1480156 1294079 1242596 1448086 1411326 1244187 1412695 1407394 1250981 1132422 1406673
2834 1406673 1301354 1193287 900422 1024938 1133793 1240317 1242235 1477599 1498817 1404049
2824 1404049 1302304 1115559 1234898 1331922 1389941 1319480 1213551 1392221 1268895 1407210
2814 1407210 1387193 1329383 1217375 1077688 1246539 1293637 1469415 1577352 1460454 1535916
2804 1535916 1531993 1433730 1400108 1432561 1589429 1690510 1674937 1731154 1674464 1568874 1778286
$$ packed form
2876A645165K45341k29458p2397M176O4134l5184o0265m6117N55j03350r3604
2865A318996M7597R8370n6055M9355r4013q1320j21480J11885O8920J39838L3115
2854A515208q0269M7789l0077J17305j46680j30230K14458j24828j01253J98733
2844A480156j86077n1483K05490l6760j67139J68508n301j56413j18559K74251
2834A406673j05319j08067k92865J24516J08855J06524J918K35364K1218r4768
2824A404049j01745j86745J19339R7024N8019p0461j05929J78670j23326J38315
2814A407210k0017n7810j12008j39687J68851M7098J75778J07937j16898P5462
2804A535916l923r8263l3622L2453J56868J01081j5573N6217n6690j05590K09412
$$ plain form
2793 1778286 1800231 2016318 2412939 2343964 2357636 2362192 2552595 2639556 2695663 2728296 2629559
2782 2629559 2645698 2541673 2474727 2287394 2100214 1920991 1880250 1817520 1732031 1697277 1866591
2771 1866591 1537245 1426459 1354950 1161532 1148497 1283090 1346557 1276317 1235559 1004063
2761 1004063 840324 708707 599793 710685 795537 521513 511646 634325 634267 737882 727406
2750 727406 698445 610000 753552 521762 534060 621888 339768 338261 468028 362433 282515
2739 282515 554616 686139 522237 550425 503796 324790 292279 299895 238374 362878 468147
2728 468147 552243 435476 493185 343342 295907 366193 290531 258597 393325 280442 60752
2717 60752 183792 348089 383980 294312 155674 153850 99098 23088 290492 274373 355780
$$ packed form
2793A778286K1945K16087L96621o8975J3672M556J90403Q6961N6107L2633r8737
2782B629559J6139j04025o6946j87333j87180j79223m0741o2730q5489l4754J69314
2771A866591l29346j10786p1509j93418j3035J34593O3467p0240m0758k31496
2761A004063j63739j31617j08914J10892Q4852k74024r867J22679n8J03615j0476
2750G27406k8961q8445J43552k31790J2298Q7828k82120j507J29767j05595p9918
2739B82515K72101J31523j63902K8188m6629j79006l2511P616o1521J24504J05269
2728D68147Q4096j16767N7709j49843m7435P0286p5662l1934J34728j12883k19690
2717F0752J23040J64297L5891q9668j38638j824n4752p6010K67404j6119Q1407
$$ plain form
2706 355780 189127 203524 4359 216185 153751 211761 345326 248058 134164 128173 271400
2695 271400 287319 325519 209447 107694 35348 61260 -177446 86485 201530 450013
2685 450013 339637 184036 150953 215254 253972 409981 289460 205321 366162 33661
2675 33661 -49595 99863 219150 115174 -8773 -1242 -30124 -39482 97702 92275 274196
2664 274196 342213 115566 -149421 13532 46675 -126107 -16624 -59753 95823 64880
2654 64880 -196896 171545 93331 29876 111464 100760 -58662 -167582 -139784 -112455 124637
2643 124637 188874 299371 372671 426610 223879 -4563 -145493 105722 196161 77972
2633 77972 177452 32762 -28499 318801 226793 86558 414831 132095 139118 157896 407109
$$ packed form
2706C55780j66653J4397j99165K11826o2434N8010J33565r7268j13894n991J43227
2695B71400J5919L8200j16072j01753p2346K5912k38706K63931J15045K48483
2685D50013j10376j55601l3083O4301L8718J56009j20521q4139J60841l32501
2675C3661q3256J49458J19287j03976j23947P531k8882r358J37184n427J81921
2664B74196O8017k26647k64987J62953L3143j72782J09483m3129J55576l0943
2654F4880k61776L68441p8214o3455Q1588j0704j59422j08920K7798K7329K37092
2643A24637O4237J10497P3300N3939k02731k28442j40930K51215R0439j18189
2633G7972R9480j44690o1261L47300r2008j40235L28273k82736P023J8778K49213
$$ plain form
2622 407109 305092 128728 130465 -103189 304387 230867 37015 347232 531073 467063
2612 467063 226431 418825 381127 345563 472421 528391 534671 504057 670491 622742 528765
2601 528765 382917 205634 331329 451504 328901 274670 40846 117955 973 316017
2591 316017 78915 29569 226684 219676 394255 225242 267675 2501 -287298 -187413 -31871
2580 -31871 -146640 -151273 -94267 80503 281658 304789 10610 160012 331765 376605 244574
2569 244574 83483 202506 210486 137477 200574 -2500 126971 257253 -1709 -3214 -32836
2558 -32836 60773 -7214 -16132 106789 227770 131446 311667 304943 180905 192170 250491
2547 250491 303235 224820 219653 178149 149910 30154 172341 -2156 -39059 103585 168087
$$ packed form
2622D07109j02017j76364J737k33654M07576p3520j93852L10217J83841o4010
2612D67063k40632J92394l7698l5564J26858N5970O280l0614J66434m7749r3977
2601E28765j45848j77283J25695J20175j22603n4231k33824P7109j16982L15044
2591C16017k37102m9346J97115p008J74579j69013M2433k65174k89799R9885J55542
2580c1871j14769m633N7006J74770K01155K3131k94179J49402J71753M4840j32031
2569B44574j61091J19023P980p3009O3097k03074J29471J30282k58962j505k9622
2558c2836R3609o7987q918J22921J20981r6324J80221o724j24038J1265N8321
2547B50491N2744p8415n167m1504k8239j19756J42187j74497l6903J42644O4502
$$ plain form
2536 168087 190424 227923 64916 -11103 65283 322693 514156 235833 405475 431940 270386
2525 270386 180361 469592 359504 239122 188782 -30798 -45752 289514 207182 144755 297454
2514 297454 187904 319535 435191 416740 221260 308076 465986 352345 451709 494893
2504 494893 430492 392833 450867 438427 431228 436154 500121 731102 722482 796392 858050 470316
2492 470316 390767 372472 544014 616667 461330 663730 474590 398872 102701 140691 103187
2481 103187 235982 279890 291836 435736 444244 543310 587472 366850 223046 143197 316557
2470 316557 417318 315870 656118 648903 464333 417406 488597 687110 901164 969348 912388
2459 912388 827692 682412 312047 407587 381946 404195 375587 513637 648905 601649 722522
$$ packed form
2536A68087K2337L7499j63007p6019P6386K57410J91463k78323J69642K6465j61554
2525B70386r0025K89231j10088j20382n0340k19580j4954L35266q2332o2427J52699
2514B97454j09550J31631J15656j8451j95480Q6816J57910j13641R9364M3184
2504D94893o4401l7659N8034j2440p199M926O3967K30981q620P3910O1658l87734
2492D70316p9549j8295J71542P2653j55337K02400j89140p5718k96171L7990l7504
2481A03187J32795M3908J1946J43900Q508R9066M4162k20622j43804p9849J73360
2470C16557J00761j01448L40248p215j84570m6927P1191J98513K14054O8184n6960
2459I12388q4696j45280l70365R5540k5641K2249k8608J38050J35268m7256J20873
$$ plain form
2448 722522 630776 756497 708353 719751 643410 591194 688528 843204 919966 1018694 1074219
2437 1074219 1026866 1268873 1343205 1151288 1219113 1272484 1113669 1050197 1134080 976854 1096611
2426 1096611 1266043 1284296 1406122 1384646 1511992 1792536 1762942 1630366 1391195 1228816
2416 1228816 1529568 1741763 1692193 1589541 1769754 1731593 1861276 1831051 2076989 2142823
2406 2142823 2138153 2239725 2344354 2426922 2821965 2997869 2702063 2884741 2892287 3043239
2396 3043239 3478882 3575506 3800219 4159374 4203143 4443699 4611456 4898698 5311544 5631453
2386 5631453 6018963 6303191 6613795 7202145 7738488 8160944 8486538 8995339 9690433 10458009
2376 10458009 11052565 11626274 11731205 12202054 12779142 13091032 13614436 14011224 14570340
$$ packed form
2448G22522r1746J25721m8144J1398p6341n2216R7334J54676P6762R8728N5525
2437A074219m7353K42007P4332j91917O7825N3371j58815o3472Q3883j57226J19757
2426A096611J69432J8253J21826k1476J27346K80544k9594j32576k39171j62379
2416A228816L00752K12195m9570j02652J80213l8161J29683l0225K45938O5834
2406B142823m670J01572J04629Q2568L95043J75904k95806J82678P546J50952
2396C043239M35643R6624K24713L59155M3769K40556J67757K87242M12846L19909
2386E631453L87510K84228L10604N88350N36343M22456L25594N08801O95094P67576
2376A0458009N94556N73709J04931M70849N77088L11890N23404L96788N59116
$$ plain form
2367 14570340 15130515 15872477 17029641 17973165 18981607 20071944 21448299 22645074 24125612
2358 24125612 26042495 27828192 29801915 31823231 33630581 35393164 37620884 40539877
2350 40539877 43691699 46797542 50481457 54625463 59701752 65556113 72416846 80354036
2342 80354036 91409613 106470182 123814482 130223266 127323780 124502476 117914032 105351598
2334 105351598 90957546 79916888 70970223 64193774 57826393 50858622 44494899 40009648
2326 40009648 36054104 32750221 29489293 26318115 23782176 21680953 19973072 18177385
2318 18177385 16705571 15372509 14280760 13415350 12344762 11741658 11176609 10269995 9563393
2309 9563393 9170607 8552562 7983558 7545590 7227520 6888426 6430195 6151650 5926331 5740783
$$ packed form
2367A4570340N60175P41962J157164R43524J008442J090337J376355J196775J480538
2358B4125612J916883J785697J973723K021316J807350J762583K227720K918993
2350D0539877L151822L105843L683915M144006N076289N854361O860733P937190
2342H0354036J1055577J5060569J7344300O408784k899486k821304o588444j2562434
2334A05351598j4394052j1040658q946665o776449o367381o967771o363723m485251
2326D0009648l955544l303883l260928l171178k535939k101223j707881j795687
2318A8177385j471814j333062j091749q65410j070588o03104n65049r06614p06602
2309I563393l92786o18045n69004m37968l18070l39094m58231k78545k25319j85548
$$ plain form
2299 5740783 5320207 4852404 4599828 4384221 3968222 3884094 3702191 3283031 3199082 2959491
2289 2959491 2673112 2600485 2639461 2849676 2713198 2550257 2332116 2320746 2574072 2378044
2279 2378044 2028348 2142590 1962751 2013220 2015690 1764480 1698918 1740622 1700115 1751960 1672569
2268 1672569 1775599 1566027 1517138 1545316 1296652 1146354 1071558 971524 1135680 1252092
2258 1252092 1223988 1318432 923543 1068498 934966 845652 927509 716499 754654 670587 533135
2247 533135 672753 787254 826715 810504 659230 368352 261834 320477 562998 563022 632142
2236 632142 699554 702084 487562 209469 292748 589450 659065 506995 512801 528358 659405
2225 659405 615772 435816 193928 229017 434971 336641 474383 523812 438978 256612 232201
$$ packed form
2299E740783m20576m67803k52576k15607m15999q4128j81903m19160q3949k39591
2289B959491k86379p2627L8976K10215j36478j62941k18141j1370K53326j96028
2279B378044l49696J14242j79839N0469K470k51210o5562M1704m0507N1845p9391
2268A672569J03030k09572m8889K8178k48664j50298p4796j00034J64156J16412
2258A252092k8104R4444l94889J44955j33532q9314Q1857k11010L8155q4067j37452
2247E33135J39618J14501L9461j6211j51274k90878j06518N8643K42521K4O9120
2236F32142O7412K530k14522k78093Q3279K96702O9615j52070N806J5557J31047
2225F59405m3633j79956k41888L5089K05954r8330J37742M9429q4834j82366k4411
$$ plain form
2214 232201 279917 342776 291680 219525 250298 79915 116787 61123 199249 336203 263090
2203 263090 268358 258217 357143 144117 68358 212081 209238 270816 1889 -166839 -25630
2192 -25630 254925 29167 -198562 -197769 -67203 172157 97591 139272 -70643 -116713 -142276
2181 -142276 -242782 -450864 -460454 -107454 283425 203116 323322 157106 7585 -83023
2171 -83023 -181729 59495 5876 117962 -48918 -46927 -55568 29640 -53265 85736 -27509
2160 -27509 -177220 40160 198894 356728 99688 -69925 -198037 -175474 -158859 -191294
2150 -191294 -85761 -53909 -326738 -335459 92861 -121911 -133143 -42093 -72446 -229949 -281088
2139 -281088 -198339 -249106 291452 207741 98206 260254 85129 199361 7465 128544
$$ packed form
2214B32201M7716O2859n1096p2155L0773j70383L6872n5664J38126J36954p3113
2203B63090N268j0141R8926k13026p5759J43723k843O1578k68927j68728J41209
2192b5630K80555k25758k27729P93J30566K39360p4566M1681k09915m6070k5563
2181a42276j00506k08082r590L53000L90879q0309J20206j66216j49521r0608
2171h3023r8706K41224n3619J12086j66880J991q641Q5208q2905J39001j13245
2160b7509j49711K17380J58734J57834k57040j69613j28112K2563J6615l2435
2150a91294J05533L1852k72829q721M28320k14772j1232R1050l0353j57503n1139
2139b81088Q2749n0767N40558q3711j09535J62048j75125J14232j91896J21079
$$ plain form
2129 128544 143512 12570 39454 -27955 174202 210676 133115 129044 -68815 -219595 -72373
2118 -72373 126087 238349 153308 -40775 -26581 13114 15412 96038 219485 50921 -92402
2107 -92402 -235353 -169437 -69594 -162193 -2802 -111202 -128064 3094 -127889 58240 180675
2096 180675 265181 268766 36413 -136842 -97832 9889 79974 178665 104062 146211 183403
2085 183403 80584 42398 -45362 78359 261349 61026 47692 58844 56294 248827 141001
2074 141001 288694 206646 162725 39553 243167 763501 793460 662681 606161 538337 220615
2063 220615 449333 388787 369421 221047 279710 347995 75467 126844 161989 15006 -221856
2052 -221856 -353371 -348155 -293711 -82633 -162204 -140846 -57309 9649 83379 -72110 16777
$$ packed form
2129A28544J4968j30942K6884o7409K02157L6474p7561m071j97859j50780J47222
2118g2373J98460J12262q5041j94083J4194L9695K298Q0626J23447j68564j43323
2107i2402j42951O5916R9843r2599J59391j08400j6862J31158j30983J86129J22435
2096A80675Q4506L585k32353j73255L9010J07721P0085R8691p4603M2149L7192
2085A83403j02819l8186q7760J23721J82990k00323j3334J1152k550J92533j07826
2074A41001J47693q2048m3921j23172K03614N20334K9959j30779n6520o7824l17722
2063B20615K28718o0546j9366j48374N8663O8285k72528N1377L5145j46983k36862
2052b21856j31515N216N4444K11078p9571K1358Q3537O6958P3730j55489Q8887
$$ plain form
2041 16777 -39086 -240173 -277947 -342410 -304524 -252272 -93246 110928 -1854 -217337 -303371
2030 -303371 -253692 -183809 -273550 -169618 -17336 92553 108896 174268 166305 -84499 -478632
2019 -478632 -645168 -518902 -326860 -305479 -116245 -41349 14667 -85580 -173910 -170401 -301103
2008 -301103 -434738 -331086 -157614 -152955 -59736 -107237 -87255 -33950 -32580 -143425 -187411
1997 -187411 -169586 -393425 -227250 -204623 -98047 -76610 -245193 -106283 4676 -3839 77906
1986 77906 15110 -68092 -317286 -552249 -364099 -207834 238302 38545 -201496 -416815
1976 -416815 -420161 -329114 -449579 -518505 -300815 -414145 -264711 -238348 -60081 95062 4662
1965 4662 220284 44044 -459792 -485343 -412632 -314585 -62865 -150942 -227458 -241974 -378064
$$ packed form
2041A6777n5863k01087l7774o4463L7886N2252J59026K04174j12782k15483q6034
2030c03371M9679O9883q9741J03932J52282J09889J6343O5372p963k50804l94133
2019d78632j66536J26266J92042K1381J89234P4896N6016j00247q8330L509j30702
2008c01103j33635J03652J73472M659R3219m7501J9982N3305J370j10845m3986
1997a87411J7825k23839J66175K2627J06576K1437j68583J38910J10959q515Q1745
1986G7906o2796q3202k49194k34963J88150J56265M46136j99757k40041k15319
1976d16815l346R1047j20465o8926K17690j13330J49434K6363J78267J55143r0400
1965D662K15622j76240n03836k5551P2711R8047K51720q8077p6516j4516j36090
$$ plain form
1954 -378064 -91518 129260 18862 -71461 127841 178558 -115660 -383832 -235326 -204447
1944 -204447 -95573 -112515 -291852 -229460 -208628 68262 85890 17441 -387417 -289522 -152984
1933 -152984 -8579 54144 -77457 -219576 -240403 -147572 80069 47078 -118552 -285279
1923 -285279 -467441 -218032 -83247 -194226 -39105 -234771 -454183 -401557 -179547 83901
1913 83901 -52805 -118848 -233251 -351047 -423965 -469434 -255391 -156645 -82179 -238524 -252507
1902 -252507 -73949 -365471 -196971 -178676 -394927 -473844 -346256 -263265 -109973 -232080
1892 -232080 -199517 -310333 -325416 -318318 -325929 -291483 -246795 6493 -262241 -414194 -234111
1881 -234111 -199986 -219997 -183631 -96345 -267991 -181169 -25781 -173057 -266347 -122321 -102720
$$ packed form
1954c78064K86546K20778j10398r0323J99302N0717k94218k68172J48506L0879
1944b04447J08874j6942j79337O2392K0832K76890J7628o8449m04858R7895J36538
1933a52984J44405O2723j31601j42119k0827R2831K27641l2991j65630j66727
1923b85279j82162K49409J34785j10979J55121j95666k19412N2626K22010K63448
1913H3901j36706o6043j14403j17796p2918m5469K14043R8746P4466j56345j3983
1902b52507J78558k91522J68500J8295k16251p8917J27588Q2991J53292j22107
1892b32080L2563j10816j5083P098p611L4446M4688K53288k68734j51953J80083
1881b34111L4125k0011L6366Q7286j71646Q6822J55388j47276r3290J44026J9601
$$ plain form
1870 -102720 -324977 -171169 -40057 -152069 -361807 -417747 -190448 -254389 -506890 -177028
1860 -177028 -223811 -430378 -339854 -350258 -315909 -168414 -275083 -30130 122778 -145068
1850 -145068 -242357 -142047 -470034 -529209 -243439 -122321 -120454 -195704 -127996 -226320 8237
1839 8237 212575 157793 86209 86554 50304 99526 -110970 -394761 -268765 -175656 245197
1828 245197 314810 116853 74295 3713 -103328 -65725 -194029 -409822 -468878 -346456 -194095
1817 -194095 -351986 -592716 -335923 -189401 -207404 -172303 -244896 -400389 -332942 -344376 -274165
1806 -274165 -7587 -141673 -325818 -96335 -143788 -297474 -367739 -368521 -347035 -157637 102610
1795 102610 -56186 -108244 -74965 -84770 -60457 4417 -232983 -99621 -296088 -343372 -258107
$$ packed form
1870a02720k22257J53808J31112j12012k09738n5940K27299o3941k52501L29862
1860a77028m6783k06567R0524j0404L4349J47495j06669K44953J52908k67846
1850a45068r7289J00310l27987n9175K85770J21118J867p5250O7708r8324K34557
1839H237K04338n4782p1584L45l6250M9222k10496k83791J25996R3109M20853
1828B45197O9613j97957m2558p0582j07041L7603j28304k15793n9056J22422J52361
1817a94095j57891k40730K56793J46522j8003L5101p2593j55493O7447j1434P0211
1806b74165K66578j34086j84145K29483m7453j53686p0265p82K1486J89398K60247
1795A02610j58796n2058L3279r805K4313O4874k37400J33362j96467m7284Q5265
$$ plain form
1784 -258107 -226928 -132112 -201442 -77494 -201272 -247416 -145856 -36261 93738 111788 169530
1773 169530 -9474 -145497 -12325 -71965 -283160 -148142 -183007 -324828 -72934 33752
1763 33752 179149 175880 -64138 11192 158756 -16982 -120893 -22201 49576 -260287 -160732
1752 -160732 -206425 -132805 -194015 -205086 -38034 102084 -67557 -135636 -43057 -237023 -216123
1741 -216123 -248270 -208675 -240574 -160339 -226198 -142649 -339730 -310152 -197297 -69382 62998
1730 62998 -78194 -274530 -275882 -255011 -243720 -169286 5537 50117 30607 51684 158346
1719 158346 214630 87837 60703 151497 -3767 4559 -164897 -128933 -37031 -32359 -271404
1708 -271404 -195892 -33663 -51249 -3089 -119200 -2445 -127759 -92612 110257 -90099
$$ packed form
1784b58107L1179R4816o9330J23948j23778m6144J01560J09595J29999J8050N7742
1773A69530j79004j36023J33172n9640k11195J35018l4865j41821K51894J06686
1763C3752J45397l269k40018P5330J47564j75738j03911R8692P1777l09863R9555
1752a60732m5693P3620o1210j1071J67052J40118j69641o8079R2579j93966K0900
1741b16123l2147L9595l1899Q0235o5859Q3549j97081K9578J12855J27915J32380
1730F2998j41192j96336j352K0871J1291P4434J74823M4580j9510K1077J06662
1719A58346N6284j26793k7134R0794j55264Q326j69456L5964R1902M672k39045
1708b71404P5512J62229j7586M8160j16111J16755j25314L5147K02869k00356
$$ plain form
1698 -90099 -263236 -65945 274193 376587 107702 125825 178091 168135 67417 88439 -39829
1687 -39829 -51013 -139426 -185000 10322 13508 155108 43835 -903 44295 216570 -127807
1676 -127807 -304117 -171461 4105 -136038 -122755 -32715 -58540 75560 -25177 -95579
1666 -95579 -128828 -54835 -37611 -47279 -103696 -67985 -10384 -122626 -110386 -64912 43015 -47743
1654 -47743 -27603 -67091 -199995 205283 17426 3691 -45706 -142004 -71568 140614 66055
1643 66055 51143 -352757 -518872 -423579 -312770 -352994 -469187 -181713 -124690 -229661 -126495
1632 -126495 -55917 -133211 -395625 -475454 -353813 -242663 -273438 -403675 -426582 -324324 -126080
1621 -126080 -118035 -143441 -37090 -118190 20253 197997 198073 103502 97024 -164281 -331932 -215790
$$ packed form
1698i0099j73137J97291L40138J02394k68885J8123N2266r956j00718K1022j28268
1687c9829j1184q8413m5574J95322L186J41600j11273m4738M5198J72275l44377
1676a27807j76310J32656J75566j40143J3283R0040k5825J34100j00737p0402
1666i5579l3249P3993J7224r668n6417L5711N7601j12242J2240M5474J07927r0758
1654d7743K0140l9488j32904M05278j87857j3735m9397r6298P0436K12182p4559
1643F6055j4912m03900j66115R5293J10809m0224j16193K87474N7023j04971J03166
1632a26495P0578p7294k62414p9829J21641J11150l0775j30237k2907J02258J98244
1621a26080Q045k5406J06351q1100J38443J77744P6r4571o478k61305j67651J16142
$$ plain form
1609 -215790 -363484 -127589 -69418 -249413 -203290 -69371 -319076 -270509 -231738 -33064
1599 -33064 -7695 -143054 -190712 -114038 6855 95724 88521 -2134 176645 268212 313724
1588 313724 289441 -10031 -305048 -234260 -26767 44013 225143 -86225 -90425 120791 -177250
1577 -177250 -161567 -151162 124611 120145 50109 -24743 51069 48277 -212606 -315861 -142587
1566 -142587 25662 -28768 -92305 -348933 -372062 -200285 -138130 -91700 -306947 7852 138351
1555 138351 -12205 -102584 -8901 -26987 -200217 -114484 -191697 -179459 -59548 18406 7167
1544 7167 -74279 -25761 -308644 -170891 -27803 -341249 -66621 216222 46009 -75863
1534 -75863 58762 101051 -117328 -203980 -244906 -136584 -204417 -98751 -207377 -213155 -70063
$$ packed form
1609b15790j47694K35895N8171j79995M6123J33919k49705M8567L8771J98674
1599c3064K5369j35359m7658P6674J20893Q8869p203r0655J78779R1567M5512
1588C13724k4283k99472k95017P0788K07493P0780J81130l11368m200K11216k98041
1577a77250J5683J0405K75773m466p0036p4852P5812k792k60883j03255J73274
1566a42587J68249n4430o3537k56628k3129J71777O2155M6430k15247L14799J30499
1555A38351j50556r0379R3683j8086j73230Q5733p7213J2238J19911P7954j1239
1544G167q1446M8518k82883J37753J43088l13446K74628K82843j70213j21872
1534g5863J34625M2289k18379q6652m0926J08322o7833J05666j08626n778J43092
$$ plain form
1523 -70063 -110048 18096 -205150 -87621 -110773 -67394 -42508 29145 -296635 -205107 -278763
1512 -278763 -192807 -305519 -50839 120991 -46491 58091 156238 -126970 -212295 -469219
1502 -469219 -387482 -318800 -45510 32943 69506 124254 -99593 -187618 -134623 -91221 -42706
1491 -42706 -125466 -203897 -404058 -423319 -96038 -28310 95386 -97379 43106 -53649 -227997
1480 -227997 -319056 -98331 134989 47695 -190278 -416245 -439143 -292052 -153358 46674
1470 46674 -24317 37658 75326 90574 70879 -58749 -238587 -24917 7625 106486 84051
1459 84051 -178447 -250086 -266188 -225914 -314235 -477323 -379656 -108571 -23274 -280135 -163992
1448 -163992 -169098 -281842 -276411 -34371 133603 99623 146279 191377 -32893 3229 -71568
$$ packed form
1523g0063l9985J28144k23246J17529k3152M3379K4886P1653l25780R1528p3656
1512b78763Q5956j12712K54680J71830j67482J04582R8147k83208q5325k56924
1502d69219Q1737O8682K73290P8453L6563N4748k23847q8025N2995M3402M8515
1491d2706q2760p8431k00161j9261L27281O7728J23696j92765J40485r6755j74348
1480b27997r1059K20725K33320q7294k37973k25967k2898J47091J38694K00032
1470D6674p0991O1975L7668J5248j9695j29628j79838K13670L2542R8861k2435
1459H4051k62498p1639j6102M0274q8321j63088R7667K71085Q5297k56861J16143
1448a63992n106j12744N431K42040J67974l3980M6656M5098k24270L6122p4797
$$ plain form
1437 -71568 28947 -235661 -345888 -456285 -36690 155592 59556 -118873 -325608 -199051
1427 -199051 -194759 71588 44961 -144437 -111945 29800 -133309 -83068 14028 -69032 -246960
1416 -246960 -13205 82069 108779 138676 141715 115968 69719 69047 344531 63969 153615 80953
1404 80953 -18118 -30350 -56828 -31822 33761 -50856 18877 79125 -86753 137852 332645
1393 332645 102171 50631 239104 173854 162686 -63410 -223963 -158015 -56063 -98554 -94832
1382 -94832 -101007 8758 310800 212751 -41280 677 30740 186816 229058 -27730 -52921
1371 -52921 -65055 -172726 -423679 -478222 -132798 -152694 68250 374082 181078 -99220
1361 -99220 109078 41720 -2261 -12 -44760 -9901 -45916 70316 242539 363657 231798
$$ packed form
1437g1568J00515k64608j10227j10397M19595J92282r6036j78429k06735J26557
1427a99051M292K66347k6627j89398L2492J41745j63109N0241R7096q3060j77928
1416b46960K33755R5274K6710K9897L039k5747m6249o72K75484k80562Q9646p2662
1404H0953r9071j2232k6478K5006O5583q4617O9733O0248j65878K24605J94793
1393C32645k30474n1540J88473o5250j1168k26096j60553O5948J01952m2491L722
1382i4832o175J09765L02042r8049k54031M1957L0063J56076M2242k56788k5191
1371e2921j2134j07671k50953n4543L45424j9896K20944L05832j93004k80298
1361i9220K08298o7358m3981K249m4748L4859l6015J16232J72223J21118j31859
$$ plain form
1350 231798 74312 306798 145559 -204787 -194321 -88954 285997 200646 134111 -121965
1340 -121965 -198642 -25761 101232 109968 86782 58664 -119946 -146658 6 134311 130095
1329 130095 275239 213824 -123759 -211392 -98250 -160999 -106089 -110913 -395224 -204316 -109517
1318 -109517 -350103 -290214 -168727 -41835 15411 21247 -243127 -19663 198466 -62421
1308 -62421 56334 19376 -145208 -189115 -455576 -262840 -10024 -12155 182433 39158 15545
1297 15545 82690 40433 -16544 214525 290568 257111 17171 -118856 -121331 -124404 -268744
1286 -268744 -390002 -295703 -43373 83092 171600 225552 43797 -37195 137496 323662
1276 323662 242222 251296 170181 18964 -53738 -803 51062 181198 -103270 83154 276288
$$ packed form
1350B31798j57486K32486j61239l50346J0466J05367L74951q5351o6535k56076
1340a21965p6677J72881J26993Q736k3186k8118j78610k6712J46664J34305m216
1329A30095J45144o1415l37583q7633J13142o2749N4910m824k84311J90908R4799
1318a09517k40586N9889J21487J26892N7246N836k64374K23464K18129k60887
1308f2421J18755l6958j64584m3907k66461J92736K52816k131J94588j43275k3613
1297A5545O7145m2257n6977K31069P6043l3457k39940j36027k475l073j44340
1286b68744j21258R4299K52330J26465Q8508N3952j81755q0992J74691J86166
1276C23662q1440R074q1115j51217p2702N2935N1865J30136k84468J86424J93134
$$ plain form
1265 276288 134404 129659 -72545 -17473 189154 96744 144467 -76769 83981 335287 223772
1254 223772 42104 -129331 95366 85877 -6966 124927 180762 -24621 -24475 -38090 -21936
1243 -21936 -24190 -67485 73796 234 11613 153100 232033 181236 -46383 -175685 -87234
1232 -87234 -131124 -46052 -12723 -98147 81777 58331 -79185 -338809 -345090 -260390 -242214
1221 -242214 -185233 93192 145929 -23309 -40368 -87911 262530 215960 89243 121674 -36702
1210 -36702 -74232 -219783 -241259 -172944 -16619 133432 139340 126843 109478 290694 274661
1199 274661 69287 -24175 125023 108677 33509 -80100 -297237 -250301 -102698 48947
1189 48947 154671 207321 330840 146636 73152 46667 -94281 -67861 -254922 -31625 149147
$$ packed form
1265B76288j41884m745k02204N5072K06627r2410M7723k21236J60750K51306j11515
1254B23772j81668j71435K24697r489r2843J31893N5835k05383J46j3615J6154
1243b1936k254m3295J41281p3562J1379J41487P8933n0797k27619j29302Q8451
1232h7234m3890Q5072L3329q5424J79924k3446j37516k59624o281Q4700J8176
1221b42214N6981K78425N2737j69238j7059m7543L50441m6570j26717L2431j58376
1210c6702l7530j45551k1476O8315J56325J50051N908j2497j7365J81216j6033
1199B74661k05374r3462J49198j6346p5168j13609k17137M6936J47603J51645
1189D8947J05724N2650J23519j84204p3484k6485j40948K6420j87061K23297J80772
$$ plain form
1178 149147 285653 237655 -6543 162388 129943 -131472 -153658 -271992 -308126 -311799 -182866
1167 -182866 -93229 -183331 -107551 121058 100743 238037 306491 254385 243841 -111883 -212522
1156 -212522 193282 189588 8425 -3992 -49322 -254432 -128237 7130 13237 -12932 -7420
1145 -7420 24524 -190603 -26039 132439 77539 18134 -106361 126002 185778 -107043 -193574
1134 -193574 -211276 76933 -62049 -162811 -152282 -88302 -124960 -257589 -314882 -257678 -167700
1123 -167700 -1226 2793 16652 -128106 118266 137630 55883 -28745 -22364 -330905 -285735
1112 -285735 -1291 -19876 -62664 -85587 -8881 115419 382475 -112731 -179077 -158005 -100341
1101 -100341 91002 228065 73491 53748 112391 -43875 -167635 -375252 -457862 -252207
$$ packed form
1178A49147J36506m7998k44198J68931l2445k61415k2186j18334l6134l673J28933
1167a82866Q9637r0102P5780K28609k0315J37294O8454n2106j0544l55724j00639
1156b12522M05804l694j81163j2417m5330k05110J26195J35367O107k6169N512
1145g420L1944k15127J64564J58478n4900n9405j24495K32363N9776k92821q6531
1134a93574j7702K88209j38982j00762J0529O3980l6658j32629n7293N7204Q9978
1123a67700J66474M019J3859j44758K46372J9364q1747q4628O381l08541M5170
1112b85735K84444j8585m2788k2923P6706J24300K67056m95206o6346K1072N7664
1101a00341J91343J37063j54574j9743N8643j56266j23760k07617q2610K05655
$$ plain form
1091 -252207 -167861 -301228 -52345 37956 85870 77479 95724 299522 142414 266732 204769
1080 204769 169197 -67508 -125574 -59432 -45609 -27427 -49235 -8657 79362 238004 86240
1069 86240 -34683 71339 220947 317511 104093 171451 136126 6086 -40024 61 -60750
1058 -60750 -160554 -67620 -101127 -77819 -40028 -184045 -177363 84887 85678 -19438 -34519 305084
1046 305084 242548 312659 222751 -105153 14966 69008 -170015 -98534 -35696 -154744 42450
1035 42450 -50887 -103383 290147 -100691 -158836 -139283 -140538 -172719 -138232 -11386 15943
1024 15943 -72085 -81179 87887 177471 46966 -78216 -165433 -134476 136395 4625 122049
1013 122049 -33284 -76182 -110663 -197363 -72076 -38778 31571 -116059 -306745 -160800 -287669
$$ packed form
1091b52207Q4346j33367K48883R0301M7914q391J8245K03798j57108J24318o1963
1080B04769l5572k36705n8066O6142J3823J8182k1808M0578Q8019J58642j51764
1069H6240j20923J06022J49608R6564k13418O7358l5325j30040m6110M0085o0811
1058f0750r9804R2934l3507K3308L7791j44017O682K62250P91j05116j5081L39603
1046C05084o2536P0111q9908l27904J20119N4042k39023P1481O2838j19048J97194
1035D2450r3337n2496L93530l90838n8145J9553j255l2181L4487J26846K7329
1024A5943q8028r094J69066Q9584j30505j25182q7217L0957K70871j31770J17424
1013A22049j55333m2898l4481q6700J25287L3298P0349j47630j90686J45945j26869
$$ plain form
1002 -287669 -155813 136024 66681 20754 43648 84089 -9457 -211657 -11284 -128469 33766
991 33766 145687 159269 194108 257500 67519 103993 -61635 -199691 72913 -119327 55383
980 55383 -71060 -41826 130708 263648 104869 -138817 -66917 -174005 -99015 247582 404421
969 404421 72035 -140936 -36287 -206240 -241598 -118221 -9760 -193624 -158389 -35262
959 -35262 -102229 -157223 -132999 -118638 -90705 118047 79962 233026 135361 33889 18596
948 18596 -67417 -246463 -91536 67434 159079 169691 241302 90086 19582 200166 -55591
937 -55591 -54816 8683 95355 -48696 176542 96117 124393 31305 56891 37112 -245942 -28076
925 -28076 137894 83070 -12251 55672 68797 126131 38711 183852 174280 -64331 90288
$$ packed form
1002b87669J31856K91837o9343m5927K2894M0441r3546k02200K00373j17185J62235
991C3766J11921J3582L4839O3392j89981L6474j65628j38056K72604j92240J74710
980E5383j26443K9234J72534J32940j58779k43686P1900j07088P4990L46597J56839
969D04421l32386k12971J04649j69953l5358J23377J08461j83864L5235J23127
959c5262o6967n4994K4224J4361K7933K08752l8085J53064r7665j01472j5293
948A8596q6013j79046J54927J58970R1645J0612P1611j51216p0504J80584k55757
937e5591P75O3499Q6672j44051K25238q0425K8276r3088K5586j9779k83054K17866
925b8076J65970n4824r5321O7923J3125N7334q7420J45141r572k38611J54619
$$ plain form
914 90288 188451 153632 383438 177799 242183 413679 147117 87822 -178959 -159959 -58238
903 -58238 160262 311680 189778 213137 99382 114842 -132408 -151764 200013 128738 68083
892 68083 155514 255158 204054 260263 240420 187756 54279 161416 215838 41277 -173668
881 -173668 -47726 203757 431113 311281 288673 468784 387200 403872 267461 191051 81559
870 81559 74894 -78067 141227 206047 -80235 -29027 -44249 -250482 -155995 -123413 -3125
859 -3125 92272 83513 131990 -46601 -85329 -27948 85202 75650 104761 311051 118613 -153775
847 -153775 -15163 -138868 -71483 -95293 -104962 78653 73735 72212 36789 163785 159529 -145449
835 -145449 -141863 -188783 23051 -196882 -318720 -95219 -199788 -112905 91820 140832 140880
$$ packed form
914I0288R8163l4819K29806k05639O4384J71496k66562n9295k66781J9000J01721
903e8238K18500J51418j21902K3359j13755J5460k47250j9356L51777p1275o0655
892F8083Q7431R9644n1104N6209j9843n2664j33477J07137N4422j74561k14945
881a73668J25942K51483K27356j19832k2608J80111q1584J6672j36411p6410j09492
870H1559o665j52961K19294O4820k86282N1208j5222k06233R4487L2582J20288
859c125R5397q759M8477j78591l8728N7381J13150r552K9111K06290j92438k72388
847a53775J38612j23705O7385k3810r669J83615m918j523l5423J26996m256l04978
835a45449L586m6920K11834k19933j21838K23501j04569Q6883K04725M9012M8
$$ plain form
824 140880 63336 71719 158091 194866 34828 -60559 -164303 -197401 52092 82825 -32833
813 -32833 320221 313945 95027 154896 132595 121559 -90581 -104062 -227571 -3915 -69471
802 -69471 77213 127539 -19730 -139218 -280358 -46620 221187 153953 238998 163675 223304
791 223304 146528 -17123 170385 177289 14717 -25135 200072 301545 252583 203333 -90995
780 -90995 49062 180967 123018 87289 194144 83726 90198 -50394 -4072 -72685 15793
769 15793 172944 -79687 193487 300869 24574 135018 340820 342135 81286 -17375 9264
758 9264 -45487 34989 3365 -107445 -285035 -282677 -362528 -33994 -136290 -383072 -237913
747 -237913 101182 217757 136134 -62774 -136468 -39868 -62644 -69310 -161684 -92229 -105652
$$ packed form
824A40880p7544Q383Q6372L6775j60038r5387j03744l3098K49493L0733j15658
813c2833L53054o276k18918N9869k2301j1036k12140j3481j23509K23656o5556
802f9471J46684N0326j47269j19488j41140K33738K67807o7234Q5045p5323N9629
791B23304p6776j63651J87508O904j62572l9852K25207J01473m8962m9250k94328
780i0995J40057J31905n7949l5729J06855j10418O472j40592M6322o8613Q8478
769A5793J57151k52631K73174J07382k76295J10444K05802J315k60849r8661K6639
758I264n4751Q0476l1624j10810j77590K358p9851L28534j02296k46782J45159
747b37913L39095J16575q1623j98908p3694R6600k2776o666r2374O9455j3423
$$ plain form
736 -105652 -200339 -395510 -175087 -22927 109107 -54300 -115943 91030 242694 239506 163832
725 163832 130944 -123457 -258788 -295384 -242124 -263415 -78514 -323954 -189717 -65144 88902
714 88902 -165909 -330345 -287883 -319322 -317200 -119235 -3558 44975 106244 -25245 29198
703 29198 198307 22750 -73065 -348671 -349936 -321994 -95000 -67871 -91833 -74573 30105
692 30105 -11663 -124644 12678 -36150 -35789 203348 -14003 -353267 -298514 18211 -42207
681 -42207 -167575 -124310 -200197 -30919 -189668 -191789 10251 196237 277281 466933 228216
670 228216 250422 140200 -38188 -333556 -84669 178241 -79278 29572 118733 39568
660 39568 143715 46842 317260 129230 -42140 49855 172128 166353 -81380 -224803 -187136
$$ packed form
736a05652r4687j95171K20423J52160J32034j63407o1643K06973J51664l188p5674
725A63832l2888k54401j35331l6596N3260k1291J84901k45440J34237J24573J54046
714H8902k54811j64436M2462l1439K122J97965J15677M8533O1269j31489N4443
703B9198J69109j75557r5815k75606j265K7942K26994K7129k3962J7260J04678
692C0105m1768j12981J37322m8828L61K39137k17351l39264N4753L16725o0418
681d2207j25368M3265p5887J69278j58749k121K02040J85986Q1044J89652k38717
670B28216K2206j10222j78388k95368K48887K62910k57519J08850Q9161p9165
660C9568J04147r6873K70418j88030j71370R1995J22273n775k47733j43423L7667
$$ plain form
649 -187136 -154258 -214502 -99410 -51474 251315 257599 175341 164831 270621 176694 140614
638 140614 -19637 15889 85628 56165 -39850 -21656 34361 -91467 -44709 -122349 72928
627 72928 -131915 -202309 62047 147634 320125 -13719 103236 382416 109619 315669
617 315669 225531 125337 9351 -17608 -97606 -14254 -130970 -25308 -89978 -44324 135589
606 135589 212879 287347 254349 397428 254982 179387 20848 113064 67976 76806 -43769
595 -43769 -72460 -68162 275087 288319 40090 8399 75212 173432 118674 150028 140163 246993
583 246993 274086 296847 208560 60390 53871 57387 88797 -54010 -61588 -32088 -86984 210928
571 210928 424453 313978 216200 -33452 -68348 -11452 -183107 -178088 35559 201961 101648
$$ packed form
649a87136L2878o0244J15092M7936L02789O284q2258j0510J05790r3927l6080
638A40614j60251L5526O9739k9463r6015J8194N6017j25828M6758p7640J95277
627G2928k04843p0394K64356Q5587J72491l33844J16955K79180k72797K06050
617C15669r0138j00194j15986k6959p9998Q3352j16716J05662o4670M5654J79913
606A35589P7290P4468l2998J43079j42446p5595j58539R2216m5088Q830j20575
595d3769k8691M298L43249J3232k48229l1691O6813R8220n4758L1354r865J06830
583B46993K7093K2761q8287j48170o519L516L1410j42807p578K9500n4896K97912
571B10928K13525j10475r7778k49652l4896N6896j71655N019K13647J66402j00313
$$ plain form
560 101648 76958 192848 83002 174105 225860 -15545 -79423 -414519 -279522 36208 -74685
549 -74685 -123085 237719 215054 -15656 15676 151463 105044 -2696 72051 108749 30285
538 30285 -145298 -36376 -87634 137934 137872 202835 150413 185534 253863 104820 74756 -254945
526 -254945 -102175 -37995 -138942 -108579 68230 5524 -127805 -151107 -219451 -208634 -164313
515 -164313 -98663 -214367 -239185 -189332 -42733 -93417 -77435 -32249 -234020 -267825 -149753
504 -149753 -112877 72737 17851 -2569 -140763 -294848 -296639 -73576 124119 13271 -200221
493 -200221 -128293 294770 114273 17392 219238 350574 343156 220830 99904 302713 83500
482 83500 74825 147404 185015 139582 80244 -50987 92957 301375 171175 111338 99480
$$ packed form
560A01648k4690J15890j09846R1103N1755k41405o3878l35096J34997L15730j10893
549g4685m8400L60804k2665k30710L1332J35787m6419j07740P4747L6698p8464
538C0285j75583J08922n1258K25568o2O4963n2422L5121O8329j49043l0064l29701
526b54945J52770O4180j00947L0363J76809o2706j33329k3302o8344J0817M4321
515a64313O5650j15704k4818M9853J46599n0684J5982M5186k01771l3805J18072
504a49753L6876J85614n4886k0420j38194j54085j791K23063J97695j10848k13492
493b00221P1928M23063j80497r6881K01846J31336p418j22326j20926K02809k19213
482H3500q675P2579L7611m5433n9338j31231J43944K08418j30200n9837j1858
$$ plain form
471 99480 230504 144453 119867 -111441 6948 -37233 -194330 -211470 -196761 -17951 15871
460 15871 116504 233364 342037 89259 14342 96483 8522 289700 335320 190249 -162989
449 -162989 -224525 -205971 -198086 -94620 100596 -107227 -127523 -12798 -86875 5834 28377
438 28377 -135430 73059 229470 171863 19697 -23556 -218155 -424311 -43003 312225
428 312225 285640 134277 78452 -114226 95145 183853 84867 49909 -151827 -118841 31815
417 31815 -68787 81623 -2299 -58314 134893 402033 189126 60662 -135221 -3166
407 -3166 164343 169811 41545 -186826 -54775 120002 385316 548108 311528 126929 73341
396 73341 -13670 -55769 -25149 44996 190941 134708 -106790 -81271 19618 145376 -51500
$$ packed form
471I9480J31024q6051k4586k31308J18389m4181j57097j7140J4709J78810L3822
460A5871J00633J16860J08673k52778p4917Q2141q7961K81178M5620j45071l53238
449a62989o1536J8554P885J03466J95216k07823k0296J14725p4077R2709K2543
438B8377j63807K08489J56411n7607j52166m3253j94599k06156L81308L55228
428C12225k6585j51363n5825j92678K09371Q8708r8986l4958k01736L2986J50656
417C1815j00602J50410q3922n6015J93207K67140k12907j28464j95883J32055
407c166J67509N468j28266k28371J32051J74777K65314J62792k36580j84599n3588
396G3341q7011m2099L0620P0145J45945n6233k41498K5519J00889J25758j96876
$$ plain form
385 -51500 -444992 -336870 -241541 -430659 -293252 -225245 -165478 123788 162761 71020 44594
374 44594 84383 327753 267916 121040 94929 149430 -102754 38418 26532 4730 -142669
363 -142669 -318886 -8817 -129278 -201549 -203967 -118363 -8742 -162365 -98058 152355 77527
352 77527 7261 135121 -61257 -137007 -65234 85552 98244 96578 -137791 75273 28270
341 28270 -135727 -124827 53311 415679 260054 114736 268625 580062 345963 50493
331 50493 46132 215828 330512 444473 331017 100623 -155515 -95042 165891 -28639 -50040
320 -50040 -228041 9664 377954 40637 -166998 -388905 -284419 2006 137702 110504
310 110504 -3188 -132058 -95882 -234367 -182945 -113948 -10034 -53117 140692 106641 -94056
$$ packed form
385e1500l93492J08122R5329j89118J37407O8007N9767K89266L8973r1741k6426
374D4594L9789K43370n9837j46876k6111N4501k52184J41172j1886k1802j47399
363a42669j76217L10069j20461p2271k418Q5604J09621j53623O4307K50413p4828
352G7527p0266J27860j96378p5750P1773J50786J2692j666k34369K13064m7003
341B8270j63997J0900J78138L62368j55625j45318J53889L11437k34099k95470
331E0493m361J69696J14684J13961j13456k30394k56138O0473K60933j94530k1401
320e0040j78001K37705L68290l37317k07635k21907J04486K86425J35696k7198
310A10504j13692j28870L6176j38485N1422O8997J03914m3083J93809l4051k00697
$$ plain form
299 -94056 98219 228279 -51039 -5711 -96515 -79392 113630 104489 166142 205689 -33682
288 -33682 -63752 23463 114136 323502 127572 43642 205460 229759 154373 145612 152297 92311
276 92311 15714 -63791 -153780 -204122 -86149 -95150 -261927 -176143 -12588 -41775 -34654 190625
264 190625 296327 110256 10743 135504 219519 323521 79278 244932 238989 288851 158767
253 158767 -37898 -78032 -30412 17542 -45661 -189135 -162653 -17923 38343 -89059 -165024
242 -165024 225028 115148 23283 34081 -10544 -185973 -238426 -213006 -174267 -157689 -156577
231 -156577 -26730 42076 69237 22234 2047 103472 -24477 22637 15220 -157878 -80129
220 -80129 -41435 144163 131337 9448 -36219 179204 182992 78400 110731 -97641 -167754
$$ packed form
299i4056J92275J30060k79318M5328r0804J7123J93022r141O1653L9547k39371
288c3682l0070Q7215R0673K09366j95930q3930J61818K4299p5386q761O685n9986
276I2311p6597p9505q9989n0342J17973r001j66777Q5784J63555k9187P121K25279
264A90625J05702j86071r9513J24761Q4015J04002k44243J65654n943M9862j30084
253A58767j96665m0134M7620M7954o3203j43474K6482J44730N6266j27402p5965
242a65024L90052j09880r1865J0798m4625j75429n2453K5420L8739J6578J112
231a56577J29847O8806K7161m7003k0187J01425j27949M7114p417j73098P7749
220h0129L8694J85598j2826j21889m5667K15423L788j04592L2331k08372p0113
$$ plain form
209 -167754 25919 80131 269749 153500 271136 172437 238506 69666 13239 -4687 -26504
198 -26504 157058 165094 216284 72126 292729 -6360 -88088 31369 4177 -16383 -195018
187 -195018 34484 64142 123969 169112 9094 91636 -76714 -83363 -136625 51875 -76744
176 -76744 -252843 274913 257174 185060 39441 54330 111909 203713 75633 -431 -99436
165 -99436 -59146 -65588 -70188 46257 131057 110320 245164 94838 -180360 -56577 56300
154 56300 -79621 169193 181546 -111705 -58821 -180843 -30437 -23883 123838 150272 -74403
143 -74403 -66775 65478 3592 -215449 -427904 -83650 -33325 -34502 -32936 -18411 226689 384768
131 384768 205105 163245 30280 109784 62621 -15657 43334 -1328 63933 -235226 -444134
$$ packed form
209a67754J93673N4212J89618j16249J17636r8699O6069j68840n6427j7926k1817
198b6504J83562Q036N1190j44158K20603k99089q1728J19457k7192k0560j78635
187a95018K29502K9658N9827M5143j60018Q2542j68350o649n3262J88500j28619
176g6744j76099N27756j7739p2114j45619J4889N7579R1804j28080p6064r9005
165i9436M0290o442m600J16445Q4800k0737J34844j50326k75198J23783J12877
154E6300j35921K48814J2353k93251N2884j22022J50406O554J47721K6434k24675
143g4403P628J32253o1886k19041k12455L44254N0325j177J566J4525K45100J58079
131C84768j79663m1860j32965P9504m7163p8278N8991m4662O5261k99159k08908
$$ plain form
120 -444134 -131303 -190216 -234334 -163501 84418 200951 189526 159283 164072 43143 32635
109 32635 117115 46103 2033 35791 238508 162304 -2440 -209711 -35786 141211 150304
98 150304 264654 49468 120811 176174 186092 59542 -24045 59938 183294 13677 17082
87 17082 234202 270732 324961 319417 242325 121837 77863 91073 37100 -132023 -88624 -7426
75 -7426 -108669 -222130 19684 12279 -28270 207118 228718 131759 8690 7779 -3668 26522
63 26522 -152085 -238487 -80865 124563 20149 -43337 -53233 -103966 -72886 -228856 -130565
52 -130565 1516 131027 139034 144358 187370 239452 114914 111651 151277 38586 43825 140066
40 140066 177107 135998 18082 6626 126017 173175 69386 -3570 5437 -54231 -81480 11443
$$ packed form
120d44134L12831n8913m4118P0833K47919J16533j1425l0243M789j20929j0508
109C2635Q4480p1012m4070L3758K02717p6204j64744k07271J73925J76997R093
98A50304J14350k15186P1343N5363R918j26550q3587Q3983J23356j69617L405
87A7082K17120L6530N4229n544p7092j20488m3974J3210n3973j69123M3399Q1198
75g426j01243j13461K41814p405m0549K35388K1600r6959j23069r11j1447L0190
63B6522j78607q6402J57622K05428j04414o3486r896n0733L1080j55970R8291
52a30565J32081J29511Q007N324M3012N2082j24538l263L9626j12691N239R6241
40A40066L7041m1109j17916j1456J19391M7158j03789p2956R007n9668k7249R2923
$$ plain form
28 11443 -35344 -27368 -93099 39478 140449 101595 49244 76494 14838 114150 109476 156586
16 156586 13774 35480 -5168 164196 127380 -85593 -26243 -52859 -197007 -146350 -25885
5 -25885 23463 40511 140073 228956 248179
0 248179
$$ packed form
28A1443m6787P976o5731J32577J00971l8854n2351K7250o1656R9312m674M7110
16A56586j42812K1706m0648J69364l6816k12973N9350k6616j44148N0657J20465
5b5885M9348J7048R9562Q8883J9223
0B48179
$$ Imaginary data points
##PAGE= N=2
##DATA TABLE= (X++(I..I)), XYDATA
$$ [...]
##END NTUPLES=NMR SPECTRUM
##END=
