##TITLE=1H_DE-80H_X3
 200.13MHz, d2o
 8 sc
 
 19ns.26.2.2025
##JCAMPDX= 6.0         $$ Bruker NMR JCAMP-DX V2.0
##DATA TYPE= NMR SPECTRUM
##DATA CLASS= NTUPLES
##ORIGIN= UXNMR, Bruker Analytische Messtechnik GmbH
##OWNER= pz
$$ XWIN-NMR		Version 3.5
$$ Tue Sep 30 10:40:48 2025 Russian Standard Time (UT+4h)  Yarkov@DPX200
##.OBSERVE FREQUENCY= 200.1313
##.OBSERVE NUCLEUS= ^1H
##.ACQUISITION MODE= SIMULTANEOUS
##.ACQUISITION SCHEME= undefined
##.AVERAGES= 8
##.DIGITISER RES= 18
##SPECTROMETER/DATA SYSTEM= spect
##.PULSE SEQUENCE= zg30
##.SOLVENT NAME= CDCl3
##.SHIFT REFERENCE= (INTERNAL, CDCl3, 0, 15.4847)
##AUDIT TRAIL= $$ (NUMBER, WHEN, WHO, WHERE, WHAT)
$$ ##TITLE= Audit trail, XWIN-NMR		Version 3.5
$$ ##JCAMPDX= 5.01
$$ ##ORIGIN= Bruker BioSpin GmbH
$$ ##OWNER= Yarkov
$$ C:/Bruker/XWIN-NMR/data/yarkov2/nmr/H-C/1/pdata/1/auditp.txt
$$ ##AUDIT TRAIL=  $$ (NUMBER, WHEN, WHO, WHERE, WHAT)
(   1,<2025-09-30 10:39:45.64 +0400>,<Yarkov>,<DPX200>,
      <created by zg, POWCHK disabled, PULCHK disabled
       configuration hash MD5:
       00 E9 B6 7A A2 85 ED C7 34 08 36 98 17 FE 4E 26
       data hash MD5: 16K
       E6 D8 3F 82 AF 4D 3D 66 AC 1B 20 DA 69 38 61 2E>)
(   2,<2025-09-30 10:39:58.01 +0400>,<Yarkov>,<DPX200>,
      <Start of raw data processing
       efp BC_mod = 2 LB = 0.25 FT_mod = 6 PKNL = 1 PHC0 = -2078.854 PHC1 = 16.19097 SI = 16K 
       data hash MD5: 16K
       55 CF 6F A3 30 9C BC 30 98 19 39 E4 E7 DB EF E0>)
(   3,<2025-09-30 10:40:02.56 +0400>,<Yarkov>,<DPX200>,
      <abs ABSG = 5 
       data hash MD5: 16K
       34 A9 D4 D2 88 9A 7E CA ED 9B DF E9 6E 98 D6 92>)
$$ ##END=
$$ 
$$ hash MD5
$$ 53 13 56 8C 9C 81 7E 9F 8A D4 32 C6 EF DF 10 34
##$RELAX= 
##$RELAX= 
##$RELAX= 
##$RELAX= 
##$RELAX= 
##$RELAX= 
$$ Bruker specific parameters
$$ --------------------------
##$DU= <C:/Bruker/XWIN-NMR>
##$EXPNO= 1
##$NAME= <H-C>
##$PROCNO= 1
##$TYPE= <nmr>
##$USER= <yarkov2>
##$AMP= (0..31)
100 100 100 100 100 100 100 100 100 100 100 100 100 100 100 100 100 100 
100 100 100 100 100 100 100 100 100 100 100 100 100 100 
##$AQSEQ= 0
##$AQ_mod= 1
##$AUNM= <au_zg>
##$AUTOPOS= <>
##$BF1= 200.13
##$BF2= 200.13
##$BF3= 200.13
##$BF4= 200.13
##$BF5= 200.13
##$BF6= 200.13
##$BF7= 200.13
##$BF8= 200.13
##$BYTORDA= 1
##$CFDGTYP= 0
##$CFRGTYP= 5
##$CHEMSTR= <none>
##$CNST= (0..31)
1 1 145 1 1 1 1 1 1 1 1 1 1 1 1 1 1 1 1 1 1 1 1 1 1 1 1 1 1 1 1 1 
##$CPDPRG= <>
##$CPDPRG1= <>
##$CPDPRG2= <>
##$CPDPRG3= <>
##$CPDPRG4= <mlev>
##$CPDPRG5= <mlev>
##$CPDPRG6= <mlev>
##$CPDPRG7= <mlev>
##$CPDPRG8= <mlev>
##$CPDPRGB= <>
##$CPDPRGT= <>
##$D= (0..31)
0 0.7 0 0 0 0 0 0 0 0 0 0.03 0 0 0 0 0 0 0 0 0 0 0 0 0 0 0 0 0 0 0 0 
##$DATE= 1759214385
##$DBL= (0..7)
120 120 120 120 120 120 120 120 
##$DBP= (0..7)
150 150 150 150 150 150 150 150 
##$DBP07= 0
##$DBPNAM0= <>
##$DBPNAM1= <>
##$DBPNAM2= <>
##$DBPNAM3= <>
##$DBPNAM4= <>
##$DBPNAM5= <>
##$DBPNAM6= <>
##$DBPNAM7= <>
##$DBPOAL= (0..7)
0.5 0.5 0.5 0.5 0.5 0.5 0.5 0.5 
##$DBPOFFS= (0..7)
0 0 0 0 0 0 0 0 
##$DE= 6
$$ [...]
##$SUBNAM3= <"">
##$SUBNAM4= <"">
##$SUBNAM5= <"">
##$SUBNAM6= <"">
##$SUBNAM7= <"">
##$SUBNAM8= <"">
##$SUBNAM9= <"">
##$SW= 18.0517328524113
##$SWIBOX= (0..15)
0 0 2 0 0 0 0 0 0 0 0 0 0 0 0 0 
##$SW_h= 3612.71676300578
##$TD= 16384
##$TD0= 1
##$TE= 0
##$TE2= 300
##$TE3= 300
##$TEG= 300
##$TL= (0..7)
0 120 120 120 120 120 120 120 
##$TP= (0..7)
150 150 150 150 150 150 150 150 
##$TP07= 0
##$TPNAME0= <>
##$TPNAME1= <>
##$TPNAME2= <>
##$TPNAME3= <>
##$TPNAME4= <>
##$TPNAME5= <>
##$TPNAME6= <>
##$TPNAME7= <>
##$TPOAL= (0..7)
0.5 0.5 0.5 0.5 0.5 0.5 0.5 0.5 
##$TPOFFS= (0..7)
0 0 0 0 0 0 0 0 
##$TUNHIN= 0
##$TUNHOUT= 0
##$TUNXOUT= 0
##$USERA1= <user>
##$USERA2= <user>
##$USERA3= <user>
##$USERA4= <user>
##$USERA5= <user>
##$V9= 5
##$VALIST= <valist>
##$VCLIST= <CCCCCCCCCCCCCCC>
##$VD= 0
##$VDLIST= <DDDDDDDDDDDDDDD>
##$VPLIST= <PPPPPPPPPPPPPPP>
##$VTLIST= <TTTTTTTTTTTTTTT>
##$WBST= 1024
##$WBSW= 4
##$XGAIN= (0..3)
0 0 0 0 
##$XL= 0
##$YL= 0
##$YMAX_a= 193614
##$YMIN_a= -147750
##$ZGOPTNS= <>
##$ZL1= 120
##$ZL2= 120
##$ZL3= 120
##$ZL4= 120
##$ABSF1= 15.48466
##$ABSF2= -2.567189
##$ABSG= 5
##$ABSL= 3
##$ALPHA= 0
##$AQORDER= 0
##$ASSFAC= 0
##$ASSFACI= 0
##$ASSFACX= 0
##$ASSWID= 0
##$AUNMP= <proc_1d>
##$AZFE= 0.1
##$AZFW= 0.1
##$BCFW= 0
##$BC_mod= 2
##$BYTORDP= 0
##$COROFFS= 0
##$CY= -3
##$DATMOD= 1
##$DC= 0
##$DFILT= <>
##$DTYPP= 0
##$F1P= 0
##$F2P= 0
##$FCOR= 1
##$FTSIZE= 16384
##$FT_mod= 6
##$GAMMA= 0
##$GB= 0
##$INTBC= 1
##$INTSCL= 3.241238e-09
##$ISEN= 128
##$LB= 0.25
##$LEV0= 0
##$LPBIN= 0
##$MAXI= 10000
##$MC2= 0
##$MEAN= 0
##$ME_mod= 0
##$MI= 1.114404
##$NCOEF= 0
##$NC_proc= -8
##$NLEV= 6
##$NOISF1= 3.799351
##$NOISF2= 2.8
##$NSP= 0
##$NTH_PI= 0
##$NZP= 0
##$OFFSET= 15.48466
##$PC= 1
##$PHC0= -2078.854
##$PHC1= 16.19097
##$PH_mod= 1
##$PKNL= yes
##$PPARMOD= 0
##$PSCAL= 0
##$PSIGN= 0
##$REVERSE= no
##$SF= 200.130007413961
##$SI= 16384
##$SIGF1= 3
##$SIGF2= 2
##$SINO= 0.751879
##$SIOLD= 32768
##$SREGLST= <19F.Aceton>
##$SSB= 0
##$STSI= 16384
##$STSR= 0
##$SW_p= 3612.71676300578
##$SYMM= 0
##$S_DEV= 0
##$TDeff= 16384
##$TDoff= 0
##$TI= <>
##$TILT= no
##$TM1= 0
##$TM2= 0
##$TOPLEV= 0
##$USERP1= <user>
##$USERP2= <user>
##$USERP3= <user>
##$USERP4= <user>
##$USERP5= <user>
##$WDW= 1
##$XDIM= 16384
##$YMAX_p= 279448202
##$YMIN_p= -4084091
$$ End of Bruker specific parameters
$$ ---------------------------------
##NTUPLES= NMR SPECTRUM
##VAR_NAME=  FREQUENCY,     SPECTRUM/REAL,   SPECTRUM/IMAG
##SYMBOL=    X,             R,               I
##VAR_TYPE=  INDEPENDENT,   DEPENDENT,       DEPENDENT
##VAR_FORM=  AFFN,          ASDF,            ASDF
##VAR_DIM=   16384,         16384,           16384
##UNITS=     HZ,            ARBITRARY UNITS, ARBITRARY UNITS
##FACTOR=    0.220516191357247, 1,           1
##FIRST=     3098.94515034611, 0,            0
##LAST=      -513.771612659672, 0,           0
##MIN=       -513.771612659672, -4084091,    0
##MAX=       3098.94515034611, 279448202,    0
$$ Real data points
##PAGE= N=1
##DATA TABLE= (X++(R..R)), XYDATA
$$ [...]
9479 602451 508517 354771 334171 473760 495276 265396 470602 496714 371566 493406
9469 493406 486309 517529 489322 403057 458952 567425 425262 371493 349788 358122 535947
9458 535947 538980 549921 621556 689015 786284 740923 778119 908698 569540 434024 707552
9447 707552 705133 602305 682944 644570 547785 413240 427387 461824 441080 936686 1098942
9436 1098942 1002975 837159 1059489 923629 999737 1122083 853874 977263 915790 893858
9426 893858 1209083 962040 1043104 1558192 1585608 1385523 1499045 1235172 1073069 1294044
9416 1294044 1090643 863166 1236883 1127849 1291804 1174433 1120651 1157729 747967 710818
9406 710818 707600 796468 867771 776586 1048421 865906 792324 978447 948033 781754 916212
9395 916212 776867 870424 759379 623620 721238 905842 1083042 1177035 897557 854348
9385 854348 1085235 1177245 1122215 876041 638854 568767 753170 345387 324383 471618
9375 471618 507918 490569 724918 666987 621795 806706 711203 750725 781401 633979 721789
9364 721789 374542 278144 261234 312028 533962 557929 454805 682572 922410 1159865
9354 1159865 843106 824602 651934 843685 850758 729141 732661 770590 729761 798318 819226
9343 819226 669652 629372 538265 658374 718587 970791 865128 858447 826301 843282 1012029
9332 1012029 1272113 950547 1068317 1006686 719356 575536 807267 1036730 1109998 1305202
9322 1305202 1496366 1271030 1184647 1153304 975134 897265 810147 940391 732056 958266
9312 958266 901090 796913 1210855 1247086 1065157 1222566 1343560 1129939 1073890 1182537
9302 1182537 1160824 1011939 864926 1024721 1043265 1044810 1178907 1442648 1097716 1082191
9292 1082191 1322696 1233396 1277661 1101786 1136517 1189056 1122271 1162371 1380553 1088173 897152
9281 897152 1111234 1023310 1062670 1021221 1085657 983958 999941 1107642 1507826 1523873 1302480
9270 1302480 1394083 1058822 976312 1004799 960104 1188648 1348366 1340581 1319967 1330789 1338589
9259 1338589 1102693 1226627 1365528 1432108 1462871 1344555 1247838 1000417 1361737 1234347
9249 1234347 1126224 1037621 856692 958780 1072962 933389 1132226 1346195 1465720 1592267
9239 1592267 1463221 1495371 1555541 1690952 1555126 1463430 1729661 1501490 1335133 1351759
9229 1351759 1598778 1582944 1495408 1811625 1698831 1485123 1452569 1618626 1325379 1418443
9219 1418443 1508848 1793331 1838647 1900691 1864249 1663350 1607325 1621698 1724778 1836232 1826619
9208 1826619 2049447 2044844 1967050 1772534 1868981 1908053 1918364 2224661 2133365 2043766 2233025
9197 2233025 2272573 2318268 2363090 2532064 2337391 2444064 2457539 2563385 2666743 2783155
9187 2783155 2884204 2866605 2817491 2534407 2449945 2865667 3251579 3346965 3228159 2903878
9177 2903878 2891705 2913485 3215865 3130479 3059538 3266579 3458355 3329997 3198364 3305081
9167 3305081 3371169 3247647 3403252 3565727 3300447 3404088 3613353 3519066 3346223 3301107
9157 3301107 3446984 3548302 3407513 3257193 3265474 3163634 3142578 3278728 3613685 3597028
9147 3597028 3551004 3428052 3700845 3820430 3852747 3679526 3669180 3828212 3804119 3688875
9137 3688875 3873769 4114708 4040573 4361928 4082871 4012242 3945643 3790757 4062592 4181715
9127 4181715 4262129 4218326 4157868 4144120 4200752 4330225 4523463 4513318 4569112 4358131 4487384
9116 4487384 4660861 4851361 5102004 4959819 5210225 5461572 5277772 5414848 5384832 5073651
9106 5073651 5091667 5206156 5378260 5795728 5568062 5739610 6015189 6068102 6110998 6190655
9096 6190655 6321595 6536583 6606983 6301654 6603073 6963039 7172123 6951470 6875472 6970213
9086 6970213 6995206 7136492 7706429 7511012 7453258 7540611 7632950 7679779 7892893 8055542
9076 8055542 8129158 8301362 8431727 8660484 8711204 9043022 9249588 9310537 9614509 9478599
9066 9478599 9545379 9551079 9455547 9720800 10011888 10257871 10083827 10011512 10153674 10008278
9056 10008278 9816555 10017408 10147241 10052995 9818952 9845243 9826590 10025615 9907682 9858718
9046 9858718 9941365 9803673 9913642 9908776 10048178 10056466 10058962 10262007 10193238 10106759 10120316
9035 10120316 10195899 9936666 10150042 10219627 10204199 10349022 10465250 10430219 10396260 10558896
9025 10558896 10614795 10600035 10668057 10824666 11142627 11315499 11487596 11693747 11667627 11988835
9015 11988835 12101848 12318526 12610925 12872968 13103342 12951200 13336711 13808424 13878768 14180115
9005 14180115 14423097 14708764 14882413 15015584 15542922 16089070 16450785 16936099 17141287
8996 17141287 17406718 17845395 18345325 18658188 19049877 19620294 19936246 20617349 21128525
8987 21128525 21609287 22135542 22512235 22948831 23530797 23993248 24179270 24743453 25095046
8978 25095046 25480188 25917583 26297656 26699217 27191690 27369937 27812263 28719491 29387215
8969 29387215 30345318 31272343 32241735 33237613 34446423 35882794 37258019 38781652 40236587
8960 40236587 41468477 42805687 44472248 46355240 48034135 49557366 51640346 54092167
8952 54092167 56775670 59695286 62982281 66332191 69446859 72782511 75772315 78571489
8944 78571489 81358407 83212434 84795491 86133576 86633008 86619037 86131530 85133464 84082836
8935 84082836 82207510 80661264 79095468 78234300 77392113 77205837 77909094 79230838 80242109
8926 80242109 81348732 81646194 79372248 75895484 71704191 67540365 63701498 60175680
8918 60175680 56046358 52408626 49404377 46618211 43991519 41973765 40094938 38679591
8910 38679591 37503030 36716390 35615140 34821539 34128088 33541933 33231669 32901275 32730198
8901 32730198 32256106 32030615 31983623 32007075 32125404 32203502 32265832 32458659 32294756 32175092
8891 32175092 31975754 31856083 31477294 31180799 30994833 30337964 29779672 28957342 28745069
8882 28745069 28632533 28020406 27560388 26968025 26367233 26201070 25888946 25387951 25069034
8873 25069034 24527434 23991625 23817833 23617863 23521300 23196311 22621414 22047616 21560780 20944516
8863 20944516 20747391 20320403 19717418 19143211 18708954 17851320 17922567 18216881 18021186 17656932
8853 17656932 17218234 17051402 17049183 16654426 16558482 16480039 16072467 15794702 15478183 15719171
8843 15719171 15623407 15572407 15269558 15052878 14821660 14615817 14340232 14228377 14144104 14458661
8833 14458661 14439324 14059591 13930494 13860509 13668936 13676511 13664649 13444336 13194931 12911824
8823 12911824 12638679 12297513 12386846 12555784 12370816 12293950 12239671 12131925 12347160 12333408
8813 12333408 12363974 12386511 12476403 12590497 12655456 13002096 13037203 12985513 13431769 13517382 13395895
8802 13395895 13746088 14260599 14605436 15109443 15279782 15689345 16142472 16696782 17038276
8793 17038276 17437158 17830141 18359780 18964610 19398010 19892082 20927443 21762160 22665758
8784 22665758 23907731 24889540 26323704 27791127 29669545 31889120 34079003 35706009
8776 35706009 37014849 38034041 38267225 37943880 37426425 36252145 35222583 33937040 32890955
8767 32890955 31855313 31098027 30373939 30133967 29971038 29725905 29460372 29466238 30080333 30702771
8757 30702771 30861877 31213853 31602733 32126083 32167467 32002585 32467014 33233958 33802254 34860741
8747 34860741 36011345 37612254 39523858 41539593 44349747 46957967 49872774 52660350
8739 52660350 54649543 56027445 56330917 55736340 54270674 52008344 49553763 46750958
8731 46750958 43912518 41505358 39505040 37301571 35859866 34536285 33213237 32394800
8723 32394800 31697363 31072988 30512586 29849286 29440688 28655110 27568986 26393463 25468477
8714 25468477 24456282 23149195 22034979 21232123 20544607 19836140 19168850 18377964 17511599
8705 17511599 16793036 16303005 15701764 15375942 15146370 14904211 14812954 14357540 14201662 14231235
8695 14231235 13705489 13733612 14194986 14222253 13992493 13976099 13987771 14225130 14560424 14591499
8685 14591499 14710562 14681034 14861647 15103895 15503245 15462087 15716798 16157575 16278135 16938183
8675 16938183 17363502 17498606 17681312 18139142 18573858 18699858 19138554 19853863 20424192
8666 20424192 21121732 21669208 22078471 22910326 24046291 24943522 26016021 27007688 28385855
8657 28385855 30056462 31475625 33216599 35169299 37488092 39872740 42628565 45481609
8649 45481609 47990254 50177480 52280614 54263236 56028089 56978389 57970556 58820327 58724789
8640 58724789 58656671 57727748 56530081 55193161 53087951 51253377 49657468 48073403 46380823
8631 46380823 44769787 43714170 43085654 42264418 41359781 40582842 40330470 40086401 39744208
8622 39744208 39752237 39749957 39444925 39585673 39616417 40015702 40237006 40413545 40974271 41750217
8612 41750217 42458549 43011670 43376272 43588104 43786677 43898167 43942745 43781298 43193765 42563825
8602 42563825 41766290 40875435 39669979 38055455 36509357 35032311 34078284 32882722 31719055
8593 31719055 31033455 30227110 29299898 28791153 28096180 27392924 26699565 25909601 25379054
8584 25379054 24696852 23894255 23281119 22791038 22165450 21252059 20148211 19298404 19639575
8575 19639575 19335271 18876311 18448464 17985409 17561223 17444791 17398613 17165476 17310208 17201061
8565 17201061 17317108 17051945 16980683 16757628 16413599 16661241 16497840 16064204 15762937 15781845
8555 15781845 15336663 14985062 14543555 13974185 13348133 12680754 12168640 11781154 11482065
8546 11482065 10857901 10471821 10155167 9833089 9787786 9412448 9167520 9019396 8886631 8648920
8536 8648920 8397550 8434202 8635503 8487684 8402613 8311515 8412065 8407207 8460439 8604453 8605931
8525 8605931 8825543 8904584 8774972 8880047 8881391 8862421 8294235 7926062 7700318 7762246
8515 7762246 7687585 7104612 6781553 6479988 6347144 6256638 5914390 5612680 5144347 4934459
8505 4934459 4761970 4413694 4224654 4062714 3966133 3739283 3424572 3075279 2943575 3184624
8495 3184624 3174903 3011589 2974430 2718061 2662383 2349624 2460478 2529761 2343208 2176917
8485 2176917 2144213 2144080 2042321 1964007 1901817 1819428 1886883 1923275 1889240 1905273 2002099 1516239
8473 1516239 1628129 1710450 1923047 1722979 1679869 1779225 1729300 1549477 1419138 1519529
8463 1519529 1481577 1511778 1480444 1533244 1151612 1027121 944348 995941 1155084 1030625 1089725
8452 1089725 986729 1167705 1248306 1197978 1161966 1211260 1165838 948609 759684 917217
8442 917217 697015 732465 892220 1015807 1054520 584095 806545 820452 864169 781518 729399
8431 729399 771361 600755 694994 511292 304493 441420 789754 826451 851514 1060437
8421 1060437 611265 462801 630430 468433 451421 493540 311256 367096 272087 434953
8411 434953 467985 261412 508733 576975 535802 290926 234792 148432 23261 72246 238391
8400 238391 484965 468519 165730 222205 150165 184785 347710 329538 474492 693419 823383
8389 823383 454650 130941 165768 211215 357771 336329 374549 349031 527727 603013 659609
8378 659609 570374 406785 391624 506944 551567 198909 366231 196520 158040 -53605
8368 -53605 -32555 237291 200471 123800 405118 487885 537434 437906 260469 190971 -62851
8357 -62851 303611 160007 -31958 175114 328021 290357 4212 -230958 -146143 361894
8347 361894 215505 199608 -19123 76271 11432 -285957 -107178 69614 -134322 -52191
8337 -52191 -165886 -188914 249277 423289 332917 270058 56813 151894 113892 10885 -73823
8326 -73823 -25348 16432 -38712 -88565 73563 139452 196065 229204 -29250 95084 188031
8315 188031 137505 158092 -63264 52685 -173898 -246293 -6076 44049 235714 128018
8305 128018 111397 211242 444368 243403 347894 431146 232323 41245 91031 429503
8295 429503 709878 668491 331394 174065 139299 498376 658267 362812 250374 -766
8285 -766 44939 1210 156755 186498 146774 83288 -186815 36053 96678 142746 295747
8274 295747 304463 143006 -107484 -80221 -139593 -64041 -128624 180911 53167 -151244 -206776
8263 -206776 -124899 -96256 59868 318550 527292 587498 572554 347782 414657 265484 275423
8252 275423 579096 830766 646795 756584 843372 537712 619760 638652 653739 674710 662400
8241 662400 691116 482241 304326 183321 157304 -103446 -121213 -98159 25874 382259
8231 382259 479993 454344 234003 126598 148202 374792 131195 17560 163631 336774
8221 336774 206826 -144186 -138994 183661 14958 -40552 124590 10080 -71230 98645
8211 98645 151334 488661 91199 -53642 129697 490219 318784 138493 73342 394098
8201 394098 242400 -28871 -549132 -360582 -714765 -686523 -1207440 -1258557 -4084091 -3164089
8191 -3164089 1940528 1410724 1329945 923578 840281 479337 521847 508465 664954 517001
8181 517001 607205 628735 526245 574659 601352 177012 147716 255617 245041 374410 336068
8170 336068 -24691 -73539 -10767 296606 310138 194596 410056 243591 454237 427009
8160 427009 64807 153809 150933 197368 39636 368799 643688 352899 275104 381443 420326
8149 420326 196547 343990 243138 352089 487530 355329 352547 352363 286131 196273 -90100
8138 -90100 142266 398106 461285 424699 477442 317997 248406 277825 491776 160979 210099
8127 210099 207580 144458 61693 284492 235654 219621 217487 169966 400371 775638 892789
8116 892789 403985 88397 62017 162893 349209 501476 362080 505524 391327 487206
8106 487206 327472 -100663 -107182 -3128 83522 248369 216213 364464 486711 452215 307487
8095 307487 18559 91039 230714 370742 381287 423692 365389 451194 558562 439951 196786
8084 196786 364855 320951 395326 333570 464298 361515 28525 45482 155238 -10622
8074 -10622 134326 222120 239683 238872 236054 363216 456621 251306 203260 557856 367978
8063 367978 143197 151861 163654 239260 323847 109813 267547 325319 418452 135626 144813
8052 144813 196481 264953 325287 372052 221440 470955 482354 486558 409107 278192 18105
8041 18105 173602 375738 339211 252092 266672 376499 620363 600913 247350 243924 353021
8030 353021 298157 247176 470221 376409 456620 332936 343216 448473 505314 422358 374443
8019 374443 291799 179771 262656 379332 244274 271529 350137 433829 190222 59856 328300
8008 328300 18718 218121 398025 561525 682678 421112 373794 422680 402121 519351
7998 519351 557206 296872 342468 344733 331852 589918 636429 505621 532550 660293 608200
7987 608200 426606 500093 494378 631668 513292 219006 385055 241098 97529 -109990
7977 -109990 28969 437823 566186 525068 654548 604138 311041 275365 278751 401842 374103
7966 374103 264684 509337 449955 363580 350236 355749 340112 516310 514794 429435 356113
7955 356113 248800 501911 350883 220289 93626 195947 408199 345952 536912 464114
7945 464114 616468 874211 624065 650877 604249 383435 310551 304884 564985 618950 449723
7934 449723 367663 729768 636810 609350 644608 673400 635475 364831 613198 612100 727029
7923 727029 730825 701053 425420 412461 397903 446640 564693 535999 317926 371537 637571
7912 637571 603441 536834 396508 277804 362334 346296 413531 504662 568632 638059 650870
7901 650870 577927 491421 530958 682465 491612 321857 421773 401811 432396 382658 403640
7890 403640 847617 890451 618182 415983 467208 594457 720643 875102 912846 913667 1028437
7879 1028437 942006 772333 734745 552113 379821 607755 498358 444760 747099 939597
7869 939597 887409 697735 785190 885513 888401 840383 405884 248232 303047 396615 387653
7858 387653 670006 800683 641885 703368 858186 973135 830084 391337 459875 527881
7848 527881 849624 943357 621743 568277 270968 553504 688995 594116 522723 823343
7838 823343 951352 817172 734845 601601 761461 1015326 801730 624255 448610 273526
7828 273526 296439 282814 344661 319080 435728 725089 753467 610243 431926 521848 699350
7817 699350 651066 770267 623319 776681 952662 747650 777949 887678 787894 1235507
7807 1235507 2011833 701861 778389 932616 825850 805759 1022446 1244193 933412 699357
7797 699357 905548 838050 724456 598208 800143 820408 751860 937379 724722 447040
7787 447040 373783 583585 680791 784375 800923 760214 1027397 1027808 1107893 1197181 847817
7776 847817 763438 814556 687802 681992 969465 823600 798091 730242 721458 749972 714307
7765 714307 1010746 893881 909762 1124343 968627 920991 1083813 1349872 928075 1113145
7755 1113145 1054882 932792 1192487 1142160 1219683 1311383 1154218 1245584 1080782 908691
7745 908691 777474 701553 898708 787621 887349 880311 670378 927240 992286 936722 856188
7734 856188 1113625 1000253 927695 1072679 1221698 1160270 960403 810949 1057746 1094868
7724 1094868 1023857 1103469 1206114 737499 790023 949498 925521 1148575 1104771 963238
7714 963238 949563 928006 1048347 1175008 938524 1002482 1201247 1153392 1052035 1169061
7704 1169061 1285298 1239365 1043620 1187629 1103364 1244304 1178745 1165701 1058498 921282
7694 921282 1003833 928521 838710 1200994 1268438 1295043 979434 881489 1178094 952993 895277
7683 895277 998308 1212211 1249225 1150809 934656 1186427 1222259 1263578 1012770 929194 1400572
7672 1400572 1504248 1301992 1304612 1276123 1187758 1485079 1560288 973874 1015568 1187023 1007429
7661 1007429 1054978 1165569 1288852 1165756 1080355 1194808 1114695 871882 963235 1064127
7651 1064127 951652 1020548 1002736 902871 683573 708968 972410 1125325 873134 670669
7641 670669 898754 839653 613831 814607 1206414 1095787 1032642 1358823 1051859 1050960 1261680
7630 1261680 1375230 1477340 1109930 1193662 1091033 1197383 1247362 1322378 1161403 1224527
7620 1224527 1097243 1012411 926878 1016414 1131457 1211197 1180093 1199544 1200722 1155539 1015668
7609 1015668 964000 1124926 1134389 1106165 1344322 1372674 1647516 1434585 1111418 1102049 1176923
7598 1176923 1318226 1244162 1306215 1234174 1246805 1104645 1146354 1135802 1161372 1072248 1337616
7587 1337616 1404685 1152830 1239063 1368761 1411155 1340132 1346360 1294431 1238417 1188898 1022874
7576 1022874 1220284 1454441 1389759 1185731 1151686 1227061 1156207 1302264 1395429 1416285 1121489
7565 1121489 1195843 1317068 1105403 1168697 1353270 1509292 1426664 1408090 1238184 1299782
7555 1299782 1466039 1570471 1598094 1430191 1485682 1666897 1433096 1406910 1594359 1630392
7545 1630392 1422849 1359265 1684717 1519064 1427814 1408963 1577824 1786793 1711906 1756294
7535 1756294 1733788 1819291 1684054 1630694 1724408 1900727 1656567 1599792 1676755 1478124 1612360
7524 1612360 1310986 1269789 1312332 962029 1005315 958681 1215925 1566989 1588031 1527866 1691431
7513 1691431 1611436 1542360 1418752 1453368 1634165 1357373 1140211 1264808 1147311 1256508
7503 1256508 1386094 1414698 1484350 1292500 1505734 1761826 1547825 1288702 1277477 1414603
7493 1414603 1477758 1521161 1247161 1623541 1794684 1688260 1807581 1649874 1707307 1877827
7483 1877827 1652393 1713758 2069572 1939982 1393376 1406548 1663967 1805283 1822204 1780864
7473 1780864 1621664 1538320 1626492 1481111 1559586 1714954 1707550 1574476 1558478 1503124 1559380
7462 1559380 1616984 1614380 1483322 1569145 1473449 1696422 1545949 1680532 1733166 1771847 1854443
7451 1854443 1870042 1677346 1671051 1799949 1539104 1496027 1553727 1735789 1805728 2005631 2270519
7440 2270519 2250831 1971741 1995219 1878225 1799005 1742355 1893740 1865569 1821134 1969424 1873584
7429 1873584 1563189 1456032 1497897 1591262 1623886 1806055 1858962 1798022 2021663 1886625
7419 1886625 2190284 1993598 1857017 1990701 2119192 1896027 1778405 2016212 2279282 2254545
7409 2254545 2166824 2261451 2055902 2054471 2286970 2038500 1799935 2191356 2205711 1875200
7399 1875200 1915853 1864703 2152049 2345520 2287698 2377036 2108395 1827694 2137402 2336062
7389 2336062 2247802 2241977 2374131 2330014 2076673 2177635 2268625 2435772 2376190 2132835 2118939
7378 2118939 2580861 2702780 2608122 2698641 2860150 2826023 2651987 2728904 2686783 2913429
7368 2913429 3187831 2916847 3198539 3453197 3289579 3493648 3643686 3360100 3278478 3525432
7358 3525432 3618424 3544229 3905297 4169161 4021696 4285420 4217779 4027763 3853147 3843585
7348 3843585 3924997 3900788 4010057 3853185 3624788 3354789 3470852 3316411 3059098 3089606
7338 3089606 2752209 2704433 2530041 2434693 2614308 2933720 2955910 2666990 2608699 2440266
7328 2440266 2578911 2621321 2725996 2738004 2752757 2852363 2775593 2614014 2623944 2602142 2500421
7317 2500421 2625212 2532528 2333491 2525533 2586104 2491599 2401016 2501366 2535323 2586561 2628448
7306 2628448 2628392 2647243 2575197 2282925 2501430 2731382 2753403 2772382 2575688 2583807 2588759 2603114
7294 2603114 2615750 2626070 2742587 2640179 2608614 2601371 2806386 2916447 3140171 3228020 3151502
7283 3151502 3198102 3188189 3430879 3498923 3485620 3605989 3688727 3799934 3993186 4096371 4255034
7272 4255034 4214886 3925127 3907934 3818776 3835911 3738601 3741566 3975827 3630083 3607562 3188766
7261 3188766 2927614 2932527 3353847 3138356 3006324 2898835 2997595 3121237 3032885 2982225
7251 2982225 2958303 2990192 2751046 2835165 2983688 3012404 2900772 2888933 2835086 2962444 3140486
7240 3140486 3280265 3059162 2982982 3196397 3163972 3210710 3172117 3323703 3421238 3242093
7230 3242093 3380041 3560189 3564680 3333932 3384434 3282679 3302408 3404935 3498928 3860594
7220 3860594 3731421 3725000 3632878 3530611 3440290 3391100 3362180 3225802 3272157 3494364 3707158
7209 3707158 3664668 3733253 3849278 3960086 3547403 3672198 3804487 3637982 3992163 3902347
7199 3902347 3770904 3565014 3639172 3795106 3783420 3556608 3673204 4005509 4129619 4207111
7189 4207111 4240610 4289868 4515234 4500699 4610847 4653504 4590553 4953134 4819345 4801993 4917022
7178 4917022 5183940 5342632 5513187 5403577 5712267 5857477 5960233 6338348 6766814 7028716
7168 7028716 7011493 7362535 7677132 8250266 8848642 9234785 9433103 10072992 10658445 11367959
7158 11367959 12237745 13191345 14078843 15261711 16554274 17611537 18681487 19971765 21390683
7149 21390683 23343531 24997617 26940632 29276392 31945966 35431767 39539799 44746234
7141 44746234 50806120 58194596 67000231 76543543 85864120 94474919 97236672 94041210
7133 94041210 87382028 80015033 72853849 66190053 59627182 52090459 45554525 40221799
7125 40221799 35676143 31883329 28973121 26125712 23644306 21960485 20242212 18453656
7117 18453656 17077177 15920252 14826489 14074444 13007188 12052074 11291781 10811522 10283863
7108 10283863 9537332 8865278 8501047 8219263 7916797 7646672 7084082 6758435 6851479 6711668
7098 6711668 6355654 6297784 6000259 5685395 5729036 5592163 5460912 5261723 5138490 5212579
7088 5212579 5054205 4773205 4769492 4338169 4231023 4529192 4339436 4451442 4107558 4230883
7078 4230883 4362865 4408722 4434277 4546786 4524097 4354534 4334984 4485494 4425229 4506971 4509885
7067 4509885 4519904 4712296 4908498 5010147 5016435 5246385 5298988 5393311 5277482 5046534
7057 5046534 5447591 5318382 4969477 4826737 4615154 4619711 4379413 3931277 3801532 3807684
7047 3807684 3965524 3882754 3658462 3511535 3441244 3196153 3044419 3129373 3104897 3015235
7037 3015235 3246163 3271092 2977528 2984196 2986327 3218023 3047289 2702021 2718968 2945459 3019437
7026 3019437 3136233 3081545 2866462 2856290 2963424 3051937 3184565 3297859 3186121 3175392
7016 3175392 3551809 3490478 3741390 4076115 4110075 4280179 4341986 4015722 4023274 4173400
7006 4173400 4070143 3893885 3837271 3632566 3389653 3252883 3116747 3503276 3372131 3177792
6996 3177792 2951274 2669253 2673229 2499144 2384930 2357899 2613127 2671870 2491707 2303267
6986 2303267 2428069 2522513 2519246 2455348 2488346 2277458 2194273 2233353 2182476 1970172 2075759
6975 2075759 2321043 2281313 2089803 2166819 2191129 1864282 2039363 2061417 1962828 1784578
6965 1784578 1628998 1553346 1475285 1575402 1659422 1668467 1615944 1414162 1543464 1551855 1645200
6954 1645200 1885548 1827204 1768468 1850534 1620418 1942786 1939868 1696659 1501076 1367966
6944 1367966 1595225 1731209 1960799 2028310 1757021 1692952 1941394 2162829 2254964 2142970
6934 2142970 1906612 1975738 1940212 1776056 2059468 2259513 2097296 1789729 1900089 1911303
6924 1911303 1871019 1782978 1722517 1594573 1426372 1479175 1702865 1582618 1270949 1518426
6914 1518426 1426334 1483481 1259671 1294619 1545628 1695805 1629550 1467667 1557135 1271660
6904 1271660 1168510 1120100 1425931 1634814 1657934 1735558 1708053 1644349 1715631 1611202 1608240
6893 1608240 1854693 1941055 1740434 1748626 1851909 1561803 1475413 1715657 1848162 1903909
6883 1903909 2266249 2126832 1699734 1884032 2017659 1887669 1786828 1868068 1900460 1931094
6873 1931094 1634902 1615785 1675973 1879411 1946960 2218335 2128027 2011379 1963018 1830096
6863 1830096 1930726 1885305 1867669 2096646 2216060 2135596 2108302 1821114 1783418 1992832
6853 1992832 1747656 1576354 1809558 1893404 2248655 2107507 1985647 1779969 1938942 2023779
6843 2023779 1788091 1514389 1467040 1599365 1618845 1687324 1670941 1701788 1866878 2041276
6833 2041276 1750241 1518607 1535085 1639061 1786460 1702610 1715935 1528388 1737245 1918247
6823 1918247 1695483 1715626 1839356 1859118 1947648 1862380 1735456 1929024 1695792 1634756
6813 1634756 1729066 1643334 1542285 1761398 1615113 1387589 1874652 2262973 2101922 1986368
6803 1986368 1755446 1731761 1852178 1839793 1772022 1680610 1587150 1438513 1821334 1949344
6793 1949344 2000537 1857666 1983813 1955920 2005182 1988170 1669749 1692559 2034018 2158065
6783 2158065 1878588 1695225 1781112 1826445 1590201 1516463 1616599 1767506 1734258 1725990 1927759
6772 1927759 1972386 2016666 1947923 2037464 2092527 2161008 2223888 1979797 2123624 1943177 1965713
6761 1965713 2329316 2456110 2197079 2152431 2265287 2270650 2099807 2205327 2200718 2134218 2380351
6750 2380351 2510317 2460364 2200169 2406241 2077907 2250488 2577451 2376956 2477018 2185010
6740 2185010 2210933 2343549 2438352 2529210 2591673 2701461 2902043 2970025 3011916 2981975 3174215
6729 3174215 3333597 3074354 3128940 3138950 2952034 2993646 2996749 3188011 2760346 2695760 2861063
6718 2861063 2683574 2656559 2605832 2654044 2719847 2778437 2657572 2626396 2737314 2732086 2351708
6707 2351708 2333232 2497105 2483721 2458695 2733377 2850002 2883500 2996753 3104053 3366348
6697 3366348 3364451 3374955 3226558 3270092 3047224 3024340 3028426 2945312 3102575 3094262 3103478 3190673
6685 3190673 3319030 3420091 3290642 3105870 3196284 3168159 3272415 3349144 3455023 3416306
6675 3416306 3707362 3569361 3468314 3423347 3652612 3743130 3661264 3672589 3696661 3895338
6665 3895338 4072166 4028135 4035031 3760857 3561534 3616202 3744309 4066137 4232443 4282863
6655 4282863 4137090 4199894 4027093 4046815 4241761 4399707 4381961 4375859 4372444 4408235 4399967
6644 4399967 4683935 4737197 4726521 4724908 4625094 4740116 4870420 4775188 4785217 4531122 4564806
6633 4564806 4680376 4716653 4950368 5278988 5496644 5409981 5516117 5709629 5687131 5163152
6623 5163152 5330327 5617614 5929215 5773354 5808917 6081451 6074523 6002915 5911063 5865800 6203625
6612 6203625 6547161 6617307 6836481 7198164 7229092 6877973 7069747 7351279 7568747 7775050
6602 7775050 7790198 8012165 8370241 8747186 8830549 8719206 8988238 9393935 9591848 9593117
6592 9593117 9738397 10196424 10484472 10602551 10931137 11108748 11490716 11664708 12062535 12626956
6582 12626956 13349699 13985224 14217099 14531286 14729033 15543712 16365416 17009180 17788981
6573 17788981 18544157 19225649 20351984 21398352 22707881 23864806 25019517 26619865
6565 26619865 28027127 29540645 31371419 33613602 35701439 38113923 40621152 43474113
6557 43474113 46438241 49781905 53303140 57965101 63108173 68776887 75027636 81997994
6549 81997994 89552854 97833745 106540952 114468006 121113692 125574143 127232968 126257907
6541 126257907 122937839 118136237 112514414 106562202 100530465 94716291 89171904 83849604
6533 83849604 79548949 75243608 71293027 67918651 64468296 61438013 58842886 56388829
6525 56388829 53982814 51912356 50471620 48892572 47750795 46844921 46075653 45273698 44932529
6516 44932529 44786290 44810588 44508057 44324062 43637642 42783253 42052498 41070685 39653911
6507 39653911 38349835 36961455 35681413 34297060 32477230 31022575 29673229 28510425
6499 28510425 27557143 26682807 25531193 24533422 23615191 22653229 21598469 21021988 20318120
6490 20318120 19670252 18969394 18137246 17629588 17280860 16754082 16005741 15659220 15219915
6481 15219915 14419781 13772004 13433633 13000117 12802557 12585594 12239952 11607080 11347377
6472 11347377 10995590 10680284 10490407 9935078 10145233 9736849 9429652 9288333 9083090
6463 9083090 9110626 8980110 8757504 8423467 8321096 8095158 7731863 7788583 7482259 7154797
6453 7154797 7232896 7420795 7229662 6794285 6723465 6677677 6563696 6516234 6167166 6013283
6443 6013283 6132789 5939972 6007097 5906349 5830044 6047624 6180678 6094289 5862389 5554111
6433 5554111 5468574 5610875 5666814 5694308 5670431 5954056 6006568 5759348 5924355 5819722
6423 5819722 5900164 5845809 5756058 5955973 6160620 6089727 5967286 5820634 5900724 6180320
6413 6180320 6092027 5989238 5974502 6007737 6444435 6418899 6077708 6421371 6287121 6394908
6403 6394908 6155042 6143248 6380127 6552153 6495914 6420828 6508524 6560008 6581121 6654136 6632094
6392 6632094 6475617 6595691 6735684 6687023 6979261 7044281 7065341 7139294 7362666 7183459
6382 7183459 7188427 7415767 7145583 7092221 7179887 7226285 7271021 7465076 7678685 7679710 7727713
6371 7727713 7647281 7507358 7385796 7591667 7873400 7874535 7954485 7940080 8155757 8290415
6361 8290415 7928886 7839156 7717202 7526982 7813488 7976243 7882870 7608652 7762304 7608678
6351 7608678 7723880 7763171 7675257 7608107 7663040 7641581 7667881 7562103 7746665 7749562 7511360
6340 7511360 7432429 7577224 7698749 7670485 7524470 7687164 7754096 7772627 7627065 7557300
6330 7557300 7380151 7216543 7193833 7119864 7099694 6929512 7038647 7176348 7233353 7162854
6320 7162854 7198731 7037184 6949268 7141692 7229798 6780590 6670097 6839881 6669803 6811731
6310 6811731 6610923 6782272 6771310 6660638 6587701 6584190 6640149 6365174 6270845 6145551 6124800
6299 6124800 6069345 6210148 6218267 6173290 5922429 5956113 5796074 5449976 5558164 5314912
6289 5314912 5448135 5447508 5454335 5271097 5140342 5334663 5315629 5123426 5044560 5063232 4983900
6278 4983900 5071789 4940661 4883975 4743903 4783851 4738560 4620537 4417347 4630392 4506303
6268 4506303 4445044 4324928 4430080 4495916 4698977 4735479 4638506 4700735 4722425 5035264 4669482
6257 4669482 4579098 4641204 4542913 4555566 4442184 4608420 4603682 4637049 4376837 4450992 4739680
6246 4739680 4576778 4803112 4944122 4889385 4862145 4617432 4556413 4687287 4758430 4688662
6236 4688662 5071458 5015083 4961356 5069730 4789630 4743828 4758550 4666937 4765507 5077264 5119108
6225 5119108 5204892 5132738 5024510 4985086 5002553 5126332 5082943 5254351 5227642 5233481 5282956
6214 5282956 5406714 5571855 5777043 6016043 6051792 6153568 6181443 6173661 5905618 6028791
6204 6028791 6069717 5804732 5762558 5692087 5457681 5534177 5813348 5896997 5809915 5711475 5350347
6193 5350347 5202064 5435422 5329050 5088612 5072879 5317822 5306781 5181181 5148721 5027205
6183 5027205 5569804 5979367 5748900 5794018 5780338 5552340 5565200 5653686 5816503 5723557
6173 5723557 5602530 5548691 5745481 5865013 5882714 5664242 5675740 5563559 5590313 5542496
6163 5542496 5366878 5510606 5646326 5744990 5808467 5473613 5331261 5524243 5573787 5528308
6153 5528308 5452200 5661311 5685618 5955272 5974423 5995037 6016920 5859380 6011968 6174241
6143 6174241 6306935 6099482 5982252 6252711 6374134 6367605 6473981 6335611 6388429 6727330
6133 6727330 6924453 6626173 6257941 6295245 6568352 6679753 6830131 6842579 6799899 7179388
6123 7179388 7041645 7057468 7256426 7312865 7256893 7225810 7440497 7632762 7740105 7695748
6113 7695748 7980309 8367257 8466218 8398228 8542468 8563353 8793838 8955402 8657299 8815881
6103 8815881 9187988 9566319 9823654 10234052 10532179 10868883 11023490 11370526 11807116 12446612
6093 12446612 12963542 13256120 13835355 14271902 14676822 14876184 14633874 14421452 14543283
6084 14543283 14322771 14012796 13533473 13417545 13170519 12652799 12281307 12187472 11888196 12103144
6074 12103144 12066140 11777717 11883265 11864170 12281978 12140478 11731905 12291126 12518136 12181330
6064 12181330 12196018 12472788 12712447 13015529 13335672 13505914 13544748 13790454 14240459 14603811
6054 14603811 14941550 14931920 15466624 15907562 16204523 16721499 17392767 17673317 17943070 18461466
6044 18461466 19218886 19769589 20763983 21532015 22315527 23429595 24309229 25303746 26804401
6035 26804401 27975278 29278336 30673156 32040546 33581493 35322265 37249856 39502786
6027 39502786 41740097 44400027 47219089 50229535 53813678 57147916 60487131 64279383
6019 64279383 67433645 69845740 71600438 72476699 72604833 71811485 70139618 68187000 66048816
6010 66048816 63539647 61102244 58463032 56075637 54041549 52317311 50774076 49782005
6002 49782005 48680493 47929294 47375121 47011275 46682412 46429058 46134221 45622889 45172690
5993 45172690 45220031 44978721 44748984 44293585 43691248 43119481 42245643 41286366 40343212 39098952
5983 39098952 37859290 36559356 35119756 33678053 32605674 31264608 30276107 29125463
5975 29125463 27747241 26666803 25720502 24886764 23695573 23051337 22294741 21474057 20810499
5966 20810499 19954800 19565326 19196851 18682582 18386675 17771306 17220854 16690502 16533949
5957 16533949 16136166 15371247 14938148 14909530 14640106 14108149 13716721 13704886 13303295 12781953
5947 12781953 12836323 12610710 12126477 11967145 11961170 11602407 11482737 11336315 11110084 10934293
5937 10934293 10626785 10517175 10135205 9931474 9989618 10054843 9994211 9752364 9641109 9320649
5927 9320649 9294503 9248270 8977725 8751220 8917834 8688212 8387216 8323824 8157042 8436615
5917 8436615 8429881 8419745 8456207 8322032 8183024 8118432 8092414 7777744 7836490 7851156 7985532
5906 7985532 7597696 7555368 7921902 7902466 7652598 7802294 7804573 7554130 7623798 7728732
5896 7728732 7566379 7667303 7638686 7582975 7487378 7657663 7682599 7262191 7499753 7620839
5886 7620839 7503073 7346958 7348502 7183111 7331657 7064196 6921554 6892806 6906268 6800293
5876 6800293 6856381 6651958 6522476 6728620 6599222 6720080 7024473 7094645 7002774 6673435
5866 6673435 6609384 6817509 6945110 6720496 6695604 6614883 6472789 6303480 6614333 6435838
5856 6435838 6516998 6285294 6275309 6251231 5965628 6204400 6212824 6144020 6081743 6046513 6319199
5845 6319199 6126184 6011080 5871293 5975176 5885274 5839951 6012677 5933548 5942198 5920882 5593524
5834 5593524 5197464 5331697 5251570 5321104 5508821 5504669 5305543 5540786 5375131 5342815
5824 5342815 5192140 5334159 5361477 5459269 5436420 5599758 5576247 5287932 5146252 4797336
5814 4797336 4845306 4744945 4795421 4729980 4666472 4663993 4774665 4893677 4801648 4769676 4733801
5803 4733801 4805936 4499490 4783198 4694265 4457145 4435730 4284354 4370913 4483416 4355046
5793 4355046 4441751 4384231 4428600 4387987 4295810 4248411 4372445 4255462 4246592 4382912 4234573
5782 4234573 4232243 4343151 4442536 4056851 4111242 4281078 4302614 4137553 4109622 4112386 3947327
5771 3947327 3827806 3932694 4114071 3880067 3834372 3856008 3923303 3875977 4174120 4176852 4164344
5760 4164344 3954225 3805303 3906688 4178674 4220436 4394866 4359243 4239478 4457383 4574787
5750 4574787 4514518 4583448 4574297 4475442 4708345 4687056 4605365 4428231 4595733 4655309 4744425
5739 4744425 4813552 4947926 4995583 4837699 4987609 4954397 5013339 4616116 4814188 5105078
5729 5105078 5018875 5235133 4978480 5126550 5208861 5198947 5163398 5272370 5017729 4845208
5719 4845208 4752949 5093531 5173051 4940405 4910116 5064029 5248244 5411890 5062425 5247265
5709 5247265 5421325 4972026 4933907 4720592 4793718 4817731 4672522 4794070 4782451 4912769
5699 4912769 4857956 5264902 5415136 4985257 5128027 5347991 5127518 5285765 5396218 5540686
5689 5540686 5317111 5227270 5360735 5717768 5665266 5732802 5904030 5779511 5887183 5888900
5679 5888900 5919678 6082757 6211521 6083970 6163833 6366897 6350409 6172156 6271135 6201128
5669 6201128 5813717 5870378 6093214 6241200 6352315 6061124 6062994 6119383 6074239 5944074
5659 5944074 5880541 5998579 5985683 5881296 6068526 5804186 5889075 5933737 6125934 6067030
5649 6067030 6139080 6430092 6207934 6312182 6446657 6231051 6118086 6061039 6278361 6285855
5639 6285855 6063485 6223597 6099201 6148510 6020179 6058966 6084117 5673300 5815914 6161822
5629 6161822 6222732 6333293 6112046 5908410 5964795 5868001 6107473 6143572 6345834 5834538
5619 5834538 5742071 6078455 6142847 6341477 6493774 6387581 6355239 6427193 6381161 6470947 6525069
5608 6525069 6466999 6471084 6671506 6712206 6610385 6867467 6992396 6954643 6945011 7009466 7121920
5597 7121920 7297477 7618917 7670915 7986440 8069999 8085350 7970708 8157374 8280540 8683010
5587 8683010 8814225 8886391 8932664 8829293 8993500 9267233 9447512 9607485 9418383 9555657
5577 9555657 9915090 10033544 10340726 10259736 10422037 10847110 11251148 11342461 11393212 11359775
5567 11359775 11654037 11924893 12113445 11907380 11782598 11862005 12075978 12097245 11944046 12001519
5557 12001519 12019839 12098536 11924830 11739099 11491529 11400705 11261217 11335517 11328536 11262995 11377088
5546 11377088 11196651 11160979 11035645 11142642 10993596 11047601 10922073 10960885 10978564 10950209
5536 10950209 10934606 10793486 10646942 10675561 10513965 10238254 10078923 9959645 9787670 9539338
5526 9539338 9488946 9349201 9025922 8767861 8913447 8690497 8402131 8104671 8021652 8018438
5516 8018438 7970909 7814876 7727086 7794688 7865195 7759298 7721695 7506908 7842304 7837933 7590694
5505 7590694 7576928 7597632 7722409 7837202 7619749 7484056 7342264 7388570 7417673 7325571
5495 7325571 7324066 6883817 7016636 7086363 6972093 6987377 6860809 6738883 6872388 6867264 7169360
5484 7169360 7344822 6652461 6538300 6513196 6654958 6561557 6523309 6577972 6805366 6478662
5474 6478662 6179059 6225609 6070955 6179704 6378678 6371038 6347235 6199962 6341497 6250324
5464 6250324 6012385 6115280 6079567 6003063 6033761 5878901 6018249 6206180 5889954 5820094
5454 5820094 5858987 5795717 5644174 5782008 5903403 5744170 5693423 5844165 5749523 5663092
5444 5663092 5564100 5840589 5881311 5794455 6072062 6110050 6163121 6009812 6143461 6243451 5998142
5433 5998142 5907210 5907836 5942137 5777454 5868311 5942376 6226570 6142758 6063648 5846488 5772645
5422 5772645 6055135 6127957 6134099 6227629 6077802 5950914 5985475 5941914 5689662 5890457 5917587
5411 5917587 6191428 6243990 6011352 6190669 6176035 6035370 5915770 5989707 6296827 6202860
5401 6202860 6304627 6423724 6357057 6278203 6245600 6200857 6461417 6366854 6357593 6356346 6229147
5390 6229147 6215157 6088537 6054865 6123138 6360434 6434110 6576276 6724707 6820180 6789386 6726497
5379 6726497 6480360 6595688 6487849 6681144 6792520 6911574 7034976 6993175 7024114 6886963
5369 6886963 6709624 6697030 6796812 6803935 6867888 6845193 6742081 6814710 6720519 6830405 6874897
5358 6874897 6765374 6748464 6966740 7461160 7574283 7541826 7261438 7261203 7184111 7220301 7160891
5347 7160891 7126069 7471026 7537989 7612179 7455826 7523808 7742972 7948835 8173798 8284977
5337 8284977 8245913 8261111 8317734 8254546 8194873 8347534 8511339 8713071 8362091 8407188 8615074
5326 8615074 8744072 8766400 8756399 9002271 8877366 8962475 9188942 8917189 8927504 9002939
5316 9002939 8946905 8993550 9267278 9573478 9238470 9126132 9288098 9182425 8991501 8991274
5306 8991274 9237569 9255047 9315049 9061200 8993632 9253328 9096912 9238724 9228626 9160874
5296 9160874 9115837 9094782 8985493 9010525 8999636 9004480 9031356 8928747 8846208 8903984 8943191
5285 8943191 8890643 9170315 9152717 9140991 9286435 9030455 9055109 9010660 8969945 9186323 9458181
5274 9458181 9373786 9561658 9661384 9783033 9877908 9927052 10052647 9994836 9939741 9934357 10168417
5263 10168417 10413581 10750972 10494797 10593715 10827364 10796784 10651990 10642129 10659105 10405030
5253 10405030 10502263 10683602 10602437 10776221 10720196 10572934 10456040 10494855 10735187 10952545
5243 10952545 10607986 10664802 10758333 10865230 10864259 10866151 10923086 11036495 10886937 10890507 11037278
5232 11037278 10901705 11165862 11206970 11455724 11398022 11561967 11549141 11523184 11423849 11420992 11400555
5221 11400555 11548128 11653913 11632468 11825609 11714607 11667290 11883238 11974361 12132093 12010221
5211 12010221 12140510 12595608 12364435 12442091 12504139 12677132 12791786 12943282 13373244 13758688
5201 13758688 14027454 13880617 13938810 14017300 14291294 14598947 14899560 15185423 15188590 15256322
5191 15256322 15497132 15568305 15620973 15726337 15770876 16027939 16166263 15595949 15397132 15612817
5181 15612817 15811808 15748839 15862791 15981577 15924902 16163848 16082798 15875520 15682946 15576627
5171 15576627 15834781 15797714 15924896 16010922 16186767 16070225 15687352 15580263 15829136 16220353
5161 16220353 16412233 16453264 16279395 16393639 16583565 16529900 16624914 16861803 16970803 17219872
5151 17219872 17132111 16902717 16968287 17430170 17778143 17949932 18135244 18405822 18561434 18719864
5141 18719864 18955574 19149478 19334309 19526556 19458749 19672841 19632224 19558814 19683805 19689193
5131 19689193 19627549 19376672 19345901 19523446 19299258 19316973 19678854 19727293 19861770 19902139
5121 19902139 19694804 19616027 19559005 19889434 20229030 19975029 19969886 20033734 19905546 19815293
5111 19815293 19752372 19730122 19786523 19711704 20027461 19866506 19877291 20247546 20372892 20257318
5101 20257318 20163422 20167531 20108387 20360382 20664429 20799987 21150100 21108372 21068515 21103282 21038382
5090 21038382 21221899 21371800 21386373 21329434 21363632 21548471 21697764 21911928 22137609 21986917
5080 21986917 21903903 22157082 22388721 22632005 22787992 22643503 22770390 22678558 22850592 23012988
5070 23012988 22905565 22881025 23073781 23245423 23548013 23567733 23916264 23959128 24014071 24292265
5060 24292265 24331431 24522524 24907343 25457898 25784856 25971571 26030276 26256229 26698625 26965105
5050 26965105 27228190 27467391 28001478 28362185 28885150 29145686 29702921 30418343 30928748
5041 30928748 31486417 32011566 32537895 32894819 33534855 34558613 35630610 36443645 37261015
5032 37261015 38042541 39469041 40914686 42319795 44119555 46050808 47736786 49633529
5024 49633529 51664754 54055864 56916223 59989547 63346166 66948968 71019682 76218123
5016 76218123 82323489 89226262 97477193 107506217 119195191 132333666 146318540 159032794
5008 159032794 168445499 172050870 169530457 162316425 152418562 141931763 131230909 120792061
5000 120792061 110881211 101354147 92900262 85785599 79628955 74560538 70574229 66892164
4992 66892164 63774432 61471614 58896374 56948208 55373898 53651709 52225520 51505850
4984 51505850 50787690 50310824 49788239 49182961 48928681 48852203 48885252 48873278 49205961 49823604
4974 49823604 50140213 50724616 51805757 52725327 53604126 54886145 56488886 58107747 59804723
4965 59804723 61932798 64108045 66388502 69061224 71706898 74866147 78554991 82745960
4957 82745960 87534778 92806957 99611660 107327440 116755563 127482636 139375981 152421416
4949 152421416 166075177 178477847 186492787 190294327 189690822 184513811 176499274 166726384
4941 166726384 156653184 147140359 138297586 130052182 122145285 115613267 110167419 105571194
4933 105571194 102219447 99474366 97131618 95369791 93771304 92866043 92209052 92183417 92249855
4924 92249855 92733629 93704993 94752567 96401368 98189159 100053062 101655703 102453069 102675998
4915 102675998 102313508 101696048 100654899 99114572 97906987 96887790 95825106 95071947
4907 95071947 94962684 95072161 95107836 96003905 97406998 99147153 100403265 102066253 103887623
4898 103887623 105633534 107082083 108111122 108796262 108758427 108127760 107050506 105909037 104618861
4889 104618861 102840633 100879362 99249786 97727808 96470304 95121888 94430974 93714312
4881 93714312 93153350 93238881 93094569 93300280 93889773 94758868 95868976 97346661 98823323
4872 98823323 100177298 102281534 104050044 106236500 108180477 109566711 111160669 112575241
4864 112575241 113079528 113044570 112857259 111984774 110632100 109294875 107929387 106103458 104376527
4855 104376527 103133570 102244886 101671778 101224895 100993304 101353612 102004233 102963221 104079654
4846 104079654 105293965 106379539 107259813 107769467 108042065 107681997 107011083 105613143 104086893
4837 104086893 102777504 101293394 99469469 97507274 95583401 93951428 92531777 91027457
4829 91027457 89718228 88408377 87168619 86188069 84961437 83672681 82707766 81679641
4821 81679641 80444884 79605003 78752359 77600193 76816931 75774595 74807180 73939603 73154661
4812 73154661 72175925 71809259 70957719 70353474 69902824 69083780 68325793 67710698 67265343
4803 67265343 66655045 65945128 65157767 64346301 63409414 62981909 62493282 61933970 61520834
4794 61520834 60849250 60206683 59664871 58938025 58289982 57781964 57552586 57449579 56785560
4785 56785560 56180536 55674629 55091634 54610075 54228471 53990950 53453432 53168907 52829292
4776 52829292 52539047 52268448 52043645 51635995 51048157 50608574 50110778 49642069 49244294
4767 49244294 48739129 48085341 47702960 47240519 46992096 46508562 46053069 45328627 44936684
4758 44936684 44427564 43824242 43667462 43286181 43132332 42913080 42608897 42012741 41390966
4749 41390966 41051828 40596062 40308615 40029880 39554612 39174931 38995584 38739999 38486598
4740 38486598 38364928 38024633 37730631 37551882 37215683 36895970 36572552 36058612 35758926
4731 35758926 35455787 35448391 35125032 34924396 34309264 33926702 33811625 33721152 33506462 33464434
4721 33464434 33194205 32885972 32990236 32663850 32835893 32775847 32649843 32382019 32073306 31998175
4711 31998175 31808007 31597229 31635220 31774711 31627261 31602862 31585133 31476827 31160841 31354025
4701 31354025 31573279 31417854 31688300 31761674 32188444 32595122 32549841 32362419 32271329 32288039
4691 32288039 32488942 32510285 32402804 32670086 32809307 32878742 32591460 32870324 33053173 33113799
4681 33113799 33481116 33857935 34062348 34137884 34326626 34272153 34641728 34871036 35316523 35714226
4671 35714226 36021572 36324923 36706698 37295024 37649888 38168695 38586117 39267644 40351805
4662 40351805 40674577 41082767 41980930 42831882 43760478 44559168 44755821 45211397 46052641
4653 46052641 46850924 47901561 48886354 49938914 51063278 52198720 53482469 54814359
4645 54814359 56055622 57861113 60010912 61591606 63493112 65680699 68244936 71150608
4637 71150608 74143897 77292305 80518378 84124075 87881709 92426261 97513380 102781578
4629 102781578 108488461 114975398 122642955 131069092 141114996 152457989 164904152 178946357
4621 178946357 193205235 206340423 216805394 222715270 223174268 219098446 212058173 203527686
4613 203527686 194297285 184647143 175261301 166164815 158074447 150951060 145207828 140500412
4605 140500412 136641505 133448082 131204898 129278001 127338415 125291482 123217582 121467715
4597 121467715 120081861 118984980 117731116 117210508 116841493 116666420 116789246 116824765 116380930
4588 116380930 115955318 114931403 113300078 111572117 109846778 107921790 105914945 103605323
4580 103605323 101535266 99350716 97204164 95799263 94436708 93112188 91400946 90115582
4572 90115582 88942244 87624081 86587310 85331474 84206248 83379964 82341253 81390788
4564 81390788 80597469 79891531 79103186 78520336 78330532 78119974 77918989 77872492 77937315 77497680
4554 77497680 77710623 77850690 77854930 78009395 78082580 78260694 79036030 79513329 79983065 80583464
4544 80583464 81648110 82601067 83205515 84095091 85064326 86235147 87473800 88622730 90374718
4535 90374718 91783679 93025438 95080378 97230817 99246071 101609055 104239297 107147013
4527 107147013 109930053 112901373 116446413 119945814 123908093 128510416 133418192 138710686
4519 138710686 144636647 151146341 158615843 167063644 176464504 187082834 198962716 212167326
4511 212167326 226072878 239970731 253243349 264692208 273509070 278374834 279448202
4504 279448202 276888639 271352307 263634538 254548377 245105754 235706626 226285253 217342761
4496 217342761 208154741 199777581 192018771 184520054 177487836 170665424 164078958 157481282
4488 157481282 151523836 146131084 140699949 135738973 130976265 126219287 122278877 118618013
4480 118618013 114958770 111950005 109182203 106733909 104634392 102895601 101691247 100463418
4472 100463418 99092820 98010599 97091683 96384456 95351792 94592829 93378608 91876859
4464 91876859 90074850 87961907 85522353 83001824 80362275 77714900 75084629 72445373
4456 72445373 69955054 67550621 65402103 63252650 61496685 59942587 58546461 57368262
4448 57368262 56354982 55713560 55096979 54669879 54280315 53960132 53643801 53697339 53449444
4439 53449444 53011776 52222212 51280073 50555392 49228595 48050511 46628913 45002565 43817617
4430 43817617 42740536 41618778 40833910 39729627 38818853 38266769 37819398 36986905 36354516
4421 36354516 35639504 35385095 35096320 34372372 33722289 33563686 33246824 32582111 32018889
4412 32018889 31673038 31061588 30658425 30419321 30212960 30131443 29749234 28873062 28281701 28195901
4402 28195901 27598137 27353511 27192817 27272517 26903735 26620580 26517667 26352809 26288990 25783539
4392 25783539 25510839 25545416 25308266 25037712 24838745 24374608 24384234 24135015 23873256 23565046
4382 23565046 23517146 23400300 23079239 22927532 22833122 22598298 22527666 22233713 22113870 22208966
4372 22208966 22007700 21811142 21599692 21894707 21931850 21873104 21753047 21393241 21791801 21889135
4362 21889135 21720348 21489276 21579549 21513912 21593270 22011375 22163338 22169941 21989310 21918434
4352 21918434 21928081 21855676 22294217 22535006 22835775 22969504 22931661 22715504 22702796 23107638
4342 23107638 23533640 23662923 23570929 23744899 23981595 24222199 24405162 24586958 24671965 24947917
4332 24947917 25094406 25140365 25010700 25353507 25519491 25641870 25917254 26365193 26392977 26465165
4322 26465165 26555834 26745343 26856456 26946124 27110650 27141775 27387672 27516923 27520854 27652619
4312 27652619 27713896 27431027 27470722 27776347 27965775 28230330 28194061 28319796 28399628 28239583
4302 28239583 28379577 28256956 28204422 28387125 28451167 28627761 28500484 28303097 28101147 28086654
4292 28086654 28203734 28592799 28504467 28144227 28098339 28271095 28060192 28047317 27854072 27752319
4282 27752319 27831313 27885483 28042716 28006877 27692040 27592651 27571374 27460738 27414566 27399614 27516686
4271 27516686 27193733 27180287 26942161 26700942 26331289 26017309 26029007 25876401 25408682 24987823
4261 24987823 24725685 24655352 24426232 24030978 23860336 23524886 23398375 23283022 23128307 22772139
4251 22772139 22416290 22618727 22587962 22336668 22390959 22266235 21860562 21821390 21862203 21841064
4241 21841064 21778566 21590139 21553451 21220140 21178707 21180650 21085177 21018892 21365680 21629979 21488688
4230 21488688 21680190 22010009 22230350 22295052 22582287 22959396 23148699 23545446 24271353 24908448
4220 24908448 25651084 26368037 26965794 27807833 28800599 29846773 30698705 31523336 32645010
4211 32645010 33990438 34890167 35436327 35896637 35938167 35478949 34920692 34240752 33393841
4202 33393841 32501484 31350661 29887154 28633616 27507611 26046525 24823190 23799020
4194 23799020 22643287 21695551 21137072 20061019 19221420 18742661 18103544 17544290 16778895
4185 16778895 16057513 15802295 15325811 14921455 14676128 14324845 14023075 13713035 13145441
4176 13145441 12915436 12412805 12168455 11814216 11858421 11982387 11638089 11516276 11219001 11132982
4166 11132982 11176275 11093208 10932238 10667315 10444293 10386400 10354207 10187179 10026274 9769197
4156 9769197 9621432 9563739 9739715 9473312 9469985 9328214 9122297 9063682 9068965 8942302 9004312
4145 9004312 9229983 9089980 8824150 8726168 8553803 8307570 8254388 8098285 8196142 8407498
4135 8407498 8513527 8042795 8111672 8071627 7975289 7773554 7818505 7997469 7897537 7728471
4125 7728471 7627567 7623885 7672149 7659128 7811120 7748641 7630442 7708430 7643749 7533166 7750670
4114 7750670 7785733 7462211 7491908 7393138 7486210 7810691 7769327 7672336 7544315 7612554 7593544
4103 7593544 7708294 7939492 7542914 7476235 7447178 7411228 7595941 7562990 7691863 7808205
4093 7808205 8093768 8226723 7785229 7967642 8419831 8438950 8331596 8323348 8074272 8448892
4083 8448892 8478452 8320879 8535566 8683480 8602641 8518821 8435318 8733026 8941680 8703819
4073 8703819 8750403 8750387 9032701 8856293 8859980 8920306 9437913 9509847 9425288 9447542 9387055 9425781
4061 9425781 9442798 9405807 9337107 9561138 9661865 9627526 9647858 9620082 9835763 9842045 10070068
4050 10070068 10279632 10359871 10445955 10572945 10738678 11081106 11322947 11141187 11191072 11424186
4040 11424186 11356725 11422347 11221836 11262904 11425003 11673355 11790675 11631827 11896509 12193706
4030 12193706 12321348 12450233 12440853 12390513 12460904 12873350 12805903 12801578 13027085 13080221 13247828
4019 13247828 13272796 13394104 13491504 13505103 13452060 13419068 13375544 13161939 13311737 13793325
4009 13793325 13785610 13593253 13457097 13782229 13687998 13599040 13852883 14106043 14168244 14069575
3999 14069575 13938463 13903372 13981650 14035589 14041195 14377024 14318249 14434100 14365623 14239060 14331047
3988 14331047 14309088 14250221 14398879 14445292 14385885 14439101 14174249 14085933 14026057 13817869 14230701
3977 14230701 14300202 14072112 13968285 13839886 13796969 13729740 13795892 13854274 13690526 13655820
3967 13655820 13606882 13847857 13853313 13634914 13813525 13918116 14040175 13920517 13932206 14480366
3957 14480366 14356368 14272705 14128874 14310902 14441426 14378700 14850015 14829326 15030493 15184385
3947 15184385 15265202 15268845 15430910 15780531 15951049 16112511 16254763 16406284 16752938 16632865
3937 16632865 16532656 16868283 17010779 17392289 17435896 17479283 17841917 17889283 17866615 18171559
3927 18171559 18117779 18072359 18587065 18581613 18622797 18665805 18946675 19124950 19308204 19356125 19368467
3916 19368467 19292814 19334950 19687610 19433261 19428021 19420623 19249632 19278617 19352733 19148749 19120811
3905 19120811 18892105 19073006 19202320 19101170 19076942 18792661 18787203 18578431 18265355 18210954
3895 18210954 18358642 18342278 18339262 18594405 18331599 17993454 18293297 18099597 18046079 18143969
3885 18143969 18100528 18125478 18138430 18396575 18358575 18570366 18760069 18693376 18849006 19045201
3875 19045201 18893301 18876637 19142840 19110131 19335217 19281151 19264803 19423774 19694241 19796101
3865 19796101 19529450 19728118 19928249 20024160 20407278 20409668 20537039 20463581 20586520 20597710
3855 20597710 20353039 20437414 20763919 21230763 21112313 20803857 21111484 21389399 21467039 21446113
3845 21446113 21674988 21728123 21641818 21619698 21583896 21782085 21936744 21730874 21345272 21491993
3835 21491993 21637777 22025328 22162734 22498919 22679457 22543572 22760566 23031240 23413617
3826 23413617 23158576 23142273 23657097 23922878 24298821 24174223 24183164 24326099 24369285 24279341
3816 24279341 24108626 24456452 24821169 24801453 24886740 24732413 24458982 24861658 24966545 24811160
3806 24811160 24826916 24909627 25100890 25024793 24980572 25157622 25131903 25453226 25562652 25748179
3796 25748179 25745526 25734410 25775796 25520207 25585960 25775193 25852101 25775758 25463275 25344339 25415668
3785 25415668 25085074 24795697 24674054 24680096 24715645 24792584 24445915 24000247 24164688 24458369
3775 24458369 24282318 24042945 24034873 23929685 23788705 23888261 24078205 24143180 23996435 23906275
3765 23906275 24206370 24254890 24342013 24472073 24759547 24761027 24668614 24900187 25598823 25757024
3755 25757024 25841329 26128591 26387953 26531971 26916099 27475058 27877103 28277713 28438966 29049342
3745 29049342 29387580 29629249 30076137 30213537 30326314 30711726 30878429 31230307 31649267
3736 31649267 32098038 32135278 32246457 32540985 32910228 33050386 33291525 33371998 33558455 34018166
3726 34018166 34257134 34380541 34682242 34909937 35382289 35766232 35677920 35515016 35548723 35737609
3716 35737609 35783627 35792701 35734286 35484645 34675684 34296013 34516392 34006267 33526627 33041285
3706 33041285 32643110 32124498 32140246 31799849 31084511 30616134 30001573 29664292 29221905 28979729
3696 28979729 28549017 28244261 28067930 27969464 27726085 27351961 26886814 27062689 27062074 27018840
3686 27018840 26515399 26297531 26166663 25853063 25766301 25175252 24739030 24376253 24203542 23589627
3676 23589627 23207982 22918050 22752570 22855993 22580467 22092578 22023793 21746096 21323457 21055397
3666 21055397 20989632 20550355 20628184 20270922 19980945 19745501 19631563 19825681 19758678 19605789
3656 19605789 19350108 19335464 19441599 19634506 19257384 19162817 18992118 19098728 18798960 18809795
3646 18809795 18915116 18961905 19216928 19202137 19253034 19284589 19137755 19181316 19260388 19211993 19239790
3635 19239790 19394429 19586932 19474593 19551922 19786179 19693847 19733928 19670096 19719891 19568266
3625 19568266 19451742 19582227 19643759 19766410 19791919 20066520 20200480 20026200 20085222 20283008
3615 20283008 20409935 20195178 20253126 20417474 20193419 20334217 20157530 20204554 20473827 20721513
3605 20721513 20935585 20789327 21063736 21196475 21555090 21583075 21601548 21586936 21959479 22369203
3595 22369203 22427741 22848252 23267017 23507929 23805456 24363331 24723969 25135142 25626724 25781363
3585 25781363 26302191 26698443 27092998 27340745 27793986 28403339 29021604 29604811 29803092
3576 29803092 30403071 30938651 31339978 31912978 32786386 33501579 33962172 34557912 35305819
3567 35305819 35802812 36857850 37653880 38113662 38882839 39481391 40284374 41136322 42035607
3558 42035607 42725520 43167763 43775415 44468153 45015930 45949161 46633964 47285449 47866976
3549 47866976 48304569 48774193 49404167 49723470 50475532 51380785 51890419 52709325 53173017
3540 53173017 53595375 54283112 54790780 55435903 56251927 56890701 57563399 58254304 59066744
3531 59066744 59664327 60236041 61106745 61553931 62124737 62760280 63403289 64013607 64497293
3522 64497293 65071575 65370728 65745640 66315178 66986255 67525608 67890464 68060917 68420116
3513 68420116 68575045 68934280 69254454 69567660 69627356 69838989 69995058 70255641 70430535 70543507
3503 70543507 70450619 70609521 71066790 71258568 71457909 71868662 71793629 72430979 72778530 72964544
3493 72964544 73221090 73480602 74057300 74640620 74659859 74841018 75424252 75767071 76195282 76384886
3483 76384886 76433840 76790182 77017734 77148133 77192079 76921715 76749076 76532832 76145975 75823439
3473 75823439 75240630 74954274 74301955 73805641 72882852 71890990 71064828 70238163 69233720
3464 69233720 68276249 67085112 66150524 65139091 63930382 63096037 61945489 61040125 60155855
3455 60155855 59573644 58463232 57719370 56937689 55998758 55173606 54710576 53903572 53257066
3446 53257066 52204618 51384782 50877038 49770094 49031082 48570272 47818515 47302904 46480473
3437 46480473 45964069 45357876 44821980 44362062 43521472 42727045 42483437 42241221 41921707
3428 41921707 41478078 40817028 40330961 39957930 39666929 39292045 39125915 39013995 38776672
3419 38776672 38692411 38209993 38208018 37997389 37788955 37780485 37798893 37732551 37420889 37302892 37402411
3408 37402411 37252361 37360930 37343468 37248997 37429137 37516461 37564245 37606152 37379503 37303644
3398 37303644 37636028 37767013 37931276 37971220 38182691 38414461 38519330 38957540 39093801 39235439
3388 39235439 39746238 39754377 39702903 39788989 40048588 40092292 40333686 40736545 40737884 40768453 40894738
3377 40894738 41279901 41489597 41675152 41383658 41268097 41186048 41102702 41105904 41322880 41359421
3367 41359421 41061051 40987894 41379423 41521114 41335139 41305976 41311903 41225935 41186064 41162336 40729370
3356 40729370 40545125 40348134 40175813 40151602 39772172 39584620 39585059 39292125 38917649 38549479
3346 38549479 38646587 38399606 38239493 37740122 37449713 37258157 37161966 37136875 37253345 37189380
3336 37189380 36744074 36366783 36508868 36840185 36551585 36752427 36982443 36870650 36903755 37103838
3326 37103838 37591527 37488637 37385292 37153101 36896285 36839935 37023035 36487604 36381634 36521746
3316 36521746 36064660 35519643 35483142 35003513 34315949 33855448 33322086 32712023 32252202 31660164
3306 31660164 30888695 30378643 29969146 29345471 28747264 28028331 27340087 27110808 26410541
3297 26410541 25882900 25538958 25151331 24498807 23997851 23622152 23556946 23130594 22589336 22370792
3287 22370792 21880717 21520807 21182538 20750001 20358793 20109792 19922581 19761947 19563827
3278 19563827 19035901 18763951 18744451 18428136 18053819 17820877 17857422 17759902 17474818 17064787
3268 17064787 17006229 16973059 16899526 16565314 16364047 16152493 15956503 16023514 15902002 15839472
3258 15839472 15875831 15398319 15230071 15416733 15070797 15087005 14785982 14711913 14745348 14626983
3248 14626983 14545314 14289017 14051818 14145388 14254283 14257304 14081741 13790096 13687987 13563349
3238 13563349 13590573 13490985 13629570 13587428 13379051 13299078 13502856 13807528 13798075 13595810
3228 13595810 13511562 13472571 13564991 13507320 13258014 13331183 13208844 13103685 13267692 13327166
3218 13327166 12875602 12798876 12937414 13335323 13116594 12994791 12905496 13137396 13407799 13572357
3208 13572357 13741100 13983768 14090879 14192110 14322139 14725956 14893637 15240118 15350453
3199 15350453 15418069 15535080 16062691 16492069 16306975 16273218 16351906 16499591 16460759 16906089
3189 16906089 17016303 16861130 16900280 17049880 17330742 17528170 17782553 17907111 18100221 18425929
3179 18425929 18747014 19174370 19739068 20438093 20909859 21360520 21982765 22470436 23145874
3170 23145874 24035928 24640285 25372339 26232206 27329629 28067498 28866543 29757248 30782703
3161 30782703 31936550 32873757 33648118 34624528 35666847 36524861 37744080 38960656 39976310
3152 39976310 40947161 41955131 42808087 44019327 45363965 46590831 48044420 48840667 50234348
3143 50234348 51485357 52693519 53895932 55183776 56586118 57946011 59835106 61266041
3135 61266041 63229784 65089617 67069623 69054538 71133861 73339204 75164942 76837761
3127 76837761 78395830 80187768 81507008 83042973 84290749 85714411 87144899 88814400
3119 88814400 90403219 92446174 94352726 95940171 97610945 99386332 101125061 102817411
3111 102817411 104143738 105288006 106316355 107073565 107988057 108707195 108763962 108952602 109069805
3102 109069805 109392426 109442555 109430661 109481810 108991118 108508228 107752834 107311195 106075399 104679176
3092 104679176 103511220 102504680 101330966 100054057 98746842 97338677 96243323 95033498
3084 95033498 93869546 92525000 91290631 90216635 89040889 88516260 87433588 86580441
3076 86580441 85903182 84744932 83708373 83281858 83205928 83018760 82791711 82863545 83144334
3067 83144334 83370330 83830920 84299058 84752049 85465785 86562490 87370676 88152891 88726010
3058 88726010 88620657 88243738 87261600 86007143 84292679 81564074 78867451 76179862 73081930
3049 73081930 69779093 66659346 63749698 60863273 58226122 55594981 52954442 50548306
3041 50548306 48402541 46183995 44256216 42228901 40382311 38773151 37406280 36012724
3033 36012724 34513622 33146037 31954356 31018214 29793986 28679228 27969858 26962847
3025 26962847 26039384 25158142 24410469 23780729 22923224 22472028 21862360 21072565 20523545
3016 20523545 20060136 19553815 18889746 18490200 17745650 17567221 17282659 16980041 16657512
3007 16657512 16238340 15907320 15076336 14608054 14568635 14084976 13461497 13414191 12951820 12868818
2997 12868818 12743410 12592303 12285117 12042408 11456356 11286683 10965873 10634272 10768056
2988 10768056 10939853 10559167 10204752 9984174 9660868 9400754 9236484 9109110 8894160
2979 8894160 8876346 8725779 8387181 8122228 8189975 8073851 7926396 7765575 7546378 7057367
2969 7057367 6817875 6666762 6717858 6638342 6679854 6601454 6237550 6004190 5944466 5678337
2959 5678337 5424746 5310828 5195753 4993869 5115856 4992140 4841861 4528638 4215874 4078631
2949 4078631 4192295 4119851 3998161 3809847 3789098 3721877 3647016 3911279 3706640 3513947
2939 3513947 3418410 3483527 3288009 3291657 3260628 3182881 3146731 2977001 3150589 2969325 2728892
2928 2728892 2649119 2606918 2677755 2473323 2747880 2712578 2526167 2715894 2534284 2232426
2918 2232426 2268337 2249663 2306937 2326815 2286975 2327681 2064387 1969724 2103496 1783577 1937557
2907 1937557 2094394 1780566 1717164 2114548 2112597 1956500 1915251 1957498 2146537 1959479
2897 1959479 1921219 1797463 1663185 2085233 2182756 2256141 2251421 2242027 1845800 1926367 1777561
2886 1777561 2169285 2116685 1876282 1997068 1836689 1822593 1704807 1767399 1704951 1759258
2876 1759258 1746243 1876576 1482065 1514665 1706742 1981085 1630430 1617527 1619126 1579530 1650432
2865 1650432 1558041 1414767 1628412 1615774 1573055 1680269 1637423 1595193 1849887 1856261 1565914
2854 1565914 1562144 1816246 1707146 1861755 1957831 2002006 2484366 2514259 2358920 2106096
2844 2106096 2070559 1920420 2073503 2367225 2082668 1952215 2235436 2088184 2043284 2045205
2834 2045205 1856055 1757915 1863183 1850452 2196297 2235829 2151923 2104078 2019709 1804886 1991504
2823 1991504 2524903 2469267 2455944 2207975 2147532 2429994 2383951 2266197 2339056 2267910 2132477
2812 2132477 2433578 2242760 1966457 1998959 1878325 1860595 1965638 1993251 2137357 2113044
2802 2113044 2010277 1997131 1944151 1936012 1741406 1623114 1654318 1519790 1726451 1581826
2792 1581826 1310576 1304528 1368823 1423538 1509777 1496431 1418196 1495324 1831051 1750937 1803135
2781 1803135 1549417 1437806 1497830 1497219 1541669 1215258 1307451 1209914 1366003 1239765 1214299
2770 1214299 1304214 1417335 1295112 1311280 1283550 1310349 1309497 1365033 1208065 951943 938758
2759 938758 1126602 931849 889343 993640 822620 1005207 1077892 658755 538029 737706
2749 737706 650425 524727 563685 590560 499533 449658 400458 565548 603347 530128 334934
2738 334934 214628 387077 398509 545279 673324 372334 343643 445515 515761 451701
2728 451701 516587 310316 298158 496637 448292 450329 534145 526247 287516 309515 192585
2717 192585 296492 423178 372757 253911 198261 -36168 98031 561011 572730 352907
2707 352907 390798 231918 139734 276257 328313 185970 214080 176081 38146 61342 332012
2696 332012 229974 67423 130723 243543 460467 338797 257291 -73635 -272254 24718
2686 24718 209757 80453 -38923 -216940 87911 331217 175606 67265 -138532 -190715
2676 -190715 -125220 -276105 126716 600171 321273 -31323 138390 95645 260664 176340
2666 176340 78551 -164145 -221933 192314 199869 13079 -89126 115084 104587 144158 191729
2655 191729 117828 50094 -118251 -194625 113521 241783 10367 253867 73559 -80703
2645 -80703 -46333 -138708 195321 299833 337350 238972 -169316 102171 398065 215256 106045
2634 106045 70497 61801 152732 247275 270546 207275 102734 31793 177775 251395 109472
2623 109472 103017 -49411 -168915 -107230 30008 239475 142145 153263 189313 245473 295223
2612 295223 248284 453938 507422 575909 368018 488453 591671 633227 868389 718665
2602 718665 1033464 899893 843591 860145 843561 814323 796820 679582 582858 404083 172815
2591 172815 262098 494779 519901 234748 296569 451158 540276 728543 546512 331804
2581 331804 186869 382428 487111 194695 155157 134996 414357 556425 603606 452859
2571 452859 329038 109604 1188 227949 299028 325398 377091 274853 64967 137488
2561 137488 258300 74030 239689 327107 482096 262067 219416 348638 235337 229258
2551 229258 333447 528402 573877 263859 318509 210452 74673 304141 141636 109055
2541 109055 246512 179684 175798 101461 87523 -67483 62109 371894 490428 421827 381198
2530 381198 486121 608007 416137 301171 373075 500102 251405 205107 274804 453984
2520 453984 564986 498305 510915 439824 148635 365472 82190 189362 333413 255080
2510 255080 -29692 -71030 269007 276068 298562 76561 134116 75961 122610 25750 32021
2499 32021 -67161 -56126 64224 -114453 237355 276691 113648 209436 89718 166447 14763
2488 14763 119138 175068 384668 521750 411288 64626 51043 117297 559312 547250 452852
2477 452852 579518 639988 212598 400962 408460 347261 678333 879712 803682 567000 429256
2466 429256 559772 531706 471408 657045 794355 729308 453351 275213 313587 430263
2456 430263 572456 593727 768191 672847 569802 728366 939648 856006 617943 586381
2446 586381 690186 798011 857507 697952 909172 1009380 896054 779400 1119760 1204595
2436 1204595 1366261 1238891 933824 836195 832824 1126709 1034913 1017395 1179450 1081246 1313889
2425 1313889 1242655 1430996 1474156 1361278 1386341 1464402 1539454 1595344 1850866 1781422 1774444
2414 1774444 1586528 1599140 1518844 1417144 1880807 2248545 1869213 2043806 1523186 1761129
2404 1761129 1890313 1946862 2071329 2161212 2114841 2188794 2229859 2458747 2349585 2387806 2567672
2393 2567672 2825550 2960407 3004730 2952389 2966429 3236309 3314217 3184694 3673843 3765656
2383 3765656 3890269 3963776 4289212 4336516 4412540 4799556 5160315 5332851 5571371 5660098
2373 5660098 6041116 6760440 7124264 7920612 8496129 8882738 9575550 10034674 10779027 11521704
2363 11521704 12318452 13313260 14588964 15799539 17137429 18905010 20774478 22723596
2355 22723596 24720182 26755771 28893210 31237121 33508697 36009893 38584716 41783140
2347 41783140 45881941 51098267 56885923 64089497 72715317 83074047 95945905 110612122
2339 110612122 124204213 137445372 144206197 141298624 132285392 122027112 111860776
2332 111860776 102377131 93171053 82395505 72170519 64010423 57255175 51329064 46796702
2324 46796702 42902823 39338302 36302536 33741631 31242182 28782447 26610103 24787181
2316 24787181 23016755 21200673 19434292 18195100 17165381 15947409 14550195 13613850
2308 13613850 12796521 12099129 11560149 10822863 10346745 9782919 9539540 9025958 8564714
2299 8564714 8250896 8206495 7754397 7165441 6796589 6670933 6354800 6120811 5632530 5323411
2289 5323411 5224932 4933283 4920411 4730980 4467171 4310083 4167941 4193832 4237288 3845845
2279 3845845 3635588 3199302 3083450 3004296 3109310 2869146 2660606 2867232 2795452 2859459
2269 2859459 2681919 2514541 2346542 2408183 2472673 2262985 2142273 1987437 2057876 1975584
2259 1975584 1740904 1608436 1594579 1669940 1564301 1554736 1413355 1363928 1370011 1168320 1271613
2248 1271613 1262608 1128296 1129098 1039186 1002678 947455 942928 944395 750356 731228 939207 987302
2236 987302 974788 827159 719864 843620 807021 746721 834078 957313 681376 606410 537066
2225 537066 388553 423861 562869 480685 414477 722979 593774 848025 934240 755882
2215 755882 873084 879925 1069944 863014 536610 434869 525336 624092 520416 495380 534135
2204 534135 352624 397521 490017 453520 166948 280935 140819 402831 442171 470374 405103
2193 405103 299789 545816 454732 388883 203218 52541 123251 475208 390156 223759
2183 223759 421089 255773 155200 177633 121399 211637 -62361 84994 282517 378916
2173 378916 273406 21544 168215 73604 353788 369760 364997 14099 -126009 171460
2163 171460 244113 238760 73 -18174 91233 131130 -165980 15293 174018 133889 70314
2152 70314 -87709 20492 49436 159968 -15365 -211838 -292262 -508816 -292057 -40783
2142 -40783 62612 172683 -105403 77082 113079 -7872 -190363 -197792 -9356 230924
2132 230924 34849 -96688 -147777 -122806 290349 395180 146125 -128442 85128 125149
2122 125149 101016 -75738 -41478 -50629 -31006 -115817 -51787 -58513 -131167 35371 146474
2111 146474 31060 -22117 127239 195305 -238594 -197526 -346217 -309318 -253167 -113240 -178503
2100 -178503 -128352 17576 4414 48353 241078 320229 168389 2448 -140744 -101193 65666
2089 65666 177168 152638 -92890 76375 272532 380166 155361 -156375 110710 -162282
2079 -162282 -124375 -242515 -65323 -17794 108773 437344 277632 523023 786268 865791
2069 865791 714682 662279 428531 518729 503209 664396 479916 415029 445872 258583 258368
2058 258368 798 -155822 124335 203707 -145125 207674 489073 398879 189374 304717
2048 304717 171851 -105383 71250 9870 -36405 -163104 -253940 -233892 -88418 -8281 -50888
2037 -50888 -168520 -66106 -232270 -285749 -114497 -125247 94644 -83884 -226133 -117648
2027 -117648 153344 111822 -92696 -25457 153413 -87460 -350733 -395798 -274322 -89145
2017 -89145 -138638 -159572 156007 17501 -119026 -12719 74773 -30129 -42644 -91890 50729
2006 50729 214963 123010 -269635 -247398 -48795 -297679 -318963 -212546 -166827 338557 110839
1995 110839 -307933 -323281 -83502 -167706 -110770 -21252 -263967 -162347 152239 289595
1985 289595 188807 5907 -44511 136383 527068 509224 251715 135632 329609 166265
1975 166265 -13381 -345813 -202685 -145366 30879 185834 153394 120067 -197824 -58936
1965 -58936 232454 -6168 -243657 -23123 -125523 -177026 133592 -149257 -241726 -80548
1955 -80548 118184 167704 -159607 -60701 200158 315192 171758 31092 -382543 -175676
1945 -175676 -116989 -244917 -260581 15134 169900 173701 -72029 72497 -76750 -290282
1935 -290282 -209921 -120946 -71806 -61412 149262 195595 -266694 -367443 -81169 -147299 -100294
1924 -100294 -186952 -580029 -154060 -212925 -205915 -266312 -263254 -413792 -226809 -51597 44754
1913 44754 110623 -153812 -55155 -25634 -66000 -126018 41198 101172 -6146 203348 -67497
1902 -67497 -223987 -146232 -23002 -57832 113635 -37136 -155850 57615 -122475 -404092
1892 -404092 -236794 -259169 -281596 -81497 -206863 6418 -231070 -203425 -120845 -241736
1882 -241736 -302715 14598 76277 -112038 -21630 21609 -149609 -118578 -47328 44702 101025
1871 101025 -125355 -213587 -209781 -417693 -142760 -64438 -210072 -19609 -234363 -404848
1861 -404848 -529504 -553527 -260208 74894 320492 -50316 -227793 -226963 22389 -86806
1851 -86806 -202922 -11844 40354 -74322 -82233 -221586 -329439 -67503 -116839 -417440 -242103
1840 -242103 44072 -134116 -212396 65572 -60695 -129411 -68065 -243921 -81007 146749
1830 146749 -108684 76364 264952 314615 204392 -8281 165130 -136021 69497 77498
1820 77498 -31967 147342 -28944 -78780 -286630 -500183 -333489 -370830 -419041 -157176
1810 -157176 -131077 271071 279391 82081 87074 -72471 -113422 -62724 -255692 -232329 -52552
1799 -52552 -98081 86054 128660 -99670 -129588 -268131 -122060 -83962 -185351 -91934 -302423
1788 -302423 -263421 -269072 -129259 23831 -30686 -82611 -362847 -481827 76529 81647 48057
1777 48057 -216156 36888 219204 -61252 284749 115579 -20528 -175645 10062 -61953
1767 -61953 -314014 -204586 -68808 -338725 -159266 37413 62844 128727 -76894 132498
1757 132498 -25001 56113 2621 -5345 -6632 42724 -271857 -160290 112326 -48601 -144852
1746 -144852 -187290 -235486 -478237 -248290 -63434 119119 -88935 -178575 -97013 -96587 -283057
1735 -283057 -307644 -207570 19620 -13086 -111814 226242 402594 155315 174962 310349
1725 310349 8829 315273 57645 -136935 -44224 177569 207421 284414 379822 -11866
1715 -11866 157610 -146672 -23053 286627 133634 -191884 -67078 174822 119113 152611
1705 152611 209246 -143366 -145344 19072 -117542 -35494 740 105375 -207085 -255475 -175939
1694 -175939 -65250 -163656 -8255 47879 203959 188896 28129 -34777 45745 275696 149204
1683 149204 5314 -183522 -233662 -226612 -84677 334540 310733 110186 -80612 -188917
1673 -188917 -36711 -245016 -5825 36941 268225 314328 41204 60193 5886 -33585 -171774
1662 -171774 -88 -3057 141517 105634 63720 128316 182857 193072 35457 33130 52758
1651 52758 -11745 117443 229475 162122 -88019 -169828 -266083 -77705 -189112 -272108 -303269
1640 -303269 -96678 89320 -22887 -119036 -328738 -235628 -1618 256805 122693 13810
1630 13810 -406241 -338224 -145432 -107355 182869 272120 -57847 -84337 -88763 -168097 -235274
1619 -235274 -54170 71610 211990 48834 255897 331242 -125201 -160417 -289707 -294145
1609 -294145 69615 -39156 -87857 212116 213907 167069 86241 198064 20596 -57073 131151
1598 131151 152668 157907 255763 106719 -222560 106231 295513 61148 178394 154065 54808
1587 54808 159835 3243 -189511 -212632 -70763 -61204 -67034 1884 -10119 130985 98803
1576 98803 119214 59355 -117241 -291699 23916 285724 177068 141535 264603 123546
1566 123546 58327 104736 319203 108627 64742 147564 -10891 107336 93663 39920 -178998
1555 -178998 -79995 -97487 -254979 -444461 -232078 -103230 -121455 -25134 15409 183910 44710
1544 44710 -200677 -65174 98297 107778 8080 352865 255099 44410 -322463 -325732 -359708
1533 -359708 -548979 -352327 -67311 -7020 42954 -173948 -266619 20404 55552 104267 -128226
1522 -128226 68422 103664 36471 21553 191133 47839 -311719 -125462 -63172 -287408
1512 -287408 -31135 -90262 -137571 146880 134725 148320 60622 -14200 69181 110606 -66730
1501 -66730 24586 201388 375258 307521 269007 218038 -113304 5473 -100831 -124915 -211566
1490 -211566 -189644 -312942 -257950 -328558 -399464 -316277 -98188 181333 349666 -20327 -163093
1479 -163093 -105465 -183457 26651 -61912 -166887 -153110 48226 5457 -45428 46239 221536
1468 221536 -22729 -244484 -70676 174254 329392 293516 146627 -92943 188402 81231
1458 81231 -138573 137046 416624 310016 27654 -16897 181142 134423 -146180 65818
1448 65818 179649 366949 502480 484035 380609 239323 105388 -84459 -167988 -8882
1438 -8882 -343060 -78213 65684 -49812 -72529 -282926 -289923 -121216 134916 134384 -4105
1427 -4105 -218121 55943 28479 73690 -21506 313119 444543 158717 265136 91311 43602
1416 43602 -51511 51914 45893 -217087 -171729 42355 104513 -114761 -194612 -203298 -312380
1405 -312380 128236 291179 238049 83143 242008 90555 -400622 -325457 -110063 -67318
1395 -67318 -186015 -101426 3531 120674 193758 114129 116971 164341 20113 -134791 -232072
1384 -232072 -282711 -66711 64896 424356 267921 103191 -100046 -157332 16841 100112
1374 100112 310809 4641 31125 74093 -280053 -56900 -23873 -267085 -248586 -16883
1364 -16883 170146 46507 4774 -242615 41571 197721 392014 31205 94490 229720
1354 229720 68828 -24477 -289214 -387393 -478901 -442103 -320262 -105936 -102225 -84687 -147210
1343 -147210 -84737 -88392 141165 176084 362484 472087 102611 -17683 -120883 37827
1333 37827 -70074 161634 163542 276373 206706 126244 109808 221547 144087 -123453 -189
1322 -189 57841 331451 257521 225068 21885 -164274 80331 55173 111922 164939 57512
1311 57512 -232626 -257850 -210259 -115780 -76479 -357724 -240487 110812 333664 423529 203714
1300 203714 -46482 193811 -106129 57925 -192586 -205069 -7508 -38609 64434 349740
1290 349740 -81436 -145739 -117522 -52299 45221 449 -1685 -34492 -90388 -262107 -102640
1279 -102640 61485 132615 389195 411854 375741 430101 286476 273032 6298 -29353 -68836
1268 -68836 186631 79416 -49718 1795 17246 177463 12985 -6825 220746 310938 500309
1257 500309 506661 54328 113458 197405 145821 329003 181249 1891 -150853 -22146 -238620
1246 -238620 -152209 21385 195896 280788 319206 213332 71085 85196 -13155 -212218 53814
1235 53814 154482 -46401 276571 171473 151261 185553 199827 108559 80040 293414 64099
1224 64099 -276803 14837 90854 4250 -47157 -457456 -403864 -266871 -88910 159359 79938
1213 79938 -194315 -38143 308118 241709 102274 34649 186255 154530 -63723 -196261
1203 -196261 -495782 -35029 27165 159405 86047 -26123 -39044 167595 409325 592454
1193 592454 389027 -94101 -219103 -198662 -183945 -104873 -2879 58849 122600 70638 116879
1182 116879 69812 -70617 -48685 235910 181773 127417 -84589 -53592 7360 179730 139543
1171 139543 -77696 -296424 -173132 3542 148338 121412 2191 167920 489079 157666
1161 157666 40720 227950 304757 164829 -118154 -91970 35240 -180075 -48490 31060
1151 31060 86163 339 184170 91763 -84213 -63090 -37662 -119548 -147742 12927 -101038
1140 -101038 -183145 -141443 -16079 -46436 -139392 -75817 141118 -151665 -200000 14364 29228
1129 29228 88065 228766 -97632 -208241 14134 120520 46054 106199 222349 341422
1119 341422 315601 106195 96075 19410 1187 353311 117785 -97755 37636 227774
1109 227774 71057 -18596 -39414 153034 39541 -8088 175158 322219 226180 30386
1099 30386 163272 -94974 -16326 21076 -39036 -87324 -50660 11169 -106492 -7193 226269
1088 226269 90666 254447 243357 20993 23217 -63072 52212 26059 78094 -136988 136326
1077 136326 367093 263700 333023 2012 4307 117754 380947 364694 65786 -85893
1067 -85893 -117255 -298996 -453665 -280777 -313391 -239195 -265553 -220785 299244 451151 373060
1056 373060 237451 51696 -149476 -332068 -7642 444133 317145 72863 216293 245141
1046 245141 173453 128836 143446 276297 325720 -6394 -191170 -159406 -122473 -6972 34291
1035 34291 -61513 -204042 -357247 -173093 -169503 -41576 -237206 -231303 -43049 -136496 23122
1024 23122 -162778 88306 326562 336822 375432 150841 -15235 -93969 -47863 7969 190393
1013 190393 196081 114317 160404 267703 93389 125148 -21966 -341999 -475728 -146502 100604
1002 100604 -179680 -27831 -68412 -41620 -137519 -137796 -188959 -74040 -544333 -300864 15017
991 15017 77585 -63623 -80144 -140639 -260658 21294 -70388 109325 25617 203780 476830
980 476830 176786 287538 325298 51104 -119971 104374 275206 325610 283531 91529
970 91529 -115068 106545 181537 204037 305594 300506 201973 151158 183078 -67124 -177381
959 -177381 -407368 -243248 372294 519895 216527 88799 128441 76621 -119434 -221565
949 -221565 -198894 -17332 -354717 -431346 -88634 39363 -217868 -194686 -154327 -250232 -114801
938 -114801 18074 80418 -5882 -299345 -2013 235262 127108 -74887 -1118 -295265
928 -295265 -293427 -178068 -184252 -315490 -398466 -54467 -136766 -163659 66226 219444 2143
917 2143 -29471 166167 341429 380448 73484 34246 63007 117646 -12954 8425 48367
906 48367 329216 82987 105050 206728 291185 320659 54824 -14070 -62034 -60003 -144725
895 -144725 -38934 -263811 -177156 168356 155967 -27014 74388 248361 175721 87181 380336
884 380336 138468 150152 441271 400546 250937 -36496 -49961 182813 5478 -35326 155963
873 155963 12835 4108 -4750 78148 210486 323537 110876 152898 158824 -268587 142032
862 142032 211867 246401 228826 460462 70861 -237748 -237544 -65227 -73895 -189845 -142948
851 -142948 -245076 -292410 -92977 120959 -133250 -101683 -104317 -207660 1567 179062 123998
840 123998 72938 83431 -1712 46863 233344 410542 283659 323229 406707 95647 -209558
829 -209558 7966 157173 -14492 -206588 -190220 -135888 -38411 77042 227044 54098
819 54098 -108437 101198 146068 158311 40854 22611 124907 78415 -93537 -214577 -118853
808 -118853 -143138 -91676 204239 54185 16647 -75951 -165870 -87031 -88260 -150420 -206640 -325912
796 -325912 -397747 -389608 -221024 -136191 -257682 -108948 80305 20601 -59325 -124568 188365
785 188365 286427 397852 136667 123240 12810 -278103 -230894 -99993 -351757 -10247
775 -10247 78459 -185330 103100 74457 67944 -54305 -13244 73662 -95502 -65203 -53853
764 -53853 -226823 -369519 -64693 -3244 108277 -28646 -168133 -34058 -69524 -64893 -177716
753 -177716 -79637 -359196 -140196 -32380 -47983 184740 111716 -101438 -347628 -412484 -276581
742 -276581 22549 371337 284531 -293106 -233239 -189767 -101435 93907 46738 32936 26869
731 26869 -126274 -221039 -214034 -148400 -67704 70941 -132511 -124234 -84878 -24835 185699 65637
719 65637 -35156 40322 -11402 161229 328855 58863 -304666 -350323 -136726 -172388 -216938
708 -216938 -287502 86022 143454 179786 167173 302684 127138 102290 74394 -11878 -117608
697 -117608 -42639 -178065 -18458 190852 212082 48550 33651 6769 -217155 -207355 -241251
686 -241251 14707 470116 425598 306892 279766 -70099 -186428 -279751 -77692 66894
676 66894 107294 -124891 -306096 -28244 12211 -1375 -200074 -371397 -188933 -240155 -187270
665 -187270 140926 384263 125967 13795 -744 55267 8319 101490 57407 51898 40056
654 40056 -110551 13162 -51453 18817 -196355 -202610 7479 11801 -15366 -15036 176336 190312
642 190312 -60775 -170425 -91371 -271116 -293122 -500749 -330295 -254982 -454777 -464504 -457060
631 -457060 -318909 50444 114253 -86478 -176700 -122995 -63766 -211491 -194503 -5906 51598
620 51598 -152879 -145988 -209035 -114260 -169327 -189860 -298866 -265987 -378228 -187170 -258287
609 -258287 -392753 -399573 -440187 -345816 -434044 -482062 -206944 105661 282527 203041 200717
598 200717 180782 23721 289251 277747 101810 -207830 -170551 -77053 99317 24035 -95366
587 -95366 -172314 -250526 -25652 983 -112298 -186469 139545 238205 -81171 -139936 -96542
576 -96542 7486 -52656 -96134 -167769 -254952 -430071 -377352 -244684 -205261 -264054 -240428
565 -240428 131843 366732 133182 196315 73296 103987 -96053 -240631 -120218 -306677
555 -306677 -232055 -275143 -166818 78573 44326 -117629 -202507 -23240 50791 19175 -98038
544 -98038 101806 55297 -217238 -256250 -367230 -221433 -28101 -53135 -203402 59313 -52632
533 -52632 55993 -175064 -370676 -302619 -175273 -33866 -269798 -34289 -122517 -176366 47667
522 47667 83041 190993 253979 76596 -213985 3234 -274251 11155 -274 -295522 112037
511 112037 -22833 -4568 23486 -4789 38412 167855 170475 66662 -35984 128987 82141
500 82141 -132891 -350508 -120388 27715 -138390 1079 219881 254000 219270 102378
490 102378 190509 276189 -55453 -226984 -277950 -432961 -134043 162930 29940 201125
480 201125 372376 -49421 -39198 25441 -186248 -58703 -57223 -79128 -243728 -275544 -302724
469 -302724 -575750 -354452 -281400 -36640 52734 -314459 -205452 -264706 -45534 -111432 68693
458 68693 57780 -39520 68848 346 6717 146071 158212 163211 64903 387262 211275 -99915
446 -99915 -26466 92561 42277 224936 197393 108306 321705 219648 134658 43335 41984
435 41984 -164178 -128121 -191791 -286235 -554539 -654774 -415221 -259367 -100627 -44561 -106224
424 -106224 -131806 -201881 -12636 -36262 -275385 -130623 107063 62116 -84265 -124566 36243
413 36243 -72981 -3057 -45444 -181183 -227311 -343295 -327000 -91775 108515 21412 -89566
402 -89566 -37896 215349 4984 -336766 -472104 -120767 -59182 -280435 -244193 -393216 -296210
391 -296210 -54191 60098 -191488 -305661 -170819 122000 -111262 -281084 -63252 124415
381 124415 -28930 -277339 -336185 -447218 -415908 -403074 45082 59414 -368536 -246985 -243406
370 -243406 -191315 -221743 -220155 -53325 -74311 -255482 -222551 -239179 -130715 128837 -38825
359 -38825 -471850 -439116 -316286 -377659 -157622 -210001 -42611 325762 11432 -258708 -249331
348 -249331 -195764 -117983 -269298 -281263 -161126 171113 -116881 -525672 -370838 -412895 -105315
337 -105315 28687 67948 158733 77840 -84802 -179839 -258162 -389352 -69840 -96718 -127417
326 -127417 -203529 -315424 -205560 19491 -141123 193422 65376 -29932 172421 27412
316 27412 -285769 -146423 -393183 -452639 -25702 -271290 -306231 -188684 -42752 56753 80412
305 80412 -247691 -206022 -128606 -229049 -468188 -310585 -282537 62298 315797 -56551 -426583
294 -426583 -473901 -257085 -405940 -485474 -421077 -321365 -220380 -245284 -213311 16566 -44009
283 -44009 -145080 -293663 -322647 -222755 -189596 -166590 33692 -57009 -468942 -219682 -145963
272 -145963 -249146 -144775 77641 30725 -206794 -473234 -293346 -91012 -99370 135919
262 135919 217853 137868 -87196 -24420 -248272 -280029 -178307 -90726 -185338 -524947 -381739
251 -381739 -369416 -332382 -233395 -178407 -206345 -179314 -242524 -109307 -288221 -402598 -235741
240 -235741 -233299 -111350 -145775 -244526 -238574 -28858 -178007 -148900 -124222 -183863 -204461 -205665
228 -205665 -22045 66575 245296 163230 199873 30105 -230308 -283649 -45289 -64031 57976
217 57976 86050 -125114 -79655 -185796 -141327 -95196 16794 -90752 -23167 -137433 -534127
206 -534127 -708287 -541591 -364151 -185128 -320215 -424799 -387387 -75566 107987 -104352
196 -104352 -96488 -96361 -108871 -165798 -175807 -86569 59458 44658 -71348 166559 313550 18469
184 18469 -183873 -236915 -201470 -80627 -14189 -37331 -13483 -65497 -368430 -370259 -137997
173 -137997 -185878 -331682 -335793 -458140 -575932 -457769 -305385 -386636 -360658 -276733 -363084
162 -363084 -259062 -331444 -170175 -18571 -350015 -258341 -79101 -254958 -334276 -166488
152 -166488 -108854 -88613 -126093 -35154 120340 -97509 -156902 -241131 -288074 -203352 -81711
141 -81711 62415 -103551 -397968 -328858 -153141 -161767 -438341 -276027 -180468 27179 -64158
130 -64158 -158801 -194255 -391059 -417748 -296150 51538 -26743 -132451 -191077 -148795 -128323
119 -128323 -259531 -320551 -59422 -147894 -101329 -247620 -210913 -170782 -174308 -170267 -134674 -75976
107 -75976 -39288 -54714 -4155 -64737 -401848 -258209 -263337 -299561 -165542 -76011 -90943 -22830
95 -22830 -107402 -167448 -96493 -79262 -132076 -60124 -86371 -252289 -204286 -150641 -197035 -385727
83 -385727 -502444 -470773 -440805 -383835 -401651 -481346 -277741 -211179 -382080 -163567 -122721
72 -122721 -130348 -23805 -53063 -133600 62730 64764 -106508 -68185 -75390 -253048 -321622 -172107
60 -172107 -66019 -39706 -120286 -53511 -103077 -104059 -89384 -14356 -17200 -257076 -178868 -268094
48 -268094 -347291 -180896 -154272 -186627 -9396 -209725 -201494 -114815 17116 -29052 -77928
37 -77928 -72944 -158460 70574 -153017 -269758 -195777 -96824 -234180 -236323 -275714 -385354 -322036
25 -322036 -295393 -168155 -153294 -176198 -248664 -92455 8546 -131496 -78690 1550 -226030
14 -226030 -40223 -164481 -318961 -223531 -188747 -281317 -361845 -188635 -281951 -335059 -247939
3 -247939 -178183 -241731 7352
0 7352
$$ Imaginary data points
##PAGE= N=2
##DATA TABLE= (X++(I..I)), XYDATA
16383 -2491158 -2644620 -2601559 -2441443 -2212992 -2228891 -2239572 -1981935 -1996093 -2152704 -2065973
16373 -2065973 -1868203 -1937124 -1895464 -1819711 -2058662 -1894009 -1717470 -1624918 -1571827 -1531517
16363 -1531517 -1422398 -1494336 -1529087 -1550177 -1508287 -1400237 -1241778 -1107911 -1111988 -1378385
16353 -1378385 -1363221 -1089285 -1059651 -851826 -691016 -803227 -899633 -996352 -955112 -811344
16343 -811344 -610388 -431105 -370743 -563876 -573856 -444265 -369037 -273338 -261029 -367814 -418745
16332 -418745 -139920 -105642 -19588 -45411 -114565 -21815 -138656 55470 292163 437629
16322 437629 408933 317394 261638 331688 103418 140025 305777 449009 575147 719377
16312 719377 694727 830607 1004227 821560 800368 773092 816148 964794 984845 1038727 1021329
16301 1021329 944096 1007061 1080597 1278091 1408116 1187133 1409869 1467460 1564500 1472293
16291 1472293 1458387 1620509 1766533 1692791 1515793 1669604 1830459 1872275 1866091 1754303
16281 1754303 1831260 2001335 2066997 2024499 1904196 2040772 2234801 2153017 2280839 2312958
16271 2312958 2166924 2326144 2287346 2437541 2533541 2498826 2377123 2342020 2435638 2418535
16261 2418535 2311788 2644667 2787999 2659026 2692954 2818835 2854348 2708341 2594212 2557924
16251 2557924 2639782 2871807 3021639 3119742 2985122 2936458 2985295 3104609 3023852 3047211
16241 3047211 3044022 3127044 3265745 3325853 3029192 2950648 3095400 3356430 3413682 3392731 3415234
16230 3415234 3519163 3731552 3611803 3410339 3342980 3619584 3675272 3485489 3494696 3586726
16220 3586726 3550409 3552480 3449972 3392160 3512415 3532006 3670515 3891995 3852267 3912576 3679418
16209 3679418 3379649 3791073 4039017 3860231 3885780 3776181 3877903 3850827 4008673 4160062
16199 4160062 3971853 3997799 3969101 4137129 4326171 4256102 4158655 4477936 4370890 3950434
16189 3950434 4074063 4090304 3900038 3867010 4086967 4241804 4086489 4284002 4255185 4225401
16179 4225401 4309863 4494719 4451826 4497340 4554618 4524954 4469536 4303392 4208379 4473385 4448365
16168 4448365 4509175 4362873 4159516 4425845 4626543 4738369 4453962 4676142 4705667 4890780
16158 4890780 4958094 4943519 4853368 4639405 4582384 4556648 4592712 4740746 4508630 4604119 4672401
16147 4672401 4863040 4827921 4691433 4581794 4646565 4586819 4568599 4679254 4674145 4831919
16137 4831919 4614128 4663024 4763339 5010533 5081413 4921675 4633965 4440800 4521180 4781313
16127 4781313 4981640 4975575 5037073 4950589 4976032 4886689 4785339 4969534 4868683 4637673
16117 4637673 4773467 4815491 4597152 4988633 5102587 4858966 4899353 4879273 4929116 4894449
16107 4894449 4969429 5050816 5111795 4868634 4700853 4859914 4804821 4876030 4867055 4792277 4685732
16096 4685732 4897509 5051230 5164684 5132698 5079837 5005433 4897372 4934728 4695976 4996142
16086 4996142 5136504 4964734 4994106 5071810 4950555 4889396 5023842 5336688 5283797 5275409
16076 5275409 4932039 4967060 4868509 4843237 5062852 4971215 4928611 5009919 5039238 4982290 4969355
16065 4969355 5084709 5264722 5145545 5056934 5135953 5306800 5333789 5361691 5233777 5203559
16055 5203559 4916865 4923950 5002088 5285348 5151319 5031257 4883331 5057825 5133399 4940955
16045 4940955 4945206 4753250 4784584 5037727 5195578 5118051 5089509 5191115 5182970 4938867 5090489
16034 5090489 5430098 5299333 5093224 4982958 4961901 4971515 4955418 5063507 5213584 5224206
16024 5224206 5154926 4886560 4969986 5084149 4978453 4965818 4894103 5220002 5105082 4903577
16014 4903577 4902265 4959459 4701251 4595587 4971158 5073262 5183324 5097977 5142082 5136017 5173600
16003 5173600 5119644 5301316 5417846 5369688 5312543 5053540 5049737 5039141 5223016 5430516
15993 5430516 5379501 5471184 5328153 5124633 5372912 5069420 4845827 4849236 5104702 5181082
15983 5181082 5035999 5180263 5055029 5062490 5011125 5035297 4930956 5096314 4959916 4556293
15973 4556293 4891501 4990217 5154368 5235205 4973817 5050901 5267749 5179992 5047344 4853986
15963 4853986 4676077 4822409 4823780 4989817 4953917 5064908 5043516 5046226 5234445 5226375 5039552
15952 5039552 4930417 5068888 5292650 4941811 4755399 4805986 5010969 5177022 4778675 4742472
15942 4742472 4946435 4990679 4966448 4835784 4723467 4845591 5012904 5098242 4763581 4805793
15932 4805793 5078870 5069966 5209564 5326724 5202739 5190167 5083467 5069094 4961637 4968909
15922 4968909 5056739 5289840 5293354 5104420 5156163 5053433 4868535 4803672 5073209 5389065
15912 5389065 5333208 5320690 5446399 5317997 5076971 5067867 4825441 4900820 5296263 5338970
15902 5338970 5146828 4936105 4835761 5066915 5182147 5047857 4973954 5086256 5057609 5169578
15892 5169578 5006691 5285964 5479098 5234564 4986332 5054225 5252285 5459607 5259423 4919219
15882 4919219 4543992 4704505 4884436 5072818 5081019 5199029 5359462 5389467 5353776 4998429
15872 4998429 4902766 4774019 4884725 5125429 5153858 5237532 5204170 4986394 5147441 5232032
15862 5232032 5071604 4827988 5128077 5138223 5159607 5282445 5085987 5137526 5138467 5227478 4875577
15851 4875577 4895580 5197097 5182236 5344803 4927997 5085153 5146834 5292410 5305109 5234082
15841 5234082 5035657 5170076 5217518 5147248 5296915 5301032 5333564 5207766 5122394 5389152
15831 5389152 5347506 5275441 5109676 5127851 5427354 5074046 4828738 5027296 5247169 5234442
15821 5234442 5103550 5277323 5361131 5377439 5168399 5310628 5172574 5062710 5314964 5215766
15811 5215766 5176771 5294233 5346989 5324093 5186005 5391643 5318107 5306601 5189571 5186343 5237074
15800 5237074 5228106 5164329 4778075 4691067 4890018 4992904 5157674 5013260 5131374 5341048
15790 5341048 5125137 5105307 5098343 5233077 5307317 5265317 4957891 4853485 5052365 5251995
$$ [...]
##END NTUPLES=NMR SPECTRUM
##END=
