##TITLE=1H_DE-80H_X3
 200.13MHz, d2o
 8 sc
 
 19ns.26.2.2025
##JCAMPDX= 6.0         $$ Bruker NMR JCAMP-DX V2.0
##DATA TYPE= NMR FID
##DATA CLASS= NTUPLES
##ORIGIN= UXNMR, Bruker Analytische Messtechnik GmbH
##OWNER= pz
$$ XWIN-NMR		Version 3.5
$$ Mon Sep 29 13:18:31 2025 Russian Standard Time (UT+4h)  Yarkov@DPX200
##.OBSERVE FREQUENCY= 200.1313
##.OBSERVE NUCLEUS= ^1H
##.DELAY= (6, 6)
##.ACQUISITION MODE= SIMULTANEOUS
##.ACQUISITION SCHEME= undefined
##.AVERAGES= 8
##.DIGITISER RES= 18
##SPECTROMETER/DATA SYSTEM= spect
##.PULSE SEQUENCE= zg30
##.SOLVENT NAME= CDCl3
##.SHIFT REFERENCE= (INTERNAL, CDCl3, 0, 14.3821)
##AUDIT TRAIL= $$ (NUMBER, WHEN, WHO, WHERE, WHAT)
$$ ##TITLE= Audit trail, XWIN-NMR		Version 3.5
$$ ##JCAMPDX= 5.01
$$ ##ORIGIN= Bruker BioSpin GmbH
$$ ##OWNER= Yarkov
$$ C:/Bruker/XWIN-NMR/data/yarkov2/nmr/H-C/1/audita.txt
$$ ##AUDIT TRAIL=  $$ (NUMBER, WHEN, WHO, WHERE, WHAT)
(   1,<2025-09-29 13:16:36.07 +0400>,<Yarkov>,<DPX200>,
      <created by zg, POWCHK disabled, PULCHK disabled
       configuration hash MD5:
       00 E9 B6 7A A2 85 ED C7 34 08 36 98 17 FE 4E 26
       data hash MD5: 16K
       C6 03 D5 F9 18 57 BC BA 70 7A 48 72 DD BD A2 D3>)
$$ ##END=
$$ 
$$ hash MD5
$$ 36 35 EB C9 6E 72 6C CD 83 2C DB 30 D3 5E 8C 83
##$RELAX= 
##$RELAX= 
##$RELAX= 
##$RELAX= 
##$RELAX= 
##$RELAX= 
$$ Bruker specific parameters
$$ --------------------------
##$DU= <C:/Bruker/XWIN-NMR>
##$EXPNO= 1
##$NAME= <H-C>
##$PROCNO= 1
##$TYPE= <nmr>
##$USER= <yarkov2>
##$AMP= (0..31)
100 100 100 100 100 100 100 100 100 100 100 100 100 100 100 100 100 100 
100 100 100 100 100 100 100 100 100 100 100 100 100 100 
##$AQSEQ= 0
##$AQ_mod= 1
##$AUNM= <au_zg>
##$AUTOPOS= <>
##$BF1= 200.13
##$BF2= 200.13
##$BF3= 200.13
##$BF4= 200.13
##$BF5= 200.13
##$BF6= 200.13
##$BF7= 200.13
##$BF8= 200.13
##$BYTORDA= 1
##$CFDGTYP= 0
##$CFRGTYP= 5
##$CHEMSTR= <none>
##$CNST= (0..31)
1 1 145 1 1 1 1 1 1 1 1 1 1 1 1 1 1 1 1 1 1 1 1 1 1 1 1 1 1 1 1 1 
##$CPDPRG= <>
##$CPDPRG1= <>
##$CPDPRG2= <>
##$CPDPRG3= <>
##$CPDPRG4= <mlev>
##$CPDPRG5= <mlev>
##$CPDPRG6= <mlev>
##$CPDPRG7= <mlev>
##$CPDPRG8= <mlev>
##$CPDPRGB= <>
##$CPDPRGT= <>
##$D= (0..31)
0 0.7 0 0 0 0 0 0 0 0 0 0.03 0 0 0 0 0 0 0 0 0 0 0 0 0 0 0 0 0 0 0 0 
##$DATE= 1759137395
##$DBL= (0..7)
120 120 120 120 120 120 120 120 
##$DBP= (0..7)
150 150 150 150 150 150 150 150 
##$DBP07= 0
##$DBPNAM0= <>
##$DBPNAM1= <>
##$DBPNAM2= <>
##$DBPNAM3= <>
##$DBPNAM4= <>
##$DBPNAM5= <>
##$DBPNAM6= <>
##$DBPNAM7= <>
##$DBPOAL= (0..7)
0.5 0.5 0.5 0.5 0.5 0.5 0.5 0.5 
##$DBPOFFS= (0..7)
0 0 0 0 0 0 0 0 
##$DE= 6
##$DECBNUC= <off>
##$DECIM= 32
##$DECNUC= <off>
##$DECSTAT= 4
##$DIGMOD= 1
##$DIGTYP= 9
##$DL= (0..7)
0 120 120 120 120 120 120 120 
##$DP= (0..7)
150 150 150 150 150 150 150 150 
##$DP07= 0
##$DPNAME0= <>
##$DPNAME1= <>
##$DPNAME2= <>
##$DPNAME3= <>
##$DPNAME4= <>
##$DPNAME5= <>
##$DPNAME6= <>
##$DPNAME7= <>
##$DPOAL= (0..7)
0.5 0.5 0.5 0.5 0.5 0.5 0.5 0.5 
##$DPOFFS= (0..7)
0 0 0 0 0 0 0 0 
##$DQDMODE= 0
##$DR= 18
##$DS= 0
$$ [...]
##$SUBNAM2= <"">
##$SUBNAM3= <"">
##$SUBNAM4= <"">
##$SUBNAM5= <"">
##$SUBNAM6= <"">
##$SUBNAM7= <"">
##$SUBNAM8= <"">
##$SUBNAM9= <"">
##$SW= 18.0517328524113
##$SWIBOX= (0..15)
0 0 2 0 0 0 0 0 0 0 0 0 0 0 0 0 
##$SW_h= 3612.71676300578
##$TD= 16384
##$TD0= 1
##$TE= 0
##$TE2= 300
##$TE3= 300
##$TEG= 300
##$TL= (0..7)
0 120 120 120 120 120 120 120 
##$TP= (0..7)
150 150 150 150 150 150 150 150 
##$TP07= 0
##$TPNAME0= <>
##$TPNAME1= <>
##$TPNAME2= <>
##$TPNAME3= <>
##$TPNAME4= <>
##$TPNAME5= <>
##$TPNAME6= <>
##$TPNAME7= <>
##$TPOAL= (0..7)
0.5 0.5 0.5 0.5 0.5 0.5 0.5 0.5 
##$TPOFFS= (0..7)
0 0 0 0 0 0 0 0 
##$TUNHIN= 0
##$TUNHOUT= 0
##$TUNXOUT= 0
##$USERA1= <user>
##$USERA2= <user>
##$USERA3= <user>
##$USERA4= <user>
##$USERA5= <user>
##$V9= 5
##$VALIST= <valist>
##$VCLIST= <CCCCCCCCCCCCCCC>
##$VD= 0
##$VDLIST= <DDDDDDDDDDDDDDD>
##$VPLIST= <PPPPPPPPPPPPPPP>
##$VTLIST= <TTTTTTTTTTTTTTT>
##$WBST= 1024
##$WBSW= 4
##$XGAIN= (0..3)
0 0 0 0 
##$XL= 0
##$YL= 0
##$YMAX_a= 878363
##$YMIN_a= -735408
##$ZGOPTNS= <>
##$ZL1= 120
##$ZL2= 120
##$ZL3= 120
##$ZL4= 120
##$ABSF1= 10
##$ABSF2= 0
##$ABSG= 5
##$ABSL= 3
##$ALPHA= 0
##$AQORDER= 0
##$ASSFAC= 0
##$ASSFACI= 0
##$ASSFACX= 0
##$ASSWID= 0
##$AUNMP= <proc_1d>
##$AZFE= 0.1
##$AZFW= 0.1
##$BCFW= 1
##$BC_mod= 2
##$BYTORDP= 1
##$COROFFS= 0
##$CY= 83.5205535888672
##$DATMOD= 1
##$DC= 2
##$DFILT= <>
##$DTYPP= 0
##$F1P= 10.8118882576601
##$F2P= -7.23987719738617
##$FCOR= 0.5
##$FTSIZE= 0
##$FT_mod= 4
##$GAMMA= 1
##$GB= 0.15
##$INTBC= 1
##$INTSCL= 1
##$ISEN= 128
##$LB= 0.25
##$LEV0= 0
##$LPBIN= 0
##$MAXI= 10000
##$MC2= 0
##$MEAN= 0
##$ME_mod= 0
##$MI= 1.114404
##$NCOEF= 0
##$NC_proc= 0
##$NLEV= 6
##$NOISF1= 3.799351
##$NOISF2= 2.8
##$NSP= 1
##$NTH_PI= 0
##$NZP= 0
##$OFFSET= 14.38212
##$PC= 1
##$PHC0= -2080.447
##$PHC1= 31.99097
##$PH_mod= 1
##$PKNL= yes
##$PPARMOD= 0
##$PSCAL= 0
##$PSIGN= 0
##$REVERSE= no
##$SF= 200.129724274929
##$SI= 16384
##$SIGF1= 3
##$SIGF2= 2
##$SINO= 400
##$SIOLD= 16384
##$SREGLST= <1H.CDCl3>
##$SSB= 0
##$STSI= 0
##$STSR= 0
##$SW_p= 3205.1282051282
##$SYMM= 0
##$S_DEV= 0
##$TDeff= 0
##$TDoff= 0
##$TI= <>
##$TILT= no
##$TM1= 0
##$TM2= 0
##$TOPLEV= 0
##$USERP1= <user>
##$USERP2= <user>
##$USERP3= <user>
##$USERP4= <user>
##$USERP5= <user>
##$WDW= 1
##$XDIM= 8192
##$YMAX_p= 0
##$YMIN_p= 0
$$ End of Bruker specific parameters
$$ ---------------------------------
##NTUPLES= NMR FID
##VAR_NAME=  TIME,          FID/REAL,        FID/IMAG
##SYMBOL=    X,             R,               I
##VAR_TYPE=  INDEPENDENT,   DEPENDENT,       DEPENDENT
##VAR_FORM=  AFFN,          ASDF,            ASDF
##VAR_DIM=   8192,          8192,            8192
##UNITS=     SECONDS,       ARBITRARY UNITS, ARBITRARY UNITS
##FACTOR=    0.0002768,     1,               1
##FIRST=     0,             0,               0
##LAST=      2.2672688,     0,               0
##MIN=       0,             -735408,         0
##MAX=       2.2672688,     878363,          0
$$ Real data points
##PAGE= N=1
##DATA TABLE= (X++(R..R)), XYDATA
0@%%%%%%%%%%%%%%MmKqJ4j6J6k1K9l6M2n0O0o9Q1r5J11j30J49j68J93k21K50k84
38a51L19l59M04m53N07n62O24o95P69q50R40j037J145j261J385j522J672j838
56i63K021k222K444k690K963l263L590l932M260m475M268k541o230R5191P89942
71H78363o05628r62124L42997M36201o2543j14795k06368j07480N05788K50888
81C55299o03142k69167O54357L50067m25038l45735J53690L29449J43824k10176
91A33428k30442O4323J13888j6489k5195o6497N19J50516p1308k73781J07671
102a13367L17790n9479j79513L9195m8642q8490J52511M3569j45563J28424R9254
113A45689l21782q8444L43253M3268k09976K8174L8661o0062Q1102J4852j13458
$$ plain form
0 0 0 0 0 0 0 0 0 0 0 0 0 0 0 0 4 0 2 -6 8 -8 8 -13 16 -20 22 -28 32 -37 44 -51 60 -70 79 -89 104 -117 133 -151
38 -151 168 -191 213 -240 267 -295 329 -366 403 -447 493 -544 601 -660 725 -797 875 -963
56 -963 1058 -1164 1280 -1410 1553 -1710 1880 -2052 2208 -2267 2001 -540 -6770 88421 878363
71 878363 272735 -689389 -346392 89809 27266 -87529 -293897 -401377 104411 355299
81 355299 -247843 -517010 137347 487414 62376 -283359 -129669 199780 343604 133428
91 133428 -97014 -32691 81197 64708 39513 -26984 -26465 124051 52743 -221038 -113367
102 -113367 204423 144944 -34569 4626 -44016 -132506 20005 63574 -81989 46435 145689
113 145689 -176093 -264537 78716 121984 -87992 -59818 -21157 -81219 -117 14735 -98723
124i8723J22975J52314k08527j61835J99925J44465o5003m0640l9517M738J34847
135A45019l4276j92730N3332J23688r9195l9611P3070m6686j2494M8845j16507
146i7545n1904J82115K9016j34187O9657N5290j64916K6890J91282q0007r0953
157f5262J31044n1577j30249J76904R1667j89210K2914J48972j51467j45732J46308
168a5688J03905n5670k3889n8000q4469J01301J39766p2733j02683M3208P0232
179D5280P886o6687l6846J41041Q3865k06527j41031J45678J12382j9226k5181
190D0634j05237o6361J63921P7680j97334l0441K13882k4207j97873L0837J08860
201A4361O406M0193l1510j36048O8559J66106p7247j12093Q2290N1511o4224k4164
$$ plain form
124 -98723 24252 176566 -31961 -193796 6129 150594 85591 44951 5434 10172 145019
135 145019 110743 -81987 -28655 95033 -4162 -43773 29297 -17389 -29883 18962 -97545
146 -97545 -149449 32666 61682 -72505 -2848 52442 -112474 -85584 105698 25691 -65262
157 -65262 65782 14205 -116044 60860 152527 -36683 -13769 135203 -16264 -161996 -15688
168 -15688 88217 32547 8658 -49342 -133811 -32510 107256 34523 -68160 -24952 45280
179 45280 53166 -13521 -50367 90674 174539 -31988 -173019 -27341 85041 65815 40634
190 40634 -64603 -130964 32957 110637 -86697 -117138 96744 72537 -125336 -94499 14361
201 14361 20767 60960 29450 -106598 -38039 128067 50820 -61273 21017 72528 8304 -15860
213a5860Q137M830L0152k9047q3867L8218J04519k0228n6488J0128l508J6253
225C239M0006n2865j0066J17954l7814j78631L4376J58540o16o7007l0804n0122
237g3810K4303J01497m0020j03455R0733J05092j18413j16914O0221R6725N5359
248H1318l1130j25948j871J58803K9175j14875j6099O7025J3936l2673n3902k7055
260e3296P6702O9707r3339j09687O1355R4299k1567n9763k5768K9761O7864j8308
272A7960p9501L5610P7524l8161n8788Q817L0454N5786L2483q1329o4594Q6357
284B2618N9011q8381l6295P2489j846n4430M587M09O186N9057k0445r5505J9481
297e3064R4021R170l6641q116k006p7M870j3994q467K3703N98m1681j2095K4087
$$ plain form
213 -15860 -7723 -2893 27259 -1788 -85655 -47437 57082 36854 -19634 -9506 -13014 3239
225 3239 43245 -9620 -19686 98268 60454 -118177 -83801 74739 74123 7116 -23688 -73810
237 -73810 -49507 51990 11970 -91485 -752 104340 -14073 -130987 -70766 25959 81318
248 81318 50188 -75760 -77631 81172 110347 -4528 -20627 46398 60334 27661 -26241 -53296
260 -53296 23406 93113 -226 -109913 -48558 45741 24174 -35589 -61357 -31596 36268 17960
272 17960 -61541 -25931 51593 13432 -45356 -36539 -6085 49701 82184 855 -63739 22618
284 22618 81629 -6752 -43047 29442 27596 -26834 -22247 -21838 -15652 43405 22960 -72545 -53064
297 -53064 40957 50127 13486 5370 3364 3287 8157 -5837 -14304 9399 9997 -31684 -43779 -19692
311a9692K2157K7431r635o0826m513M6474j377L636L8255k1318m2029K4136J5411
324A8110k4351K5141M3267l5331m4303K3912J0785k1314J9966M563n7202j3694
336e0451M0076J716j6040P009K510k133J914n30J4269K1342o331k5096m794K3253
350F714K6763L114l1982l2418K5855M4059k1951k9928L4845K0194l9333l3334
362b7402n30L0700M0301k5211p3877l915O5882K3349l8706k0189K5956K6189p282
375A5265l9262j8540N4448M6689n5887o6648K7147N6654J0143l3633l5779J9629
387a9774N1888q375n0499J1024O3332J0466n9282l6289L4629N4832K070o2316
399h294l4823N6395M2393n2241m2117L5557L3873k4087n5179j9410N4151N0513
$$ plain form
311 -19692 2465 29896 20261 -40565 -45078 1396 19 3655 41910 20592 -21437 2699 18110
324 18110 -6241 18900 62167 26836 -17467 6445 17230 -4084 15882 20445 -36757 -50451
336 -50451 -10375 -8659 -24699 -17690 -15180 -17313 -15399 -15929 -1660 19682 13351 -11745 -16539 6714
350 6714 33477 36591 4609 -27809 -1954 42105 20154 -9774 25071 45265 5932 -27402
362 -27402 -27932 2768 43069 17858 -56019 -59934 5948 29297 -9409 -29598 -3642 22547 15265
375 15265 -23997 -42537 11911 58600 2713 -63935 -36788 19866 30009 -3624 -39403 -19774
387 -19774 32114 23739 -26760 -15736 47596 58062 -1220 -37509 -2880 51952 54022 -8294
399 -8294 -43117 13278 55671 3430 -38687 -3130 30743 6656 -48523 -67933 -13782 36731
411C6731m2827o9753K0252P3832R584m8184j2447L8779L7938n617m7121r308O2972
424D4831K1935o9423m2806M1992M9067o282m5201k5802K4915L3036j3640m0109
436b7487J903M3747N861m7766k4300L6760M6273j1095n4186j0445M2858J7016
448A9139j7868p184Q339J2841m493l5947j4378M3576L0849l5674l7064K4153L7650
461B3939l376j7151l670P989J7039n108k9211P385L3444j0882l7046q291J6076
474h863J7611j52k3102j1780K0522J6387j3737j1081J2329L320j1673L0M544N818
488A73J6643k572k1204M761J4134o299P97J1117o672j4506k968L032K088L57p359
503h478j0635N109J1862n602l048J6645N842j0658o505m13J4812J8131j5145k2517
$$ plain form
411 36731 -6096 -75849 -55597 18235 27819 -20365 -32812 5967 43905 38288 -8833 -18141 44831
424 44831 66766 -2657 -45463 -3471 45596 39314 -5887 -31689 -6774 26262 12622 -27487
436 -27487 -25584 18163 24024 -23742 -48042 -11282 34991 23896 -30290 -40735 2123 19139
448 19139 1271 -5913 2426 15267 10774 -25173 -39551 4025 34874 -800 -37864 -13711 23939
461 23939 20563 3412 -258 7731 24770 19662 -9549 -2164 31280 20398 -16648 -24939 -8863
474 -8863 8748 8596 -14506 -26286 -5764 10623 -3114 -14195 -1866 1454 -10219 -10189 -5645 173
488 173 16816 14244 -6960 -2199 11935 5636 6433 17550 10878 -3628 -6596 -3564 -1476 -1119 -8478
503 -8478 -19113 -14004 -2142 -7744 -10792 5853 11695 1037 -5468 -5881 8931 27062 11917 -10600
517a0600J1142J4358q436o672P369O925k603j3883j4739R598K5079r224l7553
530b9239j325K7795L089j3182n528M788K1038O379l0078o245M0132J6834k8481
543E977k0205J0800J8870N317j7473k3345J2143L5724p090l6385N142K9779J463
556B0717j9353j8148K374L0933J0020l5251k1380K0868J8643r809j6189K861J8823
569E109P069k0831j8245K2492K8129j9021l1433N864K1013J0522l477j4820O129
582a500K6135r334l1118J1689L4481n19k7548j4692J0411K0943J189l0913j8194
595b8970K8110K1356k5062j9107J6785J7163j170k0942k1659J9108L4744j2861
607G495l2980N058K6032P865j1204j2588M627K3443P256k6408j2006K8344J3056
$$ plain form
517 -10600 542 14900 6464 -208 7161 14086 11483 -2400 -17139 -7541 17538 8314 -29239
530 -29239 -30564 -2769 320 -12862 -18390 -13602 7436 13815 -16263 -22508 17624 34458 5977
543 5977 -14228 -3428 15442 20759 3286 -20059 -7916 27808 20718 -15667 -10525 19254 20717
556 20717 1364 -16784 -14410 16523 26543 -8708 -30088 -9220 9423 -386 -16575 -13714 5109
569 5109 12178 -8653 -26898 -4406 23723 4702 -26731 -20867 146 10668 7191 -7629 -1500
582 -1500 24635 15301 -15817 -4128 30353 29834 2286 -12406 -1995 18948 20137 -10776 -28970
595 -28970 -860 20496 -4566 -23673 -6888 10275 9105 -11837 -33496 -14388 20356 7495
607 7495 -25485 -20427 5605 13470 2266 -10322 -5695 17748 25004 -1404 -13410 14934 27990
620B7990k3985j5872K634R033J2525p200j9390R324J8423j0211j3597O982Q435
633E091l16o058j0736o80J7826O590j9472p469J3751L106j767N035n097j547J1223
648I480q369j5775J2092J3938q197p683M31j56O429Q374o029o622R035L155j0907
663h04R07O334n742j931L41r769J453J1012m194k852O458m188m532R988L351q853
679c021l46M895l418M97O250m187l230Q655l031q305J2410P333j2311l363K156
694I84n471L384L629j0083m92J1246m850j1404Q900J3209m399p053q70j30R828
709F428Q110j6523j0478J7101N754j5050o140N758J1400Q301j3798j8144J2938
722d343K2681p866k2371j920J3905Q593m494j4400j957K3246P573k6463r030K2940
$$ plain form
620 27990 4005 -11867 -9233 -200 12325 5125 -14265 -4941 13482 3271 -10326 -3344 5091
633 5091 4775 -1283 -12019 -12699 5127 11717 -7755 -15224 -1473 1633 -134 4901 -196 -1743 9480
648 9480 1111 -14664 -2572 11366 3169 -4514 -4083 -4239 2190 10564 4535 -2087 6948 10103 -804
663 -804 103 6437 695 -1236 -895 -10664 -9211 1801 -2393 -5245 1213 -2975 -7507 2481 5832 -3021
679 -3021 -3367 1528 -1890 -1393 4857 670 -2560 6095 3064 -5241 7169 14502 2191 -1172 984
694 984 -4487 -1103 2526 -7557 -8049 3197 -1653 -13057 -4157 9052 4653 -2400 -3270 -3400 6428
709 6428 14538 -1985 -12463 4638 10392 -4658 -10798 -5040 6360 14661 863 -17281 -4343
722 -4343 18338 10472 -11899 -13819 86 8679 4185 -10215 -12172 11074 18647 -7816 -16846 6094
736F094J1809q654j4190q995J2185J6172j3646k0953R960J8572m896j2415K019
749f938R698P567k405j5657k058K1738L662k0654l484J1692K733j935o570o375
763h986J1135J0049j4139j1793J3612J2288r288j2310j804N886J0225n55j5036
776a0716K121K0568r80j7136O40J1519O292l141j4901o210J6407Q396j6497j0453
790a4091J0689R186m753o593m31P802J0226p592j6968P580J6851p285j2431K499
804e311N279M308l15r701m79J3647R30j3182q25J0556J591o219l967k342L764
819b266P938n596q844R357Q049p513k669L391o77K772Q6q498j175P045j148n485
835e233J766K033k711K017M679j802L65L136n021j606O879k954n479O306K159
$$ plain form
736 6094 17903 9249 -4941 -13936 -1751 14421 775 -20178 -10218 8354 3458 -8957 -6938
749 -6938 2760 10327 7922 -7735 -9793 11945 15607 -5047 -8531 3161 5894 3959 -2611 -8986
763 -8986 2149 12198 -1941 -13734 -122 12166 2878 -9432 -11236 -5350 4875 4320 -10716
776 -10716 -8595 11973 10993 -6143 -5503 6016 12308 9167 -5734 -11944 4463 12859 -3638 -14091
790 -14091 -3402 5784 1031 -5562 -5993 1809 12035 4443 -12525 -4945 11906 4621 -7810 -5311
804 -5311 -32 4276 3961 -5740 -6219 7428 8358 -4824 -5649 4907 6498 279 -3688 -6030 -2266
819 -2266 5672 76 -8768 589 8638 1125 -1544 1847 1170 3942 4028 -4470 -5645 1400 252 -5233
835 -5233 -3467 -1434 -4145 -2128 2551 749 1114 4250 -771 -2377 4502 1548 -3931 2375 4534
850D534o217L70L508J049K435k144p643J213R422j197r875k45M550k579j574m81
866d874j798O638N419r110l052J0266K328o262j787J151K185K433l464m648M962
881C87O634n477o416O327O424k510k723l405p0P507k462j2843J586J1086j629
896B416q296j462N462O856n18j0456n008J1073R062r522r908O594Q071j251o379
911c266m899P664J2872n703j3556M919J3023K59r571p268L139R438r79j2265l133
926i326J2483N292j1804o520P728P058n8p848p608Q523J0841r620j1704P131R901
941D469j367o998j828O653R069k140j1702j569J2459L117j1121m387N542M340
955D537p82o564l929Q702O020q443o208N301N772r69o254m383L265N771j367o505
$$ plain form
850 4534 -1683 -1313 2195 3244 5679 3535 -4108 -2895 6527 5330 -4545 -4790 -240 -2819 -4393 -4874
866 -4874 -6672 -34 5385 -3725 -6777 3489 5817 -445 -2232 -1081 1104 3537 73 -4575 387
881 387 7021 1544 -4872 1455 7879 5369 2646 -759 -829 6678 4216 -8627 -7041 4045 2416
896 2416 -5880 -7342 -1880 4976 4458 -5998 -11006 67 9129 -393 -10301 -3707 4364 3113 -3266
911 -3266 -8165 -501 12371 6668 -6888 -1969 11054 11313 1742 -5526 -2387 7051 6072 -6193 -9326
926 -9326 3157 8449 -3355 -9875 -2147 4911 4853 -2995 -10603 -2080 8761 -859 -12563 -5432 4469
941 4469 3102 -3896 -5724 929 9998 7858 -3844 -5413 7046 10163 -958 -5345 197 4537
955 4537 3755 -2809 -6738 1964 7984 -459 -6667 -1366 4406 3437 -2817 -7200 -3935 1836 469 -6036
971f036J233P493J18m549P97K443L234J185o779l183P814K279p550k375L243J646
987A013r8j865j784K908N205k668p603J899O280k593m498J004J055K109J028m233
1003b841j87O005M65l833K2K119Q97o10j873j748K86J304r07o71K815k9l008K719
1021I25K133k596l44L84j378J347j53l977J339M113k248m564J682N026J042j764
1037I67j039n10K559K245n123l653N747K231m525r17K105K476J748l590m324L795
1053A92M729l010n086J035L684j139l968j536K064M939O37o687M4Q312J197n147
1069B60k479J226L741O29n423k275N797L460m953m850L189N945Mm393k882K644
1085c60N605k064q233M46N847K43l066k209J856N794M08o905j690O328K919m695
$$ plain form
971 -6036 -4803 2690 2808 -1741 -944 1499 4733 5918 -861 -4044 3770 6049 -1501 -3876 -633 1013
987 1013 915 -950 -2734 174 5379 2711 -4892 -2993 3287 694 -3804 -2800 -1745 364 1392 -2841
1003 -2841 -3028 2977 3442 -391 -369 1750 2647 2037 164 -1584 -1298 6 -901 -1572 1243 1214 -1794 925
1021 925 3058 462 118 502 -876 471 318 -3659 -2320 1793 -455 -5019 -3337 1689 2731 967
1037 967 -72 -582 1977 4222 -901 -4554 1193 3424 -1101 -2018 87 2563 4311 721 -3603 192
1053 192 4921 1911 -3175 -2140 1544 405 -3563 -5099 -3035 1904 2541 -4146 -4102 4210 5407 260
1069 260 -2219 -993 2748 3377 -2046 -4321 1476 4936 -17 -4867 -1678 4267 4271 -122 -3004 -360
1085 -360 5245 3181 -5052 -4606 1241 1484 -1582 -3791 -1935 3859 4267 -2638 -4328 2000 4919 224
1101B24m510J836L833O40l178m215L163P410k363o817L152O166n93l900l406J083
1117a475N003m71o780j358O121L134n234m111L834M262l04l699k588L807M310
1132D451m339m793K228L499N02k537j865L415M150k388l919J210L132n47k829
1147f30q83Q43J148L16k601j802M032K057l577L77K790p75n05k17j757K43J704
1164G63j541k076J367K473p38j205R68L51q8J270o52j312J576j67j843O64M23
1181B33j300M47Q27p4J005J52n51J30k4q49j321R92O05j642q89J207L12R99K55
1200E14k181R16L534q21k500N25R95J54q49k057l01K437J271k321j385L150K072
1217C153k344j700L75J172J770j996l813J990L691j831k991L08K402J701j045
$$ plain form
1101 224 -4286 -2450 1383 2023 -1155 -5370 -2207 5203 2840 -3977 -825 5341 4748 848 -2558 -1475
1117 -1475 3528 3057 -3723 -5081 1040 4174 -1060 -5171 -1337 2925 2621 -1078 -3666 141 4451
1132 4451 112 -4681 -2453 1046 1548 -989 -2854 561 4711 2323 -1596 -386 2746 2199 -630
1147 -630 -1513 -670 478 794 -1807 -3609 423 2480 -1097 -720 2070 1295 790 573 -1184 -941 763
1164 763 -778 -2854 -1487 986 248 -957 11 362 274 1544 892 -420 1156 989 -854 -190 233
1181 233 -1067 -620 207 133 1138 1290 739 869 845 -4 -1325 -333 272 -1370 -2259 -1052 -740 259 514
1200 514 -1667 -751 2783 1962 -538 -13 982 1136 287 -1770 -2071 366 1637 -684 -2069 1081 3153
1217 3153 809 -891 -516 656 2426 430 -3383 -1393 2298 467 -2524 -2216 186 1887 842
1232H42k378Q01L179Q4m258j784L783J906k924j968P09L148K423l211l088L583
1248H47L429k457l120P8K588J047l043l255J810M012n69m138k45M463J500k467
1264D80k175j63L467J227m637k146M330K264k392k346M00L145J737k426k496J852
1280A21L456j539m579K01L267L15j803j992K20L986J381l777j253K951J151j450
1296F56j847l45J813Q19k048k255J507L138o64k530Q44K190J085l12k467p21K885
1313A748O6k718k44J535N60l21j118l50J594Q92j470j637J363J488j527j915M88
1330a566M63M16J82j512O66K964m62j367P11R33l28m19n67j06O68rj106p32J479
1349C08N29j181K43P06l90N23L56j338j09Q3j226K54J201p33n30J028P12k94k05
$$ plain form
1232 842 -1536 -735 2444 2528 -1730 -3514 269 2175 -749 -2717 -2008 1140 3563 352 -2736 847
1248 847 4276 1819 -1301 -1223 1365 2412 -631 -3886 -2076 1936 1367 -2771 -3016 1447 2947 480
1264 480 -1695 -1858 1609 2836 -1801 -3947 383 2647 255 -2091 -1691 1454 3191 765 -1731 121
1280 121 3577 2038 -2541 -2340 927 1242 -561 -2553 -2333 1653 3034 -743 -1996 955 2106 656
1296 656 -1191 -1536 277 1096 -952 -3207 -1700 1438 774 -1756 -912 1278 2363 2051 -416 -1137 1748
1313 1748 1814 -904 -1148 387 947 626 -492 -842 752 1644 174 -1463 -100 1388 -139 -2054 -1566
1330 -1566 -1103 -687 -505 -2017 -1351 1613 1151 -216 495 1428 1100 681 114 8 676 667 -439 -1171 308
1349 308 837 -344 -101 605 215 738 1094 -244 -353 -270 -1496 -1242 -41 -774 -1304 -276 436 142 -63
1368f3K56J42J34K52j070l52J586m46j934O56J291r8M06l93m11J708N84k179r35
1387h66R46N81j125j015L9O43Q73j35j743Q75K507o66j673N84R24L39j33k258
1405a303l66K349P43j972p00J484J461n97j214k69O42J257j250k543J025K207
1421I54r58j587J25O30J899K65k064Q2K200N47k090r92Q89Q07l60j099q57J304
1439c05K006j252k327J921J864q97j262m16M55J719j088k834M32K671J2j831l24
1456a456J764J037o02j071p51J797J051k371j576K013J400r59r94m18J216J846
1472A926q73j663Q20J293k37j495n23M48K13j35r21n79J703Q99j259l07J177j68
1490C19J15j84r60M46J079o95j294P35O48j74n0M35o3K45P17j032m48J047j65
$$ plain form
1368 -63 193 335 469 721 -349 -701 885 439 -1495 -839 452 354 760 367 -44 1664 2248 69 -866
1387 -866 80 661 -464 -1479 -1440 -797 76 -59 -1802 -927 1580 914 -759 -175 749 1088 955 -1303
1405 -1303 -1669 680 1423 -549 -1249 235 1696 1099 -115 -384 258 1515 265 -2278 -1253 954
1421 954 -4 -1591 -1466 -836 1063 1328 -736 -654 1546 2093 3 -989 -100 707 347 -752 -1609 -305
1439 -305 1701 449 -1878 43 1907 1010 -252 -668 -213 1506 418 -2416 -1984 687 699 -1132 -1456
1456 -1456 308 1345 743 -328 -1079 718 1769 -602 -2178 -165 1235 276 -718 -1136 80 1926
1472 1926 1053 -610 210 1503 1266 -229 -752 -304 -91 -226 -1147 -1726 -23 876 -383 -690 487 319
1490 319 434 250 -710 -264 815 120 -1174 -439 209 35 -15 420 357 602 1319 287 -161 886 721
1509G21j711L09N48l42N90J2q09N51R78m94n48M66R1m65j43P0m99j54M99m96k
1530h28J159M1k92J032l47p12N36j67k96n4k38k21N01J34p47j87R43L65p17K6
1550f9M69k80L00l45j535N69J327j117n87J227L26j47L4j50K76R16k65j481k67
1569g99J482j4j495pO86P4L81m15n22J517Q51j642r76J008O86l62j227m45R00
1588c19R91l50j481K36J610J94j102k07M44O97K19j748o68J656M12r05l20N31
1606a10O87N20m91j064P75R84p29j427L30R49m43m50k87j65P46Q88j147p5J563
1625A054pj084m03L16N24j29r16n97P90J348m31j269O44R58k15m01l38j16J070
1644G98j10j623M9J013L08m75n62J89J159L76q12o15M23M97n73o54O3L10m4Q8
$$ plain form
1509 721 -990 -681 -133 -475 115 127 -682 -131 847 353 -195 271 362 -103 -246 -176 -675 -829 -330 -826 -828
1530 -828 331 372 80 1112 765 53 589 422 126 72 -166 -387 114 248 -499 -686 257 622 -95 -69
1550 -69 400 120 420 75 -1460 -891 436 -681 -1268 -41 285 138 172 22 298 1214 949 -532 -799
1569 -799 683 669 -826 -833 -147 -73 308 -107 -629 888 1739 97 -879 129 815 453 -774 -1219 -319
1588 -319 672 322 -1159 -923 687 881 -221 -428 16 713 932 -816 -1484 172 584 -321 -641 -110
1606 -110 577 1097 606 -458 317 1301 572 -855 -525 424 -19 -469 -756 -921 -175 713 -434 -509 1054
1625 1054 1047 -37 -440 -124 400 271 -645 -1242 -452 896 465 -804 -160 798 583 182 -156 -272 798
1644 798 688 -935 -886 127 435 -40 -602 -413 746 1122 310 -305 118 615 42 -612 -549 -239 -283 -195
1664a95o23J26J250k50o36N80N71m01j15j50l41K66N4m45l54O82M95n08p1M62
1684C97k77qM14o62j10M38k77m67K15J2MK87J39k03J43N87rn49k28J82j60L9k85
1707c78l96N07M18m04J59K13O0K65N9l86KL27j44n23k22J33R0k1K23k39J32P41
1729F16j90m69K51m6j94J19l07k39L60J57m12K17L44J53k07n1L21L9j01l09m57
1750d05J84N12m83n55M46K77N8J21l11J99O29j53o01j03L15M28o87m46j2M87N72
1771D72m60n61N22Q94m58n49j44J99L02j56p90L08N44n6m10j66N88M19k73j63
1791F2p6K01M30n66n87M70J85m52n9K21L22K88k16k34L92L08k89n99j69M85m4
1812G3l51k38j28M14L87l87l03N64L02p2j52l99J57L50k33m27M2O05K26l09j16
$$ plain form
1664 -195 -818 -692 558 308 -328 252 823 422 307 157 -184 82 136 -309 -663 19 514 6 -65 397
1684 397 120 112 526 -136 -246 192 -85 -552 -337 -325 -321 -34 105 -98 45 632 623 74 -154 28 -132 -93 -378
1707 -378 -774 -267 151 -253 -94 119 179 444 503 117 119 446 302 -221 -443 -310 -220 -241 -18 -257 -125 616
1729 616 426 -43 208 162 -32 87 -220 -459 -99 58 -354 -137 207 360 153 102 423 462 361 52 -405
1750 -405 -221 291 -192 -747 -301 -24 34 155 -156 43 672 519 -82 -185 130 558 -129 -575 -587 -100 472
1771 472 12 -549 -27 867 409 -140 -284 -85 217 61 -729 -421 123 67 -343 -509 79 498 225 62
1791 62 -14 187 617 51 -536 -66 119 -333 -392 -171 151 439 223 -11 381 689 400 -199 -368 117 73
1812 73 -278 -516 -644 -230 157 -230 -533 31 333 261 109 -290 -133 217 -16 -443 -401 204 430 121 5
1833EJ53K45J36k85m20L35L28o45j58r6N9K08oj94J22L97o8J8m6R8K3m79j15K80
1857a05j4j3q5j67M08K37k90J34K84p4R7j43l67J93%q1l02M0K39K30k19O2j49
1880h5R2K76j87k84R5o0l5J65l89k05L68K69p5J05kK46J86k96r3j80Q6J76m99
1903c26m0L06K2MR0l21L97L16l79j53K03ok4k49j55L8J93L2m2M3L28m1k86R4K40
1928B84q6k70o6k09L47J29m01j53L42J44J49k16J24K64R9l29k69r2K44M9l56p0
1950c42O0K68L94n43m5M84L06l97j98j28J64J78k71k25J9L54J8l05P1M25r9j4
1972A74k13q7K21K0l65j90M33n9j38J53L5K40l0j47J07J45J01j46m94k2K89j38
1994a11j1q9M2M67J3l94n2L10K35k66k12k8J81n6j60p6J29J50q0o7J50J51r6J49
$$ plain form
1833 5 158 403 539 254 -166 169 497 -148 -306 -402 -343 -135 -141 -335 -213 184 116 134 88 186 209 -270 -385 -105
1857 -105 -119 -132 -217 -384 24 261 -29 105 389 315 412 269 -98 95 95 14 -288 -248 -9 221 2 64 -85
1880 -85 7 283 96 -188 -93 -153 -188 -23 -412 -617 -249 20 -55 50 48 294 480 184 91 -89 -3 173 -326
1903 -326 -366 -60 -38 -34 56 -265 132 448 69 -84 119 113 89 -160 -315 -277 -84 -52 -94 -51 277 236 -50 44 284
1928 284 198 -72 -138 -347 0 129 -272 -425 -83 61 210 -6 118 382 481 152 -117 -209 35 84 -272 -342
1950 -342 -282 -14 380 -163 -208 276 582 185 -13 -141 23 201 -70 -295 -276 78 96 -209 -138 287 188 174
1972 174 -39 -126 95 115 -250 -440 -7 -66 -204 -51 -16 224 194 47 154 299 400 254 -240 -262 27 -111
1994 -111 -122 -211 -169 298 311 -83 -135 175 410 144 -68 -96 85 29 -131 -207 -78 72 -8 -75 75 226 130 279
2018B79k81k0R8o2k31O7J1r8J72R0P2j30J04K45j34k42J64j55j90J23L7q5j8Q
2042a76Q0J94J07k64J31%L6J7k06L9p6J09j25j69K60J07m4J79j77j14K49R8k96
2065d1k21P5pJ39M4l19J90K19K5Nm1n9J33O9l9k77p3K95j98k98L14J1j0L9Q2K8
2091H5N0J59j83pj49L5Q5l57J95J46j43J12j06Q0J95l4r5J1J19j47j92j91J98
2114a34K11j78L5J14l6J21k4K3%N9mj44j90J03J59k73k7K39j52K82j28k17K52
2137I1J63q4j94N0p3J6M7q8j59L7K62j2r6M0jP3l5r7j8J21L8k23J35l0M8m9K6
2164a2J80l5K5r8j11Q8J16l18L3J75n6j7k5j11n3L54o2k29N4K53n7l3k12ll8J24
2190f8jn4J46N1j7R0O4j74M5K5l12J83J38j45m5M1%o7K31j11J4N9Q7j17q7k3Q6
$$ plain form
2018 279 -2 -22 76 14 -217 -150 -139 -237 -65 25 97 -33 71 316 182 -60 104 -51 -241 -118 -81 -166 -184 -176
2042 -176 -96 98 205 -59 72 72 108 125 -81 -42 -118 -9 -134 -303 -43 64 20 199 22 -92 157 255 -41
2065 -41 -262 -187 -194 -55 -11 -330 -140 79 104 109 68 9 142 211 172 -105 -178 117 -81 -379 -65 -54 -64 -25 57 85
2091 85 135 294 111 104 -45 -10 75 -282 -87 59 -84 28 -78 2 197 163 68 79 198 51 -141 -332 -134
2114 -134 77 -101 -66 48 12 133 109 132 132 191 187 43 -147 -44 115 -158 -185 54 -98 184 56 -161 91
2137 91 254 170 -24 26 -47 -31 16 -72 -231 -194 68 56 -40 0 -1 72 37 -60 -78 43 81 -142 -7 -37 11 -38 -12
2164 -12 168 133 158 60 -51 37 153 -165 -132 43 -13 -30 -55 -166 -219 135 73 -156 -102 151 94 61 -151 -154 -192 -68
2190 -68 -69 -123 23 74 57 147 211 37 82 107 -205 -22 116 -29 -74 -33 -33 -100 131 20 34 93 180 63 -24 -47 39
2217C9k66L2J91j85J33J1m6J47K02k03qQ7k01J76j13R1j61N2o8Qj20K56r0P0J05
2242A39j40k5J65p1k57nJ08J82n5m8p1J91p1oM6j02J44J1j06O7k59m7J37l9m6
2267a58J10l5P2O9r7J79j15N7n1j03O5nj39j4L3Q8R4N3J0k2O2j47J00r5L1m4q9
2294i1p1J50J86k08J6P9R1k5m4q2p8K02m8r3j82J50L1p3J1P7J03O0n0n6Ro9J0
2321Eq1n2J25q0j1J1J6LJ52LPRj10M5j3j7R0j25m4p4J31N0n7J19NK8k39J45J3
2350E4j28M1m2n2J32J5J5mj1p4O1J10o7J4j13K5L6j41J5J12j46K14k9l6M5R6m3
2377I9j08j1n3J60l8j87J24p7P0J1p2R9N6k0J6l4k4L0j05K1NP8r1K4o2OR9m1K40
2406B15j83O6kj54Q7J33k48j5J46j30L7M8L3q3Q8j17P9R3q9K0l1J41j95L4r3K32
$$ plain form
2217 39 -227 -195 -4 -189 -56 -45 -91 56 258 55 47 134 -67 109 -4 87 -74 -22 -90 -82 -202 54 -36 34 139
2242 139 -1 -26 139 68 -189 -194 -86 96 41 -7 -78 113 42 36 82 -20 124 135 29 96 -163 -210 -73 -112 -158
2267 -158 -48 -83 -11 58 -39 140 25 82 31 -72 -7 -12 -151 -165 -132 -44 50 103 113 91 153 6 106 11 42 -2 -91
2294 -91 -162 -12 174 -34 -18 61 152 127 83 1 -77 125 77 -16 -198 -48 -17 -90 -79 -2 101 161 111 55 64 -5 5
2321 5 -76 -128 -3 -83 -94 -83 -67 -64 88 91 98 107 -3 42 29 12 102 -23 -67 -141 -10 40 -17 102 107 135 -104 41 54
2350 54 -74 -33 -75 -127 5 20 35 31 20 -54 7 117 50 64 -49 -24 12 -129 -114 -2 -148 66 37 1 46 142 99
2377 99 -9 -20 -73 87 49 -138 -14 -91 -21 -10 -82 17 73 53 69 35 11 41 -64 -43 -38 40 -51 -27 -89 -83 16 -25 215
2406 215 32 98 96 -58 29 162 -86 -101 45 -85 -48 0 33 -50 38 -79 0 93 4 24 -7 134 -61 -27 -120 112
2432A12j38K5J2J16k7L0k69J52Jl3O2q5q5P5J32n5k5m7R0J29j34Q7j87R7Lq6L6
2459a2J2k9r3J01Oj03K45l4j16J38j18Q9j36Q1m1n1jL6j13J15J10q7J9R1l7l2
2485D0o1M1l0P2j35m8L9J27J02j42K3p4J03N0j14q3K1J19L4j13L8r3R8J16j93
2510f3J35J4j07M9rJ38o1j00o3M5p9J43J2m4qJ8l9Q3j04pJ17p0j12J40j16JM5
2537d2M0pk0L3k9k8N8J47j33j44J80l9Kj6Ro8J51n8o6L7k5J89j45j4n5lM3q4k8
2566a15Q0R7j47J00n5R1m3n1nL0P4j17lJ17o5N8p0k9J33ol7J05j13m8M9j16m3
2593a29J28j50J81l1j20K32m2j23J16k9m9N8r9o3R8q8Q7o9l9J60l1ojQp9J19j2
2620B7k4l0P4K8j42k9Q7q5M5J24m7N3P0o9q1N7q4N5j9j19J43M1r3j7R7MPk0r8
$$ plain form
2432 112 -26 -1 11 127 100 130 -139 13 14 -19 43 -42 -127 -52 80 25 0 -47 43 172 38 125 -62 35 38 -48 -12
2459 -12 0 -29 -122 -21 -15 -118 127 93 -23 115 -3 86 -50 31 -10 -61 -62 -26 -139 -24 86 -1 18 109 72 40
2485 40 -21 20 -10 62 -73 -121 -82 45 147 5 28 -46 57 107 -7 -90 -69 50 84 -29 9 -84 14 130 -63
2510 -63 72 86 -21 28 19 157 96 -4 -67 -22 -101 42 54 10 2 20 -19 64 -40 -47 70 0 -112 28 -88 -87 -42
2537 -42 -2 -9 -29 4 -25 -53 5 152 19 -125 55 16 18 2 11 -57 94 36 -30 7 -18 171 26 12 -43 -46 -3 -87 -115
2566 -115 -35 62 -85 15 -40 51 8 -43 -48 -18 56 -61 -64 53 -12 46 -24 -53 80 74 37 142 29 -19 30 -86 -129
2593 -129 -1 -151 30 -1 -121 111 69 -54 62 33 -16 42 -57 -120 -22 -110 -23 -92 -131 29 -2 -8 -9 -1 -80 39 27
2620 27 3 -27 47 75 -67 -96 -9 -94 -49 75 28 81 151 82 1 58 -26 29 10 -109 34 75 -18 -35 62 66 73 53 -45
2649d5J51n9n7p2O1K4K0j14R6Jj02J78j46o1R1Q3j10J60j36j03J66QL0p7J2J88
2675A87j36n6J38m4j27N7J3L0k0J33l05J21q1P0J72j50L8J1K6o9j19P0mj8Q5n5
2701c3m3j29K01j34L9J69K9j85N3J0m6L6K7n1J09n1N0j01m8J98j04q0J09j1r4
2726h0J45j44J22Q5j05L1q6J6j9J7L5J1j10O0J17j92P3n8l6P2O8q0J69j73k4J
2752h5L2kO7k3J1L6k9K5K6j37K41q3r4J34j98Q3M2m2p6J19q4JJ91j58J37j12L6
2779E8L8n0j21rR3k6O6m1j62K07j31R8j02O6rj9nL2n0j5M0P6j28Q4L2j6K7O9Q8
2808A90j14q7Jl4O6L7j5r3L8L0j54O4J48k6j06R4M3J2k13P2J9nN6MJ2J08k05N7
2836aR6o9Q2o9p7O4R1j93P7j23K34Lj37l2K01j59J23j12J3n7J80j66M8m4j05J41
$$ plain form
2649 -45 106 47 -10 -82 -21 3 23 -91 5 6 -96 82 -64 -125 -34 49 -61 99 -37 -140 26 34 64 -13 -1 187
2675 187 51 -5 133 89 -38 19 32 62 42 175 -130 -9 -90 -20 152 2 40 51 77 8 -111 -41 -45 -63 22 -33
2701 -33 -76 -205 -4 -138 -99 70 99 -86 -33 -23 -69 -33 -6 -57 52 1 51 -50 -98 100 -4 -84 25 14 -80
2726 -80 65 -79 43 128 23 54 -32 -16 -35 -18 17 28 -82 -22 95 -97 -24 -82 -118 -46 22 -58 111 -62 -86 -85
2752 -85 -53 -55 12 -11 0 36 7 32 58 -79 162 79 -15 119 -79 4 46 4 -72 47 -37 -36 155 -3 134 22 58
2779 58 96 46 -75 -84 9 -17 49 8 -154 53 -78 20 -82 -16 -25 -44 -49 -17 -67 -82 -42 34 -94 -10 22 6 33 102 190
2808 190 76 -11 -10 -44 22 59 44 -49 -11 19 -135 -71 77 51 -55 39 82 94 -119 -47 -28 -33 23 27 39 147 -58 -1
2836 -1 95 26 108 39 -38 26 117 -76 1 -122 112 115 -22 -54 147 -12 111 -1 12 -45 135 -31 17 -27 -132 9
2862Ij11Q6Q0L6k54J56r7J87m3q7O5n6n6J08q2k4R2J68j77P0l8j24O8o9j28K07
2888a4N7kPj63J74q8j5J02p8N5N7j06j36K53j65l2k4rM7O1k6r7J96j08MP7n5Q2
2916E4Or8op2J43R1j63P4l8p9Q0J19k02J43p1q7J03L4p3M9p6KK59j20q6pp8M3
2944e6J33J2j63P5q8N0J1j35K03k8j24J63m6L4Q6k06K17j79p2Q3M1j24K51j62
2968b4J9L8L3p9J3n4j0J40j07J11o8j47J29j2J11k5m6j4M1p4L0M7r6R4k5j00R9
2995B4p5N4P0j08O2K7L8n3M0r0R8j20j33P8J21pM1j33J2M3O3l2K3p0K2M8o1m9
3023f7M0n2L2j45J83J44r0n5J25l1j04J24k72J71Mp9K3J11j51J70N8k54J85j10
3047d0J12p2L0k3J18k62R1N4j4N3j2l0O7jj54K64j31K8j32J18j20J9j0l3l7K3
$$ plain form
2862 9 -102 -16 64 100 -154 2 -95 92 49 -38 27 -29 -85 23 -59 -83 9 177 0 70 32 -92 -24 -93 -221 -14
2888 -14 43 41 48 -115 59 -29 -44 58 -20 35 92 -14 -150 103 -62 -94 -118 -127 -80 -19 -45 -142 54 -54 -50 27 -28 54
2916 54 60 -38 -44 -116 27 118 -45 29 -9 -88 -8 111 -91 52 -19 -106 -3 31 -42 7 -69 -67 192 72 -14 -21 -99 -56
2944 -56 77 89 -74 1 -87 -37 -26 -161 42 14 -110 53 7 41 127 -79 138 -41 -113 -30 11 -113 138 -24
2968 -24 -5 33 66 -13 0 -54 -64 76 -31 80 12 -135 -6 -18 93 68 22 8 49 -25 5 52 -44 50 25 -75 24
2995 24 -51 3 73 -35 27 54 92 39 79 -11 87 -33 -166 -88 33 26 67 -66 -54 -11 52 20 43 -27 -5 43 -18 -67
3023 -67 -27 -79 -47 -192 -9 135 45 -10 115 84 -20 104 -168 3 7 -72 -49 62 -89 81 139 -115 70 -40
3047 -40 72 0 30 7 125 -137 -46 8 -6 47 35 5 72 71 -83 181 50 78 -54 64 -56 -37 -47 -80 -117 -94
3073i4K35m4j30j21J50J8K4qm4j6Oo0J04RJ1L9j12rP1j01R7n5r4P1J39p0N9j92
3101a17J30K4j00P1P2m3m6N5n1j4m6L0M0Q1p4J03j86P1J09j09L7J55l28K77l8
3126A03j47M3k8o1J9Q3j8M3r5Q7kj60J91l8n6J51p8j28J50j8j61K72p8n9J59j21
3152E3j05J33j14L8j8r1K2Nk2J19m9k2J46j85J15R7j32L0O6j52K2K9p6N5K9K8
3178B1n5K3n7J64j09j9J37j49Q6o1l7N8J13k11J34m1j3R1j57J21L0j45M0P9j79
3203a36J3J27k7l5Q4j07K32m6o9K9lm5q9J2j05J76p5J9J6L3j9J5n2Q3l3L4r1p3
3231a32k0L29l20L7J69M1m8M6k29J45J37j06j00PK9J38k06QK6N1r4R3kM8J50j76
3257B1R0j88J18q0o7P3P4j06N7J17j85O6R1p2Q1p0n0j8R8o7M3O4j83J98j03l8
$$ plain form
3073 -94 141 97 -33 -154 -4 14 38 30 -14 -30 -24 -84 20 29 40 79 -33 -42 29 -72 25 -30 -124 -53 86 16 75 -117
3101 -117 13 37 -63 8 80 37 -9 46 -5 -19 -65 -35 5 86 12 115 -71 0 109 0 37 192 -136 141 103
3126 103 -44 -1 -29 -90 -71 12 -6 37 -58 29 27 -133 58 20 -36 115 37 -91 59 41 -120 152 74 15 174 53
3152 53 -52 81 -33 5 -13 -104 -82 -77 -99 20 -29 -51 95 -90 25 122 -10 20 86 -66 -44 -15 -91 -36 -7 21
3178 21 -34 -11 -68 96 -13 -32 105 -44 42 -19 -56 2 115 -96 38 -3 -16 75 -82 39 69 -76 -36 43 -136
3203 -136 -123 4 -23 -58 26 -81 151 105 36 65 62 17 -72 -60 -165 11 -64 -45 -29 4 -15 0 -52 31 -2 32 -59 -132
3231 -132 -152 177 -143 -106 63 104 56 102 -127 18 155 49 -51 -44 -15 123 -83 -75 -49 2 -92 1 -1 47 197 21
3257 21 111 -77 41 -39 -106 -33 41 -65 -8 109 -76 -10 81 9 90 20 -30 -48 50 -17 26 90 -93 105 2 -36
3283c6J73p8q9Q2j18J24L8p0J1o4k3O4J1l9M9p1K6J22k31J47J1j18j2Q1j25J09
3309b6nKJ1q1J3O0N5n4J09q5k7K6K8m0Q9k21J51m3l5R0J2o9J56o2n3N5j96O5M4
3338c1m3M9j5p9O6LN1J00l2j44R5l2o0N8q8k4J70j32J60j06O8J02r6j6N7l8r1
3365d8J59j06O7l7j1J5N5j72O9O2r1L0P2j83O5qk8R8j15K1L7j1P0k9ML2N6q4N0
3394C9p4j3J11j44r3J30%o8J13l4K21k21j5Q2M7K7no4j60J31K9j43J61K8j19M3
3420Ij5JR1o9M2j68j05P0M4O5N1j18J27R8j29r2J29j23N8P8j04J19q6k4Q6j27
3446i2l4J29qM3n6kR8J7j51P0J8rLR0r3ro1L7N2P9j42J52k17O4r3km4m6J32J15
3476D0n7p8M7Q5r3J91o5n8n9l1R4o9q0J23N4M3j06J0m4J10n4Mj1P4j01N8k00P0
$$ plain form
3283 -36 137 59 -30 52 -66 58 96 26 37 -27 -50 14 25 -14 35 -36 -10 112 -119 28 39 -79 -91 -10 -135 -26
3309 -26 -31 -29 -18 -99 -86 -26 29 -25 84 -1 -28 -2 26 -14 75 -146 5 -38 -73 17 29 -40 116 54 1 56 -140 -75 -31
3338 -31 -74 -25 -40 -119 -53 -50 1 101 69 -75 20 -12 -72 -14 -102 -126 44 -88 72 -34 34 136 40 24 81 43 -48
3365 -48 111 5 72 35 24 39 94 -78 -9 53 -38 -8 64 -119 -54 -62 -90 8 -107 -86 -49 -60 10 -19 -15 17 73 -11 39
3394 39 -35 -48 63 -81 -174 -44 -44 -112 1 -33 188 -33 -48 34 81 108 103 39 -121 10 39 -104 57 85 -34 9
3420 9 -6 -5 86 17 59 -109 -214 -144 -100 -35 16 -102 25 123 -6 -98 31 -92 -34 44 -60 59 -27 -51 35 -92
3446 -92 -126 3 -5 38 -18 -20 78 95 -56 14 32 23 26 116 23 14 -47 -10 42 121 -21 131 -86 -22 -115 -117 -161 -207 -75 40
3476 40 -17 -95 -48 37 -56 135 70 12 -47 -78 16 -53 -133 -10 44 87 -19 -9 -53 57 3 7 -4 70 -31 27 -173 -103
3504a03M5klJ73j46R4K1n2j0j23J43M3j65K3l1n3K2J61n5MJ57j04O2OM6j14k6
3531A3n9j1j5J09Kk4K6j8j32J51K8j3PJ9r5n0N2q0J86j80RJ64j70J51N1j85J70
3558A06J10k94R6o7kO5j16n5K08oq5J10k30L28o8mj90J45L4q4o1j01J51l9Ok2
3584f5p9K33L2k04O9L8r0J07R0k39J38j19rJ15r7n2K65j54M2L7p0j5n8jM5j1q2
3611a34J61K5k3R2j2r6J50j43k9m2M1J13l2j87J7PJ04J7j3J8Jo0k9J48j33L8R9
3638I8l37J37N0q5O2k0N5Q0k7o3J90k08P7Jm3j21R3p1J76L6j09K02n5j10J68n0
3664A26k22J23M0j92J45j77M3O2n5J96k9j65J13J25noL5j80J72k50O0J04j71J37
3688B9J2o8mn5R0J47k48jP6j40N7J05j43Q7K15k0p3rJ6L0o0M4k0m9j18J44k37
$$ plain form
3504 -103 -58 -60 -63 110 -36 58 79 27 17 -106 37 80 -85 -62 -93 -146 -124 37 -18 -14 143 39 101 107 153 39 13
3531 13 -46 -57 -72 37 39 15 41 23 -109 42 70 57 64 83 -12 -62 -10 -90 96 -84 -75 89 -81 70 121 -64 106
3558 106 216 -78 18 -49 -51 14 -102 -157 51 45 -40 70 -160 168 100 96 -94 51 85 1 -60 -161 -10 -49 -43 -65
3584 -65 -144 89 121 -83 -14 24 -66 41 131 -108 30 -89 -98 17 -80 -132 133 -21 21 58 -12 -27 -85 -86 -41 -52 -134
3611 -134 27 52 29 121 109 13 163 20 -9 -51 -10 103 71 -116 -99 -92 12 29 16 34 35 -25 -54 94 -39 -1 98
3638 98 -239 -102 -52 -137 -75 -95 -40 40 13 -50 140 -68 9 10 -33 -154 -61 -132 44 80 -29 173 118 8 176 126
3664 126 -96 27 67 -125 20 -157 -114 -52 -107 89 60 -105 8 133 128 122 157 -23 149 -101 -41 63 -108 29
3688 29 41 -27 -31 -86 4 151 -97 -98 -22 -162 -105 0 -143 -56 159 139 66 57 73 103 43 87 67 18 -100 44 -193
3715a93Q0J18n8M6Q2J7l1K9q3O8l3j19O8j6j43J30K8k2N6KK9Mq8OR2j04j6j4q7
3744a52K02l4j58J81Kl1J46j40L7J09o7j88J36j16nLr0J42j2R6k1j01n0K06j6
3769G9p8O8j94J54J8j07J04r3k4J99r4k9J38j14jJ30j66K0Mn7J20m3j91K23q2
3794a6k5K57j25K0J6j14r5J76j88L3K0m4jN6j1J19j32K1N2L6n3J30j31k4R9k57
3820a81J42m5J1N7O9l9K03j83o1J3Q6n5J1m8k2P3M4j15J23Qq2J20j35J69r6j57
3846i0K10m3q1q5P0n1P8O8o6No1K07r6n3N2q6j81J75Kp5K7P8j55L38j36L1j00
3873a8L4J85j92r7J47k0j65L01k71M2K75j12K9q2O1n2L4j69P4lr2N8p5j2j3M6
3899h7J13o8J19j09K23k20N5l8l9P7K4j60J62r2O3K5m5Q3m2M2L6l0m0o0j6Q7j2
$$ plain form
3715 -193 -113 5 -53 -7 75 92 61 90 7 75 42 -77 -9 -25 -168 -38 -10 -32 24 26 55 59 -29 -23 69 -35 -51 -65 -152
3744 -152 50 16 -142 39 41 10 156 16 53 162 95 -93 43 -73 -78 -75 -165 -23 -35 61 40 -61 -111 95 79
3769 79 1 69 -125 29 47 -60 44 -49 -73 126 32 3 141 27 26 156 -10 10 14 -43 77 34 -157 66 -16
3794 -16 -41 216 91 111 127 13 -82 94 -94 -61 -41 -85 -86 -30 -41 78 -54 -33 19 55 2 132 1 -23 76 -181
3820 -181 -39 -84 -73 -16 53 14 217 34 -27 -14 72 17 28 -20 -42 31 75 -40 83 91 9 129 -6 163 67 -90
3846 -90 120 77 -4 -89 -19 -70 8 76 10 15 -46 161 65 12 64 -22 -203 -28 -26 -101 -74 4 -151 187 51 82 -18
3873 -18 16 201 9 -88 59 39 -126 175 -96 -54 221 109 138 56 117 65 99 -70 4 1 -91 -33 -108 -120 -133 -87
3899 -87 26 -42 77 -32 191 -29 26 -12 -51 26 50 -110 52 -40 23 48 3 86 44 86 122 92 52 -8 -24 63 51
3926E1k8j02O9M4J40j21k3j29J28q2J4N0m7p2P9j66L6J10RJ51r6m4K25j14Kn5
3952B9j07R5p2o5J21l3l4J21J6j05P4k6J08K6n5j69O6j60P8P3j0L6L3p0pJ12M2
3979A17N3j41o7qj19J02k1m4k9Q4nJ29P2q9O7m6op2K9o4O5j5j09K30p6j6N9j10
4007c0R3Nq9M8l1q6J99j59J6P3j03J67r0k7L5L3j4R0j7j12l8j65K4K33j42o7J32
4034b2p3N9K25j61O0J8j41N8k0OJ9p8Q1p5j67K68O4j90P9J39r1p0J13k40k8M5
4060a22M4JJ02k0M6jN9Qj05J8J03j96j0Oj6R2j29J16k6R1j9J20j34J51k4qj76
4087b9Q2l5j08J9K0P2j02qL42k26PP6j55N1M4j5j37O6m1P1Nl7J17j34J21J60k99
4114g3J62m2o8oJ16k74N7N6p7K5J00N7M5K6q6J12m6j44R6j20O0RNq7J4L2N4Q0
$$ plain form
3926 51 23 -79 -10 34 174 53 30 -99 29 -53 -39 11 -36 -108 -29 -195 -159 -49 -40 111 15 -29 196 82 84 29
3952 29 -78 17 -55 -120 1 -32 -66 55 71 -34 40 14 122 148 93 -76 -10 -170 -92 -19 -29 7 40 -30 -37 75 117
3979 117 170 29 -38 -46 -165 -63 -84 -128 -157 -73 -78 51 123 34 101 55 49 -23 6 -58 7 -8 -117 113 37 21 80 -30
4007 -30 63 68 -21 27 -4 -90 109 -50 -34 39 -64 103 13 -14 21 54 40 130 113 1 -37 -202 -178 55 -87 -154 -22
4034 -22 -95 -36 189 28 88 106 -35 23 3 9 28 -50 31 -44 -211 57 121 -69 10 149 58 -12 101 -139 -167 -122
4060 -122 -78 -77 25 5 51 50 109 117 12 30 133 -63 -73 -67 -83 9 -120 -4 -30 61 42 162 28 179 155 147 -29
4087 -29 53 18 -90 -71 -51 21 -81 -89 253 27 34 110 -45 6 50 35 -102 -36 -77 -6 -1 -38 79 -55 66 226 -73
4114 -73 89 47 -21 -27 89 -185 -128 -72 -149 -124 -24 33 78 104 18 130 84 -60 36 -84 -24 -15 -10 -97 -83 -51 3 83
4142H3j07J45o8p7P6Mj10J57k58Q3m0JJ02j2O4J08j15j20J18q9K0q2pk5K58j59
4168e0m6J25q4Q5j8n1J83m1q0J6j2j11P3p5K6k6O3o2L8L6N3ln4J05j07p1J08j5
4196Ej07M6P1K0n6P4r7J11j03J60j38j9K9r2p1J45j22J5K47j19j3J19No9J0p4
4222b3J49m0j16l6Mj8J18n0%lQ7j49J21j13J01K9j32l7O3j56K23j07j17K86N6
4247A40m9l9lO4r3m2O6q6j26L7p7O3K04l0K3J11j54j9K4J15Nj20j08P9r1K0L8
4274d8M2P8q5N0n0O8M6k38J19N6p6mj32K08o4q2P8nJ55J7Lj51Q9p9Pmj63P9M1
4303d5J6r7J92r2J01j09O8J01n6J10p9j60RJ5j18J54m9K8L0J62k40P4l3K8R5j06
4329aj39J94J4j97J26j36J05J4K11r3q0J9P3l0k04J64j7j57J16n7o5N5K0J81J27
$$ plain form
4142 83 -24 121 53 -24 52 56 -54 103 -155 -72 -112 -111 -9 -21 43 151 36 -84 34 -55 -35 -117 -124 -149 109 -50
4168 -50 -96 29 -55 30 12 -39 144 103 23 39 27 -84 -11 -86 -60 -86 -23 -85 -47 -11 42 39 -15 90 -17 -88 20 5
4196 5 -102 -56 15 35 -21 53 -44 67 -36 124 -14 -33 -4 -96 -167 -22 -144 -129 118 -1 -14 105 110 41 51 -23
4222 -23 126 86 -30 -66 -62 -80 38 -12 -12 -15 72 -77 44 -69 32 61 -71 -108 -45 -201 22 -85 -202 84 140
4247 140 91 52 49 113 20 -22 44 -42 -168 -131 -208 -145 59 29 52 163 9 -10 14 129 134 14 -94 -15 -106 -86 -48
4274 -48 -6 72 -13 37 -13 55 101 -137 -18 38 -38 -42 -174 34 -30 -112 -34 -39 116 133 136 -15 74 -5 2 -2 -165 -86 -45
4303 -45 -29 -126 66 -26 75 -34 34 135 79 189 110 -50 -41 -26 -144 10 -39 -11 19 181 -59 15 -18 10 105 -1
4329 -1 -140 54 68 -129 -3 -139 -34 -20 191 98 18 37 110 80 -124 40 23 -134 -18 -75 -140 -85 -65 116 243
4354B43k07N0o0O9J7j10j82J54j16O8J10k7l0K39j91K6J68k10M2lK6r8k5j0J41
4379H4p7m4J38j78R7J11j95J88Kl01K45k40KR6j2j0M3L5K3K21k31O0J22k10K8
4404cJ75k19j1Qj8M6j35J58j6MJ7Q5p5n1K6m8j07Q2R1p0j34Q6J32k8n5J39o3L4
4432E0o1J3q6O6j73P9J49m7K7q7J67Q0j20k1O4m9o3L3j70R9R6k47J36L6j52K19
4458C8Jm5J49m5o8J34k94J83n7j64R4R0K6m5J11r9R5l9j94R1K0n6J37k34l4J88
4484a7j05J24p7O3J07j7l9Q2p2Jq5Pp6j02J99j87K11j09J1J12k5L4l1n6J20n7
4510A6l7J8j03K9J37o6j10K55k17K20M4k13P9L8j19P2p4j48R3O1o1J47j09J56
4534A08K2j54KN8q3J8L0j23N0LJl0N9o5K58j18J55j06r1o9L7q2J04o5m1J45p2
$$ plain form
4354 243 36 86 26 95 112 2 -180 -26 -142 -74 36 9 -21 218 27 53 221 11 53 50 76 -22 -47 -57 84
4379 84 7 -37 101 -77 20 131 -64 124 126 -175 70 -170 -168 -72 -84 -94 -51 -16 7 228 -3 57 179 -31 -3
4404 -3 172 -47 -58 -50 -68 -22 -157 1 -15 -11 6 91 16 -35 -9 -57 -164 -82 9 -61 -195 -109 23 -5 -60 79 16 50
4432 50 -11 2 -84 -18 -191 -112 37 -10 17 -70 97 177 57 36 100 51 -12 21 -149 -50 46 -201 -65 -29 -181 38
4458 38 39 -6 143 98 30 164 -130 53 -4 -168 -74 16 42 -3 108 9 104 65 -129 -38 -18 -74 63 -171 -205 -17
4484 -17 -122 2 -75 -12 95 78 39 121 49 50 -35 -28 -104 -206 -7 -194 17 -92 -81 31 6 40 9 -47 73 16
4510 16 -21 -3 -106 -77 60 -6 -116 139 -78 142 186 -27 52 90 -29 43 -31 -179 -86 -25 -86 61 -48 108
4534 108 130 -24 -22 36 -47 -29 1 -122 -72 -69 -68 -98 -39 -104 154 36 191 85 -6 -75 -38 -120 -16 -81 -122 23 -49
4561d9m8J26L8J0J21k08l6J12j23l1j5N9m4J05J30j51m4N2K04j83L4o6M7q1J8
4586b3n3M6K1j82K06k1MJ0N9l8N4r1N3M5j63J16L5k43P7n7N9K58m5j33J73k31
4612f4J00j29kO4K3j11P8N2j5L8m5o0K32j91Q9ro2o2K9j24l4J89j31J15P6r7J32
4639H1P2k49L02j36j32M3Q4j34m9J20%j1O4l3Mp5N8N4pm0K5o9K3j15Q0J0K4N8
4667E2Pn7j5J00l0k0k0j24R0K5j91K66j95P4J45j27Q6M3m5r1R4r9j7J54k01K09
4693A13n3j75J14K5p8N9p4qJ33j22j7J56j49JJ17j00lK5o1K14j45N7K8Q6N2j92
4719Cj68J44or0M0m0N0O3LK7J73j68Kj04J94j47Ll2OQ1j18J24k6n7J42k9q4nJ17
4748I8q5m2j64J78O7k39R3J04j0K8m3l7J91j41M4M1k53J59P4j00j47J48o5NP5
$$ plain form
4561 -49 -97 29 67 77 198 -10 -46 66 -57 -88 -103 -44 -88 17 147 -4 -48 4 208 25 59 -7 40 -41 -23
4586 -23 -76 -30 -9 -191 15 -6 -2 8 67 29 83 -8 45 90 -73 43 78 -165 -88 -145 -86 172 127 -6 167 -64
4612 -64 36 -93 -95 -31 -8 -119 -41 11 -4 34 -11 -71 161 -30 59 50 -12 -74 -45 -169 -203 -14 -145 -30 46 -51 81
4639 81 153 -96 206 70 -62 -19 65 -69 -118 2 2 -9 55 22 26 -49 9 63 56 16 41 -28 -5 -120 -40 -30 -6 52
4667 52 59 2 -13 87 57 37 17 -107 -17 8 -183 83 -112 -38 107 -20 66 109 64 -27 67 -32 -49 105 -96 113
4693 113 60 -115 -1 24 -54 5 -69 -77 56 -66 -83 73 -76 -75 42 -58 -61 -36 -97 117 -28 29 57 143 195 3
4719 3 -165 -21 -27 -117 -77 -117 -67 -4 -1 26 199 31 33 -71 123 -24 -21 -53 -47 34 -84 40 14 -43 99 70 -14 -19 98
4748 98 13 -29 -193 -15 52 -187 -94 10 0 28 -15 -52 139 -2 42 83 -170 -11 63 -37 -184 -36 -101 -96 -21
4773b1J4L9L1o3N5N4q0J28k09O7J0o3J9J35o4N5m2J0O8m6q4L0r6pJ05j15j09J37
4801d2R2l0M4p5J74mj25O8j83k2J40j29j5J17k2l4M1J8rQ4j12J35m8m3J8q5NJ09
4829F7j38J06q9m4N7J8k4P6j3O1j16mm0M5J12k29R1K4J66p1j37J62O4j70J48j08
4855A4n4J24q5j96K8J18l6J51j43J14J27%j02L4j09J41j25m1J1P8m0l5l9J10N7
4880A02m3j7P7n5r7n0k7O9Q0o6L0q2R6O2q9O0M3Jj5O7k57M0j4n1K8O2p2J75N9
4909A16r6J45o2o3oj89J60N2j25J57j28j9J8q8J54j56J49p8J47p3qJ0l4o1R0k06
4935a94N5Q7o0J29NO2J9l1j41J26o1p1mN0l3M6PM0o3J0M3l0J10k7m8j9k4%rrJ3
4966b2j19J42N0J15j77j17J53M9K8q5q2j42K17m0l2J6Q7K9l9J3m7P3p3M6o1l9
$$ plain form
4773 -21 -7 32 63 0 55 109 29 157 -52 15 25 -38 -19 116 52 107 65 75 143 97 13 43 -53 -60 45 -70 -179 -42
4801 -42 50 20 64 -11 163 159 34 102 -81 -103 37 -92 -107 10 -12 -46 -5 13 4 88 -24 111 63 20 38 -47 -42 67
4829 67 -71 35 -54 -98 -41 -23 -47 29 16 77 -39 -43 -83 -38 74 -155 -64 -40 126 55 -82 80 144 -26 122 14
4855 14 -40 84 -1 -197 -169 -51 -87 64 -79 35 162 162 60 94 -15 126 1 -40 -29 49 9 -26 -65 45 102
4880 102 59 42 119 64 -33 -83 -110 -41 39 -27 3 -79 17 79 -10 50 93 94 79 146 -111 -71 -85 -136 -108 -46 -118 57 116
4909 116 20 165 103 40 34 -155 5 57 -68 89 -39 -58 -40 -128 26 -130 19 -59 88 15 7 17 -17 -78 12 -194
4935 -194 -139 -52 -112 17 22 84 103 72 -69 57 -4 -75 -79 -29 -62 -16 -9 31 -32 -22 21 -9 101 74 26 7 -17 -17 -26 -35 -22
4966 -22 -141 1 51 166 -11 -128 25 74 102 17 -65 -207 10 -30 -62 -46 41 70 31 44 -3 70 -3 43 -18 -57
4992e7K7k9l0j4O0mO4%LL6q5O4M8j50O4j61O2Q3j14j8J23L9Kj7j1oN0kp8Qj23
5023a66J64n7l1J02m3J28Jm5J5p1J45o5j43K8K2j12M1l1O1R6q5J07M3k9O4r4O3
5050A08j25JK9q7M4R3q3Lk1j0J15p4r3M4J00j03J31k58J43J33j69l4J3K0J62m5
5076C7nJ60j38k0Mj22P8P2j65J49n5P2j30J28n7J76nj19P2j11o1N1k7o6O6j21
5102a37J47l9n4J08K7j06l1J24K1p1r3P9k1P4j01Q8j8L6O2M4n9K7j73J30qj16
5128f0k8j20J00P5p5J21M5L0M1p6j48J54m6o0L0J9p4M1O2o9J01k17K12J18k61
5153h5K24n5Pj00l1j3O2n7J29m3NL8O8k29K14j5r2jq2N0j07P6j3K3l2P3J12j04
5181B2Q1n9l6p2K12j77K4J7j80J13n6L8J4J00L7qm1J9P6j13J8k9o4O3L9K3J3k8
$$ plain form
4992 -57 -30 -59 -89 -103 -43 -47 17 17 20 56 -29 35 83 -67 -3 -164 -102 -19 -133 -151 -28 11 13 -4 -15 -21 29 27 -51 -43 -166
5023 -166 -2 -59 -90 12 -31 97 98 53 68 -3 142 77 -66 -38 -16 -128 -87 -118 -57 39 -46 61 104 75 139 45 108
5050 108 -17 -16 13 -74 -30 63 -20 -17 -38 -48 67 -7 -100 -56 44 -59 72 -186 -43 90 -79 -113 -100 -80 82 37
5076 37 32 192 54 34 38 -84 -6 66 -99 50 -5 67 -63 65 8 184 179 60 132 21 -40 11 -16 -82 -16 -137
5102 -137 10 -29 -83 25 52 -54 -85 39 60 -11 -104 -25 -46 28 -73 15 -3 33 95 139 80 107 -66 64 56 -60
5128 -60 -88 -208 -108 -33 -108 13 58 88 129 53 -95 59 13 -47 -17 2 -72 -31 31 -38 63 -154 58 176 -85
5153 -85 139 84 91 -9 -40 -53 9 -48 81 38 43 81 149 -80 134 119 27 26 -56 -6 -113 -37 -50 -27 -59 14 126 22
5181 22 103 44 8 -64 148 -29 -5 12 -168 -55 -111 -73 -59 41 78 70 29 48 124 11 29 0 -64 -1 38 61 74 46
5209D6k4O9m9nM8j62J68q9r3J05J9j25Q5Q8j44J17o9l5J35Jq5M0r7M5K5j80N8
5236a08OQ8j26J37N2L6n3k3L7j24J11M8j95K3J37j91R9M0N7O2p1%L0mOn8l5M6
5264B7j19P4J3N2q5N3K3k3J41k1j18K0q7m5J04j43N6J45j91J33Pr1P7M1M5j23
5290c5J21l4r1kL5J16r8j53J82q4J50r3j9M2O3j38K3J27o3r4qM5K7p6K7R0j36
5317g6J22J8j35Q3J8M9q9jm8J36q6r1J87j42P9N8q8o0N7M9M4q7l1r8J27P7l6o
5345C0q5K37k18L7n9jN6n8l9Q7N8n2nrL9NJ48j80P0p1M3M1j06m0N9Jp9o0O9j6
5375i8Q5J22o0L4l8K1j61J07Mq1M1m6J43j7l9j13J46j9k1Ko4NjJ6P8j62l0J75
5403B9o4L2J5Ln8K36j55l5L9l9p2N6qo0L7J5J8l8K4J41j99N0Q0K2p5Q9k79J92
$$ plain form
5209 46 22 91 42 37 85 -77 91 2 -91 14 33 -92 -7 81 -63 54 -15 -50 85 86 1 41 -56 -11 14 -166 -108
5236 -108 -102 -14 -140 -3 49 85 32 9 46 -78 33 81 -114 -91 46 -145 -46 -6 51 113 42 42 72 68 74 16 -19 27
5264 27 -92 -18 -5 47 -38 15 38 15 156 135 17 37 -50 -95 9 -134 -78 67 -124 9 16 -75 2 43 88 -35
5290 -35 86 52 -39 -41 -6 110 12 -141 41 -43 107 14 -5 37 100 -38 -15 112 49 -45 -53 -8 19 -57 -30 60 -76
5317 -76 46 64 -71 12 30 79 -10 -11 -59 77 -9 -100 87 -55 24 82 -6 -66 -9 40 84 -3 -34 -132 -5 72 36 30
5345 30 -55 182 -36 1 -58 -59 -3 -61 -100 -13 45 -7 -12 -21 18 23 171 -9 61 -10 33 74 -32 -72 -13 -12 -91 -151 -82 -98
5375 -98 -13 109 49 83 45 66 -95 12 16 -65 -24 -70 73 56 17 -96 50 31 10 12 -52 -47 -48 -32 46 -116 -146 29
5403 29 -35 -3 12 15 -43 193 38 3 42 3 -69 -13 -21 -81 -44 -29 -11 -49 -25 116 -83 -33 47 69 -6 83 -196 -4
5431dL5Oj6J07k09R3Q2rk4j13O3Q2j24j5M5J7j44J27p0M0R4j8J07j11r8J0Q4n0
5459a3q0O2M1l9r3J80pK2JQ4j01Mj7j10K9L4j5Q0p6J28Lj27O0m8J2l7J11j72R8
5488A4j20L5l9J29o1P2L1r7K7R0q0J12nj02J2pr8K18j65n9mL6rlN4k7J38k0kR
5518G9j31J01j32J12pk27K02J07m8J1m8l6R6q4j01J53oj09M7k2J31o5p8J39o9
5543A5P8k1L8k03J37m0nm0m9R7q1R1R3j5j21J48o4m6k5O1j15N6M5n1K9N5l4M7
5571H0k51K21n8o2P9m4P8r5oJ8R9r7L4Ok6j1N9k0P7j47N6J0j13J53m7j23J76J5
5599F1l6o7N7j8J15M1j73J91j92l9N8M9o2m9N3%m7M2J38n9m4N3j15M8O2j30m5
5626a08R1n2oO4P3n5Q0o9kJ02q6l5o3P7m3k8j7L5N3LL6m2N8N2J5j53J03q5J2L4
$$ plain form
5431 -4 31 37 21 128 -81 12 94 85 61 -52 11 93 -31 -46 -1 16 -128 -1 -71 -31 63 45 152 41 -57 -47 37 -13
5459 -13 -93 -31 10 -29 -122 58 51 73 74 158 57 61 44 -66 -37 -3 -18 62 -14 114 117 -10 50 2 14 -23 88 -84 14
5488 14 -106 -71 -110 19 -42 30 61 -36 -9 81 1 113 108 6 18 11 -87 131 -34 -93 -97 -61 -70 -73 -19 -46 92 72 70 79
5518 79 -52 49 -83 29 22 -205 -3 104 56 67 19 -17 79 -5 -106 47 41 -68 -21 -43 88 23 -55 84 15
5543 15 93 72 110 -93 44 4 -1 -41 -90 7 -74 17 110 95 -26 122 58 12 -13 48 -67 -11 34 -17 12 67 33 80
5571 80 -171 50 -8 -70 9 -35 43 -52 -58 -40 59 -38 -4 2 -24 -35 24 4 81 -66 -10 0 -113 40 -7 -130 46 61
5599 61 25 -42 15 -3 112 153 -20 171 -21 -60 -2 47 -15 -64 -11 -11 -58 -16 122 63 19 72 -43 5 67 -63 -108
5626 -108 -17 -69 -75 -11 62 7 87 18 16 118 32 -3 -66 11 -32 -60 -77 -42 11 14 50 8 66 118 133 -20 83 -2 10 44
5656D4j01O5R6j68J46o6j08J53j03J10j77J55j36q2K37j34kk3J51K6q8k1L0N7
5680F1J0o9O5q2K5j06J48l3n6O7j02J47n7M4j03J39o1q8N7ll7j7l3P3j8j3J12
5707G0j72K08p2l3l9N4q3l7J86j28L2m1n7J68N5p6o7P3J5nj58j6P3P1mn3J5n4
5735g5P3r3R0J19o8Q4j84O6J7kQ5n4Nj28J50n0q6N2J03j19o4K22k30Q0Qmj8L0
5763Ikj5J03j75Q2Q0K8j09J5k1J1j2RO0j73J78q5J7J06j56l4L7K0j1J09r2k0K6
5791a5M9j03M0N9m1L%QQ5q9rR6j9K0j21j1P7J0n9J42r3k4J50j12Ln2J16j30m6
5820f6L2k2M0l3nN1k6K7j6n7N3NON1j14RM8K4q3R3l1K7RJ4L5l4j15J59j19Q3n8
5851a3M5Q3j61kN0l1Q5J5J8q7Pj36K05l3q0j7P1p9L5mO0k7m3J12o3J8j9O7j49
$$ plain form
5656 44 -57 8 104 -64 82 16 -92 61 -42 68 -109 46 -90 -172 65 -69 -71 -94 57 83 -5 -26 4 61
5680 61 71 2 67 -15 10 -96 52 19 -37 30 -72 75 18 62 -41 98 37 -51 6 3 -34 -51 -84 -11 -29 -42 70
5707 70 -102 106 34 1 -38 16 -67 -104 82 -46 -14 -55 -112 56 111 35 -32 41 56 51 -107 -123 -50 21 17 -36 -21 -75
5735 -75 -2 -95 -5 114 46 130 -54 12 29 27 112 58 63 -65 85 35 -51 1 104 -15 -79 143 -87 -7 1 -3 -21 9
5763 9 7 -8 95 -80 2 82 110 1 16 -5 6 -6 3 63 -110 68 -17 0 106 -50 -84 -47 -27 -38 71 -21 -41 -15
5791 -15 34 -69 -29 30 -11 -8 -8 0 85 -4 -13 83 64 84 -37 -48 29 39 -20 122 29 5 155 43 46 -6 110 -20 -66
5820 -66 -34 -56 -16 -49 -54 -3 -29 -2 -18 -75 -22 -17 -11 40 -74 -65 -17 7 -76 17 -14 13 22 36 71 37 -78 81 -38 45 -13
5851 -13 32 115 -46 -48 2 -29 56 71 89 2 9 -127 78 45 -35 -52 19 -60 -25 -29 31 4 -39 73 10 28 9 76 -73
5880g3J07l4q7rL5K3L5m0P2RN4p8K5qJ0o8j6P6N7p6%JJ9M1r8J47j31p2j0O0n7
5911h6J8J0L9LM4k5J9K1k6M2j13Q7Nj44O2K7K9m4J31q1m9N0OP8j53M2q0R6M3n8
5941gJ05o1q1J10P4r4J7j6K3j90K63j85J3k5J72q9o7R3q4P0j0l0n7O5m7N8j01
5968h1N5O0Lm0L1j08m7J80j38pK9K04j16j06Q0M1j56J97j1k5r1OO1l8m7R6J2j8
5996B6j08pO9Q2q5l1J27l5r8j6J24j08R2l5n8k6P4l9J5K2J7K1m1M8j14K77k92
6023i9J17k3k2QJ1l2Q8j03l4M3J66r7M2Q1j10j41J03J00j24L4k7O0J8j97R0%j8
6050f6K7N6l0l7O4k1o1M4p4R5K6Jr4N3j55J92P9j24OJk4J5n3R4O6p5Qp2Q0M4q
6081E7j7K0m7oj6K9j2%J3K9j8Rl8m5O2o1O3l9j6O9j7J7j22J03j7m6N9J6o9R5m0
$$ plain form
5880 -73 34 0 -87 -96 -61 -38 -3 -43 29 38 92 14 39 31 41 -27 -43 33 90 14 14 15 34 75 -23 124 -7 -79 -89 -29 -86
5911 -86 -68 -58 -19 -16 28 3 22 43 17 59 -54 33 38 -106 -44 -17 12 -32 99 18 -31 19 25 103 -50 -8 -88 8 51 -7
5941 -7 98 37 -44 66 140 46 63 47 70 -120 143 -42 -29 -54 118 29 -38 55 -29 41 31 1 -56 9 -38 20 -81
5968 -81 -26 34 37 -3 28 -80 -127 53 -85 -92 -63 141 25 -81 -1 40 -116 81 70 45 -46 -40 21 -17 -64 32 44 26
5996 26 -82 -89 -20 62 -23 -54 73 38 -60 -76 48 -60 32 -3 -61 -87 -13 -52 -37 -15 2 23 -18 30 -84 193 -99
6023 -99 18 -5 -27 -19 -8 -40 48 -55 -89 -46 120 23 65 146 36 -105 -2 98 -26 8 -19 41 59 -138 -48 -48 -66
6050 -66 -39 17 -13 -50 14 -7 -68 -24 -98 -3 23 24 -70 -17 -172 20 99 -25 -19 -18 -42 -27 -80 14 80 5 13 -59 21 65 57
6081 57 40 60 13 7 -9 20 8 8 21 50 32 41 3 -42 20 -41 22 -17 -33 36 19 36 -86 17 0 -46 13 29 -40 55 15
6112A5l7LM2L8Rj85P1l9oJ28p0l0J24J7n3O9j06o5J38MP3k02LP1j9P3j82J25J10
6141A19j93J02q0M0P9q3R4n7M6q7K8r0J84k0N0p5n6LN3N0j37m0O6K4lq0O8L9j60
6170a16J56j33J26k5m4OJ5L9j13qKJ70j06N5J7J2j24M7J90k09N4k0n5K2J39j30
6196c3O1n8j9M9q7P9J07j07k5qj6OQ1l0PJ0N9j18k4J03m5J5J4jkm2n4p0J83%k7
6227Hr8J69p2k2N3n5p8J38k6K5o5J16j13n5J6MR3n9J24P1k35J59j70L5M2p4J6
6254e3J37p4j34J23J2or1J26K0q8L1K4r0j5L9m1oQ6Pj8n3O0p0J39j23O8j41J21
6282a0Q3k1o0J00k5%j29J7jM4P3k6j07Q4o0qn8K10Nj90J3J18j7l0ln7J75j27R5
6311H8j14M7n1OP5j96K44j44J0L9m4J61r3Mj7k5L6n9J03n3k5Q4m4m4J2K9L6q9
$$ plain form
6112 15 -22 -19 23 61 70 -115 -44 -83 -89 39 -31 -61 63 80 27 96 -10 -75 63 67 140 -62 -59 12 -7 66 -116 9 119
6141 119 -74 28 -52 -12 67 -16 78 21 67 -20 8 -82 102 82 132 57 1 4 57 107 -30 -70 -4 20 17 -63 5 44 -116
6170 -116 40 -93 33 8 -36 -30 -15 24 -89 -97 -95 75 -31 24 41 53 -71 -24 166 -43 11 -9 -64 -42 97 -33
6196 -33 28 -30 -49 0 -87 -8 99 -8 -33 -41 -57 -51 30 0 7 17 76 -42 -66 37 -8 7 21 20 18 -24 -78 -148 35 35 8
6227 8 -90 79 7 -15 38 -17 -95 43 17 42 -23 93 -20 -75 -59 -55 38 -21 103 174 -61 98 -72 -37 5 -69 -53
6254 -53 84 10 -124 -1 11 5 -86 40 60 -28 3 27 -63 -78 -39 -80 -86 0 7 -11 -64 -4 -74 65 -58 10 -131 -10
6282 -10 73 52 -8 92 67 67 -62 -45 -46 -2 71 45 -62 22 -38 -46 -104 106 111 -79 -66 52 35 5 2 -55 120 -7 88
6311 88 -26 21 -30 -24 51 -145 99 -45 -35 4 -40 121 28 32 15 -10 26 -33 70 17 -8 76 32 -12 0 29 65 -24
6339b4J0J23j95M8ok6j0J02k8Q0O8j72J20r4K8j38P7K5n6l4J57j88J97j16J09
6364E7j10J20P8j98P7L7l7k0m6P7n3pN4O0j15R3k2q1m4N1J05r1k6J16j26K0%k
6392c3q4J25kl5m1J44m4m7L0M2p3L7J8j46N8N7Lk6N4j8N6l4k2o3N0j1o0j1O4O0
6422D8o9M2M8p8p0rK65j19o1k2J3k6k3O5O7r4q3J78m7JQO8J6j11m9O1j4oO9j19
6452e1NkO6N8n5J0r8N6L6Jm1n2M5M5k1p1J45j06O7J38j56J22j99R7l7j42J39m0
6480d1L4rr1K16Jm8J67k84N9p2Q0M8M6j29J29j22j3J1j2N7L3L6j51J15N2j24J15
6507A03j83J03m0J8j06J33K7n8oQ8m5Jj84J32j3k5JJ3N6k8j9o3J38J25j63P0q5
6534a0J59j54O1j8j21pJ54j19J04r2J0q6J36l7Q9k2o4P4J1J6r9k7R3q0o3jR5J39
$$ plain form
6339 -24 -14 109 -86 -38 -44 -70 -80 22 -6 74 142 -30 90 -4 24 -114 -37 -12 -68 -102 55 -133 64 -52 57
6364 57 -53 67 145 -53 24 61 24 4 -42 35 -18 -25 29 89 -26 67 45 -36 -80 -29 76 -15 -41 75 -51 -31 -31 -33
6392 -33 -117 8 6 -29 -70 74 30 -17 13 55 -18 19 37 -109 -51 6 9 -17 37 19 75 41 19 -44 6 -5 -65 -76 -12 48
6422 48 -21 21 69 -9 -79 -88 177 58 -3 -25 -12 -38 -61 4 71 -23 -106 72 25 26 34 102 118 7 -42 19 5 -1 68 -51
6452 -51 -46 -48 18 76 21 31 -67 -11 25 26 -15 -67 -22 23 2 -69 76 -30 37 175 19 141 -58 39 2 -140 -1 -41
6480 -41 -7 -16 -107 109 110 62 229 -55 4 -68 12 60 106 -23 106 -16 -29 -18 -30 27 60 96 -55 60 112 -12 103
6507 103 -80 23 -17 1 -105 28 55 -3 -9 79 34 35 -149 -17 -30 -55 -54 -41 15 -13 -32 -95 43 168 5 75 -10
6534 -10 149 -5 56 38 -83 -90 64 -55 49 -43 -33 -119 17 -20 69 47 -17 57 68 84 -15 -42 51 -29 -92 -93 2 141
6562A41j47K6M2n8j23O0K6O0p5O9j4K7Lj6j46J83l9J9kK2p9j3R4j52J31OL8q6
6590cJ13j85J26J28k03Q1J1j17L0j6L3l9J16jn8q2L5J02Pq5K3N2r1O8j96L6j7
6617a32J23K5jL8k1Q2lM4j41K1K4m5L2m4j06Q7J14j66J61p0j4j01J00n9J10j62
6643a04M0R9j5n9M4J5nL9p2N0po2J08r0M3o0k4n5N4J00k9JJ7j1oJ1R8j82r1J21
6673c2J32j13q8l5K04j03j1J89k03R9k7Lj30K17q6n6l0l1J20k2K4j09N5LR3Lj55
6700h9M4Q3n9n3J05m6J29n1o9R8n5m2Q5n8O3j2p9L8pr9n3M1O1N6N0j77P0K1P8
6729G3k9n8KJ4M0l0m9j4O5No4M5K9k9L4N8q6j43J78oq6q4J12oL3K7J06j76P8l2
6759Gj7rJ8K5l9k2o2QJ0J2L3M5l9O2R6j94N3KP1q7Q1o2jJ2n9%J03j99L14j10q7
$$ plain form
6562 141 -6 20 62 4 -119 -59 -33 27 -48 21 7 34 37 21 -125 58 19 38 36 58 -21 -34 60 -92 39 45 83 -3
6590 -3 110 -75 51 179 -24 57 68 -49 -19 -35 -2 -41 75 74 16 -66 -31 71 78 -7 16 68 -23 45 -151 -115 -132
6617 -132 -9 16 15 53 32 114 111 155 14 35 59 14 46 2 -104 -17 97 -69 92 22 8 -93 7 -52 58 -104
6643 -104 -64 35 20 -39 5 20 15 54 -18 32 25 -37 71 -19 24 -36 -60 -115 -61 39 10 11 28 17 11 22 120 -62 -153 -32
6673 -32 100 -13 -101 -136 68 -35 -46 143 -60 39 12 15 -115 102 16 -40 -70 -101 19 -3 21 -88 -33 -30 63 66 -89
6700 -89 -45 38 -21 -74 31 -15 114 63 -6 92 37 -5 80 22 85 73 -6 32 25 -74 -127 -86 -25 31 81 -96 -26 -5 73
6729 73 44 -14 -12 2 42 12 -37 -51 14 19 -45 0 29 0 34 92 6 -137 41 35 -51 -135 -23 -29 4 31 137 -39 39 7
6759 7 -10 -19 -1 24 -15 -37 -99 -91 -81 -69 -36 9 -30 32 128 -66 -13 -11 60 -27 54 -8 -9 3 -56 -56 47 -152 162 52 -35
6790c5J41j74P1J12k01O6M0lO4j08L7lR7j37j2J2J4J1k7%p7J67n8n6Ok0K04k7
6818A04j69P6L7k4N2on3n8J02j46J54j42O7O6m5J07j86J42p0j6o4L7K5J1k3k6
6844d8n5J55l7n1N5k3q9N8l1J0R2j15P0j06N5J30J5r2L9K2j15N2j10L9R7Jl4J4
6872bn4M8N4l5J1K7K9r6j3O7m2J13j60o4O2M3m9J40k3n7J26j76J00Q7j27j21J55
6899D3q2j29J12K9l8R7n6nP1p8L9Qj34J09j02J02j3j19J80n7O7q2nR8j12P0LJ6
6927C2Pj11J99q0j47P8k7J44m9m0L2Rn7O1%r4j00oJ07n4P9Rn1L7P1K5o3k8J40
6956A23j18q5LkJ2L6J7O6o9P2j72N7J39om3j02P6L2m8M0j10J59p6n6J87p2q2r
6984c1O7q6R5l9j35K8l1J06n4K7M6n1PK9K5QKMp7K5K4j5m0J12%n7m0K27m0q4J08
$$ plain form
6790 -35 106 -68 3 115 -86 -20 20 17 81 -27 10 7 104 -33 -45 -33 -19 -8 -35 -35 -112 55 -3 -59 -53 -73 131 104
6818 104 -65 11 48 24 76 70 17 -41 61 -85 69 -73 -6 60 15 122 -64 78 8 -8 -72 -35 -10 1 -22 -48
6844 -48 -103 52 15 -36 19 -4 -93 -35 -66 -56 36 -79 -9 -115 -60 70 85 -7 32 54 -61 -9 -119 -80 17 18 -16 -2
6872 -2 -56 -8 46 11 22 49 78 -18 -31 36 -6 107 -53 -117 -55 -12 -61 79 56 -1 125 -51 49 136 9 -112 43
6899 43 -39 -168 -56 -27 -65 32 -24 -29 42 -36 3 11 -123 -14 -116 -14 -27 -146 34 -23 44 -38 -43 55 -57 13 16 32
6927 32 39 -72 127 47 -100 -22 -49 95 46 6 38 47 -10 51 51 -43 -143 -149 -42 -96 -17 -8 -59 -22 49 74 11 -17 123
6956 123 5 -80 -77 -79 -67 -31 -14 52 -17 55 -117 -60 79 73 30 -72 4 36 -12 28 -82 77 1 -55 132 60 -22 -31
6984 -31 36 -50 45 6 -129 -101 -132 -26 -80 -53 -7 -58 -51 -22 3 11 13 17 -60 -35 -11 -26 -66 46 46 -11 -51 176 136 52 160
7015A60o1k6j12L9j7j7J46j77O1M0r2mJ1N1R7j9j30Kl3J5M4Q3q4l8Q1kk9O5p2
7044a8R3k1q2m6J27n2m9n6J2O1q6nK10j6LP8j68J17j69N4L3k6k6n1K6R3l4M0j0
7073C2N0j54J7L6j24P4Q3K3j08K8J8n4N2N0o4O1OjR3j64j6J99j18O6j35j17R4
7100g3J42j19P5Ro5J43j37J6M4j29M9k6O0j39J9J34P7j37J16j03M2R7j93J02l8
7125c4j55K00j21J97j11j6M2L7N2j18N6p1N0n5J0J46j10Jn2p2K04p7kk1M7l9M8
7152C6J8j13m0Q9L4po5N3M4%P1j27R4j89J66L5j94Q7r2J21r6Q2p8O1M5R2p6M9
7180A00j12N3j0j75J04P0l1l4L4r8R5m5M2lR5q2Q3j80R8o7K5O8J3K5r6M9m5J40
7208A16n5K4o0k4Njn7q1J74j07j6N6rk9J30Nk5p1L7K9m6k3J6P9q2PL3j08l4P0
$$ plain form
7015 160 99 73 -39 0 -17 -34 112 -65 -4 36 -56 -60 -49 2 99 80 -50 -48 -81 -66 -22 61 -23 -61 20 18 -11 54 -18
7044 -18 75 54 -28 -74 53 1 -48 -104 -92 -31 -117 -122 88 72 75 153 -15 102 -67 -13 20 -6 -32 -83 -57 36 2 42 32
7073 32 82 -72 -55 -19 -143 -69 14 37 -71 -43 -25 -79 -27 23 -41 20 26 25 118 -46 -62 137 19 85 -50 -167 -73
7100 -73 69 -50 25 34 -31 112 -25 -9 35 -94 -45 -71 -11 -150 -131 3 80 -57 59 -44 -2 95 -98 4 -34
7125 -34 -189 11 -110 87 -24 -40 2 39 91 -27 29 -42 8 -47 -37 109 -1 0 -52 -124 80 3 1 -20 27 -12 36
7152 36 54 -59 -99 -10 24 17 -48 5 49 49 120 -7 87 -102 64 99 -95 -8 -100 21 -75 7 -71 -10 35 127 51 100
7180 100 -12 41 31 -144 -40 30 -1 -35 -1 -99 -4 -49 -7 -10 85 3 86 -94 4 -63 -38 30 43 68 -28 21 -24 116
7208 116 61 85 25 1 6 5 -52 -133 41 -66 -82 -26 -35 -64 66 71 46 -25 12 41 -5 -28 -12 67 -15 -8 25 -83 -117 -47
7238d7J94q5j3l9K7Nn3r9O3rQ7p7L7p4P1P5n6rMP6j05j5J8p1l5L9M8j24J22O2
7268A7J7J49k21J22op9O0k3p6L8R0n3j0J8O4k3j6j86j7J90m8q1Mm7J62n9m3J5
7296d2N0k2N7Qo9lM1M9j39k2M3O8J8j6l8Q5M7q2Q6j24O0m8J02q6o7j00K0J56j09
7325g7J6M9j2K8J22r1o5jM0J2n2j07P8K9M9Oj16J05R0p5k3LK3m2o1J34pk00R8
7354d7LQ8o5M6nK5j4M7k8k5q9J05j01L1n9M5Q8q6pM9k3JJ7P5k35J22q3J04p1L0
7384f2J22r0P8o0J80k43J23kM2n3j2j17NP9j1L0Q2k6p6k8J3J06m5pp6M0K4k1L3
7413B8j73J24J2k6L2J8p4J09n9j41K21r0Q9j28j3J00M1J10j08l7J0L4M5p1j7j2
7439B4j16J23o6M3l4k0m9M4m3J63q9R4p0k4k7N8K1o3j1p5O1O6P1k7%K0r0M0LL9
$$ plain form
7238 -47 147 62 49 10 37 42 -11 -110 -47 -56 31 -46 -9 -83 -12 63 7 -2 2 78 -27 -42 -24 -95 -130 -91 -43 -167 -45 17
7268 17 34 183 -38 84 78 -1 59 36 -40 -2 88 35 25 43 107 84 68 -118 -135 55 7 -74 -70 -117 45 -14 -57 -42
7296 -42 8 -14 43 51 -18 -21 20 69 -70 -92 -49 19 37 21 -17 68 115 33 119 -5 55 7 109 23 -44 -144 -124 32 -77
7325 -77 -61 -12 -24 4 126 35 -30 -31 9 21 -31 -138 -60 -31 18 24 -92 13 103 28 5 8 31 -11 -72 62 55 -145 -47
7354 -47 -44 44 -21 25 20 45 31 78 50 25 -64 41 -60 -29 -88 -43 45 -41 -48 1 -22 -21 -4 71 -164 -42 -125 -21 -92 -62
7384 -62 60 -30 48 -12 168 -75 48 46 88 35 23 -94 -89 -10 -21 9 91 65 -11 -39 -26 80 35 28 -48 -8 16 -5 28
7413 28 -145 -21 -9 -35 -3 15 -59 50 -9 -150 71 -19 70 -58 -71 29 70 180 72 35 45 79 124 53 36 24
7439 24 -92 31 -35 8 -26 -46 -95 -51 -94 69 -20 74 4 -20 -47 11 32 -31 -42 -117 -56 10 81 54 54 74 -16 24 27 66
7469F6j34j0J1O4L5m8n5J51k1m7Q0j6m1l7k0J26j04j47J73m2rQnQ0o6KK9oL3o3
7499a3N1j08J06p8P7q4q9J87q9K7k8M2K6o3M7p7j04K43l9%p5N1j08N9P8P3l3j22
7527d3P9k2M7Qj7j29p7J75nr7J71jo7M0J08j15m5r5J46Jj57Q0J6qO1m2%O3j7L6
7557I4j31Q6j4L7j44K4K4n9J14N9j17O3K5m2L6K4m4j31J78k09O4N9N1K0q4j27
7583a44K05m5Q2l7n9J7j4r9J44k2j44L2P8n9k9J70k5l3J13j63M7N3j16k6M7Oj4
7610c5j4L8J35K8j56j2M9m0P5o9O2j19q4L8O1R8r7L4j5J20j96J42j00O0n5J8L
7637c1k6q1K23j1j46O1j51P4J23M7p3R8r3n0j04J68j40J42Qq4K16j59O8L1j59
7662d9m3J38o2J6J19j51mm6J22N3r8K5O0L2k3n8j06LQ9l8J03q8oj07J03J50q2
$$ plain form
7469 66 -68 -78 -67 -3 32 -16 -71 80 59 12 92 76 35 -2 -22 104 0 -147 26 -16 -25 -17 -22 58 -8 -6 23 17 50 -13
7499 -13 38 -70 36 -42 35 -49 -138 49 -40 -13 -41 1 27 -36 11 -66 -170 73 34 34 -41 10 -98 -39 39 112 79 -43
7527 -43 36 14 61 69 52 -77 -154 21 16 -81 90 89 22 62 170 55 10 -85 61 62 -95 -15 1 -7 54 12 12 75 58 94
7557 94 -37 49 35 72 -72 -48 -24 -83 31 90 -27 36 61 19 55 79 35 -96 82 -127 -63 -4 47 67 -17 -144
7583 -144 61 16 98 61 2 19 5 -94 50 28 -116 -84 -6 -65 -94 76 51 18 131 -32 15 68 -48 -74 -27 -21 -35
7610 -35 -49 -11 124 152 -4 -16 33 -7 68 -1 61 -58 -142 -104 -43 55 -42 -8 -23 97 -99 43 -57 3 -52 -34 -31
7637 -31 -57 -138 85 74 -72 -11 -162 -88 35 82 9 107 14 -36 -140 28 -112 30 38 -46 170 11 79 110 -49
7662 -49 -92 46 -16 0 119 -32 -36 -82 40 93 -5 20 80 112 89 31 -75 -72 17 -21 82 -6 -12 -119 -16 134 52
7689E2oj06J23j18K9J4nN7n2p8kk1L3J41n5J22m7m7M8K2j60R6j32J33M1j14NM1
7717A4J6J2%oO8j3m5L6j30M2jJ06j23J9M6k5O2j00N5M9N5j02o5mj6mj02M5J62
7746E1p6m6K9J06q4Q2J27j42j04n0Q4J1n3K1n0J03j7o5M4K1J81j59K8k5l9Q6j01
7773c7n3J93p5k8k6o0J41P3p9O2J0k08J04n8l6oP2n2mJ01j3N7j44J70m3n9j34
7800a32mO7JN1M7n8l8M0M1L1k6J5J39j13j35M6q3J85p5p6P9r6Q5K6l8J22o1p7
7828c7R9o9J18o5j30J04n9J30j54M9OP4m7OQ7j13M1j33J23k4L7q3Rl4K6P9LN2
7856I5K4j14P7Oj82J04L9m3N5m3n6j2j3J18Nm1J2j4L4j24Qk1K0N3k1J13j04P8
7884E3o4l3J4K8J9PKK0q6pm4K3lJ3P0J0k0N0PJ6j01K6n3K9o7K8o9O2J63p6O0J6
$$ plain form
7689 52 46 -60 63 -55 -26 -12 -17 40 -12 -90 -92 -113 -80 61 6 128 81 34 82 104 -56 40 -92 41 82 -32 -27 14
7717 14 30 42 42 36 104 91 46 82 -48 -6 -7 99 -24 -5 41 16 78 -22 33 82 137 35 -30 -34 -50 -54 -156 -111 51
7746 51 -25 -71 -42 64 -20 62 189 47 -57 -107 -23 -12 -65 -44 -94 9 -8 -73 -29 -8 173 14 42 17 -22 64 -37
7773 -37 -90 103 28 0 -26 -86 55 128 49 111 121 -87 17 -41 -77 -83 -11 -63 -67 34 21 78 -66 104 61 2 -132
7800 -132 -136 -69 -68 -17 30 -28 -66 -26 15 46 20 35 174 61 -74 -28 -111 74 -1 -77 2 -94 -9 17 -21 101 40 -37
7828 -37 62 -7 111 46 -84 20 -39 91 -63 -14 -8 66 19 25 112 -1 40 -93 30 6 43 -40 -31 -65 -39 40 43 95
7856 95 119 5 82 88 -94 10 49 6 61 18 -38 -50 -63 55 60 19 31 17 51 -73 -65 -86 -66 -13 -34 79 -25 53
7884 53 -11 -44 -30 -2 17 24 26 46 -40 -47 -91 -68 -71 -58 12 22 2 52 59 75 -26 0 -53 -24 -91 -63 -132 -70 93 17 77 93
7916I3p0l0JK6m2N6m3m4P2J4j04J16m0P1J13k05N3j12K01j65L0j35J53p3N0q6
7942a00N6P7m6J70k01qJ05m0J8mrn8O4M8j03J21n8n1N3L5K3j55R9j8nR0l1j00
7970b8p3J71j39R2J8P1r7j00J20q8R4r0R3r5K7oM1j03K51j97l7J30J4mrj1j10
7997f5N6m3P0k3O0L6j6n3kL4Mj59J75j22PL4N8j3j7m5%m6L1N5M3j08k8J07r7r9
8027a66N5L9R2j14P7r9K17q1J5Op8J14nj70Q5o1L6P0k0NOjm8K1J06j48O5m1kJ3
8057a2m7J44j00J5kP6j13O1l5mm0R3O4r8j18Q0o0jJ69j12J4J19n9K1m7K16k01
8084B3q5O0j4O0r1j2R4p2J24pq2N5q1P4j5p7N7K5r2N8L1p1R7j03J9N0m4Q3r4M8
8114A8l3J2%M2Qp3lK7J35j10J2JR7m6k8q1J07j40p2J75j6Nk64K15m7J60j14pP9
$$ plain form
7916 93 23 -7 -6 20 -22 34 -9 -53 19 33 -71 45 5 76 189 -16 37 -75 126 -39 -9 -144 9 -64 -14 -100
7942 -100 -44 33 -13 157 -44 -52 53 13 31 27 18 -40 24 72 -31 90 32 -19 34 69 92 -63 36 18 13 103 72 -28
7970 -28 -101 70 -69 23 41 112 15 -85 35 -53 41 -49 44 -51 -24 -30 11 -92 159 -38 -75 55 69 65 56 45 -65
7997 -65 -9 -52 18 -5 55 91 75 22 20 54 58 -101 74 -48 -41 -7 51 38 21 -24 -24 -70 -39 16 59 -49 -77 30 -67 -166
8027 -166 -111 -72 20 -94 -17 -116 101 20 35 41 -37 77 72 -98 -13 -74 -38 32 12 17 23 22 -26 -5 101 -47 18 -23 -25 -12
8057 -12 -59 85 -15 0 -2 74 -39 22 -13 -17 -57 36 100 2 -116 -36 -96 -97 72 -40 -26 93 34 55 8 224 23
8084 23 -62 -2 -16 44 -47 -59 35 -37 87 80 -2 53 -28 46 31 -46 11 36 -56 2 33 -38 59 -44 -25 25 -19 64 -30 18
8114 18 -15 -3 -3 39 47 -26 -29 -2 133 23 35 36 133 87 59 -22 85 -55 -127 48 32 37 -227 -12 -59 101 -13 -20 59
8143E9r4L8l2rl5O7L7p8l8oN8K4j8J29Kj23L8m7k8oL2L1p0Q0K4L8M1o7k9P2L3
8174A23LO1q7l6j95K2O2M2k0k7M7lO4o8Q5q7M5
$$ plain form
8143 59 -35 3 -29 -38 -73 -6 31 -47 -85 -91 -33 -9 -27 102 104 -19 19 -28 -56 -62 -30 1 -69 11 35 73 114 47 18 90 123
8174 123 126 187 100 64 -131 -109 -47 -5 -25 -52 -5 -8 56 -12 73 -14 31
8191C1
$$ Imaginary data points
##PAGE= N=2
##DATA TABLE= (X++(I..I)), XYDATA
0@%%%%%%qJ6j6J6k4L2m0N6p2Q8j04J28j60J92k24K68l24L84m48N20o08P05q13
29d36R36j072J224j392J576j781K005k253K528k829L158l517L910m339M810n324
45b796N883o494P163p895Q700r584J0557j1633J2830j4170J5679j7389J9344k1607
59a1412K4264k7433L1289l6103M2309n0651O2524q0879J13226j86575O34676P8054
71E93289j328697N10076N89404j25796k97698m6773r4797L39351J11911n77216
81c26946k86393O98279L30511n26507l78317K86221L36958O4583k20740j59281
91a81632J27900J60457p3664n7544L017M7134J27155l1825k51239N6697K78536
102B04992q6609k39952Q4689Q4869p3173Q0941M9441j68704N4930J58066k09574
$$ plain form
0 0 0 0 0 0 0 0 -8 8 -8 8 -16 16 -24 32 -40 48 -56 72 -88 104 -120 148 -176 208 -240 280 -328 377 -436
29 -436 500 -572 652 -740 836 -945 1060 -1193 1335 -1494 1664 -1853 2057 -2282 2528 -2796
45 -2796 3087 -3407 3756 -4139 4561 -5023 5534 -6099 6731 -7439 8240 -9149 10195 -11412
59 -11412 12852 -14581 16708 -19395 22914 -27737 34787 -46092 67134 -119441 515235 593289
71 593289 -735408 -225332 364072 238276 -59422 -106195 -200992 138359 250270 -326946
81 -326946 -613339 84940 415451 -111056 -489373 -203152 133806 198389 -22351 -181632
91 -181632 -53732 106725 33061 -24483 -21466 25668 152823 120998 -130241 -73544 204992
102 204992 118383 -121569 -36880 47989 -25184 55757 105198 -63506 -8576 149490 -60084
113f0084r7120L29004L6463l09673o287J34096m8559J6163J6507j35236L8176
124h6550J49032j42761j31182K25770J42494j65479j03852L0390N6564J34173
134A08599N217j84796J6807J49642p3573n3153J28219P706o1604J8770q8976p1513
146i8655J65431O3038j61079L16O5071j51632k1454K06467l0198j36518J07303
157H090O808j49215J27314J42005j61612j3597J75122j14927j78129J42352J32672
168A16883q4101m2897J255n1493N7645R8555r5824j14580P6547R3236k0915p2362
180c8051l4860R7015P2670j57892r5097J96384J25586j01918p6214l4157o399
191e2933J49202O9914k09706q5624J93815K126j99905M7765J65793k7432n7858
$$ plain form
113 -60084 -157204 171800 208263 -101410 -107697 26399 -22160 -5997 10510 -124726 -86550
124 -86550 62482 -80279 -211461 14309 156803 -8676 -112528 -82138 -25574 108599
134 108599 113816 -70980 -54173 95469 21896 -31257 96962 104668 43064 61834 -27142 -98655
146 -98655 66776 129814 -31265 -30949 34122 -117510 -138964 67503 37305 -99213 8090
157 8090 14898 -134317 -7003 135002 -26610 -40207 134915 19988 -158141 -15789 116883
168 116883 32782 -10115 -8860 -60353 -2708 95847 23 -114557 -38010 55226 34311 -38051
180 -38051 -72911 24104 96774 -61118 -156215 40169 165755 63837 -12377 -46534 -52933
191 -52933 96269 166183 -43523 -129147 64668 66794 -133111 -85346 80447 53015 -4843
202d843l7599r6307P1942J89800n7378j46029O8848O9437p4867k1669N1281J5924
214B8540M836k8023o9743L2822J07389j9519q0177R621Q026j8048K0816k0979
226b4439r330J02502j1776j63360L0038J76292r208j02229m526P953J9757O8060
238G9734m3037j14062O3978J07594j10448j19448Q4630R8815o359n5161q2311
249i6075J9196J46629R281j47003j7400J07013L0753l7010k9547k783N7488M4307
261H4849q4663q1830R3034J09764n3184r6806j8390L6428N1960j6460p9246J5300
273c9244O7693m7702o6933L9345O0098L2081J584p6375n5557Q8828P5567p6395
285B990m2932P8808M701p8126J873L5023R234L6791j6816r2524J0434R3859l667
$$ plain form
202 -4843 -42442 -138749 -66807 122993 65615 -80414 -11566 57871 -16996 -38665 12616 28540
214 28540 33376 5353 -64390 -31568 75821 56302 -23875 -14254 -6228 -24276 -3460 -24439
226 -24439 -33769 68733 56957 -106403 -76365 99927 90719 -11510 -16036 -8083 11674 79734
238 79734 36697 -77365 -13387 94207 -16241 -135689 -51059 47756 41397 -13764 -96075
249 -96075 -76879 69750 79031 -67972 -85372 21641 52394 15384 -14163 -16946 40542 84849
261 84849 186 -81644 11390 121154 67970 -28836 -47226 -10798 41162 24702 -54544 -39244
273 -39244 28449 -19253 -86186 -46841 13257 45338 46922 -29453 -85010 3818 79385 2990
285 2990 -39942 38866 43567 -34559 -32686 2337 11571 48362 31546 -60978 -50544 43315 39648
298C9648n9334j080K0272L807K475q505n953K5165J1777l1580r277K9187J1193
311B7795k936j7040m8186k177N1441n420l0122J7627j0540l3836L4809L7408k3673
324d850L084L4501k5064l3640M1906L4195k6503l581N884m4536p227N5342Q980
337C8491l1903m145j017j1262k84J748M288M310k0247k9155M609L5215K6215o375
351A0488l1425k1734K7993M4629j4463k8097L6371K6570m3637l2602J6590L1814
363B2497K3570k6248n9951P826O8105J1518n3596k1243L3076K1632k0035l5120
375b7969o639M7897L5934n4555n8121M1685N9404j3077m6323k1341L0861M7977
387C5733j5496n8470K420N2333j393n7846j5544N6111N1389j5004n8229j6586
$$ plain form
298 39648 -19686 -20766 -494 3313 5788 -2717 -8670 16495 28272 -3308 -12585 16602 27795
311 27795 24859 7819 -40367 -42544 8897 3477 -26645 -9018 -19558 -53394 -18585 18823 -4850
324 -4850 -1766 32735 7671 -25969 15937 50132 23629 20048 25932 -18604 -25831 29511 38491
337 38491 6588 2443 1426 -9836 -10120 -8372 -4084 226 -20021 -49176 -44567 -9352 16863 10488
351 10488 -20937 -42671 -14678 29951 15488 -12609 23762 50332 6695 -25907 -9317 22497
363 22497 46067 19819 -40132 -32306 35799 47317 -6279 -27522 5554 27186 7151 -27969
375 -27969 -34608 13289 49223 -5332 -63453 -21768 37636 24559 -21764 -43105 -12244 35733
387 35733 20237 -38233 -35813 16520 15127 -42719 -58263 -2152 49237 34233 -23996 -40582
399d0582O6382M7980n0426m2104M1785L2825l3816m4518K168N1831K7405o1052
411b122p0764K8548P4075l464o2274j3486M0423K1367k2719l8713M879O4556K1807
424D2113o6941l2516O0008N2035j8032m3687r857L4349K8608k1620l9612M251
436a0901L8931j853n0087j7169M2319L6453k1042m8325J336M9811J2230l3158
448a455j2515J3565J0279n047k5267p556L7161J9125m2608l4092L3256M1466j3113
461A3199k9072j224J2397J2856j819k0371P700L3154r364l4950N170L0352J4223
474C2251r733k5424j0402K0679J5533j6380j6183P796N16j8674l841J0681P088
487f093J1349p9j8815L837J8939m511m242J1563l081j2911J732Q497L002j086
$$ plain form
399 -40582 25800 73780 23354 -18750 23035 55860 22044 -22474 -20306 31525 58930 -2122
411 -2122 -72886 -44338 29737 26273 -36001 -49487 -9064 12303 -10416 -49129 -44250 20306 42113
424 42113 -24828 -57344 2664 54699 36667 -7020 -16877 17472 46080 24460 -15152 -10901
436 -10901 28030 26177 -23910 -41079 1240 37693 16651 -31674 -30338 19473 31703 -1455
448 -1455 -13970 -405 9874 4827 -20440 -27996 9165 28290 -14318 -48410 -15154 26312 13199
461 13199 -15873 -17097 -4700 8156 6337 -14034 -6334 26820 17456 -17494 -12324 18028 32251
474 32251 22518 -2906 -13308 7371 22904 6524 -9659 -1863 -1347 -20021 -23862 -13181 -6093
487 -6093 5256 5177 -13638 -9801 9138 4627 385 11948 8867 -4044 -2312 6185 9187 8101
501H101n464p659K698Q853o797q049J1917L713j6560q678K562Q267R810j2562
515i848j6445J9757K4029p777j0147P744P069k547p221l356J2103J7697j3293
528A7765l6430L54L1536k02k2507m687P408J2522J754k5660o735L4494Q484l7717
542a9621j8210K4008K5308J425j7025j5495J3652L0267p819l4762R099L5710l125
555B3412k7236j1859Q850K5611N584l3403j5624K9458K1040j4585j6955N358J5252
568A4903j073k2294j4084K1489K3914k1868l2778J0575K4229N27j1506j0948P151
581a1763K4294n559k9006J0265L2473o836k9917l813K2734K0663l336k5844j0041
594a5686L0438K1392k7420k1474K0197J5639j2016k0722j2185J7924K6569j9516
$$ plain form
501 8101 2637 -5022 -2324 6529 -268 -8317 3600 7313 -9247 -17925 -15363 -7096 2714 -9848
515 -9848 -26293 -6536 17493 9716 -431 7313 14382 11835 4614 1258 13361 31058 17765
528 17765 -18665 -18311 13225 13023 -9484 -14171 -6763 5759 7513 -18147 -24882 9612 18096 -19621
542 -19621 -37831 -13823 11485 12910 -4115 -19610 -5958 24309 16490 -18272 -9173 26537 23412
555 23412 -3824 -15683 -6833 18778 24362 -9041 -24665 4793 25833 11248 -5707 -349 14903
568 14903 13830 -8464 -22548 -1059 22855 987 -31791 -21216 3013 3540 -7966 -18914 -11763
581 -11763 12531 6972 -22034 -11769 20704 13868 -16049 -19862 2872 23535 20199 -5645 -15686
594 -15686 14752 36144 8724 -12750 7447 23086 11070 -9652 -21837 -3913 22656 3140
606C140l7149R640L2427L831j7068j0647O107J6371J152k3822p183L1899J5557
619B4255k6707j5554J3247J2451O618n985j6037Q417J9596j0688j7142P702R337
632I510n685r108o238K842J5833N671j7890p132J6568M184r469J228j191l399
646d276Q947l610j5574Q975J3850j1486j0067O875N912M778N029o873q714P520
660A286N476r878o38R751l161l394M484l934L85J0316m723r045N059o44n299P526
676C567K449j2533m466N735j334n38P498o13m593P225J021q242R361R038j3023
691E52n576P342j808N44M934p194k893J0050l096j2052P502J3498o916j1172O79
706e606J896M254M396j2524q566J9321R803j6203n433J0822Q200J436j2377j3535
$$ plain form
606 3140 -34009 -24369 8058 11889 -5179 -15826 -9719 6652 7804 -16018 -23201 8698 24255
619 24255 -2452 -18006 -4759 7692 14310 8325 -7712 705 20301 9613 -7529 173 9510
632 9510 3825 -5283 -11521 -8679 7154 12825 -5065 -12197 4371 8555 -914 314 -877 -4276
646 -4276 4671 1061 -14513 -5538 8312 -3174 -13241 -6366 -454 4324 9353 2480 -6234 1286
660 1286 6762 -3116 -3754 5997 2836 -558 3926 -8 377 10693 5970 -3075 1984 1340 -3959 3567
676 3567 6016 -6517 -10983 -5248 -6582 -7120 378 -235 -4828 2397 3418 -4824 4537 13575 552
691 552 -5024 2318 510 1054 5988 -1206 -4099 5951 2855 -9197 -1695 11803 4887 -6285 -5606
706 -5606 -3710 544 4940 -7584 -16150 3171 12974 -3229 -8662 2160 10360 11796 -581 -14116
720a4116J3386J9955j2087k4098K578J8764M916r545j1451J499K0097O406k4681
733h377p717K5874R688j7366j3386Q5J4108J4249j3380k0497J0808J9455p487
746F057j5473L991J0968J706p035j2697o55J9438L922k1401k975J7964M173n028
760B955k639j980Q753P805j4249j1919J3776J1997j2281j3277K939P979M937l455
774A341j2493J733J9609q63j9233J351J4714K427p174j0278j779J6764Q166j6581
788b296r350J3642R951q289q407J618O545N092p419j4064P159J6840q935j5668
802a3581O064J0072K667r68o650o99J1583k88j4491j370J2176J314q795k970J783
817d153L803N828m392r043P767R199q280m643O455Q40o29m50o895j162Q388J063
$$ plain form
720 -14116 -730 19225 7138 -16960 -14382 4382 9298 -247 -11698 -10199 9898 16304 -8377
733 -8377 -16094 9780 19468 2102 -11284 -11199 2909 17158 3778 -16719 -5911 13544 6057
746 6057 -9416 -5425 5543 7249 214 -12483 -13138 6300 10222 -11179 -14154 3810 7983 2955
760 2955 316 -1664 7089 14894 645 -11274 2502 14499 2218 -11059 -8120 -141 4796 1341
774 1341 -11152 -9419 10190 9327 -9906 -8555 6159 8586 1412 -8866 -10645 6119 14285 -2296
788 -2296 -11646 1996 11947 3658 -4749 -3131 3414 8506 1087 -12977 -5818 11022 2087 -13581
802 -13581 -7517 2555 5222 4254 -2396 -3095 8488 8200 -6291 -7661 4515 5829 -2966 -5936 -4153
817 -4153 -350 5478 1086 -7957 -190 9009 729 -3914 2541 3381 2752 2302 -4593 -5755 2633 3696
833C696n666J833L660l413j112L205k379k493K703k683l002N977q75o698N028
848b219M653n727N56O410J428L5j646n368J162Q040j804j0335P00P816q79l277
864d55Q91j042K514L438q334m318J0240K260r220k600K775J715J004k001l001
879f134N044O349m426o251O562O498n120m538q9J602N924l37j0536J954J2131
894H633k287j0056Q20P476M469l395r748l503R527O158j1342j0025Q283R327l820
909E17o877j536P058R465o541j3423O028J4057j934j1183l423O823Q498j887j0434
924d792p31J3275N108j2251o230R364N727n149q280m551P946R694r562j2071Q274
939d229J0537m626q344O2P257O046m198j0667K66J2650K230j2297l785R375M981
$$ plain form
833 3696 -1970 -137 3523 110 -1002 2203 -176 -2669 34 -2649 -5651 326 -549 -7247 -2219
848 -2219 2434 -3293 -2737 3673 5101 5136 3490 -1878 -716 7324 5520 -4815 -4115 3701 2822 -455
864 -455 436 -606 1908 5346 -2988 -7306 2934 5194 -4026 -6626 -3851 -2136 -1132 -3133 -6134
879 -6134 -1090 5259 833 -5418 1144 7642 2522 -2016 -2105 -503 5421 5084 -5452 -3498 8633
894 8633 6346 -3710 -2890 4586 9055 5660 -4088 -7591 1936 8094 -3248 -13273 -4990 4337 517
909 517 -6360 -7896 -838 8627 2086 -11337 -5309 8748 6814 -4369 -7792 -969 7529 5642 -4792
924 -4792 -5523 7752 12860 609 -5621 3743 9470 4321 -3959 -8510 -564 9130 -432 -12503 -4229
939 -4229 6308 1682 -6662 -6600 657 6703 2505 -8162 -7896 4754 6984 -5313 -9098 277 5258
954E258k019m188j241P893M807r385o949O920N875l383o561k446M257M713k675
969H76o467J270P352j03n987M90L531O87p39n173k584P767L631p239j478O207
985B041K132j710j779j076K162L479k639o635K016O661l383o351J633K822J009
1000C82P36k739l92N519J23n506p06K792L71j329j203m44J453J898l55j190J903
1017A313M10k513J854L068l003j650J160j418j16R09k441J109M578j539m429J722
1033i86M397q11l799j345N98J837J667l962l237N541L028n301r04M124K561N78
1049C986k801l092L345M008l965n401J906M717r48l777k5K588K780r12o118l70
1065d079P824O33o994j840K647K687k90m454j094O624L452m875l779M174N319
$$ plain form
954 5258 3239 -949 -2190 5703 10510 1125 -5824 1096 6971 3588 -2973 -5419 -1162 3551 876
969 876 -5591 -4321 3031 2928 -3059 -2569 962 1649 910 -4263 -6847 920 4551 -2688 -4166 2041
985 2041 4173 2463 684 -392 1770 5249 2610 -4025 -2009 4652 1269 -5082 -3449 -627 382
1000 382 1118 -1621 -2013 3506 3629 -1877 -2583 209 580 -749 -1952 -2396 -943 955 600 -590 1313
1017 1313 1723 -790 1064 4132 1129 -521 639 -779 -895 14 -2427 -1318 3260 1721 -2708 -986
1033 -986 3411 2600 -1199 -2544 -1946 -109 1558 -2404 -5641 -100 2928 -2373 -3277 847 3408 3986
1049 3986 1185 -1907 1438 5446 1481 -3920 -2014 2703 1755 -2022 -2047 541 3321 2409 -3709 -4079
1065 -4079 3745 4378 -2616 -4456 -1809 878 588 -3866 -4960 1664 5116 241 -3538 636 5955
1080E955k222n817j756L650M416k050p079J173O990n31m593o53K692M297l82o260
1096b170j368O396J697o391l958L147M401k17l123k377L325N780k997p572L034
1111b393O911j765m742j352K363M125r81o061O8P016K909n476l516M326L627k802
1127B257m751j608L777L480m131m576L561M301j132k883j028L145L496k571l974
1142b637K086L197j172l482m17J906J264J18j330r31L344J930m371r84L255o09
1158A167j933N28q17J51J659j046j948J576K585q51j697J056Q17r24J58r12j935
1175b366J194P38j584J072J484q01L25J011k12L70M2n77pJ76r00q35O72P41j499
1194i56q07J900O75RJ38j706j0K795j161l443Q00K031j98q54r32L03K361Q34k095
$$ plain form
1080 5955 3733 -2084 -3840 -190 4226 2176 -4903 -3730 3260 2729 -1864 -2517 175 4472 4090 -2170
1096 -2170 -3538 2858 4555 -1836 -5794 -2647 1754 1537 -1586 -3963 -638 5142 2145 -5427 -2393
1111 -2393 4518 2753 -1989 -3341 -978 3147 2166 -3895 -3827 3189 6098 622 -2894 1432 5059 2257
1127 2257 -2494 -4102 -325 3155 -976 -5552 -1991 2310 1178 -1705 -2733 412 3908 1337 -2637
1142 -2637 -551 2646 1474 -2008 -2425 -519 745 863 -467 -1398 1946 3876 -495 -1479 1776 1167
1158 1167 -766 -238 -1055 -904 755 -291 -2239 -663 1922 1071 -626 430 1247 323 481 -431 -2366
1175 -2366 -1172 -434 -2018 -946 538 -263 62 1073 861 1231 1273 696 689 865 -35 -870 -198 543 -956
1194 -956 -1763 137 812 821 959 -747 -757 2038 877 -2566 -1766 265 67 -787 -1719 -1416 945 1779 -316
1213c16j151K994K003k822k222J112R13N58j861k765K167M497j733l303J301K626
1229A998P26j814k486Q00K666m63l802j117M001J632l606j850K100K988J208l065
1245h4k915L514L267l577l245J386L017O10k576k065K755L637j295m236j27M559
1261B625Q10l994j821R25K644L36m423j811M874K600l108j921J691K909M81k925
1277a08k383K092K890j550m099R59M143j8k706j073J132L215Q64m005j324L413
1293A442R95k328j926J50J886Q50j960j308K067K695j333l001N78K193L1j143
1309a12j698m10K659N27k880q7K594O41m56n75L72J487N33j884j565R43J533j661
1327c9j826J154J168k46j30j316K44K315o73k116P07J154p62n78l41J62Q83L19
$$ plain form
1213 -316 -1467 1527 3530 708 -1514 -402 511 1069 -792 -3557 -1390 3107 1374 -1929 -628 1998
1229 1998 2724 910 -1576 -776 1890 1427 -2375 -3492 509 2141 -1465 -3315 -1215 1773 2981 -84
1245 -84 -2999 515 3782 205 -3040 -1654 1363 1973 -603 -2668 87 3724 2429 -1807 -1934 2625
1261 2625 3435 -559 -2380 -1455 1189 1525 -2898 -4709 165 2765 -343 -2264 -573 2336 2817 -108
1277 -108 -2491 -399 2491 941 -3158 -2199 1944 1926 -780 -1853 -721 2494 3358 -647 -1971 1442
1293 1442 2437 109 -1817 -1667 219 1069 -891 -2199 -132 2563 1230 -1771 -1193 1000 1031 -112
1309 -112 -1810 -2220 439 966 -1914 -2001 593 1234 778 203 575 2062 2595 711 -854 89 1622 -39
1327 -39 -1865 -711 457 211 81 -1235 -991 1324 651 -1465 -758 396 -366 -944 -1285 -1123 -240 79
1345G9n34MJ728P55j384l16R66r12j59M51j004m13Q41p51K7J245o35o94J200O44
1365A138m94n17L3o7n55k95o39j68J600J19j755R53J558m33k15j12l53J176O21
1384A595j873p54J359O30j092r26O76J090M60k11j330K60J913j176k434N32J265
1401a6j69l73j144j32K486O40k072l38J776J359r16j197k7P27N67j007k164Q86
1419a114K554r32j713P17J035O60j47k003m21K269Q2k052p71J341J067o25j047
1436a100P6J422J723j239k036J536J938j667j675J34O23J312q48k110P87K942
1452A818k68k302j45J754Q59j494j076p1J184R04k424j607K502J512j330q20M42
1469e62J075J402j077j967R07J445m72j497n7J046M18k94p24j62J266Q60j505
$$ plain form
1345 79 -455 -451 1277 2032 648 332 1298 386 227 678 -326 -739 102 -649 -622 623 -12 -706 494 1138
1365 1138 644 127 160 93 -462 -757 -1396 -1564 36 155 -1600 -647 911 478 263 151 -202 974 1595
1384 1595 -278 -1032 327 957 -135 -1061 -385 705 1165 954 -376 -116 1797 621 -1813 -1281 -16
1401 -16 -185 -558 -1702 -1834 652 1292 -780 -1118 658 2017 1101 -96 -123 604 1171 164 -2000 -1114
1419 -1114 1440 508 -1205 -488 547 1207 1060 -943 -1364 905 987 -1065 -1836 -495 572 -53 -1100
1436 -1100 -1024 398 2121 882 -1154 382 2320 653 -1022 -888 -265 1047 199 -1911 -1124 1818
1452 1818 1550 -752 -897 857 1716 222 -854 -925 259 1163 -1261 -2868 -366 1146 -184 -1004 -562
1469 -562 513 1915 838 -1129 -222 1223 751 -746 -803 243 661 367 -357 -519 747 1607 102
1486A02o72J356l10o92j30q68R6J319o35r25R84J035k59l36K41L5j70K82m50o77
1506f74Q68J41j286J85J109k88K71L59o82M32R21p00p31K19k0m17l44M82r2j57
1526d04N82j63m58Q00M8p07O48k79q26M27L26p00P1J07N5O25L96k87j02R06K45
1547A310j047l68M69k61j16rr27K85J308q66q09J119N48m37k8J9l5L20l22j386
1567a233J9J353M65j365L6J164J68q1k93o79R90O92j605r08J523N21p45j069q8
1586a135J197J046n13j086L20J521j91j561l83O90K85l9j300l47J680N20j199
1603d95j26O22M26L59n50n94O09P39q81j297M82J294l30n34K42q4O66N66j239
1622a25m73J267Q0j516j72P82K64j39p27k13P56J168l50j120M82J197o18q08j42
$$ plain form
1486 102 -570 786 476 -216 -346 -1214 -1118 201 -434 -1359 -375 660 401 65 306 341 171 453 3 -674
1506 -674 194 335 -951 -766 343 55 326 685 3 435 1356 656 -75 144 124 -293 -637 -155 -247 -404
1526 -404 178 15 -443 357 405 -302 346 67 -759 -332 -6 -706 -635 -528 -473 152 548 261 159 1065 1310
1547 1310 263 -105 364 103 -13 -22 -949 -664 644 -222 -1031 88 636 199 171 190 155 475 153 -1233
1567 -1233 -1214 139 604 -761 -725 439 607 526 233 -446 544 1236 -369 -1277 246 767 22 -1047 -1135
1586 -1135 62 1108 595 -491 -171 1350 1159 -402 -785 -95 190 151 -1149 -1496 184 704 -495
1603 -495 -621 1 427 786 236 -358 251 990 109 -1188 -706 588 258 -276 -34 -118 548 1114 -125
1622 -125 -598 669 749 -767 -939 -157 107 -32 -759 -972 -216 952 602 -518 -36 1161 543 -265 -407
1641d07l6M66J11j178M8J580J94r23l04L90Q57K66r58n05M52O40o87j033O43N26
1661A42j16l1k35J77R01l15j050L80N04n87l38J94k6J04K66k31k75P92M24l49
1681C31j26L84j04l72O8l37m20M52J5n13M37L55j0K34k85j53L05K29j19n88k85
1702e02M17k18J92j16m27M59O88m05k15M29o4R8k02m25k03N68j69k72j2L45K17
1723A83m4J07k7m4L81lo45J0J83m03J0Rk73K31M97l04J43L89Q7m67n6L91r0l66
1747a01l1l12O9P24m25m66M01M45J5j49k44Q2O17n04o49k5L84M17n06l08M15O22
1769D71K58m01o72N08P34m93q37J28L05J06k20p11L55P17J4l97o0N60K10m77k90
1790a92J1Q9K20l88n73O20N21m89j09M45Q3J49k48j76J84L18k77n23l4L51R4q1
$$ plain form
1641 -407 -443 23 134 -1044 -996 584 778 -145 -449 -59 798 1064 106 -399 53 693 6 -1027 -384 142
1661 142 26 -5 -240 -63 838 523 -527 -147 357 -230 -568 -374 -400 -296 -30 -261 -536 256 680 331
1681 331 205 589 485 113 181 -156 -576 -124 -109 -622 -185 170 160 394 109 -44 261 490 371 -217 -502
1702 -502 -85 -303 -111 -227 -654 -195 493 88 -127 302 238 336 134 -291 -494 74 -95 -367 -379 -34 183
1723 183 139 246 219 175 556 553 -92 -82 101 -302 -292 -283 -556 -325 172 -132 11 400 487 20 -36 355 265 -101
1747 -101 -132 -444 -375 349 -76 -542 -141 304 319 170 -74 8 625 121 -528 -553 -169 248 -258 -566 -151 471
1769 471 729 328 -344 164 898 405 -432 -304 1 107 -113 -824 -469 248 262 -135 -195 365 575 98 -192
1790 -192 -181 -92 128 -260 -833 -213 308 -181 -290 155 238 387 139 -37 147 465 188 -335 -369 -18 76 -5
1812ej54K15M19K28m15m81L42J89m64k72k8q5N45k74m35J70M97J82j14j55K08
1833A13L93j65j76m28K02M44n21l43M87J42J14O7k82J16J56l4k55j22K60j13l47
1854b92r2J40J96K5j3k06N72J01m51n3K21j90j04N3k15K26J56j06j57K26K76P3
1876C86l04J06j8M9K41k94l85MJ49r0N5j1j76M24J52k64r0O7J17lk18j07m2O4
1900a88J46k17q2L38K54l6j9j40J26K94l20m13J11J88j92R7k19K42J44r4L7Q2
1922A39J87j56k25k5K86k08j90j3m7J74K77m59j6M58J80j15k68k5K02N8l72j26
1944b84O6L30J16n06J3M33K6R6k83k09N47K2l58l27N1O0J95j09j48K49K65q5k07
1967d7Q0L30j29l04O9M0p2L3j27j46L29r3j41K13J55J21j91k69n8K89l8j6l74
$$ plain form
1812 -5 -159 56 475 703 288 -193 149 338 -126 -398 -426 -511 34 -240 -675 -505 -8 174 60 -95 113
1833 113 506 341 165 -263 -61 383 -138 -481 6 148 262 329 47 163 319 285 30 -92 168 55 -292
1854 -292 -384 -244 -48 -23 -36 -242 330 431 -20 -73 148 -42 -146 -93 -308 -82 74 -32 -189 37 313 386
1876 386 82 188 170 219 460 166 -219 -215 -66 -156 -101 -112 -288 136 288 24 -66 1 118 115 -103 -210 -252 -188
1900 -188 -42 -259 -341 -3 251 215 196 56 182 476 156 -257 -146 42 -150 -53 -272 -30 114 20 57 139
1922 139 326 170 -55 -80 206 -2 -192 -205 -252 -78 199 -260 -276 182 362 247 -21 -46 156 214 -158 -284
1944 -284 -218 112 228 -278 -265 168 194 290 7 -202 345 367 9 -318 -267 -207 -12 -121 -269 -20 245 160 -47
1967 -47 33 363 234 -70 -1 39 -33 0 -127 -273 56 -37 -178 35 190 311 120 -149 -207 82 44 28 -346
1990c46J79L50p2l01R0K36L00j64l65O0L17j72k57p7j5J10J45j58m4J72J33N7
2012A78k26L57j81m0m5q8k52K98l9j15J2P1M9P7R5q7K0N8lj40o0J52k69j40L09
2037iL2j76K88p8j09J79P2j56l5Kl7m5j19j02J62M6J8L8N6J83J28k41K2j28J2
2062CJ29k07j89K94j76J01P2k56Q2L41m3j21k9P4O8j2j83k31J07J26J1j87J79
2085d7K51r1R8j58j50J09R0j73L6p4l5N4p7R3K04o3K3J3K56r2k44j02P2M3j28
2110i2l7j31J65K28j48k46K02J91P5j03j72J47J18q6k05j97K78J06k14P6J91l0
2132A16P7P4k74j25L04j78j23M5J7J49Nm7l9m8K63Q6k03PJ30l51npr7J70j17N3
2158a18J7J88j13J32j40J33P7j05j99j4J33N9p7j46K00k7j21J35J17OR4j48k08
$$ plain form
1990 -346 -167 183 111 -190 -100 136 436 272 -93 -33 284 112 -145 -222 -237 -127 18 -140 -184 -12 121 178
2012 178 -48 309 128 88 43 -45 -297 1 -38 -153 -141 -70 -21 56 151 64 84 142 139 -1 -61 91 -178 -318 -9
2037 -9 23 -153 135 57 -52 127 199 43 8 10 -27 -72 -191 -293 -131 -85 -67 -29 27 210 338 97 119 -9 3
2062 3 132 -75 -264 30 -146 -45 27 -229 -147 194 151 30 1 75 143 131 -52 -283 -176 -50 -39 -226 -47
2085 -47 204 113 211 53 -97 12 102 -71 -35 -109 -144 -90 -167 -74 130 67 90 103 359 267 23 -79 -7 36 -92
2110 -92 -129 -260 -95 133 -15 -261 -59 132 207 104 -68 79 197 111 -94 -291 -13 93 -121 -45 146 116
2132 116 193 267 -7 -132 172 -6 -129 -84 -67 82 87 40 1 -47 216 302 99 106 236 -115 -120 -127 -224 -54 -171 -118
2158 -118 -101 87 -26 106 -34 99 176 71 -128 -142 -9 50 -27 -173 27 0 -121 14 131 137 231 83 -125
2181a25J30M2j67Q1j08lr7K91j76L5J15J56k0j15K8m6j7K3k30M9Q3n7Q8R0Q0m3
2207H7Jl8LO0m9j2j65J0J82k82K09O3l8L2O4m4r5K52k61j18N6L2k6P6k10J01J7
2234i3K06m2j02O1K0MM2j50m4J99q4k22J22J4J2Q2J9p5J62Rn9q6o0K03o9j00m0
2261g1L5m5J21j41m2K21l3J00L9j33j6J1r7J4j63N2N8J19n5J72n9q3Q1jk9K9q1
2288Co8J2K0nL9j20J40L4k5n0RJ20l8J1j30J13j47N8k7j65J49L03j88k7rK19k73
2315d2L2J7n5J25m2r5K6p2R0O7k7j7NJ82k10J64k07J41q2J0Oj32N0rLP6p6J45
2343G3N3n2k7rj10J02l3q6J01j44J52j7J15n0Q7o1q6N8Q2j81p2j8R7K1m3mJ24
2370G2j56J16M4n4J46j57O9j22K5L0o9j02O3J24K8M3r2K9L6J4l9jp9J45j57m4
$$ plain form
2181 -125 5 47 -120 -39 -147 -150 -247 44 -132 -97 18 174 154 39 67 21 4 27 -203 -154 -71 -128 -40 50 130 87
2207 87 88 50 53 113 64 52 -113 -103 79 -203 6 69 31 63 127 83 -12 240 -21 -139 -83 -51 -77 -1 -211 -110 -93
2234 -93 113 71 -31 30 50 54 96 -54 -98 101 17 -205 -83 -69 -57 25 44 -31 131 140 81 -5 -65 138 69 -31 -71
2261 -71 -36 -81 40 -101 -143 78 45 145 184 51 35 46 -51 -37 -200 -148 -90 29 -26 146 87 4 85 84 55 84 3
2288 3 -65 -53 -33 -38 1 -119 21 55 30 -20 -11 109 71 82 -48 65 -82 -24 -51 -216 -67 236 48 21 12 231 -42
2315 -42 -10 7 -48 77 35 -60 -34 -106 -16 51 24 7 12 194 -16 148 -59 82 0 10 16 -116 -66 -75 -72 4 -72 73
2343 73 126 74 47 38 -72 30 -3 -89 12 -132 20 3 118 68 155 94 8 66 148 -33 -105 -123 -26 -5 -48 -52 72
2370 72 -84 32 76 22 168 11 80 -42 -17 13 -56 -158 -95 29 57 100 8 37 73 87 48 47 -32 113 -44 -88
2396h8J80j8j69J01K4q4J47m6Qk9l7l9L5qj8L5p1L6J13j12K02j61J8J54j51R0
2422A12J4l56N5J68o4k2N6M1N2l0m4L6n4Q6J9j80j2Q4OM1l2q4J06qJ8m7P6j9J11
2451A29q7o5R7r0L8l3o4L7J07m3J4P8j87J33O1j07n9k4K3K7LJ23k10m2J87m8K2
2478B0P9o4n1K2k1K0M4j69J59rL2j73J96q2J4qo4J25k5j31L1o1J05J38j41j04
2504a18J43N5o2K4n6J1P2j54K12j73l0L6l2K0M6k2M2l4j8K9L9j06K5J41j72J24
2530D2O1j77Q3M2j54J89q5p6P2Pp4J30n9K7M3j89Q5R5k03J43o1Q6M1o1J0o3N1
2557Ej03Q0j04K75k08j4J39k2m1P3m0k5OMM5Kj45J5J14j15j14J62j18R4J10j3
2583F2K5j10p3K33m9n6M0j70k1K09r9J0J03k72J94Q2r7P0L0j46N2k8J03l7j34
$$ plain form
2396 -88 92 74 -95 6 30 -54 93 47 55 26 -11 -50 -15 -23 -41 -6 -77 -41 72 -40 162 1 19 173 22 112
2422 112 126 -230 -175 -7 -71 -93 -37 4 56 26 -18 18 -36 50 69 -111 -123 -39 -33 8 -24 -108 -2 -10 8 -39 37 18 129
2451 129 42 -23 74 -16 22 -11 -75 -38 69 26 40 118 -69 64 125 18 -41 -65 -42 -15 -12 111 -99 -141 46 -2 20
2478 20 99 35 -16 6 -15 5 49 -120 39 30 62 -111 85 3 17 9 -55 70 45 -86 -55 -116 -11 127 -14 -118
2504 -118 25 80 18 42 -14 -3 69 -85 127 -46 -76 -40 -72 -52 -6 -28 14 -20 -38 -9 30 -76 -51 90 -82 42
2530 42 103 -74 9 51 -103 86 1 -75 -3 4 -70 60 1 28 71 -118 -33 62 -141 2 -59 27 68 7 17 -46 5
2557 5 -98 -18 -122 153 -55 -69 70 48 7 80 40 15 21 25 70 72 -73 -58 56 -59 -173 -11 -129 -35 75 62
2583 62 87 -23 -96 137 88 32 72 -98 -119 90 -9 1 104 -168 26 108 11 81 111 -35 17 -11 92 55 -79
2608g9Q7N1j56J23K9l4pk2N2Ll2j38kJ38Rq6K2R2L0p5M1K0J0j48P7q5K8O0k25
2637b17K20q8L0P4J4l5J13j70J68j72J12R8j65K7K6q4J18L2m7n5Q2j5o4P0k70
2662a98K91j9O0k46N7k7K4Q7P1j1j69J55m5oJ3O4q7N5o6o9J71m9j0kr2J99qq4
2690E9q0l0M3q4J15q2O9J39j67LqJ06n9Mn2J44j31r7J05j00Q1M1j38K39m3k0O9
2717A26j64K1QJn9J46q1Qj10L5j5J63k5j26O1J1R0n7M1j75O3n0J36j13k1J57l2
2744C9J04j20j38J01l0oK9o9J23l2Nq3J51j10K0N7k19J90r4K3J39j6rm3p2J52
2770I2p5j00OR1qj1J08j59J5M4q4J24o8kj2J0k3j4L6L0k8Q2j36J21l0Q2n7o6K6
2799fJ5k1L2l7J0J28j13P9j5j22L6m1l6L7n3R4M5N4r6K02j16o8P0o9O2j38LJ43
$$ plain form
2608 -79 8 59 -97 26 55 21 14 -8 44 47 15 -123 -125 13 22 -64 -42 50 80 5 46 66 76 -72 5 -80 -52 8 -217
2637 -217 3 -85 -55 19 33 -2 111 -59 109 -63 49 147 -18 9 35 -49 69 101 54 -1 81 66 2 72 -198
2662 -198 93 74 134 -112 -55 -82 -58 29 100 89 -80 75 30 24 37 101 14 69 3 -66 105 56 46 44 -48 151 143 59
2690 59 -21 -51 -8 -92 23 -59 10 149 -18 -15 -23 83 24 28 -24 120 -11 -108 -3 -103 -22 19 -119 120 77 57 126
2717 126 -38 -17 -9 -8 -67 79 -2 6 -104 -69 -84 79 54 -72 -11 0 90 33 74 -101 -38 -88 48 -65 -86 71 39
2744 39 143 23 -115 -14 -44 -50 -21 -90 33 1 6 -77 74 -36 -16 41 -178 12 -82 -59 80 64 55 12 -60 92
2770 92 17 -83 -77 14 6 -5 103 -56 -41 3 -81 43 -25 -27 -39 -29 -52 -66 -30 0 -28 54 -82 39 9 91 34 -32 -6
2799 -6 9 -12 20 -17 -7 121 8 87 72 -50 -14 -55 -91 -54 -107 -13 32 86 -10 192 76 8 78 9 71 -67 -64 79
2827G9k03J22k7P5L7qj12m1K25n7Lo8%n0LL9J8l2l3J06j8J5m7J3p1J11j44N4J58
2856A47r0j20R9n9m8M2LP5q0J20j44M4k4P7N9k64J79j06lK18j65J25j04P1j04
2881e2P5p3J53k09L8Q4J7n4j19O9J10N5j15kJ0O4J5j08J7R1J7j38J12L3j84K08
2907A14j4r0N3o6O3l9p2J6n8M1n6R8p4Q1r9J0J94k5M6j3k02L0R5j46J45j22k6
2934a16J15q3NJ50n2M0K4q2K8Q5j63J1J64j50R1O1l5m4k2j10J09K6p8K2n7o3J33
2961In4J07j56J65p5q5N9K1Q6r3P5n5K1P5n3r1N9q2O7m1j9J76q7pM2j9Pn9N5j80
2991a32J58l0j3O4n6M7L4j4qj65R9J13j50p5J07j8j7R3k2n0J21L9j8J00l31K15
3017I1q9jR7j36l4J59j27N3M9j01K39j24j78J52o8N8K5o9o1J28J21k43Q9QK4o
$$ plain form
2827 79 -124 -2 -29 46 83 75 -37 -78 147 90 93 25 25 -25 -22 17 35 3 -30 76 58 73 26 39 -32 79 -65 -11 147
2856 147 57 -63 36 -23 -71 -29 -26 49 -31 89 -55 -11 -35 42 101 -163 16 -90 -93 125 -40 85 -19 52 -52
2881 -52 23 -50 103 -106 -68 16 33 -21 -140 -71 39 94 -21 -23 -13 51 66 -42 -25 66 83 -55 57 90 -94 114
2907 114 100 10 63 -3 60 21 -51 -35 -93 -52 -108 -10 -84 -3 -102 -92 102 77 123 110 -92 -62 33 -113 32 -90 -116
2934 -116 -1 -84 -79 71 19 59 83 1 29 114 -49 -38 126 -24 67 128 93 49 27 -83 26 52 -26 -4 -61 -124 9
2961 9 -45 62 -94 71 -4 -89 -30 -9 77 -16 59 4 25 100 47 -44 15 -67 0 -41 -60 116 29 22 64 45 52 -7 48 -132
2991 -132 26 -4 -17 47 -9 38 72 58 50 -115 -16 97 -53 -128 -21 -39 -56 37 15 -35 86 125 107 207 -124 91
3017 91 2 1 98 -38 -72 87 -40 13 62 -39 200 76 -102 50 -18 40 65 -4 -65 63 184 -59 30 38 62 56
3043E6j45J5J64p4l0l1PJ07j64N9J7o8O0P7j23J11K5k7l0K8r7J32p2j11K02j03
3069a5j13K18j49R4N5o1m1J13j66N7O3j13Q2L9j02M0o7n5J09J2P8j48J57l8j41
3094i2N3L6M8j79J61k1kJ53j24j50K16j21R0N6j48j00J45Nm7KO0M6j53kR6m6L4
3121A6p9j0J17J7j26j77K98j34O7J05j38J08n2K8Qj32LOO6lJ20q4o0J41m9j22
3147f6k2J14m7Q2j23J74j70P5M3j28M8P7o7P3J1j6R7k32O6Ok5m3J24j13j1J42
3173F9lj86J84m7n0l9K4L2m0J0L5J5j72J32n9k2K51j52J5J21j09P0J0p9j26J59
3199D3Lp7p3J05m2oP1M5m5q9R7j22J13J4j93K21j68M0J24o2R9n4m9L8P7j94O8
3226a6L1Q6o8k05k2K41J7j23K12p7k7K9j20PJ02q5l4j3n8J35Rj11J48K9j01J41
$$ plain form
3043 56 -89 -74 90 16 -14 -45 -38 69 -95 -36 -19 -87 -27 50 -73 38 63 36 6 34 -63 69 -3 -114 88 -15
3069 -15 -128 90 -59 35 90 29 -12 101 -65 -8 55 -58 24 63 -39 1 -66 -121 -12 0 78 -70 87 49 -92
3094 -92 -39 -3 45 -134 27 6 4 157 33 -117 99 -22 68 124 -24 -124 21 26 -21 -19 41 87 -66 -68 28 -18 16
3121 16 -63 -73 44 61 -65 -242 56 -78 -11 94 -44 64 12 40 48 -84 -81 -75 -9 -12 108 24 -36 105 56 -66
3147 -66 -88 26 -21 61 -62 112 -58 17 60 -68 -20 57 -10 63 74 58 155 -77 -11 -5 -30 -73 51 -62 -73 69
3173 69 66 -120 64 17 -33 -72 -48 -16 -56 -46 -11 4 -168 -36 -95 -117 134 -18 -3 118 9 79 89 10 -116 43
3199 43 46 -31 -104 1 -41 -47 24 69 24 -65 32 -90 23 37 -156 65 -103 -63 61 -1 98 44 -5 33 110 -84 -16
3226 -16 15 101 33 -172 -194 47 64 -59 153 76 49 78 -42 -35 67 -18 -52 -65 -123 12 21 -90 58 87 -14 127
3252A27j08j8J53q9j30R5Kp4J5m3O5Q3r9K3K5nK5o8P4Jp6j8O1k9qN5j18J41j1
3281E1k6R8L8k59J72q5l2K8%j33K68q9j4j02J39k6L6k28K25J74k07l5r0L3P0K1
3307B7k8J6K3P9kj45Q2Q6k59J60n3r3K00j13k3N9k9O2J33k69J10m3nN2N6j08M9
3334B4qr5P7j22P7l4rR6j01M7J20j17k5M1N1q6J57K0p0jK0mp4J76j29qo1kJ13
3363G3r2J22j34q4J52m9m6J56l1n0J6m7P9p7o1L4Q2j22K04m8j87K05RK6m8j11
3389b9O5l6pj23J97n9L5q7J5J06n7M1k1k5j3J86k48J0M6p6J26o2j82K48Q6j87
3415e1Q1m3O7M0j28k1J69j88J08m6K0P0oj22NJ91k63K25j04J7QJ9j55R0N4m7J00
3442I0p7q2J05l2J24j40m5J33m8r0P0j68M1K4J30p4J73j69Q9J0L5J21p8j90J46
$$ plain form
3252 127 19 1 154 65 -65 30 32 -42 -27 -70 -5 78 -21 2 27 22 47 -21 53 54 -22 -40 21 -8 -16 39 -79 62 51
3281 51 25 123 161 -98 74 -11 -43 -15 -15 -148 120 31 17 -85 54 28 64 -164 61 235 28 -7 -97 -64 6 27
3307 27 -1 15 38 117 115 -30 52 138 -121 39 -14 -107 93 -20 -43 16 -13 49 182 -87 23 -20 -25 27 83 -25 24
3334 24 16 -79 -2 -124 -47 -81 -90 6 -95 -48 72 -45 -70 -29 22 -64 93 113 43 42 62 58 -16 160 31 23 -38 -40 73
3363 73 -19 103 -31 -115 37 -12 -58 98 67 17 33 -14 65 -12 -73 -39 43 -79 125 77 -110 95 104 130 82 -29
3389 -29 36 0 -7 -130 67 8 43 -44 -29 77 20 61 40 15 2 188 -60 -50 -4 -80 46 -16 -198 50 136 -51
3415 -51 30 -13 54 94 -34 -55 114 -74 34 -12 8 78 72 -50 -45 146 -117 108 4 21 29 48 -107 -17 37 -10 90
3442 90 13 -69 36 4 128 -12 -57 76 28 -62 8 -160 -119 -95 35 -39 134 -35 54 64 99 220 142 -48 98
3467I8m9o9J62j36M4J03k79J38J24j26K8m0j0j5J25j81O9j61K9J64k2m2P8N0J39
3492B21n2j52K3M4j23J60m2r3L0J6k5J26r3q3K01p4m9J13j40o8Q7m5N1j53O9M5
3518fj03M0J28p1M6lj3KQ6j70q6K04j02M8N2n0LLKR4q7O8Pq9P4o3o8Pj8j8Q9J0
3550A6L3l7K8M8n5m3KK3j30L1R5k9J16j83M1J27q7r6P5O7q9J56k34lR1k4R8l0
3578Gj27J87Q6j80J54j89M2O2k8q5K8j28J18Q9o6o4J08N1N1j03J2P4r6%J36k20
3604h1r0K04r7J26j00j30M1K14n7K5j8j15P2J9n0pj17K25k3q2Q8JP6n1o1n2J35
3631I5J1j96N7K9o8Nl4Q1K0N8j23R1K7L1o5q9J9Q8j53J68j17k4J05m1PL7j89M4
3659a26J68j59J07L0j24Q0k0RN6j54Q7M2L0K8rl8J0M0K5n0j01j2O9m7mJ48l4O1
$$ plain form
3467 98 49 -20 142 6 50 153 -126 12 136 10 38 -2 -12 -27 98 -83 -14 -175 -146 18 -4 -46 32 82 221
3492 221 169 17 40 84 -39 121 79 -14 16 32 7 133 40 -43 158 84 35 148 8 -60 27 -18 33 -120 -51 -6
3518 -6 -109 -69 59 -12 34 31 18 20 106 -64 -150 54 -48 0 52 2 5 8 10 104 17 85 92 3 77 14 -54 -47 -65 -83 6 16
3550 16 49 12 40 88 33 -10 -8 15 -115 -84 11 -18 98 -85 -44 83 -4 -100 -25 42 -47 109 -125 -128 -37 -61 37 7
3578 7 -120 67 153 -27 127 -62 -20 42 14 -71 -43 -171 -53 36 -30 -94 14 65 116 13 25 99 3 3 139 -81
3604 -81 -171 33 -64 62 -38 -168 -127 87 30 55 37 -78 -6 13 -37 -44 -161 64 41 -41 47 48 124 73 12 -40 95
3631 95 106 -90 -33 -4 -72 -67 -101 -20 0 58 -65 26 53 84 19 -70 -51 37 -116 52 -65 -89 16 -25 -18 19 -170 -126
3659 -126 42 -117 -10 20 -104 -24 -44 -35 21 -133 -46 -4 26 54 45 7 17 57 82 32 -69 -81 -12 -59 -63 85 51 112
3687A12m0k9j12J80k00R7lq3L1L3j63J25l1J21%M8j57K41j03j40R1n9mmlP6P8
3714A02j68K12j63O5J55j33q6J38j96L9l0k4P9j8j04M0R9L2O6l1J4k9l6j6lj10
3740a06K9j06N9N2j6p7J61O3m4j2Jo1K7m4r5J23J6N9M3o5O3nq1J17r5l1K00n0
3768A25k94J26Qk0K2j20K5J93r4J67j02mJ38j90l3N2o3q2K08j44N5J61j24N5Q4
3793A49j61N4J2r8J29p3q5R1o2P1r5o0K03n5J8m1R1j38J81m8j93J1N0o1P7P3p1
3820c1J05K7m9J16j68K7J17j38l5o8r9K19j87K1J52M8r9J60p0P9K7k84J38K2j89
3845a59k5K04L5k1M2j33Q0l1N8M4r9q7K41j10j87R9j72K59K1j33Q9%j0Q8kj6K8
3872A03j98J29N8j55J0J19p7M5J0j20J80k9p5P3rl3rj40P5N0l1Q4j21J03J8Q7
$$ plain form
3687 112 72 43 -69 111 -89 8 5 -78 -47 -14 -177 -52 -83 38 38 86 -71 170 67 -73 18 -41 -45 -49 -52 24 102
3714 102 -66 146 -17 48 203 70 -16 122 -74 -35 -65 -89 -10 -28 -132 -92 7 39 105 74 88 59 23 7 4 -106
3740 -106 -77 -183 -124 -72 -88 -165 -4 59 15 3 4 -57 -30 -74 -169 -46 -30 29 72 7 70 65 -16 101 6 -25 175 125
3768 125 -169 -43 -35 -55 -33 -153 -128 65 -29 138 36 32 170 -20 -53 -1 -64 -146 62 -82 -27 134 10 65 149
3793 149 -12 42 54 -44 85 12 -73 18 -44 27 -68 -128 75 20 38 -3 88 -50 131 83 -110 -99 -49 -110 -33 40 -31
3820 -31 74 101 52 168 0 27 144 6 -29 -97 -196 23 -164 -143 9 57 -42 118 48 127 154 -130 8 30 -159
3845 -159 -184 20 55 34 76 -57 23 -8 50 94 -5 -92 149 39 -148 -49 -221 38 59 -74 15 15 5 93 91 75 103
3872 103 -95 34 92 -63 -53 66 -11 34 44 -76 104 75 0 73 64 31 22 -118 -43 7 -24 60 -61 42 60 147
3898A47q1j50l2K48j29r0k3K9J0M2N7j22O5N6j4L0O9k9J5o3o9J03j36n9J64j75
3924a37J3J83k12K38n4J34j02o2l7O7o4J5O6k20K49k7j07J0J70j03N9j26q1K40
3948A12p6j73m1K94k88J56Q6j30J97j5j2P0n5p9p6r4N9l9P1P4r3l2J64j54J7J43
3974H6p7K6J23k33L4P0q1O8n8M6on5N7J08m7J19r2j27M9P2k04m7K12k24J73N9
4000E1j04P2O8j4Q3j88J10k7p3L3K2r6J68o1j80Q9J25n9P5o3N5J9k2q2j3K4J0
4027B2j14m9K55j11q7K99k10L7Q1r2n7r7J17J6l4j20J27q8J22O7l3q2J61k5l7
4052F8N6j45n3R1j69M2J1K6Q7o2j5K10k9r7Q9j66%J11q8q0J10j1j6k9J6K2M9J8
$$ plain form
3898 147 66 -84 -116 132 3 -87 -110 -81 -71 -29 28 -94 -29 27 13 43 112 83 98 35 -34 69 -67 -126 38 -137
3924 -137 -124 59 -153 85 31 165 63 1 -36 31 -33 -18 48 -172 77 50 -57 -47 123 20 79 -47 -128 112
3948 112 36 -137 -178 116 -172 -16 70 -60 137 122 110 180 125 46 -30 -124 -65 -104 -33 41 -52 -84 80 -74 -57 86
3974 86 9 35 158 -75 -41 29 -52 16 -42 4 -2 -57 0 108 61 180 88 -39 10 82 -122 -169 43 -181 -8 51
4000 51 -53 19 87 73 156 -32 78 51 -22 11 33 -63 105 44 -136 -47 78 19 94 31 86 105 83 1 -12 12 22
4027 22 -92 -141 114 3 -84 215 5 42 123 31 -26 -123 -6 10 -24 -144 -17 -105 17 84 51 -31 130 105 68
4052 68 124 -21 -74 17 -152 -110 -99 -73 14 -48 -63 147 118 21 110 -56 -56 55 -33 -113 -3 -14 -30 -59 -43 -21 28 46
$$ [...]
8191g0
##END NTUPLES=NMR FID
##END=
