##TITLE=1H_DE-80H_X3
 200.13MHz, d2o
 8 sc
 
 19ns.26.2.2025
##JCAMPDX= 6.0         $$ Bruker NMR JCAMP-DX V2.0
##DATA TYPE= NMR SPECTRUM
##DATA CLASS= NTUPLES
##ORIGIN= UXNMR, Bruker Analytische Messtechnik GmbH
##OWNER= pz
$$ XWIN-NMR		Version 3.5
$$ Wed Sep 17 15:01:07 2025 Russian Standard Time (UT+4h)  Yarkov@DPX200
##.OBSERVE FREQUENCY= 200.1313
##.OBSERVE NUCLEUS= ^1H
##.ACQUISITION MODE= SIMULTANEOUS
##.ACQUISITION SCHEME= undefined
##.AVERAGES= 8
##.DIGITISER RES= 18
##SPECTROMETER/DATA SYSTEM= spect
##.PULSE SEQUENCE= zg30
##.SOLVENT NAME= CDCl3
##.SHIFT REFERENCE= (INTERNAL, CDCl3, 0, 15.4836)
##AUDIT TRAIL= $$ (NUMBER, WHEN, WHO, WHERE, WHAT)
$$ ##TITLE= Audit trail, XWIN-NMR		Version 3.5
$$ ##JCAMPDX= 5.01
$$ ##ORIGIN= Bruker BioSpin GmbH
$$ ##OWNER= Yarkov
$$ C:/Bruker/XWIN-NMR/data/yarkov2/nmr/H-C/1/pdata/1/auditp.txt
$$ ##AUDIT TRAIL=  $$ (NUMBER, WHEN, WHO, WHERE, WHAT)
(   1,<2025-09-17 14:59:57.17 +0400>,<Yarkov>,<DPX200>,
      <created by zg, POWCHK disabled, PULCHK disabled
       configuration hash MD5:
       00 E9 B6 7A A2 85 ED C7 34 08 36 98 17 FE 4E 26
       data hash MD5: 16K
       47 3F 37 2A 90 75 AD 56 0B C8 50 0E 5F 8B 0B C9>)
(   2,<2025-09-17 15:00:27.59 +0400>,<Yarkov>,<DPX200>,
      <Start of raw data processing
       efp BC_mod = 2 LB = 0.25 FT_mod = 6 PKNL = 1 PHC0 = -1351.135 PHC1 = 5.790926 SI = 16K 
       data hash MD5: 16K
       88 02 F0 1D 3D 89 91 C6 27 F5 07 51 10 61 93 43>)
(   3,<2025-09-17 15:00:34.20 +0400>,<Yarkov>,<DPX200>,
      <abs ABSG = 5 
       data hash MD5: 16K
       6A D0 6A 32 5C 6B EF EC C2 3A 7A 4F 4D BC 35 AA>)
$$ ##END=
$$ 
$$ hash MD5
$$ 8E 56 E9 9F CC 39 B2 40 06 29 F0 65 73 3F AF 3D
##$RELAX= 
##$RELAX= 
##$RELAX= 
##$RELAX= 
##$RELAX= 
##$RELAX= 
$$ Bruker specific parameters
$$ --------------------------
##$DU= <C:/Bruker/XWIN-NMR>
##$EXPNO= 1
##$NAME= <H-C>
##$PROCNO= 1
##$TYPE= <nmr>
##$USER= <yarkov2>
##$AMP= (0..31)
100 100 100 100 100 100 100 100 100 100 100 100 100 100 100 100 100 100 
100 100 100 100 100 100 100 100 100 100 100 100 100 100 
##$AQSEQ= 0
##$AQ_mod= 1
##$AUNM= <au_zg>
##$AUTOPOS= <>
##$BF1= 200.13
##$BF2= 200.13
##$BF3= 200.13
##$BF4= 200.13
##$BF5= 200.13
##$BF6= 200.13
##$BF7= 200.13
##$BF8= 200.13
##$BYTORDA= 1
##$CFDGTYP= 0
##$CFRGTYP= 5
##$CHEMSTR= <none>
##$CNST= (0..31)
1 1 145 1 1 1 1 1 1 1 1 1 1 1 1 1 1 1 1 1 1 1 1 1 1 1 1 1 1 1 1 1 
##$CPDPRG= <>
##$CPDPRG1= <>
##$CPDPRG2= <>
##$CPDPRG3= <>
##$CPDPRG4= <mlev>
##$CPDPRG5= <mlev>
##$CPDPRG6= <mlev>
##$CPDPRG7= <mlev>
##$CPDPRG8= <mlev>
##$CPDPRGB= <>
##$CPDPRGT= <>
##$D= (0..31)
0 0.7 0 0 0 0 0 0 0 0 0 0.03 0 0 0 0 0 0 0 0 0 0 0 0 0 0 0 0 0 0 0 0 
##$DATE= 1758106796
##$DBL= (0..7)
120 120 120 120 120 120 120 120 
##$DBP= (0..7)
150 150 150 150 150 150 150 150 
##$DBP07= 0
##$DBPNAM0= <>
##$DBPNAM1= <>
##$DBPNAM2= <>
##$DBPNAM3= <>
##$DBPNAM4= <>
##$DBPNAM5= <>
##$DBPNAM6= <>
##$DBPNAM7= <>
##$DBPOAL= (0..7)
0.5 0.5 0.5 0.5 0.5 0.5 0.5 0.5 
##$DBPOFFS= (0..7)
0 0 0 0 0 0 0 0 
##$DE= 6
$$ [...]
##$SUBNAM3= <"">
##$SUBNAM4= <"">
##$SUBNAM5= <"">
##$SUBNAM6= <"">
##$SUBNAM7= <"">
##$SUBNAM8= <"">
##$SUBNAM9= <"">
##$SW= 18.0517328524113
##$SWIBOX= (0..15)
0 0 2 0 0 0 0 0 0 0 0 0 0 0 0 0 
##$SW_h= 3612.71676300578
##$TD= 16384
##$TD0= 1
##$TE= 0
##$TE2= 300
##$TE3= 300
##$TEG= 300
##$TL= (0..7)
0 120 120 120 120 120 120 120 
##$TP= (0..7)
150 150 150 150 150 150 150 150 
##$TP07= 0
##$TPNAME0= <>
##$TPNAME1= <>
##$TPNAME2= <>
##$TPNAME3= <>
##$TPNAME4= <>
##$TPNAME5= <>
##$TPNAME6= <>
##$TPNAME7= <>
##$TPOAL= (0..7)
0.5 0.5 0.5 0.5 0.5 0.5 0.5 0.5 
##$TPOFFS= (0..7)
0 0 0 0 0 0 0 0 
##$TUNHIN= 0
##$TUNHOUT= 0
##$TUNXOUT= 0
##$USERA1= <user>
##$USERA2= <user>
##$USERA3= <user>
##$USERA4= <user>
##$USERA5= <user>
##$V9= 5
##$VALIST= <valist>
##$VCLIST= <CCCCCCCCCCCCCCC>
##$VD= 0
##$VDLIST= <DDDDDDDDDDDDDDD>
##$VPLIST= <PPPPPPPPPPPPPPP>
##$VTLIST= <TTTTTTTTTTTTTTT>
##$WBST= 1024
##$WBSW= 4
##$XGAIN= (0..3)
0 0 0 0 
##$XL= 0
##$YL= 0
##$YMAX_a= 77519
##$YMIN_a= -60305
##$ZGOPTNS= <>
##$ZL1= 120
##$ZL2= 120
##$ZL3= 120
##$ZL4= 120
##$ABSF1= 15.48356
##$ABSF2= -2.56829
##$ABSG= 5
##$ABSL= 3
##$ALPHA= 0
##$AQORDER= 0
##$ASSFAC= 0
##$ASSFACI= 0
##$ASSFACX= 0
##$ASSWID= 0
##$AUNMP= <proc_1d>
##$AZFE= 0.1
##$AZFW= 0.1
##$BCFW= 0
##$BC_mod= 2
##$BYTORDP= 0
##$COROFFS= 0
##$CY= -3
##$DATMOD= 1
##$DC= 0
##$DFILT= <>
##$DTYPP= 0
##$F1P= 0
##$F2P= 0
##$FCOR= 1
##$FTSIZE= 16384
##$FT_mod= 6
##$GAMMA= 0
##$GB= 0
##$INTBC= 1
##$INTSCL= 3.241238e-09
##$ISEN= 128
##$LB= 0.25
##$LEV0= 0
##$LPBIN= 0
##$MAXI= 10000
##$MC2= 0
##$MEAN= 0
##$ME_mod= 0
##$MI= 1.114404
##$NCOEF= 0
##$NC_proc= -10
##$NLEV= 6
##$NOISF1= 3.799351
##$NOISF2= 2.8
##$NSP= 0
##$NTH_PI= 0
##$NZP= 0
##$OFFSET= 15.48356
##$PC= 1
##$PHC0= -1351.135
##$PHC1= 5.790926
##$PH_mod= 1
##$PKNL= yes
##$PPARMOD= 0
##$PSCAL= 0
##$PSIGN= 0
##$REVERSE= no
##$SF= 200.130007634304
##$SI= 16384
##$SIGF1= 3
##$SIGF2= 2
##$SINO= 0.751879
##$SIOLD= 32768
##$SREGLST= <19F.Aceton>
##$SSB= 0
##$STSI= 16384
##$STSR= 0
##$SW_p= 3612.71676300578
##$SYMM= 0
##$S_DEV= 0
##$TDeff= 16384
##$TDoff= 0
##$TI= <>
##$TILT= no
##$TM1= 0
##$TM2= 0
##$TOPLEV= 0
##$USERP1= <user>
##$USERP2= <user>
##$USERP3= <user>
##$USERP4= <user>
##$USERP5= <user>
##$WDW= 1
##$XDIM= 16384
##$YMAX_p= 341626273
##$YMIN_p= -3306016
$$ End of Bruker specific parameters
$$ ---------------------------------
##NTUPLES= NMR SPECTRUM
##VAR_NAME=  FREQUENCY,     SPECTRUM/REAL,   SPECTRUM/IMAG
##SYMBOL=    X,             R,               I
##VAR_TYPE=  INDEPENDENT,   DEPENDENT,       DEPENDENT
##VAR_FORM=  AFFN,          ASDF,            ASDF
##VAR_DIM=   16384,         16384,           16384
##UNITS=     HZ,            ARBITRARY UNITS, ARBITRARY UNITS
##FACTOR=    0.220516191357247, 1,           1
##FIRST=     3098.7249026472, 0,             0
##LAST=      -513.991860358585, 0,           0
##MIN=       -513.991860358585, -3306016,    0
##MAX=       3098.7249026472, 341626273,     0
$$ Real data points
##PAGE= N=1
##DATA TABLE= (X++(R..R)), XYDATA
$$ [...]
7227F322660J4828o58751M13102J9837j1797N76755j4378k9482k43904j41368
$$ 6322660 6337488 5678737 6091839 6111676 6099879 6676634 6662256 6632774 6388870 6247502
7217F247502k09380j82055k39728J96689K49130M38375q5329j44995Q2635j33075
$$ 6247502 6038122 5856067 5616339 5813028 6062158 6500533 6415204 6270209 6352844 6219769
7207F219769j89372M12695O5609j40977j09143K22991k18079m49211L39876M23707
$$ 6219769 6030397 6443092 6508701 6367724 6258581 6481572 6263493 5814282 6154158 6577865
7197F577865l6793J24286j08254l83601K18126m71263J90743L03232j06648L57172
$$ 6577865 6541072 6665358 6557104 6173503 6391629 5920366 6111109 6414341 6307693 6664865
7187F664865m11733k94410K8760P38909N64352N3352K72784J2216K51200k62520
$$ 6664865 6253132 5958722 5987482 6726391 7290743 7344095 7616879 7629095 7880295 7617775
7177G617775M8451M59800l9448K47254j92655L52457K74081N79469K78938J43854
$$ 7617775 7666226 8126026 8086578 8333832 8141177 8493634 8767715 9347184 9626122 9769976
7167I769976O32117L89477K85417P62509R16001J257190N13168R73790J176556
$$ 9769976 10402093 10791570 11076987 11839496 12755497 14012687 14525855 15499645 16676201
7158A6676201J439826J697373J313363J991667J902134K149753K739458L252524
$$ 16676201 18116027 19813400 21126763 23118430 25020564 27170317 29909775 33162299
7150C3162299L410571M349820N851400P542217Q966246J0552489J0702540J1978733
$$ 33162299 36572870 40922690 46774090 54316307 63282553 73835042 84537582 96516315
7142I6516315J1930519P470988K135977k905540j3362216j4679279q996435p267887
$$ 96516315 108446834 115917822 118053799 115148259 101786043 87106764 78110329 70842442
7134G0842442p291396o779284m682250l759706l744398k719321k611898k773854
$$ 70842442 63551046 56771762 52089512 48329806 44585408 41866087 39254189 36480335
7126C6480335k936053k459615k290411k044364j269493j540839j617251q42984
$$ 36480335 33544282 31084667 28794256 26749892 25480399 23939560 22322309 21479325
7118B1479325p03282n70937j171157o97137l33894k88523n54309n43743o20814
$$ 21479325 20776043 20205106 19033949 18336812 18002918 17714395 17160086 16616343 15995529
7109A5995529m69680n74235o89074l60821l14403j24542j78863R949p29095J36591
$$ 15995529 15525849 14951614 14262540 13901719 13587316 13462774 13283911 13293860 12564765 12701356
7099A2701356j12295j66372r15797n11295J00132J66754P9560k35688p00241j42015
$$ 12701356 12589061 12422689 11506892 10995597 11095729 11262483 11342043 11106355 10406114 10264099
7089A0264099j77855J96488K40469q36386K41850J06532l87783L4516J64527L59371
$$ 10264099 10086244 10282732 10523201 9686815 9928665 10035197 9647414 9681930 9846457 10205828
7079A0205828N8403m62828o20143n58646q6763L2738L06033J97014K00041r9258
$$ 10205828 10264231 9801403 9181260 8622614 8535851 8568589 8874622 9071636 9271677 9172419
7069I172419l76274j05157k5797r6168m19318j41507K42900M90407j76512j21091
$$ 9172419 8796145 8690988 8665191 8569023 8149705 8008198 8251098 8741505 8564993 8443902
7059H443902o59173r619P74728L53782q71866J41845P67816M00923k19068l62491
$$ 8443902 7784729 7775110 8549838 8903620 8031754 8173599 8941415 9342338 9123270 8760779
7049H760779J56924o47279j37776M69633j45835J94006p824r68261P5255P99341
$$ 8760779 8917703 8270424 8132648 8602281 8456446 8650452 8642628 7674367 7749622 8548963
7039H548963J19390l49061J5972o2689K33807l13970l55002n27003K50377M74505
$$ 8548963 8668353 8319292 8335264 8272575 8506382 8192412 7837410 7310407 7560784 8035289
7029H035289K23299n66532l10118O93829N08288n19028J32762N15744l16885l74412
$$ 8035289 8258588 7692056 7381938 8075767 8584055 8065027 8197789 8713533 8396648 8022236
7019H022236l7677p1583M7918R1040K26766p8262Q0170J54168n79351J28832L0414
$$ 8022236 7984559 7912976 7960894 8051934 8278700 8200438 8280608 8434776 7855425 7984257 8014671
7008H014671K73734k42419j34533R9703m41851K57353J27904R5366J41721k85243
$$ 8014671 8288405 8045986 7911453 8011156 7569305 7826658 7954562 8049928 8191649 7906406
6998G906406j65842O10372o1588p22698k0189J09001p5418m37518J02677N07438
$$ 7906406 7740564 8350936 8289348 7566650 7546461 7655462 7580044 7142526 7245203 7752641
6988G752641N59679J80818k02331l50278N9090n5500J09261m62946k68961M11718
$$ 7752641 8312320 8493138 8290807 7940529 7999619 7944119 8053380 7590434 7321473 7733191
6978G733191Q3187k32976N0332j57848k66840J92656K92629q3602K60406J90015
$$ 7733191 7816378 7583402 7633734 7475886 7209046 7401702 7694331 7610729 7871135 8061150
6968H061150N09381L12310k05669k77315q01127n9377M4705K46359K46573k31899
$$ 8061150 8570531 8882841 8677172 8399857 7598730 7539353 7584058 7830417 8076990 7845091
6958G845091k79145n6028K02771j56117J5458N9752l45913K55569L19K65453K42630
$$ 7845091 7565946 7509918 7712689 7556572 7572030 7631782 7285869 7541438 7541757 7807210 8049840
6947H049840J76530K37951q67111n40314m01967P60596P75047p8696m486n07796
$$ 8049840 8226370 8464321 7597210 7056896 6654929 7415525 8190572 8111876 8107390 7599594
6937G599594o4611j74384O0009K25448j914k44469J37439J39983q9111J57569
$$ 7599594 7534983 7360599 7420608 7646056 7644142 7399673 7537112 7677095 7587984 7745553
6927G745553L89046k08828l81953Q9299j39996P55326L02433n05780l94382l69507
$$ 7745553 8134599 7925771 7543818 7633117 7493121 8248447 8550880 8045100 7650718 7281211
6917G281211L00033k20923j82905K71039o9424O23796J84812m87318J68456L74109
$$ 7281211 7581244 7360321 7177416 7448455 7379031 8002827 8187639 7700321 7868777 8242886
6907H242886k1366Q7614j5249N07269k90264o56083k86830Q9611M02144K0114
$$ 8242886 8221520 8309134 8293885 8801154 8510890 7854807 7567977 7657588 8059732 8079846
6897H079846k19040L13422J86860m31532k19641j39621K89970K60311j30668O3591
$$ 8079846 7860806 8174228 8361088 7929556 7709915 7570294 7860264 8120575 7989907 8053498
6887H053498K46080J50691j49532M01028j62836p27689n0933L4619M98547k1416
$$ 8053498 8299578 8450269 8300737 8701765 8538929 7811240 7760307 7794926 8293473 8272057
6877H272057M8803j42610R0391m7711M1373j33024K01662J3366O37650Q7134o36250
$$ 8272057 8320860 8178250 8268641 8220930 8262303 8129279 8330941 8344307 8981957 9069091 8432841
6866H432841j6408P7528L15601L7186o8451M5564M77320m29348l41900m77804
$$ 8432841 8416433 8493961 8809562 8846748 8778297 8823861 9301181 8871833 8529933 8052129
6856H052129k22590N79014K43308m4219l06272k48514M0332M26263L6805j72436
$$ 8052129 7829539 8408553 8651861 8607642 8301370 8052856 8093188 8519451 8556256 8383820
6846H383820l17437n5558j59372K83106O21685l37921m17803K23184L69709M5513
$$ 8383820 8066383 8010825 7851453 8134559 8756244 8418323 8000520 8223704 8593413 8638926
6836H638926n14386l95024R2771L25147L47856J01893m570O5086l02615j00484
$$ 8638926 8124540 7729516 7822287 8147434 8495290 8597183 8592613 8657699 8355084 8254600
6826H254600l09608J49219r9649J0506K19351n37493j41628L88184K75774M91320
$$ 8254600 7944992 8094211 7994562 8005068 8224419 7686926 7545298 7933482 8209256 8700576
6816H700576m56803k47860M40648M29781M19102n98578j33396L2173M04387j06341
$$ 8700576 8243773 7995913 8436561 8866342 9285444 8686866 8553470 8585643 8990030 8883689
6806H883689n75303J58092J85516k17480j06083L86258j20342k41522o4106j83681
$$ 8883689 8308386 8466478 8651994 8434514 8328431 8714689 8594347 8352825 8288719 8105038
6796H105038m6013j7584J83255K52773J07554m62290j40948K26667J2234j45205
$$ 8105038 8059025 8041441 8224696 8477469 8585023 8122733 7981785 8208452 8220686 8075481
6786H075481J63780k14644M54579k58412O3389l92631k66379N03326l01930K76366
$$ 8075481 8239261 8024617 8479196 8220784 8284173 7891542 7625163 8128489 7826559 8102925
6776H102925k15362j1732J94874m63075m4646M08644K73066k83416P25520K00452
$$ 8102925 7887563 7875831 8070705 7607630 7562984 7971628 8244694 7961278 8686798 8887250
6766H887250l72127K0575l47082J8044Q8970r5770J98630j53464k7789m0394l16564
$$ 8887250 8515123 8535698 8188616 8206660 8295630 8199860 8398490 8245026 8217237 8176843 7860279
6755G860279r692L32995L98737K87008n5547o23498O41178R7967j52434K25021
$$ 7860279 7850587 8183582 8582319 8869327 8813780 8190282 8831460 8929427 8776993 9002014
6745I002014k12069p303j16968k27875M12463j16354N4424K04080p4759o3844
$$ 9002014 8789945 8782642 8665674 8437799 8850262 8733908 8788332 8992412 8917653 8853809
6735H853809N34941l61676n48229O57402j90066l40299J04709K17425o10230J75486
$$ 8853809 9388750 9027074 8478845 9136247 8946181 8605882 8710591 8928016 8317786 8493272
6725H493272J48841K32808J8511j77759j31916m20197M14353K34593j81490r9040
$$ 8493272 8642113 8874921 8893432 8715673 8583757 8163560 8577913 8812506 8631016 8531976
6715H531976N76772m97363m84045j39032K82826M07113l09002j76771O54599M91363
$$ 8531976 9108748 8611385 8127340 7988308 8271134 8678247 8369245 8192474 8847073 9338436
6705I338436j2644K58993l49847l19842o23412k3607K84732J48272P37371l59774
$$ 9338436 9325792 9584785 9234938 8915096 8291684 8268077 8552809 8701081 9438452 9078678
6695I078678j72789N5516o72508K8124m76066M02615O37551m07801m1122J80939
$$ 9078678 8905889 8961405 8288897 8317021 7840955 8243570 8881121 8473320 8432198 8613137
6685H613137M6619K41539o32780k22143K65696l09940K23963L02032P7940j27194
$$ 8613137 8659756 8901295 8268515 8046372 8312068 8002128 8226091 8528123 8606063 8478869
6675H478869j076205M77439k46820O71302L63015N94523q8569p96355j17918n2235
$$ 8478869 7402664 7880103 7633283 8304585 8667600 9262123 9173554 8377199 8259281 8207046
6665H207046J86208n65280j75063j3976N37908M57078k38284N609K04009m10867
$$ 8207046 8393254 7827974 7652911 7638935 8176843 8633921 8395637 8401246 8605255 8194388
6655H194388k98772J1856O18246K18168k54639o86131O66026J26826o28047j95007
$$ 8194388 7895616 7907472 8525718 8743886 8489247 7803116 8469142 8595968 7967921 7772914
6645G772914J04405K94839M7552m05088K69998K71361K57620N7150j27387m76879
$$ 7772914 7877319 8172158 8219710 7814622 8084620 8355981 8613601 8670751 8543364 8066485
6635H066485L78336M41896J45548n07791j21546k59110N55614O11077J98285q57166
$$ 8066485 8444821 8886717 9032265 8524474 8402928 8143818 8699432 9310509 9508794 8651628
6625H651628P2815j55140J5076P9103M68820J48010j14984K84143j23801J18362
$$ 8651628 8724443 8569303 8584379 8663482 9132302 9280312 9165328 9449471 9325670 9444032
6615I444032k38209M41282K29448k48444R3659j4161R2756j17337J4571J99243
$$ 9444032 9205823 9647105 9876553 9628109 9721768 9707607 9800363 9683026 9697597 9896840
6605I896840M62583L25489J28936m10310l90249O23575N16301q6369q721K23039
$$ 9896840 10359423 10684912 10813848 10403538 10013289 10636864 11153165 11066796 11058075 11281114
6595A1281114l2934M3580M0008O1102J89700j92051J38279O30746M0263L20315
$$ 11281114 11248180 11291760 11331768 11392870 11582570 11390519 11528798 12159544 12199807 12520122
6585A2520122L16721L54603J20808J58832J24399O52618m87o8415P14583J013188
$$ 12520122 12836843 13191446 13312254 13471086 13595485 14248103 14247616 14179201 14893784 15906972
6575A5906972J81768K90131L68249L43187L05121R72171R91580Q11730J18472
$$ 15906972 16088740 16378871 16747120 17090307 17395428 18367599 19359179 20170909 20289381
6566B0289381J118468R59949R88048R72047J452348J019059J444244J989717K065746
$$ 20289381 21407849 22367798 23355846 24327893 25780241 26799300 28243544 30233261 32299007
6557C2299007K138079K553327K913727L147888L289056M132141L860221M289971
$$ 32299007 34437086 36990413 39904140 43052028 46341084 50473225 54333446 58623417
6549E8623417M092529N184499O138698N221105N610032N379131N037736M376554
$$ 58623417 62715946 67900445 74039143 79260248 84870280 90249411 95287147 99663701
6541I9663701M730038M612747M920594M475438M522117M649171L949266K628784
$$ 99663701 104393739 109006486 113927080 118402518 122924635 127573806 131523072 134151856
6533A34151856N03222q80325k988344m701508n448089n714155n905060n600798
$$ 134151856 134655078 133774753 130786409 126084901 120636812 114922657 109017597 103416799
6525A03416799n462183n704658m865478m473219m360146l742525l370073l192714
$$ 103416799 97954616 92249958 87384480 82911261 78551115 74808590 71438517 68245803
6517F8245803l038539k680505j873051k093931j891769j471687p89147r70606
$$ 68245803 65207264 62526759 60653708 58559777 56668008 55196321 54407174 53436568
6509E3436568j141273n57094j64957n89827j031153r26024j040182j484756j248052
$$ 53436568 52295295 51738201 51573244 50983417 49952264 49026240 47986058 46501302 45253250
6500D5253250k099325j708959j255579r39113p48292j071107p85922Q0834j35173
$$ 45253250 43153925 41444966 40189387 39250274 38501982 37430875 36644953 36725787 36590614
6491C6590614q05506p02387j9041l38990r71652l44574j424961j259800j826104
$$ 36590614 35785108 35082721 35063680 34724690 33753038 33408464 31983503 30723703 28897599
6482B8897599j461279r67826o53183p40144j149876n61650n30807q80498n87480
$$ 28897599 27436320 26468494 25815311 25075167 23925291 23363641 22832834 21952336 21364856
6473B1364856p50461n58431P9237l78802l84172j334418K08993k64471l80763
$$ 21364856 20614395 20055964 20135201 19756399 19372227 18037809 18246802 17982331 17601568
6464A7601568l28885m00164j60873p51820J32095o6265q06968k31845J1488P8687
$$ 17601568 17272683 16872519 16711646 15959826 16091921 16025656 15218688 14986843 14998331 15077018
6454A5077018o45078n42593q911l3824M5725q9542j16134r1380K63604Q3211J0409
$$ 15077018 14431940 13889347 13880436 13846612 13892337 13802795 13686661 13595281 13858885 13942096 13952505
6443A3952505l25146m02757k84310k97924J18654j34462K60441N38289M9355M98876
$$ 13952505 13627359 13224602 12940292 12642368 12761022 12626560 12887001 13425290 13474645 13973521
6433A3973521Q65547O1428J8517N64332j1094M15711J196737R69458J341960O76277
$$ 13973521 14839068 14900496 14919013 15483345 15472251 15887962 17084699 18054157 19396117 20072394
6423B0072394N46514M77898p77559m71494m45035n11877J35668n09428j055906
$$ 20072394 20618908 21096806 20319247 19847753 19402718 18890841 19026509 18517081 17461175
6414A7461175M71263L31242J61486q7458j16873k84892m3851M69472k17563M415
$$ 17461175 17932438 18263680 18425166 18337708 18220835 17935943 17892092 18361564 18144001 18148416
6404A8148416m85210r07679n03762p74764r80025p31475r5526k6772j161101o47170
$$ 18148416 17663206 16755527 16251765 15477001 14496976 13765501 13669975 13643203 12482102 11834932
6394A1834932l62013O16850k01993j18542J46748m02004k77753m59391m66447
$$ 11834932 11472919 12089769 11887776 11769234 11915982 11513978 11236225 10776834 10310387
6385A0310387j76036J0192p3671l42441j97593l42333k74658J83989j38363K4190
$$ 10310387 10134351 10144543 10070872 9728431 9530838 9188505 8913847 9097836 8959473 8983663
6375H983663R66306p0475o45100l20598m924M13766l03180l38465L02423L75533
$$ 8983663 9949969 9879494 9234394 8913796 8908872 9322638 9019458 8680993 8983416 9358949
6365I358949j38176k74294p07848m15652J06561R5857j00983M68112J38076l4503
$$ 9358949 9220773 8946479 8238631 7822979 7929540 8025397 7924414 8392526 8530602 8496099
6355H496099q71845k8161L71620M73690r89378l32256K73166J03057k99566l574
$$ 8496099 7624254 7596093 7967713 8441403 7452025 7119769 7392935 7495992 7196426 7192852
6345G192852J18971L1749l63112R8114M46240l79720K44183l76730J14938k02562
$$ 7192852 7311823 7343572 6980460 7078574 7524814 7145094 7389277 7012547 7127485 6924923
6335F924923N5956L14410m01381j87696J00483k45769J87436P6916j19663Q10061
$$ 6924923 6980879 7295289 6893908 6706212 6806695 6560926 6748362 6825278 6705615 7515676
6325G515676R31858k11641k39296l78848o6181m56852N67025l41249l00830N17118
$$ 7515676 8447534 8235893 7996597 7617749 7551568 7094716 7661741 7320492 7019662 7536780
6315G536780K87087J22231m95260p9107k10386R0267k77298L50038J26720N44182
$$ 7536780 7823867 7946098 7450838 7371731 7161345 7251612 6974314 7324352 7451072 7995254
6305G995254J95469o37995J79219K32363m42607K43033M3025J3680l65082J6033
$$ 7995254 8190723 7552728 7731947 7964310 7521703 7764736 7807761 7821441 7456359 7472392
6295G472392L53392j95910n04565K01280J37996J56027P73465O33184l11473m56232
$$ 7472392 7825784 7629874 7125309 7326589 7464585 7620612 8394077 9027261 8715788 8259556
6285H259556N23401j06954J31320j79957j76781O3506K31764k55169K24135J96604
$$ 8259556 8782957 8676003 8807323 8627366 8450585 8514091 8745855 8490686 8714821 8911425
6275H911425J72987Q8691L17167O48640k04421m3131J5090K75363M7362K41669
$$ 8911425 9084412 9173103 9490270 10138910 9934489 9891358 9906448 10181811 10229173 10470842
6265A0470842O741Q32880K00137L20008M82844L10030j09549o68157R0318M36108
$$ 10470842 10477583 11310463 11510600 11830608 12313452 12623482 12513933 11845776 11936094 12372202
6255A2372202K42971L12364L30589K49007K64831N33060O64496l509J29124J023814
$$ 12372202 12615173 12927537 13258126 13507133 13771964 14305024 14969520 14966011 15095135 16118949
6245A6118949L8759L34069k6959O80759j49379R1589N55505j81174K55923L53856
$$ 16118949 16157708 16491777 16464818 17145577 16996198 17087787 17643292 17462118 17718041 18071897
6235A8071897P23228p1065K11530J47243N03852l9368L19494J02638L62408j9489
$$ 18071897 18795125 18724060 18935590 19082833 19586685 19547317 19866811 19969449 20331857 20312368
6225B0312368K59246J88739L10312J3360O53653l6331k36900K58429L38976j30277
$$ 20312368 20571614 20760353 21070665 21084025 21737678 21701347 21464447 21722876 22061852 21931575
6215B1931575K93401l43374p4557k16920J47877N85507m72484l61954O57067K42823
$$ 21931575 22224976 21881602 21807045 21590125 21738002 22323509 21851025 21489071 22146138 22388961
6205B2388961K12975L70349l60346K95645j4894P86967n97917p49810N42896K43125
$$ 22388961 22601936 22972285 22611939 22907584 22892690 23679657 23081740 22331930 22874826 23117951
6195B3117951j55956o73035m5452l56921q8075J08222n8679o3924l14061o53327
$$ 23117951 22961995 22288960 22243508 21886587 21798512 21906734 21848055 21784131 21470070 20816743
6185B0816743l4413j82975R5877m2057o39745k67632j34094O2798j45065l37044
$$ 20816743 20782330 20599355 20695232 20653175 20013430 19745798 19611704 19674502 19529437 19192393
6175A9192393l56532o10980l62549k01626O7594k66336P3783n43532l9931Q2776
$$ 19192393 18835861 18224881 17862332 17660706 17728300 17461964 17535747 16992215 16952284 17035060
6165A7035060r08287r038J83195M99086l52855j22449k7371m7012K71281p24594
$$ 17035060 16126773 16117735 16300930 16800016 16447161 16324712 16297341 16250329 16521610 15797016
6155A5797016j46969o1801l59582L37570j02384n33102j9070L58541n77385J41778
$$ 15797016 15650047 15588246 15228664 15566234 15463850 14930748 14911678 15270219 14692834 14834612
6145A4834612l88046p06924l71746L07233j5217R9241L0294n75844j63894J45155
$$ 14834612 14446566 13739642 13367896 13675129 13659912 13759153 13789447 13213603 13049709 13194864
6135A3194864K51625N57577J91880J5623o2755l39163p50845k31016L0338L01820
$$ 13194864 13446489 14004066 14195946 14211569 14148814 13809651 13058806 12827790 12858128 13159948
6125A3159948R7256j98748k22454l63255K70452O18251M3831r444n46825j29358
$$ 13159948 13257204 13058456 12836002 12472747 12743199 13361450 13405281 13395837 12849012 12719654
6115A2719654R5535K39949M65904k58077K5877J36373L35883R7480k04020J11387
$$ 12719654 12815189 13055138 13521042 13262965 13288842 13425215 13761098 13858578 13654558 13765945
6105A3765945j16051L65760j5353l24627L33111N50701l67723J76740P4274J29957
$$ 13765945 13649894 14015654 14000301 13675674 14008785 14559486 14191763 14368503 14442777 14572734
6095A4572734m89271k39379J82455k7087k09183K03643N00295p22824j72664K69655
$$ 14572734 14083463 13844084 14026539 13999452 13790269 13993912 14494207 13771383 13598719 13868374
6085A3868374M7982o93183k33L64259J63899K28758J19328K90293m04196N7691
$$ 13868374 13916356 13223173 13222940 13587199 13751098 13979856 14099184 14389477 13985281 14042972
6075A4042972K22948l35355J741L13865O09130L09700K74830N37280L82898J28397
$$ 14042972 14265920 13930565 13932306 14246171 14855301 15165001 15439831 15977111 16360009 16488406
6065A6488406M01009O11562N35215L47983L94872K65445R31020J216097M70462
$$ 16488406 16889415 17500977 18036192 18384175 18779047 19044492 19975512 21191609 21662071
6056B1662071J01888M23157P88918J297896J538225J097048R58799R06803J270097
$$ 21662071 21763959 22187116 22976034 24273930 25812155 26909203 27868002 28774805 30044902
6047C0044902J716457J655894K339745K414448K582265L069413K718404L226502
$$ 30044902 31761359 33417253 35756998 38171446 40753711 43823124 46541528 49768030
6039D9768030L911416L832648L913118N341684N625524N604889O243189N674170
$$ 49768030 53679446 57512094 61425212 66766896 72392420 77997309 84240498 89914668
6031H9914668O494126P194660O607029N997207N967907N672719M789794L705165
$$ 89914668 96408794 103603454 110210483 116207690 122175597 127848316 132638110 136343275
6023A36343275K836038J531941o45458k693031l070249l954694n261351n721913
$$ 136343275 139179313 140711254 140065796 137372765 134302516 130347822 125086471 119364558
6015A19364558n559385o119071n970019n667570n481235m827797m214214m853823
$$ 119364558 113805173 107686102 101716083 96048513 90567278 85739481 81525267 76671444
6007G6671444l607646m371015l818921l576903k991260l752239k749128k752337
$$ 76671444 73063798 68692783 64873862 61296959 58305699 54553460 51804332 49051995
5999D9051995k409796k063328j659838j600373k261385j977999k077179j069448
$$ 49051995 46642199 44578871 42919033 41318660 39057275 37079276 35002097 33932649
5991C3932649j074764j249550j424762o43378j206091j208519o72040p39054j162201
$$ 33932649 32857885 31608335 30183573 29540195 28334104 27125585 26453545 25714491 24552290
5982B4552290r00757r73672r51164k24067n10687j326454o36918p58907M9974
$$ 24552290 23651533 22677861 21726697 21502630 20991943 19665489 19028571 18269664 18319638
5973A8319638n85012l61164l32948m75131l29088l35040l24237k3530q21119l47858
$$ 18319638 17734626 17373462 17040514 16565383 16236295 15901255 15577018 15553488 14732369 14384511
5963A4384511k45104Q2578m14797n69220j69968q19731m7563K48908j92873m21178
$$ 14384511 14139407 14221985 13807188 13237968 13068000 12248269 12200706 12449614 12256741 11835563
5953A1835563n00363k85012J5020n2733M08421K04409m39021j83746O0274j75370
$$ 11835563 11335200 11050188 11065208 11012475 11420896 11625305 11186284 11002538 11062812 10887442
5943A0887442O5214n7031p96903r7850r4079k57998p1580R1215l3601L0428l19072
$$ 10887442 10952656 10895625 10098722 10000872 9906793 9648795 9577215 9668430 9634829 9665257 9346185
5932I346185l46380M59448l3119m9393l22415l55423j11229m95998J34961j10307
$$ 9346185 8999805 9459253 9426134 9376741 9054326 8698903 8587674 8091676 8226637 8116330
5922H116330l73833j25565L22527K65527p89417k11861N03000M02317j69193p93946
$$ 8116330 7742497 7616932 7939459 8204986 7415569 7203708 7706708 8109025 7939832 7145886
5912G145886n2849j35675k3511K43818O59727q93864n17562R31156N2097J61920
$$ 7145886 7093037 6957362 6933851 7177669 7837396 6943532 6425970 7357126 7409223 7571143
5902G571143j58579l89361q15158L45727N34392M0738l61024p80087k42376J94950
$$ 7571143 7412564 7023203 6208045 6553772 7088164 7128902 6767878 5987791 5745415 5940365
5892E940365J13459M30638o925j56437n23514L86343k65811J65768M52359o06191
$$ 5940365 6053824 6484462 6477537 6321100 5797586 6183929 5918118 6083886 6536245 5930054
5882E930054j62231P8659M16120o8070l57191K10521N49798l37324L0951J50588
$$ 5930054 5767823 5846482 6262602 6194532 5837341 6047862 6597660 6260336 6291287 6441875
5872F441875l6842l48517k42114k34958j52014J56075O6050K56089R1746j97724
$$ 6441875 6405033 6056516 5814402 5579444 5427430 5583505 5649555 5905644 5997390 5799666
5862E799666n66661J62278J88724m47712k48030k6996P9483P15843N33095o95746
$$ 5799666 5233005 5395283 5584007 5136295 4888265 4861269 4940752 5656595 6189690 5493944
5852E493944p858j24835k28100J8575L05197P6697K88025o2941j81799m43346
$$ 5493944 5486086 5361251 5133151 5151726 5456923 5533620 5821645 5758704 5576905 5133559
5842E133559q9449n24960M30247K62125j18614K803n83216L40456K18635L7863
$$ 5133559 5044110 4519150 4949397 5211522 5092908 5095711 4512495 4852951 5071586 5109449
5832E109449n35367m0271K92871L72050N74173j9408n37801k44741j418N80938
$$ 5109449 4574082 4533811 4826682 5198732 5772905 5753497 5215696 4970955 4969537 5550475
5822E550475M46356l30985m11983L25227L6458J79201J93310k37860l66166K32422
$$ 5550475 5996831 5665846 5253863 5579090 5615548 5794749 5988059 5750199 5384033 5616455
5812E616455P60151k14544p39899K32204n1127P8306m3360o0159j95750k30894
$$ 5616455 6376606 6162062 5422163 5654367 5603240 5681546 5638186 5578027 5382277 5151383
5802E151383k67865N64844L5242J16738N50355K1998J02278j23799L20397j40296
$$ 5151383 4883518 5448362 5483604 5600342 6150697 6172695 6274973 6151174 6471571 6331275
5792F331275n46981j60235Q68850L77767k29347n2386M59036m64500k5144J067278
$$ 6331275 5784294 5624059 6492909 6870676 6641329 6588943 7047979 6583479 6558335 7625613
5782G625613J16301l39247K81287k97822k42476J2203O17744Q50613l33439J48469
$$ 7625613 7741914 7402667 7683954 7386132 7143656 7155859 7773603 8624216 8290777 8439246
5772H439246p2193l3372l42349J51296O08950O8416l62186j46564M48710J22578
$$ 8439246 8367053 8333681 7991332 8142628 8751578 8819994 8457808 8311244 8759954 8882532
5762H882532n278m55587L48302K32201k92624P01020P56606m43518O2714K40526
$$ 8882532 8877254 8421667 8769969 9002170 8709546 9410566 10167172 9723654 9786368 10026894
5752A0026894K33298N70077J99488P62039j00532L20177m68388J89853L22868
$$ 10026894 10260192 10830269 11029757 11791796 11691264 12011441 11543053 11732906 12055774
5743A2055774O4380o39425k89961n1147j12153o06781J4032Q3207n9611M31835
$$ 12055774 12120154 11480729 11190768 11139621 11027468 10420687 10434719 10517926 10458315 10890150
5733A0890150j75302L39876L21084j23976k62477m39992L78370O09226m16559
$$ 10890150 10714848 11054724 11375808 11251832 10989355 10549363 10927733 11536959 11120400
5724A1120400M43282R12451N74093L36636J130769Q85085M75620l72888p81860
$$ 11120400 11563682 12476133 13050226 13386862 14517631 15402716 15878336 15505448 14723588
5715A4723588l53144l80378j161669L02301k64175r29678k63681n40883m29532
$$ 14723588 14370444 13990066 12828397 13130698 12866523 11936845 11673164 11132281 10702749
5706A0702749L2195j66699L08920j58148j75673J621J9585m30403j00878K00285
$$ 10702749 10734944 10568245 10877165 10719017 10543344 10544965 10564550 10134147 10033269 10233554
5696A0233554k69832o974O88388M60380n5469Q10854Q81676O95368O81722P88601
$$ 10233554 9963722 9956748 10645136 11105516 11050047 11860901 12742577 13437945 14119667 14908268
5686A4908268L98777P31211M05447n26442p71354q19728p17387p88292M4162J95086
$$ 14908268 15307045 16038256 16443703 15917261 15145907 14326179 13608792 12820500 12864662 13059748
5676A3059748l42939j60151l73466k94192j93178n44894m59388J53834N03860
$$ 13059748 12716809 12556658 12183192 11889000 11695822 11150928 10691540 10845374 11349234
5667A1349234P4966k6000K1093J05602m273O21626P40206M64074M65799K5649
$$ 11349234 11424200 11398200 11419293 11524895 11520622 12142248 12882454 13346528 13812327 13837976
5657A3837976J225223R61371M73713J405295Q60139N91278N76607J14468M30887
$$ 13837976 15063199 16024570 16498283 17903578 18763717 19354995 19931602 20046070 20476957
5648B0476957O55350K18977J067405N04045L83398J04948k72920M7577n16554
$$ 20476957 21132307 21351284 22418689 22922734 23306132 23411080 23138160 23185737 22669183
5639B2669183j637724j012380o84998j059058r44559r80859p47644p19542q94074
$$ 22669183 21031459 20019079 19334081 18275023 17330464 16349605 15601961 14882419 13988345
5630A3988345p69771n90040j061004j19261K48434q10270q54180n32778j8314
$$ 13988345 13218574 12628534 11567530 11448269 11696703 10886433 10032253 9499475 9481161
5621I481161m96747n09650Q5927K46115l93510l53176k65860k10485j51395l31810
$$ 9481161 8984414 8474764 8560691 8806806 8413296 8060120 7794260 7583775 7432380 7100570
5611G100570J11620M20977l12042n28310Q9950j13110J41071m17207j38412l244
$$ 7100570 7212190 7633167 7321125 6792815 6882765 6769655 6910726 6493519 6355107 6351863
5601F351863K94522J2775k4574M48621K07736j117875j18648m5652N40569L40812
$$ 6351863 6646385 6659160 6634586 7083207 7290943 6173068 6054420 6008768 6549337 6890149
5591F890149o05875j08878K9063K24695K57589K26541j62172m93298k84031o06000
$$ 6890149 6284274 6175396 6204459 6429154 6686743 6913284 6751112 6257814 5973783 5367783
5581E367783p5703N71495N12324k21385K48489n17951j95890l89132j94660j8304
$$ 5367783 5292080 5863575 6375899 6154514 6403003 5885052 5689162 5300030 5105370 5087066
5571E087066m8655O56119N26671J33801j29807M6491j81671P0563N4902M93714
$$ 5087066 5038411 5694530 6221201 6355002 6225195 6271686 6090015 6160578 6215480 6709194
5561F709194j8250l41396M46916k96731j24266M50709j32885K8007j52229j31128
$$ 6709194 6690944 6349548 6796464 6499733 6375467 6826176 6693291 6721298 6569069 6437941
5551F437941m76497K81432N24806l10544j50644k61431K88661j36828J14396K72192
$$ 6437941 5961444 6242876 6767682 6457138 6306494 6045063 6333724 6196896 6311292 6583484
5541F583484r19658J90772N08983L27789j4599K11603K60460J51771m09394n50084
$$ 6583484 5663826 5854598 6363581 6691370 6676771 6888374 7148834 7300605 6891211 6341127
5531F341127Q6210L10946J45572K87770L003l63232L5831J80764m05822L89439
$$ 6341127 6427337 6738283 6883855 7171625 7174628 6811396 6847227 7027991 6622169 7011608
5521G011608M20466n49076q55664J35575M15623M6812L20931j28523l06555n4845
$$ 7011608 7432074 6882998 6027334 6162909 6578532 6625344 6946275 6817752 6511197 6456352
5511F456352J78776o5188k3865L94169l30978k65655J55823K18949J044j58204
$$ 6456352 6635128 6569940 6546075 6940244 6609266 6343611 6499434 6718383 6719427 6561223
5501F561223L68172j39334K82003O25504n0766L83513K57201J39029J24293K59239
$$ 6561223 6929395 6790061 7072064 7697568 7646802 8030315 8287516 8426545 8550838 8810077
5491H810077J61004J73637P50046L89043M33089N77965J274453J097668J501139
$$ 8810077 8971081 9144718 9894764 10283807 10716896 11294861 12569314 13666982 15168121
5482A5168121K328814J785563J589277J845546Q21488L67099r62570k427303j870405
$$ 15168121 17496935 19282498 20871775 22717321 23538809 23905908 22943338 20516035 18645630
5473A8645630j779283p36547p77710j237611j069516n34258j103542l16821k26165
$$ 18645630 16866347 16129800 15352090 14114479 13044963 12510705 11407163 11090342 10864177
5464A0864177n59615p49010l63910j53989m62326q15066n14113P4163p375l65930
$$ 10864177 10304562 9555552 9191642 9037653 8575327 7760261 7246148 7320311 7312936 6947006
5454F947006l45978L83108n16560j48344k08369J14057J67898m48836l01141K79389
$$ 6947006 6601028 6984136 6467576 6319232 6110863 6224920 6392818 5943982 5642841 5922230
5444E922230M09497m69201k49665n18540Q2067N10902k72239j10882j92822J06164
$$ 5922230 6331727 5862526 5612861 5094321 5176388 5687290 5415051 5304169 5111347 5217511
5434E217511J93211k46090k45647l23857j15093l17477J20417n150l55182Q03601
$$ 5217511 5410722 5164632 4918985 4595128 4480035 4162558 4282975 4277825 3922643 4726244
5424D726244k91553o86102J07173K58919l48285j25254K58271J20298k45705O536
$$ 4726244 4434691 3748589 3855762 4114681 3766396 3641142 3899413 4019711 3774006 3780542
5414C780542K77546J82076K55423J0759K3618k24460l02433N3749j83327R060
$$ 3780542 4058088 4240164 4495587 4506346 4529964 4305504 4003071 4056820 3873493 3882553
5404C882553K9826l7882L70799o7113p0451J80102j15547k58975L81527j2234
$$ 3882553 3912379 3874497 4245296 4178183 4107732 4287834 4172287 3913312 4294839 4282605
5394D282605J87916l19750m80692p8254K9082M09073O9984L1622j6545O7363J09210
$$ 4282605 4470521 4150771 3670079 3591825 3620907 4029980 4099964 4131586 4115041 4182404 4291614
5383D291614k18472K03926k78488o72407K24119L58479J85862L38701j09770j017646
$$ 4291614 4073142 4277068 3998580 3326173 3550292 3908771 4094633 4433334 4323564 3305918
5373C305918j67270L08947N16331r4053K11564l0225q5461q851N76369M76681
$$ 3305918 3138648 3447595 3963926 3869873 4081437 4051212 3965751 3956900 4533269 5009950
5363E009950k16075m17800r1150k27929r322R4071n202L92186j08540l33735m50414
$$ 5009950 4793875 4376075 4284925 4056996 4047674 4141745 4136543 4528729 4420189 4086454 3636040
5352C636040M54799K0922k81092M27601Q5613l22654j2408L70531O14120j31369
$$ 3636040 4090839 4111761 3830669 4258270 4343883 4021229 4008821 4379352 4993472 4862103
5342D862103k29531M09857K12241n02364n7189l4888j48944r7675k13879M48757
$$ 4862103 4632572 5042429 5254670 4752306 4695117 4660229 4511285 4413610 4199731 4648488
5332D648488k21648K1941L03745n79439k09116j10658l16101L61907P6117J42369
$$ 4648488 4426840 4448781 4752526 4173087 3963971 3853313 3537212 3899119 3975236 4117605
5322D117605K56541n75118O2359J70769m63157K2484K93329o2172P1831M37582
$$ 4117605 4374146 3799028 3861387 4032156 3568999 3591483 3884812 3822640 3894471 4332053
5312D332053o51478k5466N54143q4901k14912K20795J38759n08397M08356L68303
$$ 4332053 3680575 3655109 4209252 4124351 3909439 4130234 4268993 3760596 4168952 4537255
5302D537255M14979n74875l96517L06917P6743L9722J86124K57201l66942L93913
$$ 4537255 4952234 4377359 3980842 4287759 4364502 4404224 4590348 4847549 4480607 4874520
5292D874520L59864m24520k16105j83829P6472k44682j09139m05687O54639K84818
$$ 4874520 5234384 4809864 4593759 4409930 4486402 4241720 4132581 3726894 4381533 4666351
5282D666351p99280K50845J14542K7972l27616Q4486P05042n28312l39314L07497
$$ 4666351 3867071 4117916 4232458 4260430 3932814 4017300 4722342 4194030 3854716 4162213
5272D162213O96j0258N26564J3505o01062k09818N1324K29907P6410J26586l90292
$$ 4162213 4162909 4152651 4679215 4692720 4091658 3881840 3933164 4163071 4239481 4366067 3975775
5261C975775l9370Q5494K88866J28641j43474M34651O9235j30148j25355p5883
$$ 3975775 3936405 4021899 4310765 4439406 4295932 4730583 4799818 4669670 4544315 4468432
5251D468432j72341J20885k26794k82148R88311q1192n2972P0399L29218l42921
$$ 4468432 4296091 4416976 4190182 3908034 4896345 4815153 4762181 4832580 5161798 4818877
5241D818877m01571j477P09961N4554p90335N19785L39734n4876K17726L03776
$$ 4818877 4417306 4415829 5125790 5180344 4390009 4909794 5249528 5194652 5412378 5716154
5231E716154J96154J50550j94423M76908k1923k7797j25907l7639P2468K95736
$$ 5716154 5912308 6062858 5868435 6345343 6323420 6295623 6169716 6132077 6204545 6500281
5221F500281k70145K59681m2379J19763O11643j14409M09808J794N12212J99834
$$ 6500281 6230136 6489817 6447438 6567201 7178844 7064435 7474243 7476037 7988249 8188083
5211H188083N3815O64253Q1539K13126j27J54486k43201k14606q9793L55385k53576
$$ 8188083 8241898 8906151 8987690 9200816 9200689 9355175 9111974 8897368 8807575 9162960 8909384
5200H909384o48965P8794M13157J74673l4132j67694k7180P00976J16409K54645
$$ 8909384 8260419 8339213 8752370 8927043 8892911 8725217 8698037 9399013 9515422 9770067
5190I770067j96477l98880N67109K91798L43352j5334K01080L57998j00181L03659
$$ 9770067 9573590 9174710 9741819 10033617 10376969 10361635 10562715 10920713 10820532 11124191
5180A1124191J00525J73102M38455M44992m3133L17026k00319O582L11429N42987
$$ 11124191 11224716 11397818 11836273 12281265 12238132 12555158 12354839 12361421 12672850 13215837
5170A3215837J80183L3909L20739p6935K48353M88478m35492j00786O90098l32509
$$ 13215837 13396020 13429929 13750668 13673733 13922086 14410564 13975072 13874286 14564384 14231875
5160A4231875M4943J5810K71661J21631N67228O7470k74144M72031L54980K45270
$$ 14231875 14276818 14292628 14564289 14685920 15253148 15320618 15046474 15518505 15873485 16118755
5150A6118755L48739P35105M45920J010098O04778N70780J123525L32827N20072
$$ 16118755 16467494 17202599 17648519 18658617 19263395 19834175 20957700 21290527 21810599
5141B1810599Q55371r7003R89945P24989K61182j40283O88766N88754j14002K60948
$$ 21810599 22665970 22568967 23558912 24283901 24545083 24404800 25093566 25682320 25568318 25829266
5131B5829266m44777j56974K06523m38862J6750j37198j47823j65203n11635o5810
$$ 25829266 25384489 25227515 25434038 24995176 25011926 24874728 24726905 24561702 24050067 23984257
5121B3984257o08404p52812m4598n90636m41951m00420j31094K41150n12342m56958
$$ 23984257 23375853 22623041 22578443 21987807 21545856 21145436 21014342 21255492 20743150 20286192
5111B0286192J92039j2266k46838K54064l55036l65904N37041Q47534J04625J58964
$$ 20286192 20478231 20465965 20219127 20473191 20118155 19752251 20289292 21136826 21241451 21400415
5101B1400415o9196O1824R82660L49718K46853M70998N11541M93597J062521N74530
$$ 21400415 21331219 21393043 22375703 22725421 22972274 23443272 23954813 24448410 25510931 26085461
5091B6085461O47575P49949J59512M04929O06599P35924n8181N43019N41003J75866
$$ 26085461 26733036 27482985 27642497 28047426 28654025 29389949 29331768 29874787 30415790 30591656
5081C0591656m18393L41869L59848l29525k37231j9984L84195m86724k45403n5510
$$ 30591656 30173263 30515132 30874980 30545455 30308224 30288240 30672435 30185711 29940308 29884798
5071B9884798o6638l79430j111559o74494n13499o56534l24426m63723p66476
$$ 29884798 29818160 29438730 28327171 27652677 27139178 26482644 26158218 25694495 24928019
5062B4928019o84440r02723m90632q09653m94585o45261M61505p00711q70761
$$ 24928019 24243579 23340856 22850224 22040571 21545986 20900725 21362230 20661519 19790758
5053A9790758j73976m27539m21214l06820K72792l55325n32428q3981N53963k46520
$$ 19790758 19616782 19189243 18768029 18461209 18734001 18378676 17846248 17762267 18316230 18069710
5043A8069710l32583o19729j67748L13867j6418l25448k92479O3802k9882l55122
$$ 18069710 17737127 17117398 16949650 17263517 17247099 16921651 16629172 16692974 16663092 16307970
5033A6307970k49944k84113j5760j26728K02203k22001l10108J7776L1781K56100
$$ 16307970 16058026 15773913 15758153 15631425 15833628 15611627 15301519 15319295 15351076 15607176
5023A5607176j44536J73528o2062K64081L39596O25595M95264N37206P28962m6233
$$ 15607176 15462640 15636168 15574106 15838187 16177783 16803378 17298642 17835848 18564810 18518577
5013A8518577j70516J25432l43854o7545l72731m98528J1649k67310J89371j56561
$$ 18518577 18348061 18473493 18129639 18062094 17689363 17190835 17202484 16935174 17124545 16967984
5003A6967984r12775j27164n03618K59584K98370n51718L7178k34276j08894K89692
$$ 16967984 16055209 15928045 15424427 15684011 15982381 15430663 15467841 15233565 15124671 15414363
4993A5414363r1926P431k28868K03007j6766p5892L44918O63728r7277k14598
$$ 15414363 15322437 15329868 15101000 15304007 15287241 15211349 15556267 16219995 16122718 15908120
4983A5908120J2087L3921J009622P9114l6404m6796j48527r1048M69952m7131
$$ 15908120 15920207 15954128 16963750 17042864 17006460 16959664 16811137 16720089 17190041 17142910
4973A7142910M43123N71126J28111k59340k19319O3739R01662K21268k07260j63973
$$ 17142910 17586033 18157159 18285270 18025930 17806611 17870350 18772012 18993280 18786020 18622047
4963A8622047N74179R90117O67311Q75185J64255P99468N59454K12064K79115
$$ 18622047 19196226 20186343 20853654 21728839 21893094 22692562 23252016 23464080 23743195
4954B3743195P43346R81716P08836J137750j55921L37992J99461j91566Q25734
$$ 23743195 24486541 25468257 26177093 27314843 27158922 27496914 27696375 27504809 28330543
4945B8330543L44869L00295L73692N29313R76488M61744M76558P66515J608180
$$ 28330543 28675412 28975707 29349399 29878712 30855200 31316944 31793502 32560017 34168197
4936C4168197N24726M02940J618645Q79977J406565O93758P37205J247891O13457
$$ 34168197 34692923 35095863 36714508 37594485 39001050 39694808 40432013 41679904 42293361
4927D2293361P82299J212341J561024J519741J393558J757943J972674J210561
$$ 42293361 43075660 44288001 45849025 47368766 48762324 50520267 52492941 53703502
4919E3703502J397083K130074J980676J700454J610378J486970K108055J569163
$$ 53703502 55100585 57230659 59211335 60911789 62522167 64009137 66117192 67686355
4911F7686355J890608K013145K104752K190035J129246K141743J888972R70143
$$ 67686355 69576963 71590108 73694860 75884895 77014141 79155884 81044856 82014999
4903H2014999J176148J173450L29889L11903K65673J41426N41107P23962J129530
$$ 82014999 83191147 84364597 84694486 85006389 85272062 85413488 85954595 86678557 87808087
4894H7808087J379920J263399J482786K093469K056995J551339K337792K170800
$$ 87808087 89188007 90451406 91934192 94027661 96084656 97635995 99973787 102144587
4886A02144587K421969J339873J716591K230052J576520J228670Q00144J405812
$$ 102144587 104566556 105906429 107623020 109853072 111429592 112658262 113458406 114864218
4878A14864218Q65798M85228J143780K96318k44521L36413O05659L53493O91774
$$ 114864218 115730016 116215244 117359024 117655342 117410821 117747234 118352893 118706386 119398160
4869A19398160K53066L14949J244741Q39158J832678Q49975J745689R59902J80300
$$ 119398160 119651226 119966175 121210916 122050074 123882752 124732727 126478416 127438318 127618618
4860A27618618O61131k77908N91j60951m69391p49798j172232j461482n59829
$$ 127618618 128279749 128001841 128002432 127841481 127372090 126622292 125450060 123988578 123428749
4851A23428749q25196j38700m28379r57432r42062j023412n78804o26089l06792
$$ 123428749 122603553 122464853 122036474 121079042 120136980 119113568 118534764 117908675 117601883
4842A17601883o36726K67673M71044K28224M56151Q68379J762755J310298J735879
$$ 117601883 116965157 117232830 117703874 117932098 118388249 119256628 121019383 122329681 124065560
4833A24065560K265626K395924K364346K760424K780298K847481K828279K580178
$$ 124065560 126331186 128727110 131091456 133851880 136632178 139479659 142307938 144888116
4825A44888116J878409K480867K530068J405584K180142K275743N11417O39731
$$ 144888116 146766525 149247392 151777460 153183044 155363186 157638929 158150346 158790077
4817A58790077K34956M94516J478590J081707O40662M73460Q16713J18082K15092
$$ 158790077 159025033 159519549 160998139 162079846 162720508 163193968 164010681 164128763 164343855
4808A64343855M41204K80382q58013j176526o17062m16921j477780j397401j875795
$$ 164343855 164785059 165065441 164207428 163030902 162413840 161996919 160519139 159121738 157245943
4799A57245943j648082j916915j729562j566659j767343j335271j221912j110727
$$ 157245943 155597861 153680946 151951384 150384725 148617382 147282111 146060199 144949472
4791A44949472j256588o43332o58428j193904j142560n76830j642809j334025
$$ 144949472 143692884 143049552 142391124 141197220 140054660 139477830 137835021 136500996
4783A36500996q67976j464441j711900k088183j537462j959987j967014j486223
$$ 136500996 135633020 134168579 132456679 130368496 128831034 126871047 124904033 123417810
4775A23417810j925606k029225j594633j332625r20806j730836k030487j001904
$$ 123417810 121492204 119462979 117868346 116535721 115614915 113884079 111853592 110851688
4767A10851688m23275p58909j000848j388816j553804n91363r45685j641711j344289
$$ 110851688 110428413 109669504 108668656 107279840 105726036 105134673 104188988 102547277 101202988
4758A01202988r95851p60444p52747j347100j549850j116704j082675j018554
$$ 101202988 100207137 99446693 98693946 97346846 95796996 94680292 93597617 92579063
4750I2579063p50720r18570j056995j120669k161344k148462j496758j643851
$$ 92579063 91828343 90909773 89852778 88732109 86570765 84422303 82925545 81281694
4742H1281694j798590k162332j416197j797478j292823j509871j658388q61782
$$ 81281694 79483104 77320772 75904575 74107097 72814274 71304403 69646015 68784233
4734F8784233j493649j411154n19719r44949j068536o97110n22891r61707n22196
$$ 68784233 67290584 65879430 65359711 64414762 63346226 62649116 62126225 61164518 60642322
4725F0642322p90348p03652j62512m41609r12650m35854r41734j145798p46397
$$ 60642322 59851974 59148322 58985810 58544201 57631551 57195697 56253963 55108165 54361768
4716E4361768r11111o12020o32205p28125r36555j049926q37695l14436j111909
$$ 54361768 53450657 52838637 52206432 51478307 50541752 49491826 48654131 48339695 47227786
4707D7227786q01987q9881j044504K3887l16346q94477l01979q2162J57263p934
$$ 47227786 46425799 46335918 45291414 45315301 44998955 44104478 43802499 43720337 43877600 43869666
4697D3869666J20610j69453j03507k72957R3599N83569J19960k74764L89726p21718
$$ 43869666 43990276 43820823 43717316 43444359 43537958 44121527 44241487 43966723 44356449 43634731
4687D3634731r2524m03302N9018J28489j82753p01885j64393m2508n14311M081
$$ 43634731 43542207 43138905 43197923 43326412 43143659 42441774 42277381 42234873 41720562 41724643
4677D1724643n4322j13218K90914J31259l7398k29802M77351P30106K05201M35929
$$ 41724643 41670321 41557103 41848017 41979276 41941878 41712076 42189427 42919533 43124734 43560663
4667D3560663P09142J123602N56182Q05475J542678P82706O07353J280619J780038
$$ 43560663 44269805 45393407 45949589 46755064 48297742 49080448 49687801 50968420 52748458
4658E2748458K301525J762534K010226K353624L488967L423183L697535L659457
$$ 52748458 55049983 56812517 58822743 61176367 64665334 68088517 71786052 75445509
4650G5445509K979213K329288J389963K5921j412351j844687k060283j368326
$$ 75445509 78424722 80754010 82143973 82169894 80757543 78912856 76852573 75484247
4642G5484247j367098j413678l54993m64082l30651l8274O48459N76037P97232
$$ 75484247 74117149 72703471 72348478 71884396 71553745 71515471 72163930 72739967 73537199
4633G3537199Q07993J026080J298922J941017J917463J836532K781580L565934
$$ 73537199 74345192 75371272 76670194 78611211 80528674 82365206 85146786 88712720
4625H8712720L478403L335682L891224M710113N270218N921846O292702O827344
$$ 88712720 92191123 95526805 99418029 104128142 109398360 115320206 121612908 128440252
4617A28440252Q129470P769218Q559388Q716003Q766219P717601O894933N483686
$$ 128440252 136569722 144338940 152898328 161614331 170380550 178098151 184993084 190476770
4609A90476770O442930O536956P690171R515465R441036R701371Q392483O021634
$$ 190476770 196919700 203456656 211146827 220662292 230103328 239804699 248197182 254218816
4601B54218816K837505k006171o481787r885082j0784707j0682139j0206930r534602
$$ 254218816 257056321 255050150 248568363 238683281 227898574 217216435 207009505 197474903
4593A97474903q891207p268485o936790o059009n536461m918619n187069m548321
$$ 197474903 188583696 181315211 174378421 168319412 162782951 157864332 152677263 148128942
4585A48128942l829252l500111k640236l101944l005798k040825j606374j496943
$$ 148128942 144299690 140799579 138159343 135057399 132051601 130010776 128404402 126907459
4577A26907459j608437j851196k292979j502426k541105k106346k353097k240869
$$ 126907459 125299022 123447826 121154847 119652421 117111316 115004970 112651873 110411004
4569A10411004k486606k178706j231261j232683j507552m70875q78645j231502
$$ 110411004 107924398 105745692 104514431 103281748 101774196 101303321 100424676 99193174
4561I9193174j384711q19188l31330m4095m28526j39734K55859l86131J62743
$$ 99193174 97808463 96989275 96657945 96613850 96185324 96045590 96301449 95915318 96078061
4552I6078061L39586J10539L07698Q57082J117770J173711J258513K166817K045289
$$ 96078061 96417647 96528186 96835884 97692966 98810736 99984447 101242960 103409777 105455066
4543A05455066J895627K830574L549958K862653L186300L503713K580650K116055
$$ 105455066 107350693 110181267 113731225 116593878 119780178 123283891 125864541 127980596
4535A27980596K474497J777132Q30510O78036J749914J679705K247134K851459
$$ 127980596 130455093 132232225 133062735 133740771 135490685 137170390 139417524 142268983
4527A42268983L791286M992358N944912O220694P890673Q519363J0194266J2172403
$$ 142268983 146060269 151052627 156997539 163218233 171108906 179628269 189822535 201994938
4519B01994938J3389756J5645986J7572643J7852955J7890526J6967353J5064137
$$ 201994938 215384694 231030680 248603323 266456278 284346804 301314157 316378294
4512C16378294J2390705Q532402M324872q50836m842561q559791j0927392j1794375
$$ 316378294 328768999 337301401 341626273 340775437 335932876 327373085 316445693 304651318
4504C04651318j2414391j1543336j0304112q504593o823352n769164n060016m337062
$$ 304651318 292236927 280693591 270389479 261884886 255061534 249292370 244232354 239895292
4496B39895292l081409k042127m43996J92146R81242K100775L084727K610187
$$ 239895292 236813883 234771756 234327760 234519906 235501148 237601923 240686650 243296837
4488B43296837L535247L538238L426201L808937L509418M253760N158072N961197
$$ 243296837 246832084 250370322 253796523 257605460 261114878 265368638 270526710 276487907
4480B76487907O614574P245951O316703M732802J825779j85821l969028p208223
$$ 276487907 283102481 290348432 296665135 301397937 303223716 303037895 299068867 291860644
4472B91860644r046726j0928312j2216717j2219508j1909223j1023562j0034484
$$ 291860644 282813918 271885606 259668889 247449381 235540158 224516596 214482112
4465B14482112r523657q009026p305723o892710n883521m293724l481184l338744
$$ 214482112 204958455 196949429 189643706 182750996 176867475 172573751 169092567 165753823
4457A65753823k729449k013546j035983q71410p29541J35042j65497j092957j563160
$$ 165753823 163024374 161010828 159974845 159103435 158373894 158508936 158343439 157250482 155687322
4448A55687322l146489m166696m565351m845170n706142m485501l818596l630356
$$ 155687322 152540833 148374137 143808786 138963616 133257474 128771973 124953377 121323021
4440A21323021l188425l753740k899094k004330k860354k191519j843740k086175
$$ 121323021 118134596 114380856 111481762 109477432 106617078 104425559 102581819 100495644
4432A00495644j491186j263891o12332j176917p72575j672407j528210o64381
$$ 100495644 99004458 97740567 97128235 95951318 95178743 93506336 91978126 91313745
4424I1313745q21829r56026j040375q14576p03844q80983j157698p14459J80334
$$ 91313745 90491916 89535890 88495515 87680939 86977095 86096112 84938414 84223955 84404289
4415H4404289j247097r80134r82663p62095n42789j139842j692513j267426j416915
$$ 84404289 83157192 82177058 81194395 80432300 79889511 78749669 77057156 75789730 74372815
4406G4372815q74203j175525j758614j602839j265096j223208r42421o86587j104117
$$ 74372815 73498612 72323087 70564473 68961634 67696538 66473330 65530909 64844322 63740205
4397F3740205o52674j084188j002775l97815o44071k63220q28515k40913k68302
$$ 63740205 63087531 62003343 61000568 60602753 59958682 59695462 58866947 58626034 58357732
4388E8357732o64671N1429m16008K00868o69693l58285P21530j27471r35611l24730
$$ 58357732 57693061 57744490 57328482 57529350 56859657 56501372 57222902 57095431 56159820 55835090
4378E5835090K0392Q0875m02130J1516K86776J60379J87641l95235O10412J25987
$$ 55835090 55855482 55936357 55534227 55545743 55832519 55992898 56180539 55785304 56395716 56521703
4368E6521703j58384j02822J99695M27425j26808Q8167J50372o3012O32152J262158
$$ 56521703 56363319 56260497 56460192 56887617 56760809 56848976 56999348 56936336 57568488 58830646
4358E8830646N29986l86784o28013j498690k568359k019555j538793j269367n13764
$$ 58830646 59360632 58973848 58345835 56847145 54278786 52259231 50720438 49451071 48937307
4349D8937307r47696j282072p95660j286027n15543o33140o52976k69754J08906
$$ 48937307 47989611 46707539 45911879 44625852 44110309 43477169 42824193 42554439 42663345
4340D2663345l99773J79855k30884o09484l53365L67917P6702L21781n0507q9780
$$ 42663345 42263572 42443427 42212543 41603059 41249694 41617611 41694313 42016094 41965587 41875807
4330D1875807P44074L33978J51100k78519O36007J68388N3074Q78021R48616J108790
$$ 41875807 42619881 42953859 43104959 42826440 43462447 43630835 43683909 44561930 45510546 46619336
4320D6619336K36211L61330N03404P98522O17097q4384O18265P40143L3557k17524
$$ 46619336 46855547 47216877 47720281 48518803 49135900 49051516 49669781 50409924 50443481 50225957
4310E0225957n8129l34534j63440J1184o77537j087796r17527o23692k98888m78746
$$ 50225957 50167828 49833294 49669854 49681038 49003501 47915705 46998178 46374486 46075598 45596852
4300D5596852k89663l42897M23434o32107m54924j04640J89789j06756K54876
$$ 45596852 45307189 44964292 45387726 44755619 44300695 44196055 44385844 44279088 44533964
4291D4533964n4563k74317K95157j47099J25291j36468j68176N69603M87970m72139
$$ 44533964 44479401 44205084 44500241 44353142 44478433 44341965 44173789 44743392 45231362 44759223
4281D4759223N6863M67364J3730L2015J18693O2991L51538M75776R9130K84720
$$ 44759223 44816086 45283450 45297180 45329195 45447888 45510879 45862417 46338193 46437323 46722043
4271D6722043j75476O25142j31828N5892r932O7599P23031K76370K00012M59788
$$ 46722043 46546567 47171709 47039881 47095773 47085841 47153440 47876471 48152841 48352853 48812641
4261D8812641Q09940O3560M23385R7748J133521L57482O84605N90173O54802M94253
$$ 48812641 49622581 49686141 50109526 50207274 51340795 51698277 52382882 52973055 53627857 54122110
4251E4122110J590737Q46867P85199J093434J021857J656117J907087J302117
$$ 54122110 55712847 56559714 57344913 58438347 59460204 61116321 63023408 64325525
4243F4325525J126867K279588J702856J841298J458199J116490J597695K451363
$$ 64325525 65452392 67731980 69434836 71276134 72734333 73850823 75448518 77899881
4235G7899881J876021J489282K596660K118647K331746L577631L289389L647877
$$ 77899881 79775902 81265184 83861844 85980491 88312237 91889868 95179257 98827134
4227I8827134M876230M436210N136625N482011O411380O669395P308336Q142551
$$ 98827134 103703364 108139574 113276199 118758210 125169590 131838985 139147321 147289872
4219A47289872Q521762Q255332P931602P358737N178590L265196j44543k333233
$$ 147289872 155811634 164066966 171998568 179357305 184535895 187801091 187656548 185323315
4211A85323315n318678o745674p865449q489519q287596q245283q239312p373395
$$ 185323315 180004637 173258963 165393514 156903995 148616399 140371116 132131804 124758409
4203A24758409p192862n756373o257554n954247n403085m897636m760735m317816
$$ 124758409 117565547 111809174 105551620 99597373 94194288 89296652 84535917 80218101
4195H0218101l981710l710116l150503l693408k739907k310612k642030j913367
$$ 80218101 76236391 72526275 69375772 65682364 62942457 60631845 57989815 56076448
4187E6076448k139454k471412j916911j815374j898044j754205j199105j579746
$$ 56076448 53936994 51465582 49548671 47733297 45835253 44081048 42881943 41302197
4179D1302197j605043j685002j170235n67267r78766r62504r76646q51703q22057
$$ 41302197 39697154 38012152 36841917 36274650 35295884 34333380 33356734 32505031 31682974
4170C1682974j436307j222953l39909n46927m16249o60601r74725l98985o17242
$$ 31682974 30246667 29023714 28683805 28136878 27720629 27060028 26085303 25686318 25069076
4161B5069076r16219m81243R2620p35206j17627n20674l87577k36967o82011j82466
$$ 25069076 24152857 23671614 23764234 23029028 22911401 22390727 22003150 21766183 21084172 20901706
4151B0901706n64137m68565K28947J79879l73452l72136m19321j000634J63988
$$ 20901706 20337569 19869004 20097951 20277830 19904378 19532242 19112921 18112287 18276275
4142A8276275N33869l25130j24329K444l60383k10438l19873r6548j2041m13772
$$ 18276275 18810144 18485014 18360685 18363129 18002746 17792308 17472435 17375887 17363846 16950074
4132A6950074j43027l67206n53420K49087q1219N4246m04147m39950L61992Q270
$$ 16950074 16807047 16439841 15886421 16135508 16054289 16108535 15704388 15264438 15626430 15634700
4122A5634700N0082j58044p54913L24932Q2027k15534j82990Q9672o27286k66756
$$ 15634700 15684782 15526738 14771825 15096757 15178784 14963250 14780260 14869932 14242646 13975890
4112A3975890Q1278n16407K53411k06531L46836l53379l48072l56750M10061j69368
$$ 13975890 14057168 13540761 13794172 13587641 13934477 13581098 13233026 12876276 13286337 13116969
4102A3116969j45959m28193k18144J126583k09726k89036L09821j40167k78721
$$ 13116969 12971010 12542817 12324673 13451256 13241530 12952494 13262315 13122148 12843427
4093A2843427l09619m11987q4549J06980m90308o969L59061k83387j8398l24135
$$ 12843427 12533808 12121821 12037272 12144252 11653944 11646975 12006036 11722649 11704251 11380116
4083A1380116j53052R0708l07568k82496K90478J64429n15774M06312k62487m31787
$$ 11380116 11227064 11317772 11010204 10727708 11018186 11182615 10666841 11073153 10810666 10378879
4073A0378879N117j23060m4006L41058R2960q79945q6776M54185l99316j75966
$$ 10378879 10383996 10260936 10216930 10557988 10650948 9771003 9684227 10138412 9739096 9563130
4063I563130m74728J55536o38509K1279R31860J94329j13188j013704r0318J2055
$$ 9563130 9088402 9243938 8605429 8626708 9558568 9752897 9639709 8626005 8535687 8547742
4053H547742J21356m48759K06952l34515p8979P98015k46411m88835Q1356l52082
$$ 8547742 8669098 8220339 8427291 8092776 8013797 8811812 8565401 8076566 8157922 7805840
4043G805840p7538l6369o9805L02453m3587m6956o79692N09883N53958j21470
$$ 7805840 7728302 7691933 7622128 7924581 7880994 7834038 7154346 7664229 8218187 8096717
4033H096717m86197n34938j1863n63244N39461M089n5011N56258L6093l58909
$$ 8096717 7610520 7075582 7063719 6500475 7039936 7044025 6989014 7545272 7581365 7222456
4023G222456N6443J46860M49716l48717k1723N9691j85571n13580j88747k309
$$ 7222456 7278899 7425759 7875475 7526758 7505035 7564726 7379155 6865575 6676828 6674519
4013F674519J27992K10205q4913j18154j90642r7688J41175M11431L92883n1972
$$ 6674519 6802511 7012716 6927803 6809649 6619007 6521319 6662494 7073925 7466808 7414836
4003G414836m08205r4379K82847M59758j54278o22345L80983k23183n61523M86960
$$ 7414836 7006631 6912252 7195099 7654857 7500579 6878234 7259217 7036034 6474511 6961471
3993F961471L58970k75820p66430L96948L383J94209J37161l00640L2384J06160
$$ 6961471 7320441 7044621 6278191 6675139 6678522 6872731 7009892 6709252 6741636 6847796
3983F847796N39252j49800q11078M31676J74165K60888p4011q6225j36031J45218
$$ 6847796 7387048 7237248 6426170 6857846 7032011 7292899 7218888 7132663 6996632 7141850
3973G141850j15482k08585j86956L9355M5823O11926m477k04606j8319K7350K8668
$$ 7141850 7026368 6817783 6630827 6670182 6716005 7327931 7323454 7118848 7100529 7127879 7156547
3962G156547N4674K73753N2407n39397J90539M65076k90892K33152M08724p79070
$$ 7156547 7211221 7484974 7537381 6997984 7188523 7653599 7362707 7595859 8004583 7225513
3952G225513N8225M80630m23656l68916r9467K258j89386J45133k42678Q4241
$$ 7225513 7283738 7764368 7340712 6971796 6872329 6874587 6685201 6830334 6587656 6671897
3942F671897L41595J67633j45913L6954K48677l82143Q31721j20598j26243K26697
$$ 6671897 7013492 7181125 7035212 7072166 7320843 6938700 7770421 7649823 7523580 7750277
3932G750277J10135j46679m72731J11432J19011M3406J96733O40023n81720J34762
$$ 7750277 7860412 7713733 7241002 7352434 7471445 7514851 7711584 8351607 7769887 7904649
3922G904649K03857J50987M48621K27668p81755K33988j44809n25055P09043M53277
$$ 7904649 8108506 8259493 8708114 8935782 8154027 8388015 8243206 7718151 8427194 8880471
3912H880471m57044M68143k36500L04874J45680j48961J62585J09620q3732K13873
$$ 8880471 8423427 8891570 8655070 8959944 9105624 8956663 9119248 9228868 9145136 9359009
3902I359009O2838O11577K36874m57868P29232K68019J50798j05236n0844K48201
$$ 9359009 9421847 10033424 10270298 9812430 10541662 10809681 10960479 10855243 10804399 11052600
3892A1052600L67208K17281N3464k7078P18577L98462l09244O25825N57518N29555
$$ 11052600 11419808 11637089 11690553 11663475 12382052 12780514 12471270 13097095 13654613 14184168
3882A4184168J35654J51414k1580J49781M26035N5473l25148J63332p7772P57755
$$ 14184168 14319822 14471236 14449656 14599437 15025472 15080945 14755797 14919129 14841357 15599112
3872A5599112l42166L72508J61022p69574Q53990l40708R7879L20867P6967k02791
$$ 15599112 15256946 15629454 15790476 15020902 15874892 15534184 15632063 15952930 16029897 15827106
3862A5827106K58335P8129L51995K731K27528j81242L0839n2377M70525L72871
$$ 15827106 16085441 16163570 16515565 16518296 16745824 16564582 16595421 16543044 17013569 17386440
3852A7386440J0980Q30964P7836K90352O90565N74058Q67095N82121O10748N75757
$$ 17386440 17397420 18228384 18306220 18596572 19287137 19861195 20728290 21310411 21921159 22496916
3842B2496916P59074R50633J138637Q55904J794644Q62647R69808J072946J582267
$$ 22496916 23255990 24206623 25345260 26201164 27995808 28858455 29828263 30901209 32483476
3833C2483476O37054R71707J174269R24512J443482O05634J585682R67448P67560
$$ 32483476 33120530 34092237 35266506 36191018 37634500 38240134 39825816 40793264 41560824
3824D1560824O88018J141267J073340O34882O30837O30017P29578P48444N35282
$$ 41560824 42248842 43390109 44463449 45098331 45729168 46359185 47088763 47837207 48372489
3815D8372489L21380k0697M06315P69620N50086N03400K20846K38126k54868L89482
$$ 48372489 48693869 48673172 49079487 49849107 50399193 50902593 51123439 51361565 51106697 51496179
3805E1496179n4161j47252M1836p97422l39065o88355m54883l51406p36821l9150
$$ 51496179 51442018 51294766 51336602 50539180 50200115 49511760 49056877 48705471 47968650 47929500
3795D7929500l98324p97652o56133m79251j149700o63088m57153j212481p11619
$$ 47929500 47531176 46733524 46077391 45598140 44448440 43785352 43328199 42115718 41404099
3786D1404099j416106j337600j164149l55574q44447r66168j201208q91008q36214
$$ 41404099 39987993 38650393 37486244 37130670 36286223 35320055 34118847 33227839 32391625
3777C2391625j316289p39804j33075p21238o07896p18259n81103m91293o03437
$$ 32391625 31075336 30335532 30202457 29481219 28873323 28155064 27573961 27082668 26479231
3768B6479231l24363j51082m82522n19115j34924N19466j65289k83031l69838
$$ 26479231 26154868 26003786 25521264 25002149 24867225 25386691 25221402 24938371 24568533
3759B4568533J53599l48992l98583o5583K13428N19065K99157M11057R2493j81356
$$ 24568533 24722132 24373140 23974557 23908974 24122402 24641467 24940624 25351681 25444174 25262818
3749B5262818m05152J02920N897Q42425O18964l82951j85832K77357j61529m23944
$$ 25262818 24857666 24960586 24966483 25808908 26427872 26044921 25859089 26136446 25974917 25550973
3739B5550973J84388P71879J27943J45733M06285L85340O97974R13160N73529
$$ 25550973 25735361 26507240 26635183 26780916 27187201 27572541 28270515 29183675 29757204
3730B9757204m5847L14084J35413Q33427J217866K47897P37248R38540J263889
$$ 29757204 29711357 30025441 30160854 30994281 32212147 32460044 33197292 34135832 35399721
3721C5399721N33433R11506J280152R71093J149977Q42439Q58602N46459q0356
$$ 35399721 35933154 36844660 38124812 39095905 40245882 41088321 41946923 42493382 42413026
3712D2413026p3217M24490Q39203R20062O23864K2795Q41909k84209k87801n5166
$$ 42413026 42339809 42764299 43603502 44523564 45147428 45170223 46012132 45727923 45440122 45384956
3702D5384956K4772J1252L89500l5119m95988K58033n41438k47942m47941n58173
$$ 45384956 45409728 45420980 45810480 45775361 45279373 45537406 44995968 44748026 44300085 43741912
3692D3741912J59683J96797l65853l11792m72471j65335l97580r86241q19479
$$ 43741912 43901595 44098392 43732539 43420747 42948276 42782941 42385361 41399120 40579641
3683D0579641r01625K36613o98466M1676n60237o70503o19920q64721k75276k67874
$$ 40579641 39678016 39914629 39216163 39257839 38697602 38027099 37407179 36542458 36267182 35999308
3673C5999308J08044l90863j9896l78391n80924k78467J61832M86032N4739o3325
$$ 35999308 36107352 35716489 35696593 35318202 34737278 34458811 34620643 35106675 35161414 35098089
3663C5098089m57544J25224l0495k06505P84583M79875O09919Q13214N22072M83733
$$ 35098089 34640545 34765769 34735274 34528769 35313352 35793227 36403146 37216360 37738432 38222165
3653C8222165Q58501M41067P21381O45359O38528M86015J000158J205846J181574
$$ 38222165 39080666 39521733 40243114 40888473 41527001 42013016 43013174 44219020 45400594
3644D5400594P60242J445338J570891J258956J087735J482217J511257J964387
$$ 45400594 46160836 47606174 49177065 50436021 51523756 53005973 54517230 56481617
3636E6481617J072736J157124R68550O13487J483127P42451R57444Q41496J056394
$$ 56481617 57554353 58711477 59680027 60293514 61776641 62519092 63476536 64318032 65374426
3627F5374426J422397N55831L51650R97783L74225K88128J159012J008467P08733
$$ 65374426 66796823 67352654 67704304 68702087 69076312 69364440 70523452 71531919 72240652
3618G2240652J277665J715384J461114K056116K049294K785037K026002K072283
$$ 72240652 73518317 75233701 76694815 78750931 80800225 83585262 85611264 87683547
3610H7683547K662439K889456L006663K226184K276478J997694J505693J535436
$$ 87683547 90345986 93235442 96242105 98468289 100744767 102742461 104248154 105783590
3602A05783590M77484L14974j55165o89573k63103o75124j830687j757797j360314
$$ 105783590 106261074 106576048 106420883 105731310 105468207 104793083 102962396 101204599 99844285
3593I9844285j619780j770407j654584j727434k188092j263291j257962j183398
$$ 99844285 98224505 96454098 94799514 93072080 90883988 89620697 88362735 87179337
3585H7179337j519332o87703j062404q47807m61103j40240j582997n77878r4491
$$ 87179337 85660005 84972302 83909898 83062091 82600988 82460748 80877751 80299873 80205382
3576H0205382j133357j730984n46085j017549j458386j368509j770772r36794
$$ 80205382 79072025 77341041 76794956 75777407 74319021 72950512 71179740 70242946
3568G0242946j009273j137504j506677j509971j429936j099595j071106q00182
$$ 70242946 69233673 68096169 66589492 65079521 63649585 62549990 61478884 60678702
3560F0678702j033321j482878j329354m81214m37911k72523l62487l61326l48591
$$ 60678702 59645381 58162503 56833149 56351935 55914024 55641501 55279014 54917688 54569097
3551E4569097M525k18935M2613M4987O78680J112046j71315O95167K69401P30817
$$ 54569097 54573622 54354687 54397300 54442287 55120967 56233013 56061698 56756865 57026266 57757083
3541E7757083J157863J182020J174382R82968J904906J414018J485286J928976
$$ 57757083 58914946 60096966 61271348 62254316 64159222 65573240 67058526 68987502
3533F8987502K467550K667895K466201K913808L147923K768861K365996K878994
$$ 68987502 71455052 74122947 76589148 79502956 82650879 85419740 87785736 90664730
3525I0664730K893591L046809L301793K910899L071269L106438L561965K525760
$$ 90664730 93558321 96605130 99906923 102817822 105889091 108995529 112557494 115083254
3517A15083254K962344L667602L698304K332501K753129J918162J684064K399905
$$ 115083254 118045598 121713200 125411504 127744005 130497134 132415296 134099360 136499265
3509A36499265J486207O93840M62937J124905Q25835O05557k23929M11202j80422
$$ 136499265 137985472 138679312 139142249 140267154 141092989 141698546 141474617 141885819 141705397
3500A41705397j41890K72065j95656j077522j397737r81717j843335j559294j498536
$$ 141705397 141563507 141835572 141639916 140562394 139164657 138182940 136339605 134780311 133281775
3491A33281775j995698j314947j246313j374639j090679j385172k622742k104629
$$ 133281775 131286077 129971130 128724817 127350178 126259499 124874327 122251585 120146956
3483A20146956j741597j776159j819351j654428j445820j378127j328946j228358
$$ 120146956 118405359 116629200 114809849 113155421 111709601 110331474 109002528 107774170
3475A07774170n89734o13979l91842p48759m81289L86847R314K45775J229116
$$ 107774170 107184436 106570457 106178615 105429856 104948567 105335414 105344728 105590503 106819619
3466A06819619o48102M53364J206609J175389J391137K045328K466196K316371
$$ 106819619 106171517 106624881 107831490 109006879 110398016 112443344 114909540 117225911
3458A17225911L324731L192773K964171K186373J850100J634178J029050J693675
$$ 117225911 120550642 123743415 126707586 128893959 130744059 132378237 133407287 135100962
3450A35100962J981345K288037L120996K903937L266584K068132K646057L246237
$$ 135100962 137082307 139370344 142491340 145395277 148661861 150729993 153376050 156622287
3442A56622287K321991K502097K631423K180871K001887R90042L51414J106921
$$ 156622287 158944278 161446375 164077798 166258669 168260556 169250598 169602012 170708933
3434A70708933j97728r88518k80988l40502k68498j105291j265992j248964k442863
$$ 170708933 170511205 169522687 169241699 168901197 168632699 167527408 166261416 165012452 162569589
3425A62569589k573137k885363l033740m103877n406254n361979m604722m819239
$$ 162569589 159996452 157111089 154077349 149973472 144567218 139205239 134600517 129781278
3417A29781278m934995m336897m943258m771734l951316l867941l605298l283904
$$ 129781278 124846283 120509386 115566128 110794394 106843078 102975137 99369839 96085935
3409I6085935l221458k842841k921838k821131k350640k445749j907537k471255
$$ 96085935 92864477 90021636 87099798 84278667 81928027 79482278 77574741 75103486
3401G5103486k663960j380630j600662j703124j848626j594195j247911j781010
$$ 75103486 72439526 71058896 69458234 67755110 65906484 64312289 63064378 61283368
3393F1283368n24437k99639k286474q29348p57895p03486j258875r58182n39549
$$ 61283368 60758931 60459292 58172818 57343470 56585575 55882089 54623214 53665032 53125483
3384E3125483j058158j89994l55102n32093n57862o83157Q9545j4244l63071n37221
$$ 53125483 52067325 51877331 51522229 50990136 50432274 49749117 49838662 49824418 49461347 48924126
3374D8924126j45619m94696q87856L88042L54739m6195K01529K76800q9940K24992
$$ 48924126 48778507 48283811 47395955 47783997 48138736 48092541 48294070 48570870 48480930 48705922
3364D8705922o751o022M99136L94326M82230Q78639M00926J44926J109005J617713
$$ 48705922 48699171 48693149 49192285 49586611 50068841 50947480 51348406 51493332 52602337 54220050
3354E4220050J128350R13140J517539J633369J563522O40011P81481J165379J091231
$$ 54220050 55348400 56261540 57779079 59412448 60975970 61615981 62397462 63562841 64654072
3345F4654072Q11812J24463K88963O51306R84652m73384m27160J08154j8125o92583
$$ 64654072 65465884 65590347 65879310 66530616 67515268 67041884 66614724 66722878 66704753 66012170
3335F6012170j99054k40453r39446j107628k16931p34630j012592j623706j204426
$$ 66012170 65813116 65572663 64633217 63525589 63308658 62574028 61561436 59937730 58733304
3326E8733304n66541m61461n85968j406149p84075o76367q98044n8254l62350
$$ 58733304 58166763 57705302 57119334 55713185 54929110 54252743 53354699 53296445 52934095
3317E2934095q12494m24445l78083p71172m63225n41819j62248k22999n67422
$$ 52934095 52121601 51697156 51319073 50547901 50084676 49542857 49380609 49157610 48590188
3308D8590188K86749o11128k58838k09203Q14287K49750l80407l908L1691O36215
$$ 48590188 48876937 48265809 48006971 47797768 48612055 48861805 48481398 48477490 48509181 49145396
3298D9145396J187428J105306J42836K16880Q22184J788360R12959Q09673J100687
$$ 49145396 50332824 51438130 51580966 51797846 52620030 54408390 55321349 56131022 57231709
3289E7231709R20165J201768O25087R04139K58619N06538k7111N007l51753k45317
$$ 57231709 58151874 59353642 59978729 60882868 61141487 61648025 61620914 61625921 61274168 61028851
3279F1028851m20965j290233r52567j050753o45756j341554j189558j184173j179137
$$ 61028851 60607886 59317653 58365086 57314333 56668577 55327023 54137465 52953292 51774155
3270E1774155p75010n14174r74684p49182l62852p7099l81832n1274R6722L94269
$$ 51774155 50999145 50484971 49510287 48761105 48398253 48321154 47939322 47888048 47984770 48379039
3260D8379039L97815l0812O24746L27098K17838M64647P95623O92374N70352O79859
$$ 48379039 48776854 48746042 49370788 49697886 49915724 50380371 51175994 51868368 52438720 53118579
3250E3118579J76955J57248l50815n41325J14728k48146q03158j129379j781460
$$ 53118579 53295534 53452782 53101967 52560642 52675370 52427224 51624066 50494687 48713227
3241D8713227j038918j170642j209105j696216j495680j090662q26972j227248
$$ 48713227 47674309 46503667 45294562 43598346 42102666 41012004 40185032 38957784
3233C8957784j509519r36801o51747m65022q98141j097791j015466r78035n43788
$$ 38957784 37448265 36511464 35859717 35394695 34496554 33398763 32383297 31405262 30861474
3224C0861474m9055o30316o97355l17214m10860o94294m26520k28175k53942j78722
$$ 30861474 30812419 30182103 29484748 29167534 28756674 28062380 27635860 27407685 27153743 26975021
3214B6975021m12255n98639o2744k9456K04688l32919J53282k64051r8001o47502
$$ 26975021 26562766 25964127 25901383 25871927 26076615 25743696 25896978 25632927 25534926 24887424
3204B4887424J2770K00084K51634n20893M39966J03254j02274K16827J29450L64265
$$ 24887424 24900194 25100278 25351912 24831019 25270985 25374239 25271965 25488792 25618242 25982507
3194B5982507L67940n1280m08228j92839L02824K63146k90598k37505l65691p8507
$$ 25982507 26350447 26299167 25890939 25698100 26000924 26264070 25973472 25735967 25370276 25291769
3184B5291769m38375m19639k92619o09835l64547l64379L6304l43558j33176n75414
$$ 25291769 24853394 24433755 24141136 23531301 23166754 22802375 22838679 22495121 22361945 21786531
3174B1786531J23073L56975k04910j50817o37191J71670J92015j93697L3521N43171
$$ 21786531 21909604 22266579 22061669 21910852 21273661 21445331 21637346 21443649 21477170 22020341
3164B2020341N9694K65661K82515M20732k1774M02648Q55880P55516L66639K93701
$$ 22020341 22080035 22345696 22628211 23048943 23027169 23429817 24285697 25041213 25407852 25701553
3154B5701553N78907N03723N78680Q04418O22087Q16420J053876J022169k74908
$$ 25701553 26280460 26784183 27362863 28167281 28789368 29605788 30659664 31681833 31406925
3145C1406925j11644M54598Q57257Q58867K47678L38425J114511P78249J464685
$$ 31406925 31295281 31749879 32607136 33466003 33713681 34052106 35166617 35944866 37409551
3136C7409551O51205K86958M98178J128375J416795J234552J157100J489296O51981
$$ 37409551 38060756 38347714 38845892 39974267 41391062 42625614 43782714 45272010 45923991
3127D5923991P11249P18353J759934J299168J312264J982531K344719J901531
$$ 45923991 46635240 47353593 49113527 50412695 51724959 53707490 56052209 57953740
3119E7953740K139466K901198K988706M120740L396303M969517M427351M948758
$$ 57953740 60093206 62994404 65983110 70103850 73500153 78469670 82897021 87845779
3111H7845779N854186N645057P193665Q223203P842941Q049278J0001949J0907409
$$ 87845779 93699965 99345022 106538687 114761890 122604831 130654109 140656058 151563467
3103A51563467J1363796J1725737J1427680R789400P446876M465353L93326l539225
$$ 151563467 162927263 174653000 186080680 195870080 203316956 207782309 208175635 204636410
3095B04636410n892657o742614q112010p933955p127939o488069n673279n266036
$$ 204636410 198743753 192001139 183889129 175955174 168827235 162339166 156665887 151399851
3087A51399851m423454m587660m308234m026866m132180m497440m162164l344975
$$ 151399851 146976397 142388737 138080503 134053637 129921457 125424017 121261853 117916878
3079A17916878l352153k663351k543053l061637k916102k526432k223497j603300
$$ 117916878 114564725 111901374 109358321 106296684 103380582 100854150 98630653 97027353
3071I7027353j163704j169837j352606l84264o98928n93412l25578R7048M88926
$$ 97027353 95863649 94693812 93341206 92956942 92258014 91664602 91339024 91436072 91924998
3062I1924998M76458R04773L78575J447285J995856R34688K117604K967100L227747
$$ 91924998 92401456 93306229 93684804 95132089 97127945 98062633 100180237 103147337 106375084
3053A06375084L186667L708691M388910N088681N794441O731560P226290P827926
$$ 106375084 109561751 113270442 117659352 122748033 128542474 135274034 142500324 150328250
3045A50328250Q991946R498265J0724404J2330307J2248140J2460106J2774214
$$ 150328250 159320196 168818461 179542865 191873172 204121312 216581418 229355632
3038B29355632J3225815J2176101J0354749Q336721O417395L985174J329663p62902
$$ 229355632 242581447 254757548 265112297 273449018 279866413 283851587 285181250 284418348
3030B84418348l633889o172098q030953j0606313j1750669j1760178j2724713
$$ 284418348 280784459 274612361 266581408 255975095 244224426 232464248 219739535
3023B19739535j2739618j1407549j1318294j1317621r707700r441321q648019
$$ 219739535 206999917 195592368 184274074 172956453 163248753 153807432 145159413
3016A45159413p972767p257046o429230o769713n380824n300690m455246m156507
$$ 145159413 137186646 129929600 123500370 116730657 111349833 106049143 101593897 97437390
3008I7437390l938505l893325l484482k627117l336825k899262k810712k115277
$$ 97437390 93498885 89605560 86121078 83493961 80157136 77257874 74447162 72331885
3000G2331885k378355k121224j873289k158138j907253j779554j851410j527785
$$ 72331885 69953530 67832306 65959017 63800879 61893626 60114072 58262662 56734877
2992E6734877k357467j660335k180874j649750j722715j870694j761404j474611
$$ 56734877 54377410 52717075 50536201 48886451 47163736 45293042 43531638 42057027
2984D2057027r94366j279117j253012j375742j004534q45826o25084j156933j365568
$$ 42057027 41062661 39783544 38530532 37154790 36150256 35304430 34679346 33522413 32156845
2975C2156845j384759l44315j088640p07167o28453l06244q37628l90644l99151
$$ 32156845 30772086 30427771 29339131 28631964 28003511 27697267 26859639 26468995 26069844
2966B6069844j055166n35375l39220q73662l58837m95421j39169n91400j049914
$$ 26069844 25014678 24479303 24140083 23266421 22907584 22412163 22272994 21681594 20631680
2957B0631680K47553m24906m72291J62310j28836m68482n99672m95936m14620
$$ 20631680 20879233 20454327 19982036 20144346 20015510 19547028 18947356 18451420 18036800
2948A8036800k83311m08960k90117m40802J01774m2816n67869n91936r46209L5717
$$ 18036800 17753489 17344529 17054412 16613610 16715384 16672568 16104699 15512763 14566554 14602271
2938A4602271p92322K48387K67986J22236l32993n72773n61441n89205m14546
$$ 14602271 13809949 14058336 14326322 14448558 14115565 13542792 12981351 12392146 11977600
2929A1977600L91768l86592l84909K47901K8751J30399j71639J37446j27380l23030
$$ 11977600 12369368 11982776 11597867 11845768 11874519 12004918 11833279 11970725 11843345 11520315
2919A1520315J29666l13036l99561l62033M64042m52190l14928k21401L97153
$$ 11520315 11649981 11336945 10937384 10575351 11039393 10587203 10272275 10050874 10448027
2910A0448027o5957l73367j51614r0722L95038j07530q663o73600k77863m48208
$$ 10448027 10382070 10008703 9857089 9766367 10161405 10053875 10045212 9371612 9093749 8645541
2900H645541P8632o58075K9822O29255l35169J99031n7291K64332k93528l63031
$$ 8645541 8724173 8066098 8095920 8725175 8390006 8589037 8531746 8796078 8502550 8139519
2890H139519l8486Q3811p07336j76657Q5733k9603K27261J10673L5956l80570
$$ 8139519 8101033 8184844 7477508 7300851 7386584 7356981 7584242 7694915 7730871 7350301
2880G350301J59035r43639n07947N16656J36853q2762K12314K19910q19380m63010
$$ 7350301 7509336 6565697 6057750 6574406 6711259 6628497 6840811 7060721 6241341 5778331
2870E778331O42072J5229m15211M15427N37170n05969k1j58379n87416P9456Q8891
$$ 5778331 6420403 6435632 6020421 6435848 6973018 6467049 6467028 6308649 5721233 5800689 5889580
2859E889580j39742M5033p49518N51697M73026l80146k56970M9256n84703m2837
$$ 5889580 5749838 5794871 5045353 5597050 6070076 5689930 5432960 5482216 4897513 4854676
2849D854676P4195k2400N006l1315n8937J35341m93146J50874K87472n44618M56297
$$ 4854676 4928871 4906471 4911477 4880162 4821225 4956566 4463420 4614294 4901766 4357148 4813445
2838D813445j79683j38068j6871L32076J69432q3511K24199M02902m39998r7815
$$ 4813445 4633762 4495694 4478823 4810899 4980331 4896820 5121019 5523921 5083923 4986108
2828D986108K10256N47423j096240m82666K92341m01449K28115k54406J25144
$$ 4986108 5196364 5743787 4647547 4164881 4457222 4055773 4283888 4029482 4154626
2819D154626J61540K94820M38258m88077l03412j28480R8634O67735M9654K6850
$$ 4154626 4316166 4610986 5049244 4561167 4257755 4129275 4227909 4895644 4945298 4972148
2809D972148k9103l56851k06774K97629o28398p2889k41915K84294M15666q4363
$$ 4972148 4943045 4586194 4379420 4677049 4048651 3975762 3733847 4018141 4433807 4349444
2799D349444p33227K03119J84286k10722K80196M3860k6019l69908O800o1405
$$ 4349444 3616217 3819336 4003622 3792900 4073096 4116956 4090937 3721029 3727829 3666424
2789C666424K0737N5058k97312K43651M39591j82100k45209j4008K37075k09805
$$ 3666424 3687161 3742219 3444907 3688558 4128149 3946049 3700840 3686832 3923907 3714102
2779C714102l80537L61078k83973m87299K53607k85664K15838Q14559l55530l83524
$$ 3714102 3333565 3694643 3410670 2923371 3176978 2891314 3107152 3921711 3566181 3182657
2769C182657O90490o39057M1137k73089k16624M29440l96002n7985J38680K94540
$$ 3182657 3873147 3234090 3275227 3002138 2785514 3214954 2818952 2760967 2899647 3194187
2759C194187m6591k9203l2458N79584n4591k94709J66081Q1697K1161K80041J69274
$$ 3194187 3147596 3118393 3085935 3665519 3610928 3316219 3482300 3563997 3585158 3865199 4034473
2748D034473m37008K30779k69058j29003r4309M7836n83444L29336P923n91934
$$ 4034473 3597465 3828244 3559186 3430183 3335874 3383710 2800266 3129602 3137525 2545591
2738B545591Q4371j45514N28728j4583n2064P8540N93963j56163o08385q85525
$$ 2545591 2629962 2484448 3013176 2998593 2946529 3025069 3619032 3462869 2854484 1968959
2728A968959J17151P87017m70630j67903J67706M0059k03728J62826j84425j11517
$$ 1968959 2086110 2873127 2402497 2234594 2402300 2442359 2238631 2401457 2217032 2105515
2718B105515J53189R3961o71518N35513O10176j42723n31067k10327q759J87482
$$ 2105515 2258704 2352665 1681147 2216660 2826836 2684113 2153046 1942719 1933960 2121442
2708B121442J64629l36507n00007K42806L59903l2262l0753K27376L37679m28049
$$ 2121442 2286071 1949564 1449557 1692363 2052266 2020004 1989251 2216627 2554306 2126257
2698B126257l42238J14183l9511J56716j01347n43379L95456M70534k48163l25065
$$ 2126257 1784019 1898202 1858691 2015407 1914060 1370681 1766137 2236671 1988508 1663443
2688A663443J10654l924k63945K89546K28598j99981j39606k45662j10023j27351
$$ 1663443 1774097 1770173 1506228 1795774 2024372 1824391 1684785 1439123 1329100 1201749
2678A201749O82691j3720o74708J37025M68420j97039j29128J02305j2666l7290
$$ 1201749 1884440 1870720 1196012 1333037 1801457 1604418 1475290 1577595 1564929 1527639
2668A527639K7877Q7980j48658J94750k8304l51828j8266O39238l53939k3134
$$ 1527639 1555516 1643496 1494838 1689588 1661284 1309456 1291190 1930428 1576489 1553355
2658A553355O10153m67902j62392K83803q4942l95021k10807K56618k8342l06662
$$ 1553355 2163508 1695606 1533214 1817017 1732075 1337054 1126247 1382865 1354523 1047861
2648A047861M86330L04536k11896Q1644l039j107650K75346K28012j44124j48287
$$ 1047861 1534191 1838727 1626831 1708475 1705436 597786 873132 1101144 957020 808733
2638H08733K90060K82128n52993M48835L99229l35600n19365M5376j11552K96864
$$ 808733 1098793 1380921 827928 1276763 1675992 1340392 821027 866403 754851 1051715
2628A051715K93143K02347L0213j55590l54253m6821N91539j83638J12186n96246
$$ 1051715 1344858 1547205 1577418 1421828 1067575 1020754 1612293 1428655 1540841 944595
2618I44595K0042j27014M28651L87451J49732J25426M02583J0668n6799N34948
$$ 944595 964637 837623 1266274 1653725 1803457 1928883 2331466 2342134 2285335 2820283
2608B820283k23190L40859j12101l83900J70658J39671J57804k75164l6444j03550
$$ 2820283 2597093 2937952 2825851 2441951 2612609 2752280 2910084 2634920 2598476 2494926
2598B494926k32556m20498l29530J99912l39784J58470L20159R9484k19299R7318
$$ 2494926 2262370 1841872 1512342 1712254 1372470 1530940 1851099 1950583 1731284 1828602
2588A828602p6454l05964k89187j13345l25115N03633l66j62900K5993j68563
$$ 1828602 1752148 1446184 1156997 1043652 718537 1222170 1221804 1058904 1084897 916334
2578I16334M20468k94005k07663K59949k24296L16211j55967m63954M88621k06780
$$ 916334 1336802 1042797 835134 1095083 870787 1186998 1031031 567077 1055698 848918
2568H48918L30876J41596k64871K5857j67693K66663j902J28019k70418n15759
$$ 848918 1179794 1321390 1056519 1082376 914683 1181346 1179444 1307463 1037045 521286
2558E21286M0413L27482K03112L89036P648j17206n465j34478j25476n2096k25733
$$ 521286 561699 889181 1092293 1481329 1488977 1371771 1366306 1231828 1106352 1054256 828523
2547H28523p4281n0058k31695K83066j57613K55481L82890K62972J46318O2848
$$ 828523 754242 704184 472489 755555 597942 853423 1236313 1499285 1645603 1708451
2537A708451k37127o24272K79325j21130J15695K99982k96005n33547K61439O0024
$$ 1708451 1471324 847052 1126377 1005247 1120942 1420924 1124919 591372 852811 912835
2527I12835J4124R01516q7724J69982n8378j34100N5433l34584q5499l77011J4961
$$ 912835 926959 1828475 1740751 1910733 1852355 1718255 1773688 1439104 1353605 976594 991555
2516I91555L9762J44524K48787l31587N2386K56120p4725K1172M76982o44313
$$ 991555 1031317 1175841 1424628 1093041 1145427 1401547 1326822 1347994 1824976 1180663
2506A180663l96654K19067J52411J44276Q1456M44634J32512l82166l83179K49573
$$ 1180663 784009 1003076 1155487 1299763 1381219 1825853 1958365 1576199 1193020 1442593
2496A442593j33840k46590L44079k98325Q8764J40974m61826K99211K62604n67710
$$ 1442593 1308753 1062163 1406242 1107917 1196681 1337655 875829 1175040 1437644 869934
2486H69934j21085K13525M64068K34253k89721o18578K43738O72176n32491n99275
$$ 869934 748849 962374 1426442 1660695 1370974 752396 996134 1668310 1135819 536544
2476E36544M88801j78930m37552M06187j79174M54735L31470m62306k37201J98423
$$ 536544 1025345 846415 408863 815050 635876 1090611 1422081 959775 722574 920997
2466I20997J14255J27686J38389R1380l27131o9497j91263P30423J94320o61540
$$ 920997 1035252 1162938 1301327 1392707 1065576 996079 804816 1535239 1729559 1068019
2456A068019k29889P66448m6559j67487j63843N4986L85797m27760j27023j27115
$$ 1068019 838130 1604578 1558019 1390532 1226689 1281675 1667472 1239712 1112689 985574
2446I85574K82158M69038k26556K37092p68061L69062J34029k20045M56773J92571
$$ 985574 1267732 1736770 1510214 1747306 979245 1348307 1482336 1262291 1719064 1911635
2436A911635J64571n17626J60683m337J73059j18620J28910j53911l54477J53172
$$ 1911635 2076206 1558580 1719263 1714926 1887985 1769365 1898275 1744364 1389887 1543059
2426A543059N34294o0034j75820k59811K38113O3526L01927J176J20377P4357
$$ 1543059 2077353 2017319 1841499 1581688 1819801 1883327 2185254 2186430 2306807 2381164
2416B381164O30272j9744m81233J66705J28303k94980J3654J56192J43530K10095
$$ 2381164 3011436 2991692 2510459 2677164 2805467 2510487 2524141 2680333 2823863 3033958
2406C033958J55908N19528j44716o96698R9996M666M1339M35940K33256J64159
$$ 3033958 3189866 3709394 3564678 2867980 2967976 2972642 3013981 3449921 3683177 3847336
2396C847336O10622J16213N6904q4355o2730N59817N94742n8989r6210O59815
$$ 3847336 4457958 4574171 4631075 4546720 4483990 5043807 5638549 5579560 5483350 6143165
2386F143165r8203M62695m31772K2201O60829j25344K35112N80863N95401k32502
$$ 6143165 6044962 6507657 6075885 6098086 6758915 6633571 6868683 7449546 8044947 7812445
2376G812445M75031J036597L4640Q87623J099607O10853L7687N14102J499389
$$ 7812445 8287476 9324073 9358713 10246336 11345943 11956796 11994483 12508585 14007974
2367A4007974R86652J012898J123247J555891J835798J662530J922844K679562
$$ 14007974 14994626 16007524 17130771 18686662 20522460 22184990 24107834 26787396
2359B6787396K890301L098888L451730M363848N144934M978186M768506N155917
$$ 26787396 29677697 32776585 36228315 40592163 45737097 50715283 55483789 60639706
2351F0639706N587393P122869Q041090R062089J3011045J6747427K0714904K5104166
$$ 60639706 66227099 73349968 81391058 90453147 103464192 120211619 140926523 166030689
2343A66030689K6477263K8028667L0659827K4872750Q691683j799240k2343261
$$ 166030689 192507952 220536619 251196446 276069196 284760879 282961639 260618378
2336B60618378l8210330k7511602j9639712j7884948j7458356j3718613j0245846
$$ 260618378 222408048 194896446 175256734 157371786 139913430 126194817 115948971
2329A15948971r181753q328195p009110q178841p068662n948891n958785m919077
$$ 115948971 106767218 98439023 91429913 83251072 76182410 70233519 64274734 59355657
2321E9355657m520436m231537l758614l166189k816023k394491j828333j474725
$$ 59355657 54835221 50603684 46845070 43678881 40862858 38468367 36640034 35165309
2313C5165309j670175k343278j487066j584288j581204p26000j267938j245218
$$ 35165309 33495134 31151856 29664790 28080502 26499298 25773298 24505360 23260142
2305B3260142p70218o79563p75850j022770j027377r06445n50798r33109j66473
$$ 23260142 22489924 21810361 21034511 20011741 18984364 18077919 17527121 16594012 16427539
2296A6427539j58160j672286p87667J64706j30792q46963m59754o34916k13061
$$ 16427539 16269379 14597093 13809426 13974132 13843340 12996377 12536623 11901707 11688646
2287A1688646q26501k80705l61605l78392n66243k11561m7411k09941o969l93169
$$ 11688646 10862145 10581440 10219835 9841443 9275200 9063639 9016228 8806287 8799318 8406149
2277H406149k37040k56137K2529k43978K56583N6249p44028R5258n1659m87455
$$ 8406149 8169109 7912972 7935501 7691523 7948106 8004355 7260327 7355585 7303926 6816471
2267F816471j565k66083J59601m98902j17299K10730m09837j59482m8941N69323
$$ 6816471 6814906 6548823 6708424 6209522 6092223 6302953 5893116 5733634 5684693 6254016
2257F254016J82188o72743l48153j98045J49445P45087n40446n48795j081n39164
$$ 6254016 6436204 5763461 5415308 5217263 5366708 6111795 5571349 5022554 5021473 4482309
2247D482309K94716l86772r6132J11792Q4028L75063k13408l34976n54119M71096
$$ 4482309 4777025 4390253 4294121 4405913 4489941 4865004 4651596 4316620 3762501 4233597
2237D233597m58385j47605K12822K175l21311O6152n32613P74368L53751l15774
$$ 4233597 3775212 3627607 3840429 3842604 3521293 3587445 3054832 3829200 4182951 3867177
2227C867177L3412L27737j31296k13878j76525R9837J53029j000564J65258P9609
$$ 3867177 3900589 4228326 4097030 3883152 3706627 3806464 3959493 2958929 3124187 3203796
2217C203796K30861j54942k6010K63054R8977K39769j69147l06414j8541k10096
$$ 3203796 3434657 3279715 3253705 3516759 3615736 3855505 3686358 3379944 3361403 3151307
2207C151307j85243L44408o2748l34668j97024k21974N02672j61826m42000Q3715
$$ 3151307 2966064 3310472 3247724 2913056 2716032 2494058 2996730 2834904 2392904 2476619
2197B476619K82599J5370l04967L8416m7827j80973O72029j10556n01343m23611
$$ 2476619 2759218 2774588 2469621 2508037 2460210 2279237 2951266 2840710 2339367 1915756
2187A915756l90610L53152j01733J20366N9571l7896J44115l62888P5466k31306
$$ 1915756 1525146 1878298 1776565 1896931 1956502 1918606 2062721 1699833 1775299 1543993
2177A543993L68476R2164k64675j5180k98470K13064M44348q2926j69709r6449
$$ 1543993 1912469 2004633 1739958 1724778 1426308 1639372 2083720 2000794 1831085 1734636
2167A734636R7888m39034p60137O03603O6005K60672o67679m62452K63636l68230
$$ 1734636 1832524 1393490 633353 1236956 1302961 1563633 895954 433502 697138 328908
2157C28908M68286k33687K53259K9341K33718O50068m3192n38564M87802K13646
$$ 328908 797194 563507 816766 846107 1079825 1729893 1686701 1148137 1635939 1849585
2147A849585k31287K31765l20964k43020O1461o668L36231k53865j20609k89420
$$ 1849585 1618298 1850063 1529099 1286079 1347540 1340872 1677103 1423238 1302629 1013209
2137A013209k15278K11472m58393l0900J10534L94822L10337k89525k91590M6125
$$ 1013209 797931 1009403 551010 520110 630644 1025466 1335803 1046278 754688 800813
2127H00813K19677M72823l76926Q5045K67316j57846j25538L58808l89398n63928
$$ 800813 1020490 1493313 1116387 1201432 1468748 1310902 1185364 1544172 1154774 590846
2117E90846J82846o906K9285K58454M2271j97164J05640J92027k3775k08484J26417
$$ 590846 773692 766786 796071 1054525 1096796 899632 1005272 1197299 1173524 965040 1091457
2106A091457j8833L44024j82032j2347l37230l04372L89306l01915l36657O03575
$$ 1091457 1072624 1416648 1234616 1222269 885039 580667 969973 668058 331401 934976
2096I34976J56868N5643k21327J57715K43260k06550k71740o7111L70720m14681
$$ 934976 1091844 1147487 926160 1083875 1327135 1120585 848845 781734 1152454 737773
2086G37773K91307k85149l79032q0999m1699M86908O45894l1418N4936j9589k57892
$$ 737773 1029080 743931 364899 283900 242201 729109 1375003 1343585 1398521 1378932 1121040
2075A121040O4724p1505K56353M07774M70733j83721m43431M62710j57058N007
$$ 1121040 1185764 1114259 1370612 1778386 2249119 2065398 1621967 2084677 1927619 1932626
2065A932626M30784j34077l73326j98129m62639J69057k50825p84174j6041O45076
$$ 1932626 2363410 2229333 1856007 1657878 1195239 1364296 1113471 329297 313256 958332
2055I58332O97132j29105p166k20967m79132n38417M39461k6501m84342N06366
$$ 958332 1655464 1526359 1519193 1298226 819094 280677 720138 693637 209295 715661
2045G15661K6056k97976K40790L92562m9297r195N50516j22686o63284m7813j32035
$$ 715661 741717 443741 684531 1077093 1027796 1018601 1569117 1446431 783147 735334 603299
2034F03299j8328K20059L50980j7772m37980m7715Q2735l5336K79790l55240K77031
$$ 603299 584971 805030 1156010 1138238 700258 652543 735278 699942 979732 624492 901523
2023I01523o52512L23847L96796m58167j98881J28758J69793j67397m2345K07187
$$ 901523 249011 572858 969654 511487 312606 441364 611157 443760 401415 608602
2013F08602L22265r0162n11171l13700j96346K70345L88553J95324m545j99073
$$ 608602 930867 840705 329534 15834 -180512 89833 478386 673710 669165 470092
2003D70092J25985l2765j83751l73003L04263j3903M7920K47955k51255j9404
$$ 470092 596077 563312 379561 6558 310821 296918 344838 592793 341538 322134
1993C22134M5617l31958K8858K64199L99424J51831m3394j45967k56135k86990
$$ 322134 367751 35793 64651 328850 728274 880105 836711 690744 434609 147619
1983A47619J70565K82073J62765L59656K575n99722M65052L5683n14425l50422
$$ 147619 318184 600257 763022 1122678 1125253 525531 990583 1026266 511841 161419
1973A61419j9808o7880M39549O5754N66611m46017J1466L65366n96364k86445
$$ 161419 141611 73731 513280 579034 1145645 699628 711094 1076460 480096 193651
1963A93651L1371L28657J88839k97576Q1065L1872o10566J72225j72322N2290
$$ 193651 225022 553679 742518 444942 526007 557879 -52687 119538 -52784 -494
1953d94j03334n62402N56263O0748M47968J05504k40044M3610K25834J5232n6345
$$ -494 -103828 -666230 -109967 -49219 398749 504253 264209 307819 533653 548885 492540
1942D92540n28721l4379j48547q1368N59672K24472N2658j50963P9647n0822L4143
$$ 492540 -36181 -70560 -219107 -300475 259197 483669 536327 385364 465011 414189 448332
1931D48332N0377j56749j66349K1821m23958J93476R8357K3810J08416j42621
$$ 448332 498709 341960 175611 197432 -226526 -33050 65307 89117 197533 54912
1921E4912m28633K77658K88647L6492K45304j8964k86775L88718N0789l55441
$$ 54912 -373721 -96063 192584 229076 474380 455416 168641 557359 608148 252707
1911B52707k12991L66703j17945J04416L7744J44883j88902J33034m79918n41392
$$ 252707 39716 406419 288474 392890 430634 575517 386615 519649 39731 -501661
1901e01661N57302J65930J9057L70452j33564N9959r0464k05833M95648j94704
$$ -501661 55641 221571 240628 611080 477516 537475 447011 241178 736826 542122
1891E42122o63241L8127M41081K16594l92361m82790K74787J37783k95447K9703
$$ 542122 -121119 -82992 358089 574683 182322 -300468 -25681 112102 -183345 -153642
1881a53642L58971l87561l94792M31626l15194N70443Q8253q97040J94205L36936
$$ -153642 205329 -182232 -577024 -145398 -460592 109851 198104 -698936 -504731 -167795
1871a67795P81812K37534l53860L92831n63553J00507r0637N1119L86382k32011
$$ -167795 614017 851551 497691 890522 326969 427476 336839 387958 774340 542329
1861E42329p82548r7690L38979N9753J29112J20591J55724j98909o3385k31005
$$ 542329 -240219 -337909 1070 60823 189935 310526 466250 267341 203956 -27049
1851b7049k46319P2300M6738r0580J85274L3285K07688n07394O21144j11720k59204
$$ -27049 -273368 -201068 -154330 -244910 -59636 -26351 181337 -326057 295087 183367 -75837
1840g5837k58019M29748K41993L7433m08359L8468J10617m91435m39919j15301
$$ -75837 -333856 95892 337885 375318 -33041 5427 116044 -375391 -815310 -930611
$$ [...]
##END NTUPLES=NMR SPECTRUM
##END=
