##TITLE=1H_DE-80H_X3
 200.13MHz, d2o
 8 sc
 
 19ns.26.2.2025
##JCAMPDX= 6.0         $$ Bruker NMR JCAMP-DX V2.0
##DATA TYPE= NMR SPECTRUM
##DATA CLASS= NTUPLES
##ORIGIN= UXNMR, Bruker Analytische Messtechnik GmbH
##OWNER= pz
$$ XWIN-NMR		Version 3.5
$$ Wed Sep 17 15:08:12 2025 Russian Standard Time (UT+4h)  Yarkov@DPX200
##.OBSERVE FREQUENCY= 200.1313
##.OBSERVE NUCLEUS= ^1H
##.ACQUISITION MODE= SIMULTANEOUS
##.ACQUISITION SCHEME= undefined
##.AVERAGES= 8
##.DIGITISER RES= 18
##SPECTROMETER/DATA SYSTEM= spect
##.PULSE SEQUENCE= zg30
##.SOLVENT NAME= CDCl3
##.SHIFT REFERENCE= (INTERNAL, CDCl3, 0, 15.4152)
##AUDIT TRAIL= $$ (NUMBER, WHEN, WHO, WHERE, WHAT)
$$ ##TITLE= Audit trail, XWIN-NMR		Version 3.5
$$ ##JCAMPDX= 5.01
$$ ##ORIGIN= Bruker BioSpin GmbH
$$ ##OWNER= Yarkov
$$ C:/Bruker/XWIN-NMR/data/yarkov2/nmr/H-C/1/pdata/1/auditp.txt
$$ ##AUDIT TRAIL=  $$ (NUMBER, WHEN, WHO, WHERE, WHAT)
(   1,<2025-09-17 15:07:10.17 +0400>,<Yarkov>,<DPX200>,
      <created by zg, POWCHK disabled, PULCHK disabled
       configuration hash MD5:
       00 E9 B6 7A A2 85 ED C7 34 08 36 98 17 FE 4E 26
       data hash MD5: 16K
       CB 7A 19 91 61 3A 4A C6 A3 AD 1D 8B 2A 80 28 A8>)
(   2,<2025-09-17 15:07:14.10 +0400>,<Yarkov>,<DPX200>,
      <Start of raw data processing
       efp BC_mod = 2 LB = 0.25 FT_mod = 6 PKNL = 1 PHC0 = -1351.135 PHC1 = 5.790926 SI = 16K 
       data hash MD5: 16K
       07 1D 65 9F 00 7E 16 31 85 19 74 90 D8 78 E4 78>)
(   3,<2025-09-17 15:07:33.92 +0400>,<Yarkov>,<DPX200>,
      <pk PHC0 = 3.115467 PHC1 = -7 
       data hash MD5: 16K
       31 EE 33 C2 76 1C 42 3E 44 DD F0 8F 75 B7 F2 C1>)
$$ ##END=
$$ 
$$ hash MD5
$$ CE B8 77 9A 61 10 07 99 93 BB 80 B5 BD 93 92 FF
##$RELAX= 
##$RELAX= 
##$RELAX= 
##$RELAX= 
##$RELAX= 
##$RELAX= 
$$ Bruker specific parameters
$$ --------------------------
##$DU= <C:/Bruker/XWIN-NMR>
##$EXPNO= 1
##$NAME= <H-C>
##$PROCNO= 1
##$TYPE= <nmr>
##$USER= <yarkov2>
##$AMP= (0..31)
100 100 100 100 100 100 100 100 100 100 100 100 100 100 100 100 100 100 
100 100 100 100 100 100 100 100 100 100 100 100 100 100 
##$AQSEQ= 0
##$AQ_mod= 1
##$AUNM= <au_zg>
##$AUTOPOS= <>
##$BF1= 200.13
##$BF2= 200.13
##$BF3= 200.13
##$BF4= 200.13
##$BF5= 200.13
##$BF6= 200.13
##$BF7= 200.13
##$BF8= 200.13
##$BYTORDA= 1
##$CFDGTYP= 0
##$CFRGTYP= 5
##$CHEMSTR= <none>
##$CNST= (0..31)
1 1 145 1 1 1 1 1 1 1 1 1 1 1 1 1 1 1 1 1 1 1 1 1 1 1 1 1 1 1 1 1 
##$CPDPRG= <>
##$CPDPRG1= <>
##$CPDPRG2= <>
##$CPDPRG3= <>
##$CPDPRG4= <mlev>
##$CPDPRG5= <mlev>
##$CPDPRG6= <mlev>
##$CPDPRG7= <mlev>
##$CPDPRG8= <mlev>
##$CPDPRGB= <>
##$CPDPRGT= <>
##$D= (0..31)
0 0.7 0 0 0 0 0 0 0 0 0 0.03 0 0 0 0 0 0 0 0 0 0 0 0 0 0 0 0 0 0 0 0 
##$DATE= 1758107229
##$DBL= (0..7)
120 120 120 120 120 120 120 120 
##$DBP= (0..7)
150 150 150 150 150 150 150 150 
##$DBP07= 0
##$DBPNAM0= <>
##$DBPNAM1= <>
##$DBPNAM2= <>
##$DBPNAM3= <>
##$DBPNAM4= <>
##$DBPNAM5= <>
##$DBPNAM6= <>
##$DBPNAM7= <>
##$DBPOAL= (0..7)
0.5 0.5 0.5 0.5 0.5 0.5 0.5 0.5 
##$DBPOFFS= (0..7)
$$ [...]
##$SUBNAM2= <"">
##$SUBNAM3= <"">
##$SUBNAM4= <"">
##$SUBNAM5= <"">
##$SUBNAM6= <"">
##$SUBNAM7= <"">
##$SUBNAM8= <"">
##$SUBNAM9= <"">
##$SW= 18.0517328524113
##$SWIBOX= (0..15)
0 0 2 0 0 0 0 0 0 0 0 0 0 0 0 0 
##$SW_h= 3612.71676300578
##$TD= 16384
##$TD0= 1
##$TE= 0
##$TE2= 300
##$TE3= 300
##$TEG= 300
##$TL= (0..7)
0 120 120 120 120 120 120 120 
##$TP= (0..7)
150 150 150 150 150 150 150 150 
##$TP07= 0
##$TPNAME0= <>
##$TPNAME1= <>
##$TPNAME2= <>
##$TPNAME3= <>
##$TPNAME4= <>
##$TPNAME5= <>
##$TPNAME6= <>
##$TPNAME7= <>
##$TPOAL= (0..7)
0.5 0.5 0.5 0.5 0.5 0.5 0.5 0.5 
##$TPOFFS= (0..7)
0 0 0 0 0 0 0 0 
##$TUNHIN= 0
##$TUNHOUT= 0
##$TUNXOUT= 0
##$USERA1= <user>
##$USERA2= <user>
##$USERA3= <user>
##$USERA4= <user>
##$USERA5= <user>
##$V9= 5
##$VALIST= <valist>
##$VCLIST= <CCCCCCCCCCCCCCC>
##$VD= 0
##$VDLIST= <DDDDDDDDDDDDDDD>
##$VPLIST= <PPPPPPPPPPPPPPP>
##$VTLIST= <TTTTTTTTTTTTTTT>
##$WBST= 1024
##$WBSW= 4
##$XGAIN= (0..3)
0 0 0 0 
##$XL= 0
##$YL= 0
##$YMAX_a= 702237
##$YMIN_a= -526539
##$ZGOPTNS= <>
##$ZL1= 120
##$ZL2= 120
##$ZL3= 120
##$ZL4= 120
##$ABSF1= 0
##$ABSF2= 0
##$ABSG= 0
##$ABSL= 0
##$ALPHA= 0
##$AQORDER= 0
##$ASSFAC= 0
##$ASSFACI= 0
##$ASSFACX= 0
##$ASSWID= 0
##$AUNMP= <proc_1d>
##$AZFE= 0.1
##$AZFW= 0.1
##$BCFW= 0
##$BC_mod= 2
##$BYTORDP= 0
##$COROFFS= 0
##$CY= -3
##$DATMOD= 1
##$DC= 0
##$DFILT= <>
##$DTYPP= 0
##$F1P= 0
##$F2P= 0
##$FCOR= 1
##$FTSIZE= 16384
##$FT_mod= 6
##$GAMMA= 0
##$GB= 0
##$INTBC= 1
##$INTSCL= 3.241238e-09
##$ISEN= 128
##$LB= 0.25
##$LEV0= 0
##$LPBIN= 0
##$MAXI= 10000
##$MC2= 0
##$MEAN= 0
##$ME_mod= 0
##$MI= 1.114404
##$NCOEF= 0
##$NC_proc= -5
##$NLEV= 6
##$NOISF1= 3.799351
##$NOISF2= 2.8
##$NSP= 0
##$NTH_PI= 0
##$NZP= 0
##$OFFSET= 15.41525
##$PC= 1
##$PHC0= -1348.02
##$PHC1= -1.209074
##$PH_mod= 1
##$PKNL= yes
##$PPARMOD= 0
##$PSCAL= 0
##$PSIGN= 0
##$REVERSE= no
##$SF= 200.130021305482
##$SI= 16384
##$SIGF1= 3
##$SIGF2= 2
##$SINO= 0.751879
##$SIOLD= 32768
##$SREGLST= <19F.Aceton>
##$SSB= 0
##$STSI= 16384
##$STSR= 0
##$SW_p= 3612.71676300578
##$SYMM= 0
##$S_DEV= 0
##$TDeff= 16384
##$TDoff= 0
##$TI= <>
##$TILT= no
##$TM1= 0
##$TM2= 0
##$TOPLEV= 0
##$USERP1= <user>
##$USERP2= <user>
##$USERP3= <user>
##$USERP4= <user>
##$USERP5= <user>
##$WDW= 1
##$XDIM= 16384
##$YMAX_p= 291052286
##$YMIN_p= -553917
$$ End of Bruker specific parameters
$$ ---------------------------------
##NTUPLES= NMR SPECTRUM
##VAR_NAME=  FREQUENCY,     SPECTRUM/REAL,   SPECTRUM/IMAG
##SYMBOL=    X,             R,               I
##VAR_TYPE=  INDEPENDENT,   DEPENDENT,       DEPENDENT
##VAR_FORM=  AFFN,          ASDF,            ASDF
##VAR_DIM=   16384,         16384,           16384
##UNITS=     HZ,            ARBITRARY UNITS, ARBITRARY UNITS
##FACTOR=    0.220516191357247, 1,           1
##FIRST=     3085.0542758113, 0,             0
##LAST=      -527.66248719448, 0,            0
##MIN=       -527.66248719448, -553917,      0
##MAX=       3085.0542758113, 291052286,     0
$$ Real data points
##PAGE= N=1
##DATA TABLE= (X++(R..R)), XYDATA
$$ [...]
8027a34183N344j935J715J1648j5076k38J6388k3995Q955j5845n518L390R790
$$ -134183 -128839 -130774 -129059 -117411 -132487 -132725 -116337 -140332 -131377 -147222 -152740 -149350 -139560
8014a39560Q799L445o804m510J1135N283j3583k3911p601P037K313M500j6868
$$ -139560 -130761 -127316 -134120 -138630 -127495 -122212 -135795 -159706 -167307 -160270 -157957 -153457 -170325
8001a70325J7083O996j1637o760n511M513P116R906m238L146O239J1613l334j9907
$$ -170325 -153242 -146246 -157883 -164643 -170154 -165641 -158525 -148619 -152857 -149711 -143472 -131859 -135193 -155100
7987a55100J663K935K289J730K4022r91j8930p595j0444J2816j4230j9353K0864
$$ -155100 -153437 -150502 -148213 -146483 -122461 -123452 -142382 -149977 -160421 -147605 -161835 -181188 -160324
7974a60324O384m637j4535J0216o089O100J0837j929j0475K281j247l974M188
$$ -160324 -153940 -158577 -173112 -162896 -168985 -162885 -152048 -153977 -164452 -162171 -163418 -167392 -163204
7961a63204j8434Q240J3420j2163N016J3182j5847o805K1431J0363p384j1802
$$ -163204 -181638 -173398 -159978 -172141 -167125 -153943 -169790 -176595 -155164 -144801 -152185 -163987
7949a63987j1357k778N835r471j977J3207N336J749k0681N813J208M351l730m532
$$ -163987 -175344 -178122 -172287 -181758 -183735 -170528 -165192 -163443 -184124 -178311 -177103 -172752 -176482 -181014
7935a81014K907n193j2670K4719R639l545J8082O36r696J801j2365K652K612l970
$$ -181014 -178107 -183300 -195970 -171251 -161612 -165157 -147075 -146439 -156135 -154334 -166699 -164047 -161435 -165405
7921a65405n393J2855j2091l135L853N340p744j9647O359K2590L570l367r976
$$ -165405 -170798 -157943 -170034 -173169 -169316 -163976 -171720 -191367 -185008 -162418 -158848 -162215 -172191
7908a72191r315J1735l275j8095n568J5975n272k869N971p576j500j156J1080
$$ -172191 -181506 -169771 -173046 -191141 -196709 -180734 -186006 -188875 -182904 -190480 -191980 -193136 -182056
7895a82056n768k547k919r437p875k349J9735m361l655J0575k228j5429k92J6238
$$ -182056 -187824 -190371 -193290 -202727 -210602 -212951 -193216 -197577 -201232 -190657 -192885 -208314 -208606 -192368
7881a92368m557j298J7966j836j5302O791n139n982j5320N273K9650L792j029
$$ -192368 -196925 -198223 -180257 -182093 -197395 -190604 -195743 -201725 -217045 -211772 -182122 -178330 -179359
7868a79359j7143n21Q221k966j1239r23J4161j2033L112P087p778O264M01j3753
$$ -179359 -196502 -197023 -188802 -191768 -203007 -203930 -189769 -201802 -198690 -191603 -199381 -193117 -192716 -206469
7854b06469R471J1414Q298p974L828Q46L069K5009J359p666k283M064j2185P55
$$ -206469 -196998 -185584 -177286 -185260 -181432 -180586 -177517 -152508 -151149 -158815 -161098 -157034 -169219 -168464
7840a68464n770L236j6359j660J0085R317j3686N794p234r498k72l500N358o702
$$ -168464 -174234 -170998 -187357 -189017 -178932 -169615 -183301 -177507 -184741 -194239 -194511 -198011 -192653 -199355
7826a99355J2845K123P460O93J0778j0855o265K958k77r86J647j0971k2897R575
$$ -199355 -186510 -184387 -176927 -176234 -165456 -176311 -182576 -179618 -179895 -180881 -179234 -190205 -213102 -203527
7812b03527K9818J3897j6494m407K2714J9594L4458j03971r9590O1109L8046K6304
$$ -203527 -173709 -159812 -176306 -180713 -157999 -138405 -103947 -207918 -307508 -246399 -208353 -182049
7800a82049M616J6068M060N938k871j536K397J0417j4105N978J843O359j37j9404
$$ -182049 -177433 -161365 -157305 -151367 -154238 -155774 -153377 -142960 -157065 -151087 -149244 -142885 -143022 -162426
7786a62426O962O387R678J540k834n929j1917j5227O314J0092L014n701k4496
$$ -162426 -155464 -149077 -139399 -137859 -140693 -146622 -158539 -173766 -167452 -157360 -154346 -160047 -184543
7773a84543p661J6490J3464J048j2710J772J3636O139o269q412m224k93O398k3554
$$ -184543 -192204 -175714 -162250 -161202 -173912 -172140 -158504 -152365 -158634 -167046 -171270 -171563 -165165 -188719
7759a88719K1077K0509o720j9454j1903k034p448N610O429P112J1990J509M216
$$ -188719 -167642 -147133 -153853 -173307 -185210 -187244 -194692 -189082 -182653 -175541 -163551 -162042 -157826
7746a57826J1950k209r237o491R964n243j0859L335l830K700j3894j204J7123
$$ -157826 -145876 -148085 -157322 -163813 -153849 -159092 -169951 -166616 -170446 -167746 -181640 -182844 -165721
7733a65721j323J2399Q54l262j8417Q260P5O434K127N492P517l377k2749L939
$$ -165721 -167044 -154645 -153791 -157053 -175470 -167210 -167135 -160701 -158574 -153082 -145565 -148942 -171691 -167752
7719a67752J789M940N987j1107P879j388j0804M25P674M008n786p596q474J102
$$ -167752 -165963 -161023 -155036 -166143 -158264 -159652 -170456 -170031 -162357 -158349 -164135 -171731 -180205 -179103
7705a79103q15J0477J2047j6602k564j389M446Q51j0196m533P068K481k8343j942
$$ -179103 -179918 -169441 -157394 -173996 -176560 -177949 -173503 -172652 -182848 -187381 -180313 -177832 -206175 -208117
7691b08117J1158l113J6567l927m501k103q243J067Q007J7561R663l2124j1814
$$ -208117 -196959 -200072 -183505 -187432 -191933 -194036 -202279 -201212 -193205 -175644 -165981 -198105 -209919
7678b09919J7952K699M514r316k324K328Q271J9819J68k1547q787q485P642J7506
$$ -209919 -191967 -189268 -184754 -194070 -196394 -194066 -185795 -165976 -165808 -187355 -196142 -204627 -196985 -179479
7664a79479J587r850k087j3621P185J2542P259K170j4131K310q60O277N451j7685
$$ -179479 -177892 -187742 -189829 -203450 -196265 -183723 -176464 -174294 -188425 -186115 -186975 -180698 -175247 -192932
7650a92932P665M74m305q520Q076j7429l738J2119q78j226k00R659K870M988K398
$$ -192932 -185267 -184793 -189098 -197618 -189542 -206971 -210709 -198590 -199468 -200694 -200894 -191235 -188365 -183377 -180979
7635a80979R718J438j0095r289J5099N013o663J7191P606j5128l378N509Q424
$$ -180979 -171261 -169823 -179918 -189207 -174108 -169095 -175758 -158567 -150961 -166089 -169467 -163958 -155534
7622a55534j2152N145N454l227j8139J132PJ8895l33n38j4679N49J0622j1839
$$ -155534 -167686 -162541 -157087 -160314 -178453 -177321 -177314 -158419 -158752 -159290 -173969 -173420 -162798 -174637
7608a74637p57Q424N620L317J0910j7573p304K048J7093k194n15j7181P332l881
$$ -174637 -175394 -166970 -161350 -158033 -147123 -164696 -172000 -169952 -152859 -155053 -155568 -172749 -165417 -169298
7594a69298N189n940j9173R226J6757J0125o436J2211m268O728j8870L561M252
$$ -169298 -164109 -170049 -189222 -179996 -163239 -153114 -159550 -147339 -151607 -144879 -163749 -160188 -155936
7581a55936K652q335J1865M602k872L167R882Q501n864p324j0415j5307j08O143
$$ -155936 -153284 -161619 -149754 -145152 -148024 -144857 -134975 -126474 -132338 -139662 -150077 -165384 -165492 -159349
7567a59349n88Q273M954o466R297q520J256j138j073p842P147J8520j0525J3762
$$ -159349 -159937 -151664 -146710 -153176 -143879 -152399 -151143 -152281 -153354 -161196 -154049 -135529 -146054 -132292
7553a32292m688p878N024P395M793p901l304j1393J565P796n187P270r022r301
$$ -132292 -136980 -144858 -139834 -132439 -127646 -135547 -138851 -150244 -148679 -140883 -146070 -138800 -147822 -157123
7539a57123k406R760L624O415L155l304M806p543j0035J674J0873K2632j4744
$$ -157123 -159529 -149769 -146145 -139730 -136575 -139879 -135073 -142616 -152651 -150977 -140104 -117472 -132216
7526a32216o838J2892j1752k1769Q491Q237k348J8449Q440K6473K19j0803L535
$$ -132216 -139054 -126162 -137914 -159683 -151192 -142955 -145303 -126854 -118414 -91941 -91722 -102525 -98990
7513i8990J7377K3423n7086J2195Q379P143J1705j1089J5465j1136Q991K7261
$$ -98990 -81613 -58190 -115276 -103081 -94702 -87559 -75854 -86943 -71478 -82614 -73623 -46362
7501d6362Q145M623O380K1691N51J2588O333m29K4854J3168K7660J4831K02J4517
$$ -46362 -38217 -33594 -27214 -5523 -4972 7616 13949 13520 38374 51542 79202 94033 94235 108752
7487A08752K8457N655M0292K4246K4341K8424K5439L5577K9550N0725L9142L6212
$$ 108752 137209 142864 183156 207402 231743 260167 285606 321183 350733 401458 440600 476812
7475D76812L5132M3627L4083L8715L3979M6532J9721q767l766J643m4065k7074
$$ 476812 511944 555571 589654 628369 662348 708880 728601 719834 716068 717711 673646 646572
7463F46572k6573m6985l7779l2795m7953l0424k2654j2247m408k1062j3457j9971
$$ 646572 619999 573014 535235 502440 454487 424063 401409 389162 384754 363692 350235 330264
7451C30264J2933O549J6777n646j0491N639L8758K1719J4725J5315J7133J6717
$$ 330264 343197 349746 366523 360877 350386 356025 394783 416502 431227 446542 463675 480392
7439D80392l720j1750L19J6912J7739r99M595M1732L6855J0295K1212K9790M8998
$$ 480392 476672 464922 465241 482153 499892 498893 503488 545220 582075 592370 613582 643372 692370
7426F92370N4038J5417L4065M5269J8288K9528L5479j833j0458q909j8013l0711
$$ 692370 746408 761825 795890 841159 859447 888975 924454 922621 912163 903254 885241 854530
7414H54530l8144l7525j5869j0482k5885O62j7400k2788O691k1064j685O967M731
$$ 854530 816386 778861 762992 752510 726625 727287 709887 687099 693790 672726 671041 678008 682739
7401F82739J0770j771K3740J5613K2449L1214R767L0000L8861R116N79Q644m352
$$ 682739 693509 691738 715478 731091 753540 784754 794521 824521 863382 872498 873077 881721 877369
7388H77369j8567j0098q437k6942m8477m3992m7701m0951m2520l1488m6330k9241
$$ 877369 858802 848704 840267 813325 764848 720856 673155 632204 589684 558196 511866 482625
7376D82625j7395l1384j4465j5135n687m478j680k4871k9192j6799j372o96j127
$$ 482625 465230 433846 419381 404246 398559 394081 392401 367530 338338 321539 320167 319471 318344
7363C18344K232L563J1366j325J6457J0992K4597R578M235K1360K5816K5254J7462
$$ 318344 320576 324139 335505 334180 350637 361629 386226 395804 400039 421399 447215 472469 489931
7350D89931K8949M0496L4717K3479L7429K3693L9758K1901J3008J2777q422j5388
$$ 489931 518880 559376 594093 617572 655001 678694 718452 740353 753361 766138 757716 742328
7338G42328k1026j3256k5414l3283m5530m1322j4264l2578l2625m2060m677j8385
$$ 742328 721302 708046 682632 649349 603819 562497 548233 515655 483030 440970 436293 417908
7326D17908k5373k0064k5896k1537l0899J4067j2841l4281l4160L900qk4784j2670
$$ 417908 392535 372471 346575 325038 294139 308206 295365 261084 226924 230824 230816 206032 193362
7313A93362k2873l77K1114j1346j3793p192n007O651J1050j5848k0638k767j789
$$ 193362 170489 170112 191226 179880 166087 158895 153888 160539 171589 155741 135103 132336 130547
7300A30547Q131K668n880p125q171q126p696p566Q16k302k321p071j4051J739
$$ 130547 138678 141346 135466 128341 120170 112044 104348 96782 97598 95296 92975 85904 71853 73592
7286G3592N090L555q127p120J0670q209K479J0850j4535q967N919L361R494k729
$$ 73592 78682 82237 74110 66990 77660 69451 71930 82780 68245 59278 65197 68558 78052 75323
7272G5323q17J970n989N157N266j0054j950R113R743R066p321q632J1604K7400
$$ 75323 74506 76476 70487 75644 80910 70856 68906 78019 87762 96828 89507 80875 92479 119879
7258A19879N757k3971j4324N297o151l337k560j5249P553q537m702J0305R399
$$ 119879 125636 101665 87341 92638 86487 83150 80590 65341 72894 64357 59655 69960 79359
7245G9359P254J6908j0664j5822j3678j48n021l585M265O540m849j3264R949O94
$$ 79359 86613 103521 92857 77035 63357 63209 58188 54603 58868 65408 60559 47295 57244 57938
7231E7938o413K2024n072k582q601k498O180j4538l368J4186K6021K0827K711
$$ 57938 51525 73549 68477 65895 57294 54796 60976 46438 43070 57256 83277 104104 106815
7218A06815p276M945M264Q929K121n510q039r974k146N018q96M216o972K793n589
$$ 106815 99539 104484 108748 117677 119798 114288 106249 96275 94129 99147 98251 102467 95495 98288 92699
7203I2699j5944M51J9702n992J5342k4869j1490k167p066j0396L581J5448J8183
$$ 92699 76755 77206 96908 90916 106258 81389 69899 67732 60666 50270 53851 69299 87482
7190H7482J4736P85k120Q175m899l889k930K4886P25n091L282O443j2823K56N216
$$ 87482 102218 103003 100883 109058 104159 100270 97340 122226 122951 117860 121142 127585 114762 115018 120234
7175A20234J1131Q661Q229Q33j0022J1291J5585p41K525J3212j710K2816J1922
$$ 120234 131365 140026 148255 149088 139066 150357 165942 165201 167726 180938 179228 202044 213966
7162B13966j346n777J0602L642R897Q635O169q372R229J1555K0044l295J8300
$$ 213966 212620 206843 217445 221087 230984 239619 245788 237416 246645 258200 278244 274949 293249
7149B93249J4510R721J1898K6195L1003K4550L2174M1184L7110M3926K7113N8020
$$ 293249 307759 317480 329378 355573 386576 411126 443300 484484 521594 565520 592633 650653
7137F50653P2448N6628M1840P5436P0102M4326M0634J7719K3963k1328k5377l8647
$$ 650653 723101 779729 821569 897005 967107 1011433 1052067 1069786 1093749 1072421 1047044 1008397
7125A008397l7032l7093n9895m2662m1302l9489l1425k5819n614k2717l1881j6536
$$ 1008397 971365 934272 874377 831715 790413 750924 719499 693680 688066 665349 633468 616932
7113F16932r022r246j4612J0751J7133Q625N090K3321J3313j363K1860J9865J1157
$$ 616932 607910 598664 584052 594803 611936 620561 625651 648972 662285 660922 682782 702647 713804
7100G13804L1815K6531K1528J5283L4324K8157N6045N1794N4153N0676O6915N8403
$$ 713804 745619 772150 793678 808961 843285 871442 927487 979281 1033434 1084110 1151025 1209428
7088A209428P2874O0196P8621J04545R7151J16167R4009Q8995R3128R4121O5776
$$ 1209428 1282302 1342498 1421119 1525664 1622815 1738982 1832991 1921986 2015114 2109235 2175011
7077B175011O2064M9664L0368N8721O2384O6602Q0798P3954J03109J11855J39740
$$ 2175011 2237075 2286739 2317107 2375828 2438212 2504814 2585612 2659566 2762675 2874530 3014270
7066C014270J83830J91102K63677K79354K60784K84576L16557L42014L57729L38220
$$ 3014270 3198100 3389202 3652879 3932233 4193017 4477593 4794150 5136164 5493893 5832113
7056E832113L69197M09072M51976N13742O42161P55197Q68084J117275J394265
$$ 5832113 6201310 6610382 7062358 7576100 8218261 8973458 9841542 10958817 12353082
7047A2353082J677144J971694K367453K775595K873888K813205K747863J531595
$$ 12353082 14030226 16001920 18369373 21144968 24018856 26832061 29579924 31111519
7039C1111519q48250l892078m334680k999931k184107j735478j552103j264000
$$ 31111519 30263269 26371191 22036511 19036580 16852473 15116995 13564892 12300892
7031A2300892j052165r03823q59649q21242q82071q23769o52487n17949m24753
$$ 12300892 11248727 10344904 9485255 8664013 7781942 6958173 6305686 5787737 5362984
7022E362984l46422l18309k68182k36549j85768j55065j40574r0426q1037r4732
$$ 5362984 5016562 4698253 4430071 4193522 4007754 3852689 3712115 3621689 3540652 3445920
7012C445920q6183p6503o3654p1363o1512p8761o9797j15903j30081j33769j03920
$$ 3445920 3359737 3283234 3219580 3148217 3086705 3007944 2938147 2822244 2692163 2558394 2454474
7001B454474r4885r7044j02800o9582p3015q7383q5196p3815o5959o0124m9206
$$ 2454474 2359589 2262545 2159745 2090163 2017148 1929765 1844569 1770754 1704795 1644671 1595465
6990A595465m5708l2054k1381l2423m5207j2213k6430l1094l5648l5053j9721
$$ 1595465 1549757 1517703 1496322 1463899 1418692 1406479 1380049 1348955 1313307 1278254 1258533
6979A258533j4551j900m0242j1031j5272l367j8141j1323J6739J3997j0955J0
$$ 1258533 1243982 1242082 1201840 1190809 1175537 1172170 1154029 1142706 1159445 1173442 1162487 1162497
6967A162497K020j1919j7896N770K1714J0138J2209J9012P146J8238L1516O110
$$ 1162497 1164517 1152598 1134702 1140472 1162186 1172324 1184533 1203545 1210691 1228929 1260445 1266555
6955A266555J0098K2231K9939J1919r068K850R878k923j1985l084j9651j0923
$$ 1266555 1276653 1298884 1328823 1340742 1331674 1334524 1344402 1341479 1329494 1326410 1306759 1295836
6943A295836k5955k9535l5971l799k5244n882l1971l9821j8251j550j6218q598
$$ 1295836 1269881 1240346 1204375 1200576 1175332 1169450 1137479 1097658 1079407 1077857 1061639 1053041
6931A053041p425P166N902R12J4728k4520O419O438J1570j971l322K3962L0169
$$ 1053041 1045616 1052782 1058684 1059596 1074324 1049804 1056223 1062661 1074231 1072260 1068938 1092900 1123069
6918A123069J4750P06K5639K8607J7510K0298J3228K0086q146J900j36K726k0471
$$ 1123069 1137819 1138525 1164164 1192771 1210281 1230579 1243807 1263893 1255747 1257647 1257511 1260237 1239766
6905A239766o190j9895k2298k4511l9644n9514m0855l5694l9508j5666j9036k1858
$$ 1239766 1233576 1213681 1191383 1166872 1127228 1067714 1026859 991165 951657 935991 916955 895097
6893H95097j1833l3217j8887l0175l76L096j0371j9514j1042j566k4193k0141
$$ 895097 883264 850047 831160 800985 800609 803705 793334 773820 762778 761212 737019 716878
6881G16878N726j3102l6967j3602P953J470r126j8075j2027j4969q030n167j1322
$$ 716878 722604 709502 672535 658933 666886 668356 659230 641155 629128 614159 606129 600962 589640
6868E89640k0394k689n368J8113O105j1946j5404q125J2916L0505J2221j0322
$$ 589640 569246 566557 561189 579302 585407 573461 558057 549932 562848 593353 605574 595252
6856E95252N911N06n547J0314r326J4429P093J1327J7479J3017K2147K99K969
$$ 595252 601163 601669 596122 606436 597110 611539 618632 629959 647438 660455 682602 682901 685870
6843F85870P604L334K1480J8504r676J4937P477J1477J8358K0560q563J4557P801
$$ 685870 693474 696808 718288 736792 727116 742053 749530 761007 779365 799925 791362 805919 813720
6830H13720J404j31M283l048k4506l144K258k5830j4174j6657k1848l301q97q955
$$ 813720 815124 814993 819276 816228 791722 788578 790836 765006 750832 734175 712327 709026 708129 699174
6816F99174m793L239N527O682q053j3663J772q324P720Q302q342J5663o875m07
$$ 699174 694381 697620 703147 709829 701776 688113 689885 681561 689281 697583 689241 704904 698029 697622
6802F97622m804o225n659p174Q513q665K4021j7023j0977k1134p39Q808K098M399
$$ 697622 692818 686593 680934 673760 682273 673608 697629 680606 669629 648495 647756 656564 658662 663061
6788F63061J0037k562k722N614j0730J2544j525R660J1313j7722o721L039J082
$$ 663061 673098 670536 667814 673428 662698 675242 673717 683377 694690 676968 670247 673286 674368
6775F74368R10J5542J8497J4437L393N968J3894p311K6606J1147l24O019J1261
$$ 674368 675278 690820 709317 723754 727147 733115 747009 739698 766304 777451 777127 783146 794407
6762G94407K6983J1108O925L5534L9642J6435J9352K2245M0333M0496L0973M1472
$$ 794407 821390 832498 839423 874957 914599 931034 950386 972631 1012964 1053460 1084433 1125905
6750A125905M1952K1762L6762K9981L9255M6503M2983M1196L6471M1089L9198
$$ 1125905 1167857 1189619 1226381 1256362 1295617 1342120 1385103 1426299 1462770 1503859 1543057
6739A543057K6878L2157M0694J5030K000L849n657j1302k6638m4995l6143l2357
$$ 1543057 1569935 1602092 1642786 1657816 1659816 1663665 1658008 1646706 1620068 1575073 1538930 1506573
6727A506573j1008j3818m4803m0730j6685q335k6709l1195j6792k0203o003j1260
$$ 1506573 1495565 1481747 1436944 1396214 1379529 1371194 1344485 1313290 1296498 1276295 1270292 1259032
6715A259032L9j5246j0751R404q579k9647j0174n509n533N76j4381M090j7604
$$ 1259032 1259071 1243825 1233074 1242478 1233899 1204252 1194078 1188569 1183036 1183612 1169231 1173321 1155717
6702A155717l2314o176k1529j8629j8308k3745k9617l5141k4402j8894m393j009
$$ 1155717 1123403 1117227 1095698 1077069 1058761 1035016 1005399 970258 945856 926962 922569 921560
6690I21560j9606L780k3391k2059k33j0895n934J0091J8244j4466J431J0937J9047
$$ 921560 901954 905734 882343 860284 860051 849156 843222 853313 871557 857091 858522 869459 888506
6677H88506J645N483J4810J2282n334j2952N112O343N260M820M633j5376o358
$$ 888506 890151 895634 910444 922726 917392 904440 909552 915895 921155 925975 930608 915232 908874
6664I08874k065j1774Q355P135n613K233K1283J1884L82J7962J9648j4965K649
$$ 908874 906809 895035 903390 910525 904912 907145 928428 940312 940694 958656 978304 963339 965988
6651I65988M3516P429J8408L9111K8821J1691K4556L1373L6835K9118M1454K1906
$$ 965988 1009504 1016933 1035341 1074452 1103273 1114964 1139520 1170893 1207728 1236846 1278300 1300206
6639A300206K7177L7717K0091Q703P326n817l2531k5007l2306j6012k0809j5799
$$ 1300206 1327383 1365100 1385191 1393894 1401220 1395403 1362872 1337865 1305559 1289547 1268738 1252939
6627A252939n703L861p67j8572j3063j3880k4597k316O052j4976j8001j794R111
$$ 1252939 1247236 1251097 1250330 1231758 1218695 1204815 1180218 1177902 1183954 1168978 1150977 1149183 1158294
6614A158294M592K3689P213P335o143k2377J2209J1375J2832L1050O395J4243
$$ 1158294 1162886 1186575 1193788 1201123 1194980 1172603 1184812 1196187 1209019 1240069 1246464 1260707
6602A260707K2324K6141J137J8094K5777K9997M6711L2524K7129K8883M8915L8782
$$ 1260707 1283031 1309172 1310309 1328403 1354180 1384177 1430888 1463412 1490541 1519424 1568339 1607121
6590A607121K7247L7069K9853K6602N0404L8751M2251M4516K8721K7362L5910
$$ 1607121 1634368 1671437 1701290 1727892 1778296 1817047 1859298 1903814 1932535 1959897 1995807
6579A995807K1058L1900L8112M0432M0770K6760L6312L7087M1064M6148O2696
$$ 1995807 2016865 2048765 2086877 2127309 2168079 2194839 2231151 2268238 2309302 2355450 2418146
6568B418146O0448O6541O8719Q9140J16849Q3514Q0243R2436J10000Q4841J10809
$$ 2418146 2478594 2545135 2613854 2702994 2819843 2903357 2983600 3076036 3186036 3270877 3381686
6557C381686J26833J30544J41588J39170J42546J29510J49153J95215J94127J83920
$$ 3381686 3508519 3639063 3780651 3919821 4062367 4191877 4341030 4536245 4730372 4914292
6547D914292J89491J83265K08497K45121K32120K64230K69937L02607L22746L46733
$$ 4914292 5103783 5287048 5495545 5740666 5972786 6237016 6506953 6809560 7132306 7479039
6537G479039L53728L88574M20055M51309M81512M98222N44762N90546O43436O85908
$$ 7479039 7832767 8221341 8641396 9092705 9574217 10072439 10617201 11207747 11851183 12537091
6527A2537091P52015P89981Q64584R48446J034208J116838J191637J305418J403154
$$ 12537091 13289106 14079087 14943671 15892117 16926325 18043163 19234800 20540218 21943372
6518B1943372J513290J634527J754967J890304K069000K246530K475586K689939
$$ 21943372 23456662 25091189 26846156 28736460 30805460 33051990 35527576 38217515
6510C8217515K962134L245925L562913L891178M186396M477457M678164M757237
$$ 38217515 41179649 44425574 47988487 51879665 56066061 60543518 65221682 69978919
6502F9978919M638180M323891L757715K902163J705901L17600j171241k522176
$$ 69978919 74617099 78940990 82698705 85600868 87306769 87624369 86453128 83930952
6494H3930952l536054m149416m399289m390655m232648l971476l728201l489111
$$ 83930952 80394898 76245482 71846193 67455538 63222890 59251414 55523213 52034102
6486E2034102l254300l077461k909097k723791k534541k349117k171543j975112
$$ 52034102 48779802 45702341 42793244 40069453 37534912 35185795 33014252 31039140
6478C1039140j842294j727676j590305j442039j342276j237254j117515j029461
$$ 31039140 29196846 27469170 25878865 24436826 23094550 21857296 20739781 19710320
6470A9710320r36964q68442q08687p38119o76101n96172n71726n21403n01107
$$ 19710320 18773356 17904914 17096227 16358108 15682007 15085835 14514109 13992706 13491599
6461A3491599m69727m29742m21380l76091l30301l40950k67455k64527k37610
$$ 13491599 13021872 12592130 12170750 11794659 11464358 11123408 10855953 10591426 10353816
6452A0353816j78494j88915j54337j37081j29900j08122j09582r4728j16602j31048
$$ 10353816 10175322 9986407 9832070 9694989 9565089 9456967 9347385 9252657 9136055 9005007
6442I005007j07755j37107j19294j23450r8380j03758q3990q6390n8131p5731
$$ 9005007 8897252 8760145 8640851 8517401 8419021 8315263 8231273 8144883 8086752 8011021
6432H011021q0741j09398j16401j07969j30704j71758j62268j70518j82634j70587
$$ 8011021 7930280 7820882 7704481 7596512 7465808 7294050 7131782 6961264 6778630 6608043
6422F608043j84671j50609j39431j32881j29516j19985j06147j14202r3287p9695
$$ 6608043 6423372 6272763 6133332 6000451 5870935 5750950 5644803 5530601 5437314 5357619
6412E357619r9668n7811n0646m4792n6562m5380l6238l3915k9451j9646l3264
$$ 5357619 5257951 5200140 5149494 5104702 5048140 5002760 4966522 4932607 4903156 4883510 4850246
6401D850246j8335k834l5207j8360j5629l0566j0610j5073o519j8952k053l668
$$ 4850246 4831911 4829077 4793870 4775510 4759881 4729315 4718705 4703632 4697113 4678161 4676108 4672440
6389D672440O316L4928J8216O0191P0182P6656Q5866O3028P3966M2706o3438j40652
$$ 4672440 4678756 4713684 4731900 4792091 4862273 4938929 5024795 5087823 5161789 5204495 5141057 5000405
6377E000405j69855j88719j54548j12190r4405r9625q5582m9966m1544n121j4562
$$ 5000405 4830550 4641831 4487283 4375093 4280688 4181063 4095481 4045515 4003971 3998850 3984288
6366C984288o196k778k5506m4546j10164j51354j70485j62603j23728j17942j10578
$$ 3984288 3978092 3975314 3949808 3905262 3795098 3643744 3473259 3310656 3186928 3068986 2958408
6355B958408r5383q2985o1844p5619o3348m0167o1260l9628n7445m0011k0318
$$ 2958408 2863025 2780040 2718196 2642577 2579229 2539062 2477802 2438174 2380729 2340718 2320400
6344B320400k9434k4309k7437k3761k6743m0045l1192j4857j7438j8593l9278
$$ 2320400 2290966 2266657 2239220 2215459 2188716 2148671 2117479 2102622 2085184 2066591 2027313
6333B027313k8269k1059l9940j2920l9081j9687m1668p993r131k7925k2805q776
$$ 2027313 1999044 1977985 1938045 1925125 1886044 1866357 1824689 1816696 1807565 1779640 1756835 1748059
6321A748059j4460j7200K4677o723L471M912N48j2927j0227P591n210m059L035
$$ 1748059 1733599 1716399 1741076 1734353 1737824 1742736 1743284 1730357 1720130 1727721 1722511 1718452 1721487
6308A721487m879n170J553j6365j0761p544j2466j939l7693k0781k086k480k0803
$$ 1721487 1716608 1711438 1712991 1696626 1685865 1678321 1665855 1663916 1626223 1605442 1603356 1600876 1580073
6295A580073q517P330k8924j4647j5850j2166o794l981j6652n352k688R36o886
$$ 1580073 1571556 1578886 1549962 1535315 1519465 1507299 1500505 1496524 1479872 1474520 1471832 1472768 1465882
6282A465882L0963K5666Q580J2103M106K2488L3372M2202J8381M3421M4770N0258
$$ 1465882 1496845 1522511 1531091 1543194 1547300 1569788 1603160 1645362 1663743 1707164 1751934 1802192
6270A802192L6350N6818M9274L3586L9656N7241M656K7268j1255k9666j4395k0991
$$ 1802192 1838542 1895360 1944634 1978220 2017876 2075117 2079773 2107041 2095786 2066120 2051725 2030734
6258B030734m4152l9078k8719l1908k5418l9106k5742q710J122j6052j2853o809
$$ 2030734 1986582 1947504 1918785 1886877 1861459 1822353 1796611 1787901 1789023 1772971 1760118 1753309
6246A753309K132j209M325o403J4408J7963J3955N500j8144n858P211J8523K0540
$$ 1753309 1755441 1754232 1758557 1752154 1766562 1784525 1798480 1803980 1785836 1779978 1787189 1805712 1826252
6233A826252J4709K3080M1580K7489J8521K4384K9501J4272K4380L3686K8621
$$ 1826252 1840961 1864041 1905621 1933110 1951631 1976015 2005516 2019788 2044168 2077854 2106475
6222B106475J6401K887j2033k7762k0519m0761l5661k2472k7804j5996k7580j0411
$$ 2106475 2122876 2125763 2113730 2085968 2065449 2024688 1989027 1966555 1938751 1922755 1895175 1884764
6210A884764j5440k7735m5485n299j7590j4006N626j8682L651n728M991n511K7762
$$ 1884764 1869324 1841589 1796104 1790805 1773215 1759209 1764835 1746153 1749804 1744076 1749067 1743556 1771318
6197A771318J9972N241J8230L3121J4204J7072K7831L8246J6976K4100M2288L8441
$$ 1771318 1791290 1796531 1814761 1847882 1862086 1879158 1906989 1945235 1962211 1986311 2028599 2067040
6185B067040L2805K4409L7775K8825M2703K7577K6084J7282J1645K2021L7223
$$ 2067040 2099845 2124254 2162029 2190854 2233557 2261134 2287218 2304500 2316145 2338166 2375389
6174B375389M5330K3380L3952L4181L4830K5305M9412M5106M4358L3582M9484
$$ 2375389 2420719 2444099 2478051 2512232 2547062 2572367 2621779 2666885 2711243 2744825 2794309
6163B794309L5452L0288L7172K3991M3776N2597K4844j327J5080q550q258R455
$$ 2794309 2829761 2860049 2897221 2921212 2964988 3017585 3042429 3041102 3056182 3047632 3039374 3048829
6151C048829o818k9498j0822k4408j706J4390j0260J1318p98J0171M1465K5744
$$ 3048829 3042011 3012513 3001691 2977283 2975577 2989967 2979707 2991025 2990227 3000398 3041863 3067607
6139C067607K4905L8556J8873K8898N1240M5822M9577P0078P0031P0838P1233
$$ 3067607 3092512 3131068 3149941 3178839 3230079 3275901 3325478 3395556 3465587 3536425 3607658
6128C607658Q0411Q4507Q2755P0653O5223Q2568P8953O1834N5767L4662O2817
$$ 3607658 3688069 3772576 3855331 3925984 3991207 4073775 4152728 4214562 4270329 4304991 4367808
6117D367808M5913O0468Q1694N0018N7691J01593P7685O7782Q9965J00016R4986
$$ 4367808 4413721 4474189 4555883 4605901 4663592 4765185 4842870 4910652 5000617 5100633 5195619
6106E195619J10495J28482J28801J43808J68536J75000K01153K23026K07382J89280
$$ 5195619 5306114 5434596 5563397 5707205 5875741 6050741 6251894 6474920 6682302 6871582
6096F871582J46751J30603O7513M9620M542m2057o8097j05199j24268j00879p2767
$$ 6871582 7018333 7148936 7216449 7266069 7270611 7228554 7160457 7055258 6930990 6830111 6757344
6085F757344k7966m1871n69R490q642J3556M0849N9422P1066R8414J11525J41321
$$ 6757344 6729378 6687507 6686938 6696428 6687786 6701342 6742191 6801613 6872679 6971093 7082618 7223939
6073G223939J76621J80199K22827K56750K51494K58587K74356K95187L02137L11081
$$ 7223939 7400560 7580759 7803586 8060336 8311830 8570417 8844773 9139960 9442097 9753178
6063I753178L23537L15351L52774L84878L97965M44289M47968M71604M77373N14741
$$ 9753178 10076715 10392066 10744840 11129718 11527683 11971972 12419940 12891544 13368917 13883658
6053A3883658N18901N16303N06773N34526N31334M90042N02658M78513M74224
$$ 13883658 14402559 14918862 15425635 15960161 16491495 16981537 17484195 17962708 18436932
6044A8436932N07286N33913N75245O17541O61415P53796Q33124R06229R85640
$$ 18436932 18944218 19478131 20053376 20670917 21332332 22086128 22919252 23825481 24811121
6035B4811121J108863J234782J365360J503257J632153J725133J846691J889776
$$ 24811121 25919984 27154766 28520126 30023383 31655536 33380669 35227360 37117136
6027C7117136J848398J676797J378223R18310L51995l17224r67849j506013j905729
$$ 37117136 38965534 40642331 42020554 42938864 43290859 42973635 42005786 40499773 38594044
6018C8594044k133170k221932k188075k096353j975164j843585j718569j611407
$$ 38594044 36460874 34238942 32050867 29954514 27979350 26135765 24417196 22805789
6010B2805789j501403j402218j295978j183310j093313j009643r07632q04722
$$ 22805789 21304386 19902168 18606190 17422880 16329567 15319924 14412292 13607570
6002A3607570p48043p00049o17464n80764n40412m91951m54271m14476l66692
$$ 13607570 12859527 12159478 11542014 10961250 10420838 9928887 9474616 9060140 8693448
5993H693448l49392l37742k94422k68941k73310k38898k24005k07866k12038j94228
$$ 8693448 8344056 8006314 7711892 7442951 7169641 6930743 6706738 6498872 6286834 6092606
5983F092606j74274j61782j44429j53590j44814j33475j27164j25524j06720r9260
$$ 6092606 5918332 5756550 5612121 5458531 5313717 5180242 5053078 4927554 4820834 4721574
5973D721574j00979j08901j14768n4235o8381q2829p7439q3161p8641o3208n3725
$$ 4721574 4620595 4511694 4396926 4342691 4274310 4191481 4114042 4030881 3952240 3889032 3835307
5962C835307n3168o5203o2317n3195n9752p1251o7301n4835l0822n8740m1259
$$ 3835307 3782139 3716936 3654619 3601424 3541672 3470421 3403120 3348285 3317463 3258723 3217464
5951C217464k0529n4904n0267m0984n3185l6937m5401l7821m2092k7879m2263
$$ 3217464 3196935 3142031 3091764 3050780 2997595 2960658 2915257 2877436 2835344 2807465 2765202
5940B765202k4924j3836n5862k5733j9963k1610k8538k5807L69j0370l0861m9459
$$ 2765202 2740278 2726442 2670580 2644847 2624884 2603274 2574736 2548929 2549298 2538928 2508067 2458608
5928B458608m0577j3558k6894k0928j1404k9522n800k3196q889j6936j2205k0342
$$ 2458608 2418031 2404473 2377579 2356651 2345247 2315725 2309925 2286729 2277840 2260904 2248699 2228357
5916B228357m4137n620j164j5715j5437J2683j4344N578m454j7037k0336k7479
$$ 2228357 2184220 2178600 2177436 2161721 2146284 2158967 2144623 2150201 2145747 2128710 2108374 2080895
5904B080895n659j5694m053q989k3785j8150j0269j4852j4984m06j4659j0837
$$ 2080895 2075236 2059542 2055489 2046500 2022715 2004565 1994296 1979444 1964460 1964054 1949395 1938558
5892A938558r950m971j0620J0581p577j9935O173J1137m922J1471r713j407p245
$$ 1938558 1928608 1923637 1913017 1923598 1916021 1896086 1902259 1913396 1908474 1919945 1910232 1908825 1901580
5879A901580L455j501O325r485L280q156J3212J3081q178J9157j43O719r83L159
$$ 1901580 1905035 1903534 1909859 1900374 1903654 1895498 1908710 1921791 1913613 1932770 1932627 1939346 1938363 1941522
5865A941522o908P585J3527K73J6603P684k356K239J6368O702K168L3707Q142
$$ 1941522 1934614 1942199 1955726 1955999 1972602 1980286 1977930 1980169 1996537 2003239 2005407 2039114 2047256
5852B047256K092J7968J6819J559L828O211K2707L1486K1668K2506J9788J8356
$$ 2047256 2049348 2067316 2084135 2085694 2089522 2095733 2118440 2149926 2171594 2194100 2213888 2232244
5840B232244K4202K1015K3806M0280J9847K4084M0115M4097K5955L5196L7808
$$ 2232244 2256446 2277461 2301267 2341547 2361394 2385478 2425593 2469690 2495645 2530841 2568649
5829B568649K6211O951J9231K6604L5898K2770J7786L0078L6063L9759K3135L8611
$$ 2568649 2594860 2601811 2621042 2647646 2683544 2706314 2724100 2754178 2790241 2830000 2853135 2891746
5817B891746M9197M3945L6252M9267L7452K3862K3084L8177K0092Q187K5069O238
$$ 2891746 2940943 2984888 3021140 3070407 3107859 3131721 3154805 3192982 3213074 3221261 3246330 3252568
5805C252568K1675L729n452M816K5963J9249J9256J4633J0815K6335J0500M5671
$$ 3252568 3274243 3277972 3272520 3277336 3303299 3322548 3341804 3356437 3367252 3393587 3404087 3449758
5793C449758M5961M6446L0531K7827N4250N8890M5082M9581N4741O9113L9923
$$ 3449758 3495719 3542165 3572696 3600523 3654773 3713663 3758745 3808326 3863067 3932180 3972103
5782C972103N5034N2709L5209K6197J7073R056L2537J2941K0041R481M590M64
$$ 3972103 4027137 4079846 4115055 4141252 4158325 4167381 4199918 4212859 4232900 4242381 4246971 4247435
5770D247435J9851j0586J871q006O34J0775j5685m97j0882j8502j5329j5556k5930
$$ 4247435 4267286 4256700 4258571 4250565 4251199 4261974 4246289 4245792 4234910 4216408 4201079 4185523 4159593
5757D159593Q171k4595k0447l745k7580k9895k656o458j5726j4203J8647Q674
$$ 4159593 4167764 4143169 4122722 4118977 4091397 4061502 4058846 4052388 4036662 4022459 4041106 4049780
5745D049780J296N3K186j12j1124j8050k8145l8610j7622l1992o3520l1683o1902
$$ 4049780 4051076 4051129 4053315 4053203 4042079 4024029 3995884 3957274 3939652 3907660 3844140 3812457 3750555
5732C750555o8805m4449o1513n2682m8980m8293o4986o8308l5533m3858l9716
$$ 3750555 3681750 3637301 3575788 3523106 3474126 3425833 3360847 3292539 3257006 3213148 3173432
5721C173432n3311n0886l7707m8169n2081l0947n3403n0386k6131l0743l6972
$$ 3173432 3120121 3069235 3031528 2983359 2931278 2900331 2846928 2796542 2770411 2739668 2702696
5710B702696l7125l8248l6597l8335j8392j1074k4653m6423j3087k4337k9331
$$ 2702696 2665571 2627323 2590726 2552391 2533999 2522925 2498272 2451849 2438762 2414425 2385094
5699B385094j2782n447q961m8985k5130k4110n887j2812j0909M479O054l048J2066
$$ 2385094 2372312 2366865 2357904 2308919 2283789 2259679 2253792 2240980 2230071 2234550 2240604 2237556 2249622
5686B249622n825K1623K9198K2865J6385J9640J6195N094L896j3335j6318o711
$$ 2249622 2243797 2265420 2294618 2317483 2333868 2353508 2369703 2374797 2378693 2365358 2349040 2342329
5674B342329j4314J4259m844n10k7814j6449j17R846j7149j0210R234P004J2291
$$ 2342329 2328015 2342274 2337430 2336920 2309106 2292657 2292540 2302386 2285237 2275027 2284261 2291265 2303556
5661B303556L915J8994J6354K9229L5000J0119M3387O1127O0604N0741O4913P0192
$$ 2303556 2307471 2326465 2342819 2372048 2407048 2417167 2460554 2521681 2582285 2633026 2697939 2768131
5649B768131M1595L2353Q82k7018n3281o1988o3058k8869J425j6985l0356Q416
$$ 2768131 2809726 2842079 2842961 2815943 2762662 2700674 2637616 2608747 2610172 2593187 2562831 2571247
5637B571247l1855k3963k073l802o233J8991P454k765J9953K4809M3209K5990
$$ 2571247 2539392 2515429 2513356 2509554 2503321 2522312 2529766 2527001 2546954 2571763 2614972 2640962
5625B640962M4746P5342O1646P5386Q7178J07537R3501R8947R7313R1826M7941
$$ 2640962 2685708 2761050 2822696 2898082 2985260 3092797 3186298 3285245 3382558 3474384 3522325
5614C522325J5867l641j1687Q883M777Q764o101O74j1673q384J457l39J5177K1569
$$ 3522325 3538192 3534551 3522864 3531747 3536524 3545288 3539187 3539861 3528188 3519804 3521261 3520922 3536099 3557668
5600C557668J3656K3520P832l703J5221K1229J4708K3489K9599L9687M9781O5485
$$ 3557668 3571324 3594844 3602676 3598973 3614194 3635423 3650131 3673620 3703219 3742906 3792687 3858172
5588C858172P2246N7368N7043K3898K9432l050o495M4J6612K2137K6392L5226
$$ 3858172 3930418 3987786 4044829 4068727 4098159 4095109 4088614 4088658 4105270 4127407 4153799 4189025
5576D189025K2173L3419M2110N7644O2518P1891Q8182Q1350J03110J43179J59415
$$ 4189025 4211198 4244617 4286727 4344371 4406889 4478780 4566962 4648312 4751422 4894601 5054016
5565E054016J56199J85299J90119J55322J15834K6581l7344o2779o5280l7432
$$ 5054016 5210215 5395514 5585633 5740955 5856789 5883370 5846026 5783247 5717967 5680535
5555E680535j9170l940J5901M5346M8744L9741P1795O5590Q7622J01440J11071
$$ 5680535 5661365 5657425 5673326 5718672 5767416 5807157 5878952 5944542 6032164 6133604 6244675
5544F244675J24367J41290J77960J86478K05008J91935J70036J41947J06217N3113
$$ 6244675 6369042 6510332 6688292 6874770 7079778 7271713 7441749 7583696 7689913 7743026
5534G743026J7746K2798O5437O9746N1491P9561R2619Q3827P8379R1599Q2639
$$ 7743026 7760772 7783570 7849007 7918753 7970244 8049805 8142424 8226251 8304630 8396229 8478868
5523H478868L8368j0921p7133j12155j32142q8202o4725m0869p336L9350N9996
$$ 8478868 8517236 8506315 8429182 8317027 8184885 8096683 8031958 7991089 7983753 8023103 8083099
5512H083099P9827R0113P3211N6412K0121k6484o1492j31305j54839j51584j54642
$$ 8083099 8162926 8253039 8326250 8382662 8402783 8376299 8314807 8183502 8028663 7877079 7722437
5501G722437j26089j15585r8786p2134n8973q2002o7825p5766r2130j36474j60469
$$ 7722437 7596348 7480763 7381977 7309843 7250870 7168868 7101043 7025277 6933147 6796673 6636204
5490F636204j95473j57592j22606j08941j34440j14012j06147j29204j39575j31410
$$ 6636204 6440731 6283139 6160533 6051592 5917152 5803140 5696993 5567789 5428214 5296804
5480E296804j50060j58010j68914j55980j56456j58447j35809j18794j42471j70803
$$ 5296804 5146744 4988734 4819820 4663840 4507384 4348937 4213128 4094334 3951863 3781060
5470C781060j48617j38175j19017q9821q1012j03599p6772n3645l3804m3812n5623
$$ 3781060 3632443 3494268 3375251 3285430 3204418 3100819 3024047 2970402 2936598 2892786 2837163
5459B837163l2266k4791k7544j6476m066j8508K033j8283O294Q811J728K539K3926
$$ 2837163 2804897 2780106 2752562 2736086 2732020 2713512 2715545 2697262 2703556 2712367 2714095 2716634 2740560
5446B740560j0470N17L6349k130k7915l6944n6585n7754k2873k6082Q890l0864
$$ 2740560 2730090 2730607 2766956 2764826 2736911 2699967 2643382 2585628 2562755 2536673 2545563 2514699
5434B514699r01j9623n836k7488k7231j1143k9753k4978j4522j9192l5181l1567
$$ 2514699 2513798 2494175 2488339 2460851 2433620 2422477 2392724 2367746 2353224 2334032 2298851 2267284
5422B267284j1292j962k5168j4459Q46K1898R798k353K2476K9533J4223K3408
$$ 2267284 2255992 2254030 2228862 2214403 2215249 2237147 2246945 2244592 2267068 2296601 2310824 2334232
5410B334232J7893L0438K7507N6347K9034M2784N9973K8679L8950N3586N1522
$$ 2334232 2352125 2382563 2410070 2466417 2495451 2538235 2598208 2626887 2665837 2719423 2770945
5399B770945M5125L8017L9307J6319J2771K1470R044J092k3726l632j7920j4728
$$ 2770945 2816070 2854087 2893394 2909713 2922484 2943954 2952998 2954090 2930364 2926732 2908812 2894084
5387B894084k237j3944j7084j5336j7970k63j2560q975l620m0548k2382L448K231
$$ 2894084 2891847 2877903 2860819 2845483 2827513 2827250 2814690 2805715 2802095 2761547 2739165 2742613 2744844
5374B744844j9866q628J535k348j3480k1178m615k115Q572n030o714j9392k9398
$$ 2744844 2724978 2716350 2717885 2715537 2702057 2680879 2676264 2674149 2682721 2677691 2670977 2651585 2622187
5361B622187j6036k1149l1259l5337k8206j9511m4839m6510l7513l3650k6528
$$ 2622187 2606151 2585002 2553743 2518406 2490200 2470689 2425850 2379340 2341827 2308177 2281649
5350B281649l4954n9354m1032n1238k5975k1269j2530k5306j3253k2358j3842
$$ 2281649 2246695 2187341 2146309 2095071 2069096 2047827 2035297 2009991 1996738 1974380 1960538
5339A960538o056r600j4708m807j6553o271L626r580m781N542j0756k504J4932
$$ 1960538 1954482 1944882 1930174 1925367 1908814 1902543 1906169 1896589 1891808 1897350 1886594 1884090 1899022
5326A899022M439O032j0871J0707J4583k6M076K3236K2423K5037J2568K6313J1576
$$ 1899022 1903461 1909493 1898622 1909329 1923912 1923886 1927962 1951198 1973621 1998658 2011226 2037539 2049115
5313B049115J9812K3540L3101K0978L712K3511K6480m05K065p524j1122p971j5217
$$ 2049115 2068927 2092467 2125568 2146546 2150258 2173769 2200249 2199844 2201909 2194385 2183263 2175292 2160075
5300B160075k5311m803k9591j6582j8160k2001j0089k340j9891j7726J4471J0768
$$ 2160075 2134764 2129961 2100370 2083788 2065628 2043627 2033538 2031198 2011307 1993581 2008052 2018820
5288B018820k0501j1970J6094J7357J7131J4372J6835K2149N1479L7828M1307
$$ 2018820 1998319 1986349 2002443 2019800 2036931 2051303 2068138 2090287 2141766 2179594 2220901
5277B220901L7271R584P052q586k3847m7737l9311k9687M14k2136l942p915k3194
$$ 2220901 2258172 2267756 2274808 2266222 2242375 2194638 2155327 2125640 2126054 2103918 2099976 2092061 2068867
5264B068867L1221J3191J2757K1978L2453J5968L8343N5185L9561M8462K8573
$$ 2068867 2100088 2113279 2126036 2148014 2180467 2196435 2234778 2289963 2329524 2377986 2406559
5253B406559N5501M2200M2866N4546N3926N2999L7878K9813J0170J9959j4325
$$ 2406559 2462060 2504260 2547126 2601672 2655598 2708597 2746475 2776288 2786458 2806417 2792092
5242B792092j2703k3450l646K4148J4238L7139L8066N4142P1567N2887L2039M7067
$$ 2792092 2779389 2755939 2752293 2776441 2790679 2827818 2865884 2920026 2991593 3044480 3076519 3123586
5230C123586L6625K1024j3850j2146m681j9629l621j0087J805J7060J1369K8138
$$ 3123586 3160211 3181235 3167385 3155239 3150558 3130929 3127308 3117221 3119026 3136086 3147455 3175593
5218C175593L0840M3862L7746M6845O8597Q2795Q7237J20142J44627J42194J43198
$$ 3175593 3206433 3250295 3288041 3334886 3403483 3486278 3573515 3693657 3838284 3980478 4123676
5207D123676J17979J13850O4329N3341K4066Q701Q023k730J525j1387k7824m350
$$ 4123676 4241655 4355505 4419834 4473175 4497241 4505942 4513965 4511235 4512760 4501373 4473549 4469199
5195D469199l845M267J6611M2499L4444L6124K1652o114o7218p4160p3820m8468
$$ 4469199 4465354 4469621 4486232 4528731 4563175 4599299 4620951 4614837 4547619 4473459 4399639 4351171
5183D351171k8784j5268m5465j6619J1147L33K1834K3867k105J733J4821o203
$$ 4351171 4322387 4307119 4261654 4245035 4256182 4256515 4278349 4302216 4300111 4301844 4316665 4310462
5171D310462K5327J5622P036l69J522L220j766k42J0286o294j4271k0982j4548
$$ 4310462 4335789 4351411 4358447 4358078 4359600 4362820 4361054 4360812 4371098 4364804 4350533 4329551 4315003
5158D315003m2352l6858l2244l7040k0159k7125m3189l8898n9314o0582l8411
$$ 4315003 4272651 4235793 4203549 4166509 4146350 4119225 4076036 4037138 3977824 3917242 3878831
5147C878831l1301l3499k1185l9841j7580k5168j2763k268J7647K0779J1645J4900
$$ 3878831 3847530 3814031 3792846 3753005 3735425 3710257 3697494 3695226 3712873 3733652 3745297 3760197
5135C760197K9257n199K4459J7915k802J8644j0132Q489M0902K6129J5851K4665
$$ 3760197 3789454 3784255 3808714 3826629 3823827 3842471 3832339 3840828 3881730 3907859 3923710 3948375
5123C948375p927K9409K9120J6490K1439K4620M0267N1002L5908M5859K5384M0768
$$ 3948375 3940448 3969857 3998977 4015467 4036906 4061526 4101793 4152795 4188703 4234562 4259946 4300714
5111D300714O6422P2855O4051O5683N4850O9061P6194N3288N5635M6194N2972
$$ 4300714 4367136 4439991 4504042 4569725 4624575 4693636 4769830 4823118 4878753 4924947 4977919
5100D977919L2476J2252K6021J110L822l63o788j4809p469P606N117j5702R751
$$ 4977919 5010395 5022647 5048668 5049778 5053600 5053237 5046449 5031640 5024171 5031777 5036894 5021192 5030943
5087E030943k38L493q266L82K8722J003p166j1725m276Q336R172J3548L5383J9833
$$ 5030943 5030705 5034198 5025932 5026314 5055036 5056039 5048873 5037148 5032872 5041208 5050380 5063928 5099311 5119144
5073E119144O405K3154Q378k1291l7562n0355n5430p1653o8514q3561p9288n1295
$$ 5119144 5125549 5148703 5157081 5135790 5098228 5047873 4992443 4920790 4852276 4768715 4689427 4638132
5061D638132o0469m9396k7558k0904k1221k0048o026j9866j5275k0777k6103l8986
$$ 4638132 4577663 4528267 4500709 4479805 4458584 4438536 4432510 4412644 4397369 4376592 4350489 4311503
5049D311503l5074j6675L949l719J2574N601K3751J4531O477o648j0161o131j5705
$$ 4311503 4276429 4259754 4263703 4259984 4272558 4278159 4301910 4316441 4322918 4316270 4306109 4299978 4284273
5036D284273j9736k7696O73K2766K3130M1451M2524N9298N7561O1855N5739L9282
$$ 4284273 4264537 4236841 4237514 4260280 4283410 4324861 4367385 4426683 4484244 4546099 4601838 4641120
5024D641120M3965M6776M0779M5130K0236K3855J6150J1400J7972K4277K9483
$$ 4641120 4685085 4731861 4772640 4817770 4838006 4861861 4878011 4889411 4907383 4931660 4961143
5013D961143M8013N3918L0028K3921K1997L5682L4802M6218M6867L6957L0438
$$ 4961143 5009156 5063074 5093102 5117023 5139020 5174702 5209504 5255722 5302589 5339546 5369984
5002E369984N8218N1113O5556P8579O6447O6434O8175M8726P4614Q2346P0066
$$ 5369984 5428202 5479315 5544871 5623450 5689897 5756331 5824506 5873232 5947846 6030192 6100258
4991F100258Q3617P4202Q0936J07623R5844J10741J00623J05778J11475J21223
$$ 6100258 6183875 6258077 6339013 6446636 6542480 6653221 6753844 6859622 6971097 7092320
4981G092320J13247J27321J45640J55993J40703J54688J20427J23602J30779J38876
$$ 7092320 7205567 7332888 7478528 7634521 7775224 7929912 8050339 8173941 8304720 8443596
4971H443596J36771J30993R4503J20958J26405J23450J80012J88522K09506K15158
$$ 8443596 8580367 8711360 8805863 8926821 9053226 9176676 9356688 9545210 9754716 9969874
4961I969874J98245J76319J79066J69789K05309J97342J96254K03259K19072J98777
$$ 9969874 10168119 10344438 10523504 10693293 10898602 11095944 11292198 11495457 11714529 11913306
4951A1913306K20370K67163L17444L63633L92989L99388M10335M30195M46569
$$ 11913306 12133676 12400839 12718283 13081916 13474905 13874293 14284628 14714823 15161392
4942A5161392M44621M92327N24214N56625N89290N89836O37067O90960P33719
$$ 15161392 15606013 16098340 16622554 17179179 17768469 18358305 18995372 19686332 20420051
4933B0420051P66400Q24725Q63352Q97215R82688J016709J065538J141814J217875
$$ 20420051 21186451 22011176 22874528 23771743 24754431 25771140 26836678 27978492 29196367
4924B9196367J304959J385919J492966J641034J789785J953000K157959K341932
$$ 29196367 30501326 31887245 33380211 35021245 36811030 38764030 40921989 43263921
4916D3263921K523126K721943K925642L117845L326398L559066L830485M124481
$$ 43263921 45787047 48508990 51434632 54552477 57878875 61437941 65268426 69392907
4908F9392907M511278N012845N578476O342425P407009Q534683R775235J1162736
$$ 69392907 73904185 78917030 84495506 90837931 98244940 106779623 116554858 127717594
4900A27717594J2650777J4017989J4981648J5743698J5431682J2592705P392770
$$ 127717594 140368371 154386360 169368008 185111706 200543388 213136093 220528863
4893B20528863K164254o80105l276116n239881l200263P18987M143798O923702
$$ 220528863 222693117 222013012 218736896 213497015 210296752 211015739 215159537 222083239
4885B22083239R046918J0699946J1655617J2009880J1639735R524084M392867
$$ 222083239 231130157 241830103 253485720 265495600 277135335 286659419 291052286
4878B91052286l147209j0021528j4952007j6939452j5688648j3651164j2277640
$$ 291052286 287905077 277883549 262931542 245992090 230303442 216652278 204374638
4871B04374638j1289000j0538323r920093r454798r145741q905084q572765q089188
$$ 204374638 193085638 182547315 172627222 163172424 154026683 145121599 136548834 128459646
4863A28459646p490023o787400o122217n593415n135369m721649m361548l975801
$$ 128459646 120969623 114182223 108060006 102466591 97331222 92609573 88248025 84272224
4855H4272224l620129l334957l112995k918483k750004k586528k412815k257236
$$ 84272224 80652095 77317138 74204143 71285660 68535656 65949128 63536313 61279077
4847F1279077k092305j961950j861704j806779j727768j683160j619764j518849
$$ 61279077 59186772 57224822 55363118 53556339 51828571 50145411 48525647 47006798
4839D7006798j442934j379102j308463j273967j239216j167319j129358j058851
$$ 47006798 45563864 44184762 42876299 41602332 40363116 39195797 38066439 37007588
4831C7007588r70777r35262q76945q01485p61370p27123o77348o73226o97614
$$ 37007588 36036811 35101549 34224604 33423119 32661749 31934626 31257278 30584052 29886438
4822B9886438o94284o86026o66698o48750o29058n93160n78727n70244n40680
$$ 29886438 29192154 28506128 27839430 27190680 26561622 25968462 25389735 24819491 24278811
4813B4278811n30358n26173n09854m62541m34059m24467m46516m48645m53816
$$ 24278811 23748453 23222280 22712426 22249885 21815826 21391359 20944843 20496198 20042382
4804B0042382m45388m44902m09125l50268l27517l35348l00655l08910k73108
$$ 20042382 19596994 19152092 18742967 18392699 18065182 17729834 17429179 17120269 16847161
4795A6847161k68657k45307k15330j52594j65840j43812j34603j07362r1464j03047
$$ 16847161 16578504 16333197 16117867 15965273 15799433 15655621 15521018 15413656 15322192 15219145
4785A5219145q0994o8429n8746n4028n5156m8640p2336r5835j20155j27435j38966
$$ 15219145 15138151 15069722 15010976 14956948 14901792 14853152 14780816 14684981 14564826 14437391 14298425
4774A4298425j34526j12640j14785q5966q0393r6150r5561p6608o7706p8247q7432
$$ 14298425 14163899 14051259 13936474 13850508 13770115 13673965 13578404 13501796 13434090 13355843 13268411
4763A3268411q3705n5130o4887r4082q7009n8750o0214q6112q5140p9957p8313
$$ 13268411 13184706 13129576 13064689 12970607 12883598 12824848 12764634 12678522 12593382 12513425 12435112
4752A2435112q5690o9522r7054n3588n6010l2964k6120j5859j2702j3204l0725
$$ 12435112 12349422 12279900 12182846 12129258 12073248 12040284 12014164 11998305 11985603 11972399 11941674
4741A1941674k0736n5994p9875p3010o7334q0344p6159p1849o1617m0790l9769
$$ 11941674 11920938 11864944 11785069 11712059 11644725 11564381 11488222 11416373 11354756 11313966 11274197
4730A1274197m5570k8952k4918l1777k6938k5704m0389k7626n1534n1621n9439
$$ 11274197 11228627 11199675 11174757 11142980 11116042 11090338 11049949 11022323 10970789 10919168 10859729
4719A0859729k7868k8859q678j75N262n131k8677l4565m5540m4114l1057n2682
$$ 10859729 10831861 10803002 10794324 10794149 10799411 10794280 10765603 10731038 10685498 10641384 10610327 10557645
4707A0557645m7912l8121k5086o096r712P244J4699K5558M0736K7863L7045M8335
$$ 10557645 10509733 10471612 10446526 10440430 10430718 10437962 10452661 10478219 10518955 10546818 10583863 10632198
4695A0632198M0663N0913N4863Q5465R3497P9489N9132R4355R5364R3618P1500
$$ 10632198 10672861 10723774 10778637 10864102 10957599 11037088 11096220 11190575 11285939 11379557 11451057
4684A1451057O2662M8923N3151l107m734Q007k105l3231l1k4714m0744l8393l4534
$$ 11451057 11513719 11562642 11615793 11612686 11607952 11615959 11613854 11580623 11580592 11555878 11515134 11476741 11442207
4671A1442207M675J371J0931K5097L4490M8109O3281Q3836R7030J22089J29699
$$ 11442207 11446882 11448253 11459184 11484281 11518771 11566880 11630161 11713997 11811027 11933116 12062815
4660A2062815J22547J49407J58531J56111J76354J60692J76459J94737J93245
$$ 12062815 12185362 12334769 12493300 12649411 12825765 12986457 13162916 13357653 13550898
4651A3550898J81187J97779K08549K24105K49202K54789K74455K90946K90417
$$ 13550898 13732085 13929864 14138413 14362518 14611720 14866509 15140964 15431910 15722327
4642A5722327L29618L55187L52336L80835M34427M65851M58887N41012N63407
$$ 15722327 16051945 16407132 16759468 17140303 17574730 18040581 18499468 19040480 19603887
4633A9603887O05697O57369O87928P43997P75315Q49673R01340R36153R94600
$$ 19603887 20209584 20866953 21554881 22298878 23074193 23923866 24825206 25761359 26755959
4624B6755959J083604J124166J217328J295775J353621J499075J583757J713345
$$ 26755959 27839563 28963729 30181057 31476832 32830453 34329528 35913285 37626630
4616C7626630J864100K027869K191869K377217K587862K824362L115794L408451
$$ 37626630 39490730 41518599 43710468 46087685 48675547 51499909 54615703 58024154
4608E8024154L693900M061596M497594M951679N456611O025981O603811P238390
$$ 58024154 61718054 65779650 70277244 75228923 80685534 86711515 93315326 100553716
4600A00553716P857864Q421198Q793031Q840220Q351131P138297N058566K104792
$$ 100553716 108411580 116832778 125625809 134466029 142817160 149955457 155014023 157118815
4592A57118815j416049m788879p070486q010930q034826p691599p207824o672825
$$ 157118815 155702766 150913887 143843401 135832471 127797645 120106046 112898222 106225397
4584A06225397o113205n659351n234133m853899m477583m078250l651109l211731
$$ 106225397 100112192 94452841 89218708 84364809 79887226 75808976 72157867 68946136
4576F8946136k748287k360308k032778j713726j448712j265849j098974r72186
$$ 68946136 66197849 63837541 61804763 60091037 58642325 57376476 56277502 55305316
4568E5305316q60001p00249n25763m02538k40191p6640J12976L36361N55646Q16874
$$ 55305316 54445315 53745066 53219303 52816765 52576574 52499934 52612910 52949271 53504917 54321791
4558E4321791J046631J308289J569659J833157K116506K389975K669792K981696
$$ 54321791 55368422 56676711 58246370 60079527 62196033 64586008 67255800 70237496
4550G0237496L281995L621729M017605M468530M914248N450488O011554O619903
$$ 70237496 73519491 77141220 81158825 85627355 90541603 95992091 102003645 108623548
4542A08623548P224482P811282Q249367Q427218Q162097P291132N674030L321982
$$ 108623548 115848030 123659312 131908679 140335897 148497994 155789126 161463156 164785138
4534A64785138M65633k422568n068110p228144q628110r250649r128091q498817
$$ 164785138 165250771 162828203 157760093 150531949 141903839 132653190 123525099 115026282
4526A15026282p624590o763368o059706n464689m919593m428674m023029l658750
$$ 115026282 107401692 100638324 94578618 89113929 84194336 79765662 75742633 72083883
4518G2083883l365781l089224k890698k745115k628087k546606k496506k440212
$$ 72083883 68718102 65628878 62738180 59993065 57364978 54818372 52321866 49881654
4510D9881654k310189k182856k049396j892524j741295j607338j496074j359250
$$ 49881654 47571465 45388609 43339213 41446689 39705394 38098056 36601982 35242732
4502C5242732j254093j159392j058167r70572r07870q26565p63096p10284o32179
$$ 35242732 33988639 32829247 31771080 30800508 29892638 29066073 28302977 27592693 26960514
4493B6960514o09717n41690n27037m72334m51804m18354l53809l38805l02334
$$ 26960514 26350797 25809107 25282070 24809736 24357932 23939578 23585769 23246964 22944630
4484B2944630k65890k37135k13021j83268j50797j37377q1397m9304k5530L3344
$$ 22944630 22678740 22441605 22228584 22045316 21894519 21757142 21675745 21626441 21600911 21634255
4474B1634255O5914Q8431J00161P8996O1584O726q8901j55844k27345k89246l06113
$$ 21634255 21700169 21788600 21888761 21967757 22029341 22036067 21947166 21791322 21563977 21274731 20968618
4463B0968618l37774l21601k62777k03085j53393j07275p8633l2366K3048L1099
$$ 20968618 20630844 20309243 20046466 19843381 19689988 19582713 19504080 19471714 19494762 19525861
4453A9525861L9008J9806J0121k0544j06178j84428k21498k41113k45343k20410
$$ 19525861 19564869 19584675 19594796 19574252 19468074 19283646 19062148 18821035 18575692 18355282
4443A8355282k16137j99736k14990k23233k63755k75427l16379l21949l10534
$$ 18355282 18139145 17939409 17724419 17501186 17237431 16962004 16645625 16323676 16013142
4434A6013142l21309k84936k75176k87118k80634k57449k55943k46561k26738
$$ 16013142 15691833 15406897 15131721 14844603 14563969 14306520 14050577 13804016 13577278
4425A3577278k01311j89371j41507j32956j40797j10710p7055n1109l9033j8137
$$ 13577278 13375967 13186596 13045089 12912133 12771336 12660626 12583571 12532462 12493429 12475292
4415A2475292K779N100N0064N3011Q0542P1903Q7805J06006R2079Q9101O1888
$$ 12475292 12478071 12483171 12533235 12586246 12666788 12738691 12826496 12932502 13024581 13113682 13175570
4404A3175570J6582l4381k5802o0814r4884r0545r9098j16534j14248j47401j91522
$$ 13175570 13192152 13157771 13131969 13071155 12976271 12885726 12786628 12670094 12555846 12408445 12216923
4393A2216923k32350k66919k63955k37492k22336j78635j45530j29019j23866
$$ 12216923 11984573 11717654 11453699 11216207 10993871 10815236 10669706 10540687 10416821
4384A0416821o7596l5430k7985R278J3301M1041O6194N8175P5028O2222P2785
$$ 10416821 10349225 10313795 10285810 10295088 10308389 10349430 10415624 10473799 10548827 10611049 10683834
4373A0683834K4196J1506J5505k2742n4898m5692p0460p4319p3481r3554r0519
$$ 10683834 10708030 10719536 10735041 10712299 10657401 10611709 10541249 10466930 10393449 10299895 10209376
4362A0209376n9439n7948o9721p2255n5542m2869m3339j8272k6913l2504l6362
$$ 10209376 10149937 10091989 10022268 9950013 9894471 9851602 9808263 9789991 9763078 9730574 9694212
4351I694212n3667q7660o8031q3884l3779l3030j9489k39m303J75l843O286K3480
$$ 9694212 9640545 9552885 9484854 9400970 9367191 9334161 9314672 9314433 9310130 9310305 9306462 9312748 9336228
4338I336228P142J3668J9778K8299L0863O9041N4066P6674Q9596Q4258Q9215Q5568
$$ 9336228 9343370 9357038 9376816 9405115 9435978 9505019 9559085 9635759 9725355 9809613 9898828 9984396
4326I984396J01357J26003J10515J14571J07006J29056J21410J28777J11237J16431
$$ 9984396 10085753 10211756 10322271 10436842 10543848 10672904 10794314 10923091 11034328 11150759
4316A1150759J30657J08751J07533J18032J35553J10066J20428R9145Q6640R3135
$$ 11150759 11281416 11390167 11497700 11615732 11751285 11861351 11981779 12080924 12167564 12260699
4306A2260699P9800Q0092Q8023O8007N8144P1934L6673J9328K2351L892k5967
$$ 12260699 12340499 12420591 12508614 12576621 12634765 12706699 12743372 12762700 12785051 12788943 12762976
4295A2762976k2694m3393q6481p8631r3958j12700j24021j24740j44945j60865
$$ 12762976 12740282 12696889 12610408 12531777 12437819 12325119 12201098 12076358 11931413 11770548
4285A1770548k04722k13050k45584k28124k39812k54982k45463k17047k58556
$$ 11770548 11565826 11352776 11107192 10879068 10639256 10384274 10138811 9921764 9663208
4276I663208k39176k23717k26225k27080k27864k02897k17877k34314k01637j89665
$$ 9663208 9424032 9200315 8974090 8747010 8519146 8316249 8098372 7864058 7662421 7472756
4266G472756j90418j62621j78453j71388j52973j34970j33667j31546j30917j06653
$$ 7472756 7282338 7119717 6941264 6769876 6616903 6481933 6348266 6216720 6085803 5979150
4256E979150r3664q7918r8648o6036o5965p7738p6970q7729r3579j08886j05202
$$ 5979150 5885486 5797568 5698920 5632884 5566919 5489181 5412211 5324482 5230903 5122017 5016815
4245E016815j20726j22466j33716j10470j13588j21856j02680j14719j07837j03543
$$ 5016815 4896089 4773623 4639907 4529437 4415849 4293993 4191313 4076594 3968757 3865214
4235C865214q7583r4349r2541o9958j00896p8813o0668q0650q9037m3669m7573
$$ 3865214 3777631 3683282 3590741 3520783 3419887 3341074 3280406 3199756 3110719 3067050 3019477
4224C019477n6363o3169n7277m9013l3106n6743m2730k7785l5670m3789l7509
$$ 3019477 2963114 2899945 2842668 2793655 2760549 2703806 2661076 2633291 2597621 2553832 2516323
4213B516323k7246l2105l4076l5340l5928k5672j4854k1384j4093m6721k6054
$$ 2516323 2489077 2456972 2422896 2387556 2351628 2325956 2311102 2289718 2275625 2228904 2202850
4202B202850k3163j9821j7103j4722q812l5848k3329k2889k3777j3595q454q395
$$ 2202850 2179687 2159866 2142763 2128041 2119229 2083381 2060052 2037163 2013386 1999791 1991337 1982942
4190A982942l8934k6999j8906k6185r332p801n854j2997j1711J20l7497j2631
$$ 1982942 1944008 1917009 1898103 1871918 1862586 1854785 1848931 1835934 1824223 1824343 1786846 1774215
4178A774215J1620j6273l1857k124j5754k9535k1399j0269k2017o513j2552M420
$$ 1774215 1785835 1769562 1737705 1735581 1719827 1690292 1668893 1658624 1636607 1630094 1617542 1621962
4166A621962j4019k9623q03O367k7414j8304n128p479k755j4097l4846l9074P020
$$ 1621962 1607943 1578320 1577517 1583884 1556470 1538166 1533038 1525559 1522804 1508707 1473861 1434787 1441807
4153A441807Q294k9728r566Q318p581j5344j9303m760p339j3019j3436j0082p629
$$ 1441807 1450101 1420373 1410807 1419125 1411544 1396200 1376897 1372137 1364798 1351779 1338343 1328261 1320632
4140A320632j1775j8901p535P671n44m014J0706k5344n587N877o100L851j5332
$$ 1320632 1308857 1289956 1282421 1290092 1289548 1285534 1296240 1270896 1265309 1271186 1265086 1268937 1253605
4127A253605n44n474L002O467L606o829k565l905j8642Q737K387N222M602k598
$$ 1253605 1253061 1247587 1250589 1257056 1260662 1253833 1251268 1247363 1228721 1237458 1239845 1245067 1249669 1247071
4113A247071L231l4111j027R727p347j782O926L290j4034l876p386J3689J6353
$$ 1247071 1250302 1216191 1215164 1224891 1217544 1215762 1222688 1225978 1211944 1208068 1200682 1214371 1230724
4100A230724j1981L437O191J0267M470j8066O430J0078J3300j7339k34K140m363
$$ 1230724 1218743 1222180 1228371 1238638 1243108 1225042 1231472 1241550 1254850 1237511 1237277 1239417 1235054
4087A235054k2881Q570K8539q528R726L0880N686n41K054M764J6277q205J3374
$$ 1235054 1212173 1220743 1249282 1240754 1250480 1281360 1287046 1286505 1288559 1293323 1309600 1301395 1314769
4074A314769J8322p106J8401J5234P058o32J7606K346n576j162j358k2429p370
$$ 1314769 1333091 1325985 1344386 1359620 1366678 1366046 1383652 1385998 1380422 1379260 1377902 1355473 1348103
4061A348103o87n905P531j629l5660k8667J1087J8736j5286o19k7752k1736K97
$$ 1348103 1347416 1341511 1349042 1347413 1311753 1283086 1294173 1312909 1297623 1297004 1269252 1247516 1247813
4048A247813j2474n173j275j2760j3654J0230m626j0978j8314o01n83p447l922
$$ 1247813 1235339 1230166 1228891 1216131 1202477 1212707 1208081 1197103 1178789 1178188 1177605 1170158 1166236
4035A166236Q661k3519j0234K2596Q154k0635K871j3552K9232J4319J4756O419
$$ 1166236 1174897 1151378 1141144 1163740 1171894 1151259 1154130 1140578 1169810 1184129 1198885 1205304
4023A205304l565P835K273N83Q261n081n129J9453J032K4662R499r279p49o319
$$ 1205304 1201739 1209574 1211847 1212430 1220691 1215610 1210481 1229934 1230966 1255628 1265127 1255848 1255099 1248780
4009A248780n076n795J3529J3364K865k5322L251J288q182Q39j6102k0769l586
$$ 1248780 1243704 1237909 1251438 1264802 1267667 1242345 1245596 1246884 1238702 1239541 1223439 1202670 1199084
3996A199084O82J423j2373j0608P690j3822N678o072k124p68j0414j4333Q125
$$ 1199084 1199766 1201189 1188816 1178208 1185898 1172076 1177754 1171682 1169558 1168790 1158376 1144043 1152168
3983A152168j3729n382j5289M022J5689l913Q861n609j2253J305P079K1785K173
$$ 1152168 1138439 1133057 1117768 1121790 1137479 1133566 1142427 1136818 1124565 1125870 1132949 1154734 1156907
3970A156907O405N561n581L7014K9407K3067P297L4658L2292J8846K8913P369
$$ 1156907 1163312 1168873 1163292 1200306 1229713 1252780 1260077 1294735 1327027 1345873 1374786 1382155
3958A382155K0287K8064K2946j387M032R432L1047K6054K9256R412K6745J3596
$$ 1382155 1402442 1430506 1453452 1452065 1456097 1465529 1496576 1522630 1551886 1561298 1588043 1601639
3946A601639L809J4686Q126J8763L531K3387M896J1381O887J3891L940l25L026
$$ 1601639 1605448 1620134 1628260 1647023 1650554 1673941 1678837 1690218 1697105 1710996 1714936 1714611 1717637
3933A717637Q510J3194N564j3442j4860N195n533r255K5952J5717Q038q145m580
$$ 1717637 1726147 1739341 1744905 1731463 1716603 1721798 1716265 1707010 1732962 1748679 1756717 1748572 1743992
3920A743992J1324Q4L4067J4015N088J8908J7949M4065K1396Q836J8097N2372
$$ 1743992 1755316 1755400 1789467 1803482 1808570 1827478 1845427 1889492 1910888 1919724 1937821 1990193
3908A990193M1572L0668L9121M3201N5505N2020L7305L7319M4007M6972L5419
$$ 1990193 2031765 2062433 2101554 2144755 2200260 2252280 2289585 2326904 2370911 2417883 2453302
3897B453302L3807N0209K8503L5879J7986K5795K2495M0325K7160K3138L1007
$$ 2453302 2487109 2537318 2565821 2601700 2619686 2645481 2667976 2708301 2735461 2758599 2789606
3886B789606M4461J8135J1482L1914J8421L2766J5814K2694L0275K3153J2843
$$ 2789606 2834067 2852202 2863684 2895598 2914019 2946785 2962599 2985293 3015568 3038721 3051564
3875C051564L5971K0357K7841K7936L3965K8846M2291P2228L4002N8074M8709
$$ 3051564 3087535 3107892 3135733 3163669 3197634 3226480 3268771 3340999 3375001 3433075 3481784
3864C481784N8013N8021O3429N6550M6179N1843P0828N2107L0703M8924N0495
$$ 3481784 3539797 3597818 3661247 3717797 3763976 3815819 3886647 3938754 3969457 4018381 4068876
3853D068876M6500L9791L4986N3345M2891L5828M6023M1020L3518L4081M6875
$$ 4068876 4115376 4155167 4190153 4243498 4286389 4322217 4368240 4409260 4442778 4476859 4523734
3842D523734M9304K0321L4503J6602J587K6967J9920J0903N587p137Q260L6292
$$ 4523734 4573038 4593359 4627862 4644464 4646051 4673018 4692938 4703841 4709428 4702291 4710551 4746843
3830D746843q898J2269o941j1111O368J1820K3972O866j3947J8103M725O16j0680
$$ 4746843 4737945 4750214 4743273 4732162 4738530 4750350 4774322 4781188 4767241 4785344 4790069 4790685 4780005
3817D780005L44R847N867O420K202q81K100l322O587J7763J383l379l047M886
$$ 4780005 4780349 4790196 4796063 4802483 4804685 4803804 4805904 4802582 4809169 4826932 4828315 4824936 4821889 4826775
3803D826775J9453N042m166J0933J9413K9366O406K9259M3550L4246L0970M8078
$$ 4826775 4846228 4851270 4847104 4858037 4877450 4906816 4913222 4942481 4986031 5020277 5051247 5099325
3791E099325M3399N1366O3576N0482N3882O5398N7968N8086L2474O1472R9413
$$ 5099325 5142724 5194090 5257666 5308148 5362030 5427428 5485396 5543482 5575956 5637428 5736841
3780E736841Q1183Q3306P4535P7399P5528Q2133R9900J02415R9733J17074J24616
$$ 5736841 5818024 5901330 5975865 6053264 6128792 6210925 6310825 6413240 6512973 6630047 6754663
3769F754663J26799J18508J27401J30293J23122J33705J71406J68720J37854J76909
$$ 6754663 6881462 6999970 7127371 7257664 7380786 7514491 7685897 7854617 7992471 8169380
3759H169380J64569J70883J94406J72418J77087J73111J84030J89520J92475J75229
$$ 8169380 8333949 8504832 8699238 8871656 9048743 9221854 9405884 9595404 9787879 9963108
3749I963108J98557K10259J95757K05707J96254K00131K20921K25715K07267K01679
$$ 9963108 10161665 10371924 10567681 10773388 10969642 11169773 11390694 11616409 11823676 12025355
3739A2025355K02420J77321J74102J52015J29705J05354O9153P4297L1588J7286
$$ 12025355 12227775 12405096 12579198 12731213 12860918 12966272 13035425 13109722 13141310 13158596
3729A3158596K859k6736m8944n0475n0944o5282q8745q9944q9217j13225j01353
$$ 13158596 13161455 13134719 13085775 13035300 12984356 12919074 12830329 12740385 12651168 12537943 12436590
3718A2436590j13472j32213j31327j41182j58707j46770j54815j42766j32876
$$ 12436590 12323118 12190905 12059578 11918396 11759689 11612919 11458104 11315338 11182462
3709A1182462j00309j23085j11555n2063o5715k7517m5532k7640L583J6220J3627
$$ 11182462 11082153 10959068 10847513 10795450 10729735 10702218 10656686 10629046 10632629 10648849 10662476
3698A0662476N235P284J3528q207L2887K3891J3817L6958L8387L4318L8022M1620
$$ 10662476 10667711 10674995 10688523 10680316 10713203 10737094 10750911 10787869 10826256 10860574 10898596 10940216
3686A0940216P2398Q0652P1667P7676J02431Q5072J00601J00856Q1037R4374O5835
$$ 10940216 11012614 11093266 11164933 11242609 11345040 11430112 11530713 11631569 11712606 11806980 11872815
3675A1872815O1488N7035J2494O014m517n1705n1223r1598j17739j23882j22187
$$ 11872815 11934303 11991338 12003832 12009846 12005329 11953624 11902401 11810803 11693064 11569182 11446995
3664A1446995j15556j70685j69451j35375j33082j31417j19190r1661r1015p8319
$$ 11446995 11331439 11160754 10991303 10855928 10722846 10591429 10472239 10380578 10289563 10211244
3654A0211244m9378m7937m9809j9078q460J232p059J1510k644J1749J8552L3546
$$ 10211244 10161866 10113929 10064120 10045042 10036582 10037814 10030755 10042265 10039621 10051370 10069922 10103468
3642A0103468L8374J5940K4837L1904J5901M2721M4575M0049K7184L3962L2442
$$ 10103468 10141842 10157782 10182619 10214523 10230424 10273145 10317720 10357769 10384953 10418915 10451357
3631A0451357O2140K9884K1126M7247J9002J6757K2857L1413J9853K3997r419
$$ 10451357 10513497 10543381 10564507 10611754 10630756 10647513 10670370 10701783 10721636 10745633 10736214
3620A0736214K4042O1217L3040N3922L6249O1761N6987N4247P3689P3763P8543
$$ 10736214 10760256 10821473 10854513 10908435 10944684 11006445 11063432 11117679 11191368 11265131 11343674
3609A1343674R1873J11396R2447R8598J23171J26804J15298J22547J27535J36193
$$ 11343674 11435547 11546943 11639390 11737988 11861159 11987963 12103261 12225808 12353343 12489536
3599A2489536J52229J64731J54109J79778J79752J84038K14851K17266K23722
$$ 12489536 12641765 12806496 12960605 13140383 13320135 13504173 13719024 13936290 14160012
3590A4160012K56959K63217K72718K97696K92143L25060L67344L71993L69733
$$ 14160012 14416971 14680188 14952906 15250602 15542745 15867805 16235149 16607142 16976875
3581A6976875M00345M27679M31206M43036M61788M80440M95611N12042N30436
$$ 16976875 17377220 17804899 18236105 18679141 19140929 19621369 20116980 20629022 21159458
3572B1159458N63195N83591O10039O19937O43457P01530P16302P38662P90022
$$ 21159458 21722653 22306244 22916283 23536220 24179677 24881207 25597509 26336171 27126193
3563B7126193Q29980Q47001Q87784R03826R31745R88347R95787J027823J053636
$$ 27126193 27956173 28803174 29690958 30594784 31526529 32514876 33510663 34538486 35592122
3554C5592122J079688J098013J142846J155707J184682J208137J212402J246976
$$ 35592122 36671810 37769823 38912669 40068376 41253058 42461195 43673597 44920573
3546D4920573J268587J272133J259955J216672J180124J103992J022068Q93400
$$ 44920573 46189160 47461293 48721248 49937920 51118044 52222036 53244104 54137504
3538E4137504P43919O07304M62593L28582K19512R9212K0626q1076j39025j87254
$$ 54137504 54881423 55488727 55951320 56279902 56499414 56598626 56619252 56538176 56399151 56211897
3528E6211897k44299l31460l99306m71191n52553o21979o99824p39221p99449
$$ 56211897 55967598 55636138 55236832 54765641 54213088 53591109 52891285 52152064 51352615
3519E1352615q46482q64789q58277q53420q33824p99510p83572p57900p19498
$$ 51352615 50506133 49641344 48783067 47929647 47095823 46296313 45512741 44754841 44035343
3510D4035343p22330o92407o82202o66321o64637o49539o64823o74508o71031
$$ 44035343 43313013 42620606 41938404 41272083 40607446 39957907 39293084 38618576 37947545
3501C7947545o94460p08095p24299p50050p60494p88235p94294q03291q40644
$$ 37947545 37253085 36544990 35820691 35070641 34310147 33521912 32727618 31924327 31083683
3492C1083683q54914q54749q57482q49701q62905q50562q23869p77795p59696
$$ 31083683 30228769 29374020 28516538 27666837 26803932 25953370 25129501 24351706 23592010
3483B3592010p34437o95037o63534o26841n98106n72561n46361n33551m78217
$$ 23592010 22857573 22162536 21499002 20872161 20274055 19701494 19155133 18621582 18143365
3474A8143365m54732m38274l97567l87606l81501l64779l23914k90141l01767
$$ 18143365 17688633 17250359 16852792 16465186 16083685 15718906 15394992 15104851 14803084
3465A4803084k68286k56809k53530k24534k35116k07736j92592j72971j52659
$$ 14803084 14534798 14277989 14024459 13799925 13564809 13357073 13164481 12991510 12838851
3456A2838851j53620j49125j52177j85633k18253k25585j97564j71700j45047
$$ 12838851 12685231 12536106 12383929 12198296 11980043 11754458 11556894 11385194 11240147
3447A1240147j31125j17651j21112j39445j30083j10235j05576q0078q7183n1419
$$ 11240147 11109022 10991371 10870259 10730814 10600731 10490496 10384920 10304842 10217659 10166240
3437A0166240l3762m5118q588r189J1820J1332N267L9355N7876P2100J08805J19509
$$ 10166240 10132478 10087360 10078772 10069583 10081403 10092735 10098002 10137357 10195233 10267333 10376138 10495647
3425A0495647J10228R9219O2303M670q8875j70380j65453j33164q9370q8491p2027
$$ 10495647 10605875 10705094 10767397 10772067 10683192 10512812 10347359 10214195 10124825 10036334 9964307
3414I964307l9293l4548l5804r958J8043j5117K5329K3380O5208Q1843R2742J10858
$$ 9964307 9925014 9890466 9854662 9844704 9862747 9847630 9872959 9896339 9961547 10043390 10136132 10246990
3402A0246990J18092J63820J57413J76193J94870K15097K34633K43175K63610
$$ 10246990 10365082 10528902 10686315 10862508 11057378 11272475 11507108 11750283 12013893
3393A2013893K89164K79465K65444K58450K36981K29135K31636K43436K94504
$$ 12013893 12303057 12582522 12847966 13106416 13343397 13572532 13804168 14047604 14342108
3384A4342108L43669L57596L71591M16023M15982M47500M42414M50761M65627
$$ 14342108 14685777 15043373 15414964 15830987 16246969 16694469 17136883 17587644 18053271
3375A8053271M48843M32343M01979L69567L41458L04552K63063K10882J48304
$$ 18053271 18502114 18934457 19336436 19706003 20047461 20352013 20615076 20825958 20974262
3366B0974262J38780P0618J9654k4549n3851j24165j80672k20044k59839l03887
$$ 20974262 21113042 21183660 21203314 21178765 21124914 21000749 20820077 20600033 20340194 20036307
3356B0036307l60213l57446l59127l93359m02937l85968l84139l78694l66165
$$ 20036307 19676094 19318648 18959521 18566162 18163225 17777257 17393118 17014424 16648259
3347A6648259l60848l32608l39016l26850l24564l07932k97522l00828k83910
$$ 16648259 16287411 15954803 15615787 15288937 14964373 14656441 14358919 14058091 13774181
3338A3774181k52083k76395k71582k66845k68032k53620k49213k25008k37354
$$ 13774181 13522098 13245703 12974121 12707276 12439244 12185624 11936411 11711403 11474049
3329A1474049k34245k39915k41893k47904k17682k34844k46557k19055k01150
$$ 11474049 11239804 10999889 10757996 10510092 10292410 10057566 9811009 9591954 9390804
3320I390804k00471j81132j91005j85897j51720j42411j54707j48864j52899j33673
$$ 9390804 9190333 9009201 8818196 8632299 8480579 8338168 8183461 8034597 7881698 7748025
3310G748025j45446j27117j15072j39013j22685j07023j05456j00376p3490r7096
$$ 7748025 7602579 7475462 7360390 7221377 7098692 6991669 6886213 6785837 6712347 6615251
3300F615251r1375p8232p1178n2063m7695p7414n8714k9145l9378k1194k5644
$$ 6615251 6523876 6445644 6374466 6322403 6274708 6197294 6138580 6109435 6070057 6048863 6023219
3289F023219j6215k3997N385J3609J1719N0856N8175N8660O3632O3154N9838K5886
$$ 6023219 6007004 5983007 5988392 6002001 6013720 6064576 6122751 6181411 6245043 6308197 6368035 6393921
3277F393921K1080j6551n6815p7222j02599j10114r0793q0958n9203m7625l7195
$$ 6393921 6415001 6398450 6341635 6264413 6161814 6051700 5960907 5879949 5820746 5773121 5735926
3266E735926j1712l1299l8395l3638j5178m1616m5608l3464m2911n5079o1751
$$ 5735926 5724214 5692915 5654520 5620882 5605704 5564088 5518480 5485016 5442105 5387026 5325275
3255E325275n1434m6644m7511n1584n3251k8748r416R534K9930K1121L2436K6226
$$ 5325275 5273841 5227197 5179686 5128102 5074851 5046103 5036687 5046221 5076151 5097272 5129708 5155934
3243E155934M1895K4996m526l9868k5754j3966j4319j2524l6150Q308M839K6683
$$ 5155934 5197829 5222825 5218299 5178431 5152677 5138711 5124392 5111868 5075718 5084026 5088865 5115548
3231E115548K1288K6861J4113K4014K3634J5812J7613M2663K3216r688J9707K7088
$$ 5115548 5136836 5163697 5177810 5201824 5225458 5241270 5258883 5301546 5324762 5315074 5334781 5361869
3219E361869K7354O274K3539K0693L6846M6906N9565M9441P2765R4297P6750J02888
$$ 5361869 5389223 5395497 5419036 5439729 5476575 5523481 5583046 5632487 5705252 5799549 5876299 5979187
3207E979187R6368J18556J29577J24806J40236J49600J88502J76434J80375K11227
$$ 5979187 6075555 6194111 6323688 6448494 6588730 6738330 6926832 7103266 7283641 7494868
3197G494868K10337K35803K45524K64287K65981K91823K98763L26874L33785L54942
$$ 7494868 7705205 7941008 8186532 8450819 8716800 9008623 9307386 9634260 9968045 10322987
3187A0322987L82640M03531M20597M35617M46307M93989N31934N73899O10486
$$ 10322987 10705627 11109158 11529755 11965372 12411679 12905668 13437602 14011501 14621987
3178A4621987O45226P02094P44664P92671Q56249R20021R57226J042301J136880
$$ 14621987 15267213 15969307 16713971 17506642 18362891 19282912 20240138 21282439 22419319
3169B2419319J213746J294667J389039J453144J520349J608806J638109J684943
$$ 22419319 23633065 24927732 26316771 27769915 29290264 30899070 32537179 34222122
3161C4222122J732610J797338J875456J980746K131095K323415K503195K700015
$$ 34222122 35954732 37752070 39627526 41608272 43739367 46062782 48565977 51265992
3153E1265992K890758L053287L137860L171402L151391L040451K941581K818616
$$ 51265992 54156750 57210037 60347897 63519299 66670690 69711141 72652722 75471338
3145G5471338K683065K488797K217828J857680J266526N10461k69648r70050j462152
$$ 75471338 78154403 80643200 82861028 84718708 85985234 86495695 86226047 85255997 83793845
3136H3793845j872250k261178k665927k934785l136264l261788l361507l389982
$$ 83793845 81921595 79660417 76994490 74059705 70923441 67661653 64300146 60910164
3128F0910164l368288l282283l175838l029195k891860k700905k500203k323537
$$ 60910164 57541876 54259593 51083755 48054560 45162700 42461795 39961592 37638055
3120C7638055k125878j969524j807944j652373j518867j423386j311242j204572
$$ 37638055 35512177 33542653 31734709 30082336 28563469 27140083 25828841 24624269
3112B4624269j108533j018502r71325r02198q30037p85745p77154p58719p39160
$$ 24624269 23515736 22497234 21525909 20623711 19793674 19007929 18230775 17472056 16732896
3103A6732896p28498o71034o46003o18706n82640n28837m83641m81532m33825
$$ 16732896 16004398 15333364 14687361 14068655 13486015 12957178 12473537 11992005 11558180
3094A1558180m09934l68755l68418l43207l26100l15465k97150k50803k47343
$$ 11558180 11148246 10779491 10411073 10067866 9741766 9426301 9129151 8878348 8631005
3085H631005k68768k31998k15472k08932k05692j85399j78293j72925j64916j58985
$$ 8631005 8362237 8130239 7914767 7705835 7500143 7314744 7136451 6963526 6798610 6639625
3075F639625j64646j45775j61507j73650j76349j15913j28431j26377j19952j15743
$$ 6639625 6474979 6329204 6167697 5994047 5817698 5701785 5573354 5446977 5327025 5211282
3065E211282j05785j31572j22212r9353j08093r5174r0711r9553q2991q4713r5104
$$ 5211282 5105497 4973925 4851713 4752360 4644267 4549093 4458382 4358829 4275838 4191125 4096021
3054D096021p2231n4738n7305n9098p8752o5717o3843o2275n4833m6711m7335
$$ 4096021 4023790 3969052 3911747 3852649 3773897 3708180 3644337 3582062 3527229 3480518 3433183
3043C433183l6909o1705n2184l3426n2690l8289m7067n2207l6346k7371l6216
$$ 3433183 3396274 3334569 3282385 3248959 3196269 3157980 3110913 3058706 3022360 2994989 2958773
3032B958773m2451m6134k5621l9727l9458k9244m3756m8970l2538l4670k8493
$$ 2958773 2916322 2870188 2844567 2804840 2765382 2736138 2692382 2643412 2610874 2576204 2547711
3021B547711n6770l2567n0333m4243m4339m7225l8313m5902n7978m4438l6083
$$ 2547711 2490941 2458374 2408041 2363798 2319459 2272234 2233921 2188019 2130041 2085603 2049520
3010B049520m5944l4570l2787m2917l0157l5774k6430l1926l5861j3115l3646
$$ 2049520 2003576 1969006 1936219 1893302 1863145 1827371 1800941 1769015 1733154 1720039 1686393
2999A686393k7386j6752l7010l1190q547k3198k7869j0428j6106l1323j5783k0915
$$ 1686393 1659007 1642255 1605245 1574055 1565508 1542310 1514441 1504013 1487907 1456584 1440801 1419886
2987A419886j871j3284p786o332l2955l0335k0308k4135j5403q285j2330k4416
$$ 1419886 1418015 1404731 1396945 1390613 1357658 1327323 1307015 1282880 1267477 1259192 1246862 1222446
2975A222446l199j2160j7640j1226k2236p395J1322q581n094P175l550j7147K127
$$ 1222446 1219247 1207087 1189447 1178221 1155985 1148590 1159912 1151331 1146237 1153412 1149862 1132715 1134842
2962A134842J3612q14m292J729J3335P042J3239J0661R19J576J494K0906J9805
$$ 1134842 1148454 1147640 1143348 1145077 1158412 1165454 1178693 1189354 1190273 1191849 1193343 1214249 1234054
2949A234054K8816O923J0852m89j1052l963O106o933J4753J278l794J1638N722
$$ 1234054 1262870 1269793 1280645 1280156 1269104 1265141 1271247 1264314 1279067 1280345 1276551 1288189 1293911
2936A293911K029j5427r838N76l313k3948j4309j16K484j5523n209j1738m463
$$ 1293911 1295940 1280513 1270675 1271251 1267938 1243990 1229681 1229565 1232049 1216526 1211317 1199579 1195116
2923A195116J0487J6795K1800L890M603L2424M6648K0525L1214L7566M8554J7666
$$ 1195116 1205603 1222398 1244198 1248088 1252691 1285115 1331763 1352288 1383502 1421068 1469622 1487288
2911A487288K5266K3073K6920L5423P423J8171J7656K9921J0539R923J2388j0544
$$ 1487288 1512554 1535627 1562547 1597970 1605393 1623564 1641220 1671141 1681680 1691603 1703991 1693447
2899A693447l4484j1186k6213l7189n0502k0306m4504k7125j9586m0185l0320
$$ 1693447 1658963 1647777 1621564 1584375 1533873 1513567 1469063 1441938 1422352 1382167 1351847
2888A351847j2061p417k4268K239K7065P633O344L4284K1699K941K7633K3732
$$ 1351847 1339786 1332369 1308101 1310340 1337405 1345038 1351382 1385666 1407365 1410306 1437939 1461671
2876A461671p254K7110K5390j122m579N957J3555J6519m456K1711J1619J0290
$$ 1461671 1454417 1481527 1506917 1505795 1501216 1507173 1520728 1537247 1532791 1554502 1566121 1576411
2864A576411j4885k9455l6981k2737k4934m1962n3414n1309m3005k9918m6291
$$ 1576411 1561526 1532071 1495090 1472353 1447419 1405457 1352043 1300734 1257729 1227811 1181520
2853A181520o3493l6882m0801l0627m4923l1361m1460l1771n400k3220j4101q702
$$ 1181520 1118027 1081145 1040344 1009717 964794 933433 891973 860202 854802 831582 817481 808779
2841H08779k6686j2447k2752j6284l2033j3764k1989k7558r698k2799k2141k3614
$$ 808779 782093 769646 746894 730610 698577 684813 662824 635266 625568 602769 580628 557014
2829E57014k7309l1144j1865j8487j2098j138k3836l4713j3266k4047k9743j4569
$$ 557014 529705 498561 486696 468209 456111 454973 431137 396424 383158 359111 329368 314799
2817C14799k1203q674j7027k2654q252j3561j3258k3771k4281Q909J4984j0789
$$ 314799 293596 284922 267895 245241 236989 223428 210170 186399 162118 171027 186011 175222
2805A75222j1765K127j4986j4378n031o369j0368j2993n876j2045j3870o171j4085
$$ 175222 163457 165584 150598 136220 131189 124820 114452 101459 95583 83538 69668 63497 49412
2792D9412J341j636k5831j925k092r710K760k992l763j5673j927Q2j2459l97m807
$$ 49412 50753 49117 23286 21361 19269 9559 12319 9327 5564 -10109 -12036 -11954 -24413 -24810 -29617
2777b9617K120P150j4320j1693K757n284j099j6117R624p270j1094J3028J580
$$ -29617 -27497 -20347 -34667 -46360 -43603 -48887 -49986 -66103 -56479 -63749 -74843 -61815 -60235
2764f0235k1736L649l272n542k842p478P612j37N407j0730P686j683j7469O809
$$ -60235 -81971 -78322 -81594 -87136 -89978 -97456 -89844 -89981 -84574 -95304 -87618 -89301 -106770 -99961
2750i9961M119Q30j066q550N449m132k358l414K988j3813Q864N847p383J4597
$$ -99961 -95842 -95012 -96078 -104628 -99179 -103311 -105669 -109083 -106095 -119908 -111044 -105197 -112580 -97983
2736i7983k253o765n067j9248L446j434q336J9134P325j1598k2679P756j899j0428
$$ -97983 -100236 -107001 -112068 -131316 -127870 -129304 -137640 -118506 -111181 -122779 -145458 -137702 -139601 -150029
2722a50029R829P547O897n891p193k1453K4890k984m189J6032o336j1450J5388
$$ -150029 -140200 -132653 -125756 -131647 -138840 -160293 -135403 -138387 -142576 -126544 -132880 -144330 -128942
2709a28942m354k0221J1654K621j7923L368R460m646q494O710q595K39K711j0077
$$ -128942 -133296 -153517 -141863 -139242 -157165 -153797 -144337 -148983 -157477 -150767 -159362 -159123 -156412 -166489
2695a66489J1958k068K386n770n868J878J5196r482K626r929k6q501K0478j0839
$$ -166489 -154531 -156599 -154213 -159983 -165851 -163973 -148777 -158259 -155633 -165562 -165588 -174089 -153611 -164450
2681a64450r060o123j937J6611J6454R017m19j9440j5597P782j296K2046q20o015
$$ -164450 -173510 -179633 -181570 -164959 -148505 -139488 -139907 -159347 -174944 -167162 -168458 -146412 -147232 -153247
2667a53247J572Q826J1895j9506m623K55L544J010r92j0064Q794M247k782J360
$$ -153247 -151675 -142849 -130954 -150460 -155083 -154828 -151284 -150274 -151266 -161330 -152536 -148289 -151071 -149711
2653a49711Q389M232k7479j2701M416N508p413L557n329j8935k594k228l488J4280
$$ -149711 -141322 -137090 -164569 -177270 -172854 -167346 -174759 -171202 -176531 -195466 -198060 -200288 -203776 -189496
2639a89496L930j0356j903L626L689J72j1675j5256O01J4082o142j2402J3751
$$ -189496 -185566 -195922 -197825 -194199 -190510 -190338 -202013 -217269 -216668 -202586 -208728 -221130 -207379
2626b07379j929K58J8091j3657l166p757n985J752K405K702J2713j1696m015M819
$$ -207379 -209308 -209050 -190959 -204616 -207782 -215539 -221524 -219772 -217367 -214665 -201952 -213648 -217663 -212844
2612b12844k693J4831J732k0437R82J1895j7367J7531L556r993J986j692m520
$$ -212844 -215537 -200706 -198974 -219411 -218429 -206534 -223901 -206370 -202814 -212807 -210821 -212513 -217033
2599b17033j3555J7061l737j6925K338o575m67J5660j4414L153J3874J7779N067
$$ -217033 -230588 -213527 -217264 -234189 -231851 -238426 -238893 -223233 -237647 -234494 -220620 -202841 -197774
2586a97774j8261j4016l922q063K088k932q234J7441R840o632J2588Q850j1408
$$ -197774 -216035 -230051 -233973 -242036 -239948 -242880 -251114 -233673 -223833 -230465 -217877 -209027 -220435
2573b20435N299J031q786p321J1059K0598k27J143j1048l42j2114Q548M626j195
$$ -220435 -215136 -214105 -222891 -230212 -219153 -198555 -198782 -197639 -208687 -209029 -221143 -212595 -207969 -209164
2559b09164Q01k709O295j6666r493O770K0210R951l04k4365r280J3950R499n724
$$ -209164 -208363 -211072 -204777 -221443 -230936 -224166 -203956 -194005 -194309 -218674 -227954 -214004 -204505 -210229
2545b10229M370l265k847j2172L946N46q329K4092j551j1759l783P733M391M117
$$ -210229 -205859 -209124 -211971 -224143 -220197 -219651 -227980 -203888 -205439 -217198 -220981 -213248 -208857 -204740
2531b04740l978m075k7057r927J7725O262O723O12j68r63p598m635J318K202r798
$$ -204740 -208718 -212793 -239850 -249777 -232052 -225790 -219067 -218455 -218623 -219586 -227184 -231819 -230501 -228299 -238097
2516b38097j2026n23N94J9882J6956p475o009K889l623M64N879K386n518j3068
$$ -238097 -250123 -250646 -250052 -230170 -213214 -220689 -226698 -223809 -227432 -226968 -221089 -218703 -224221 -237289
2502b37289m460J4178J0945k823j2286p71k638J3249P934l984r199J789o888J5545
$$ -237289 -241749 -227571 -216626 -219449 -231735 -232506 -235144 -221895 -213961 -217945 -227144 -225355 -232243 -216698
2488b16698J0482J487j0440J749j0136k354K1188n666M435k2480M112m088j5517
$$ -216698 -206216 -204729 -215169 -213420 -223556 -225910 -204722 -210388 -205953 -228433 -224321 -228409 -243926
2475b43926J4422P045Q459o237J0750k05j960l900k370J6983r422j3630j883J1079
$$ -243926 -229504 -222459 -214000 -220237 -209487 -209692 -211652 -215552 -217922 -200939 -210361 -223991 -225874 -214795
2461b14795m760L503J2982r370j0774l808m03J0508J0877Q282P165j8L009n555
$$ -214795 -219555 -216052 -203070 -212440 -223214 -227022 -227425 -216917 -206040 -197758 -190593 -190611 -187602 -193157
2447a93157o7r344J524J8392M926P807j0759O110J5047J6141L22k008K549k290
$$ -193157 -193224 -202568 -201044 -182652 -177726 -169919 -180678 -174568 -159521 -143380 -143058 -145066 -142517 -144807
2433a44807J3209J5067j619O756J5891J4240K6884J428M137K0953J1103r54K7419
$$ -144807 -131598 -116531 -118150 -111394 -95503 -81263 -54379 -52951 -48814 -27861 -16758 -17712 9707
2420I707L9740K1042J2063M1642K8949M9311M3368K8286N4202O2772O1873O6648
$$ 9707 49447 70489 82552 124194 153143 202454 245822 274108 328310 391082 452955 519603
2408E19603P1046P0975N9232O9557R1356J04184J06209J21291J77075K30567L04641
$$ 519603 590649 661624 720856 790413 881769 985953 1092162 1213453 1390528 1621095 1925736
2397A925736L61359K94574K56776K20138R9994j79749n16779m53865k97777k32814
$$ 1925736 2287095 2581669 2838445 3058583 3158577 2978828 2462049 2008184 1710407 1477593
2387A477593j99950j55108j31728j09892j12334j05269j02355o1174o2971n0772
$$ 1477593 1277643 1122535 990807 880915 768581 663312 560957 499783 436812 386040
2377C86040n8818n4655o7537k3495k7554o0460k7559k1594l48j6543j4946j7401
$$ 386040 327222 272567 205030 181535 153981 93521 65962 44368 44020 27477 12531 -4870
2365d870j2683k6670q195J364j8190k6521p09K736O3k855p239j9162k7283p299
$$ -4870 -17553 -44223 -52418 -51054 -69244 -95765 -96474 -93738 -93675 -96530 -103769 -122931 -150214 -157513
2351a57513L547L937L079m065Q175j4690r430R143j0763k103J761J1967k403j2299
$$ -157513 -153966 -150029 -146950 -151015 -142840 -157530 -166960 -157817 -168580 -170683 -168922 -156955 -159358 -171657
2337a71657j411J717Q917n030r402j1261r062P097l386j4797l808k577o004J985
$$ -171657 -173068 -171351 -162434 -167464 -176866 -188127 -197189 -190092 -193478 -208275 -212083 -214660 -220664 -218679
2323b18679P536R484j0916j1311M355j8160J0393q746j5878L429M728Q887l403
$$ -218679 -211143 -201659 -212575 -223886 -219531 -237691 -227298 -236044 -251922 -248493 -243765 -234878 -238281
2310b38281j6467M247j004J5380o490j1706n915K522J3436j1344J348L243K828
$$ -238281 -254748 -250501 -251505 -236125 -242615 -254321 -260236 -257714 -244278 -255622 -254274 -251031 -248203
2297b48203J7668q882l810J2165j7950q706K686K235o686o238M117N62K172n808
$$ -248203 -230535 -239417 -243227 -231062 -249012 -257718 -255032 -252797 -259483 -265721 -261604 -261042 -258870 -264678
2283b64678R893K031k186m498k0638J8599J162k1237J5697K4754k1447J0858K362
$$ -264678 -254785 -252754 -254940 -259438 -280076 -261477 -260315 -281552 -265855 -241101 -262548 -251690 -249328
2270b49328j1880r955O089K850j3591j508K7472K126R62J867r973l35m472N720
$$ -249328 -261208 -271163 -265074 -262224 -275815 -277323 -249851 -247725 -246763 -244896 -254869 -255204 -259676 -253956
2256b53956k7888o37K6408J859q539O117m750Q665l529j6609Q560k319K022n569
$$ -253956 -281844 -282481 -256073 -254214 -262753 -256636 -261386 -252721 -256250 -272859 -264299 -266618 -264596 -270165
2242b70165J3129j0141k206O507r708J853N475k216O601O056m724m045J060j854
$$ -270165 -257036 -267177 -269383 -262876 -272584 -270731 -265256 -267472 -260871 -254815 -259539 -263584 -262524 -264378
2228b64378J3851q257j8115J7791J3510j775k5448M358j009p368j310N506j5671
$$ -264378 -250527 -258784 -276899 -259108 -245598 -247373 -272821 -268463 -269472 -276840 -278150 -272644 -288315
2215b88315J1063m949p536J4532M946N301K903m656L599O303o462Q25r143j6808
$$ -288315 -277252 -282201 -289737 -275205 -270259 -264958 -262055 -266711 -263112 -256809 -263271 -262446 -271589 -288397
2201b88397N064m050J2523l777P20N763k4245l224J1688K245k616J735K4818J1862
$$ -288397 -283333 -287383 -274860 -278637 -277917 -272154 -296399 -299623 -287935 -285690 -288306 -286571 -261753 -249891
2187b49891k9433m828P008j403p146O598M57K325Q897L66l487k1404P553K669
$$ -249891 -279324 -284152 -277144 -278547 -285693 -279095 -278638 -276313 -267416 -267050 -270537 -291941 -284388 -281719
2173b81719j1471n021R863P463J7551q767m060j0336J3332K530r568j5709k790
$$ -281719 -293190 -298211 -288348 -280885 -263334 -272101 -276161 -286497 -273165 -270635 -280203 -295912 -298702
2160b98702J5944K31q74k0956O228J1158R666j2773L959r827j4727J6378J1584
$$ -298702 -282758 -282527 -283401 -304357 -298129 -286971 -277305 -290078 -286119 -295946 -310673 -294295 -282711
2147b82711J1214J3068L222j5502p813n179m919O041j1624m568j588K0726j4263
$$ -282711 -271497 -258429 -255207 -270709 -278522 -283701 -288620 -282579 -294203 -298771 -300359 -279633 -293896
2134b93896J7552P4J4767j3877N847j4550O167J0214p779N760o737N963j781Q994
$$ -293896 -276344 -276270 -261503 -275380 -269533 -284083 -277916 -267702 -275481 -269721 -276458 -270495 -272276 -263282
2120b63282K231j7919j0397L607k309j8776J3129Q60q522J5138J7064m384j1696
$$ -263282 -261051 -278970 -289367 -285760 -288069 -306845 -293716 -292856 -301378 -286240 -269176 -273560 -285256
2107b85256L968n569n659q307J3578l108j5801J0567J1168k7425P286o439P750
$$ -285256 -281288 -286857 -292516 -300823 -287245 -290353 -306154 -295587 -284419 -311844 -304558 -310997 -303247
2094c03247J5828l145l425j8867M403J8903n058M614o927p68m220M705p173q691
$$ -303247 -287419 -290564 -293989 -312856 -308453 -289550 -294608 -289994 -296921 -297689 -301909 -297204 -304377 -313068
2080c13068K959J8664J59M04k428o025j2555P119J5896n484q0O114J7996l721
$$ -313068 -310109 -291445 -291286 -290882 -293310 -299335 -311890 -304771 -288875 -294359 -294439 -288325 -270329 -274050
2066b74050q836L704q881j5776J6932J998j1570r964m896N588J4746O223r447
$$ -274050 -282886 -279182 -288063 -303839 -286907 -284909 -296479 -306443 -311339 -305751 -291005 -284782 -294229
2053b94229N543j1894j1222J860K102R515L721l622q399M904n950j3994J7936
$$ -294229 -288686 -300580 -311802 -309942 -307840 -298325 -294604 -298226 -306625 -301721 -307671 -321665 -303729
2040c03729j3455l549R741J3885L214J3633J3298q832j2278p511r243J504J5480
$$ -303729 -317184 -320733 -310992 -297107 -293893 -280260 -266962 -275794 -288072 -295583 -304826 -303322 -287842
2027b87842j2442l811J8326K818j9275n990J3446m092m672j5065n386J1418n488
$$ -287842 -300284 -304095 -285769 -282951 -302226 -308216 -294770 -298862 -303534 -318599 -323985 -312567 -318055
2014c18055J9686k416j2789l931L906k549J4714J468Q106o054m742J0193k750
$$ -318055 -298369 -300785 -313574 -317505 -313599 -316148 -301434 -299966 -291860 -297914 -302656 -292463 -295213
2001b95213J4946K875n557k2655q92k228p937P705o53N557O183m26m607o59k021
$$ -295213 -280267 -277392 -282949 -305604 -306496 -308724 -316661 -308956 -309609 -304052 -297869 -298295 -302902 -303561 -305582
1986c05582J9457o560q146O543r868J0639P833j991J1526j3949j7452K981p088
$$ -305582 -286125 -292685 -300831 -294288 -304156 -293517 -285684 -287675 -276149 -290098 -307550 -304569 -311657
1973c11657Q968o845m57N395o095O458j2407P831j6138J289K0596j1097J0822
$$ -311657 -302689 -309534 -309991 -304596 -310691 -304233 -316640 -308809 -324947 -323658 -303062 -314159 -303337
1960c03337Q973j3039J751n219l356n867O649J3138L358k863P60j9253j675J7324
$$ -303337 -294364 -307403 -305652 -310871 -314227 -320094 -313445 -300307 -296949 -299812 -299052 -318305 -319980 -302656
1946c02656O848J0845l607r182M203J3294J295n080j2943J1296k055M30j540j5652
$$ -302656 -295808 -284963 -288570 -297752 -293549 -280255 -278960 -284040 -296983 -285687 -287742 -287312 -288852 -304504
1932c04504J4R025j148j5192Q026J1306j5418n463R334J0373O506j339j4548q844
$$ -304504 -304490 -295465 -296613 -311805 -303779 -292473 -307891 -313354 -304020 -293647 -287141 -288480 -303028 -311872
1918c11872p067p391O224K1904L281l249J2011j2091l0939J3221M48K3148k745
$$ -311872 -318939 -326330 -320106 -298202 -294921 -298170 -286159 -298250 -329189 -315968 -315520 -292372 -295117
1905b95117j989j0444p318K945L761q242Q149J340p45Q126n163K311l773l512
$$ -295117 -297106 -307550 -314868 -311923 -308162 -316404 -308255 -306915 -307660 -299534 -304697 -302386 -306159 -309671
1891c09671j5006k676M210n579Q212K300o311P683j73M631J4858N816k467n668
$$ -309671 -324677 -327353 -323143 -328722 -320510 -318210 -324521 -316838 -317011 -312380 -297522 -291706 -294173 -299841
1877b99841k2993q441J1367nm974J6640l972J4566K0790l323j6699N25j993k335
$$ -299841 -322834 -331275 -319908 -319913 -324887 -308247 -312219 -297653 -276863 -280186 -296885 -296360 -298353 -300688
1863c00688j7614J4212q596N472K481J048o787J776m383M854j0613J914K041j1537
$$ -300688 -318302 -304090 -312686 -307214 -304733 -303685 -310472 -308696 -313079 -308225 -318838 -316924 -314883 -326420
$$ [...]
##END NTUPLES=NMR SPECTRUM
##END=
