##TITLE=1H_DE-80H_X3
 200.13MHz, d2o
 8 sc
 
 19ns.26.2.2025
##JCAMPDX= 6.0         $$ Bruker NMR JCAMP-DX V2.0
##DATA TYPE= NMR SPECTRUM
##DATA CLASS= NTUPLES
##ORIGIN= UXNMR, Bruker Analytische Messtechnik GmbH
##OWNER= pz
$$ XWIN-NMR		Version 3.5
$$ Tue Sep 16 10:24:51 2025 Russian Standard Time (UT+4h)  Yarkov@DPX200
##.OBSERVE FREQUENCY= 200.1313
##.OBSERVE NUCLEUS= ^1H
##.ACQUISITION MODE= SIMULTANEOUS
##.ACQUISITION SCHEME= undefined
##.AVERAGES= 8
##.DIGITISER RES= 18
##SPECTROMETER/DATA SYSTEM= spect
##.PULSE SEQUENCE= zg30
##.SOLVENT NAME= CDCl3
##.SHIFT REFERENCE= (INTERNAL, CDCl3, 0, 15.4759)
##AUDIT TRAIL= $$ (NUMBER, WHEN, WHO, WHERE, WHAT)
$$ ##TITLE= Audit trail, XWIN-NMR		Version 3.5
$$ ##JCAMPDX= 5.01
$$ ##ORIGIN= Bruker BioSpin GmbH
$$ ##OWNER= Yarkov
$$ C:/Bruker/XWIN-NMR/data/yarkov2/nmr/H-C/1/pdata/1/auditp.txt
$$ ##AUDIT TRAIL=  $$ (NUMBER, WHEN, WHO, WHERE, WHAT)
(   1,<2025-09-16 10:23:37.76 +0400>,<Yarkov>,<DPX200>,
      <created by zg, POWCHK disabled, PULCHK disabled
       configuration hash MD5:
       00 E9 B6 7A A2 85 ED C7 34 08 36 98 17 FE 4E 26
       data hash MD5: 16K
       25 C0 EB 28 41 51 8E 2E A7 FC 41 9C C3 B0 DD 1A>)
(   2,<2025-09-16 10:23:46.56 +0400>,<Yarkov>,<DPX200>,
      <Start of raw data processing
       efp BC_mod = 2 LB = 0.25 FT_mod = 6 PKNL = 1 PHC0 = -1362.576 PHC1 = 17.99092 SI = 16K 
       data hash MD5: 16K
       C7 06 47 A7 F8 A0 84 01 F5 FD AD C3 3A 08 45 A8>)
(   3,<2025-09-16 10:23:52.64 +0400>,<Yarkov>,<DPX200>,
      <abs ABSG = 5 
       data hash MD5: 16K
       EB C6 2B 98 24 48 C2 D9 0D A0 79 52 D2 6C 1E 17>)
$$ ##END=
$$ 
$$ hash MD5
$$ 7D 67 90 34 46 3A D3 90 34 B2 C2 02 A0 7E A2 62
##$RELAX= 
##$RELAX= 
##$RELAX= 
##$RELAX= 
##$RELAX= 
##$RELAX= 
$$ Bruker specific parameters
$$ --------------------------
##$DU= <C:/Bruker/XWIN-NMR>
##$EXPNO= 1
##$NAME= <H-C>
##$PROCNO= 1
##$TYPE= <nmr>
##$USER= <yarkov2>
##$AMP= (0..31)
100 100 100 100 100 100 100 100 100 100 100 100 100 100 100 100 100 100 
100 100 100 100 100 100 100 100 100 100 100 100 100 100 
##$AQSEQ= 0
##$AQ_mod= 1
##$AUNM= <au_zg>
##$AUTOPOS= <>
##$BF1= 200.13
##$BF2= 200.13
##$BF3= 200.13
##$BF4= 200.13
##$BF5= 200.13
##$BF6= 200.13
##$BF7= 200.13
##$BF8= 200.13
##$BYTORDA= 1
##$CFDGTYP= 0
##$CFRGTYP= 5
##$CHEMSTR= <none>
##$CNST= (0..31)
1 1 145 1 1 1 1 1 1 1 1 1 1 1 1 1 1 1 1 1 1 1 1 1 1 1 1 1 1 1 1 1 
##$CPDPRG= <>
##$CPDPRG1= <>
##$CPDPRG2= <>
##$CPDPRG3= <>
##$CPDPRG4= <mlev>
##$CPDPRG5= <mlev>
##$CPDPRG6= <mlev>
##$CPDPRG7= <mlev>
##$CPDPRG8= <mlev>
##$CPDPRGB= <>
##$CPDPRGT= <>
##$D= (0..31)
0 0.7 0 0 0 0 0 0 0 0 0 0.03 0 0 0 0 0 0 0 0 0 0 0 0 0 0 0 0 0 0 0 0 
##$DATE= 1758003817
##$DBL= (0..7)
120 120 120 120 120 120 120 120 
##$DBP= (0..7)
150 150 150 150 150 150 150 150 
##$DBP07= 0
##$DBPNAM0= <>
##$DBPNAM1= <>
##$DBPNAM2= <>
##$DBPNAM3= <>
##$DBPNAM4= <>
##$DBPNAM5= <>
##$DBPNAM6= <>
##$DBPNAM7= <>
##$DBPOAL= (0..7)
0.5 0.5 0.5 0.5 0.5 0.5 0.5 0.5 
##$DBPOFFS= (0..7)
0 0 0 0 0 0 0 0 
##$DE= 6
$$ [...]
##$SUBNAM3= <"">
##$SUBNAM4= <"">
##$SUBNAM5= <"">
##$SUBNAM6= <"">
##$SUBNAM7= <"">
##$SUBNAM8= <"">
##$SUBNAM9= <"">
##$SW= 18.0517328524113
##$SWIBOX= (0..15)
0 0 2 0 0 0 0 0 0 0 0 0 0 0 0 0 
##$SW_h= 3612.71676300578
##$TD= 16384
##$TD0= 1
##$TE= 0
##$TE2= 300
##$TE3= 300
##$TEG= 300
##$TL= (0..7)
0 120 120 120 120 120 120 120 
##$TP= (0..7)
150 150 150 150 150 150 150 150 
##$TP07= 0
##$TPNAME0= <>
##$TPNAME1= <>
##$TPNAME2= <>
##$TPNAME3= <>
##$TPNAME4= <>
##$TPNAME5= <>
##$TPNAME6= <>
##$TPNAME7= <>
##$TPOAL= (0..7)
0.5 0.5 0.5 0.5 0.5 0.5 0.5 0.5 
##$TPOFFS= (0..7)
0 0 0 0 0 0 0 0 
##$TUNHIN= 0
##$TUNHOUT= 0
##$TUNXOUT= 0
##$USERA1= <user>
##$USERA2= <user>
##$USERA3= <user>
##$USERA4= <user>
##$USERA5= <user>
##$V9= 5
##$VALIST= <valist>
##$VCLIST= <CCCCCCCCCCCCCCC>
##$VD= 0
##$VDLIST= <DDDDDDDDDDDDDDD>
##$VPLIST= <PPPPPPPPPPPPPPP>
##$VTLIST= <TTTTTTTTTTTTTTT>
##$WBST= 1024
##$WBSW= 4
##$XGAIN= (0..3)
0 0 0 0 
##$XL= 0
##$YL= 0
##$YMAX_a= 35327
##$YMIN_a= -36583
##$ZGOPTNS= <>
##$ZL1= 120
##$ZL2= 120
##$ZL3= 120
##$ZL4= 120
##$ABSF1= 15.49678
##$ABSF2= -2.555069
##$ABSG= 5
##$ABSL= 3
##$ALPHA= 0
##$AQORDER= 0
##$ASSFAC= 0
##$ASSFACI= 0
##$ASSFACX= 0
##$ASSWID= 0
##$AUNMP= <proc_1d>
##$AZFE= 0.1
##$AZFW= 0.1
##$BCFW= 0
##$BC_mod= 2
##$BYTORDP= 0
##$COROFFS= 0
##$CY= -3
##$DATMOD= 1
##$DC= 0
##$DFILT= <>
##$DTYPP= 0
##$F1P= 0
##$F2P= 0
##$FCOR= 1
##$FTSIZE= 16384
##$FT_mod= 6
##$GAMMA= 0
##$GB= 0
##$INTBC= 1
##$INTSCL= 3.241238e-09
##$ISEN= 128
##$LB= 0.25
##$LEV0= 0
##$LPBIN= 0
##$MAXI= 10000
##$MC2= 0
##$MEAN= 0
##$ME_mod= 0
##$MI= 1.114404
##$NCOEF= 0
##$NC_proc= -9
##$NLEV= 6
##$NOISF1= 3.799351
##$NOISF2= 2.8
##$NSP= 0
##$NTH_PI= 0
##$NZP= 0
##$OFFSET= 15.47585
##$PC= 1
##$PHC0= -1362.576
##$PHC1= 17.99092
##$PH_mod= 1
##$PKNL= yes
##$PPARMOD= 0
##$PSCAL= 0
##$PSIGN= 0
##$REVERSE= no
##$SF= 200.130009177153
##$SI= 16384
##$SIGF1= 3
##$SIGF2= 2
##$SINO= 0.751879
##$SIOLD= 32768
##$SREGLST= <19F.Aceton>
##$SSB= 0
##$STSI= 16384
##$STSR= 0
##$SW_p= 3612.71676300578
##$SYMM= 0
##$S_DEV= 0
##$TDeff= 16384
##$TDoff= 0
##$TI= <>
##$TILT= no
##$TM1= 0
##$TM2= 0
##$TOPLEV= 0
##$USERP1= <user>
##$USERP2= <user>
##$USERP3= <user>
##$USERP4= <user>
##$USERP5= <user>
##$WDW= 1
##$XDIM= 16384
##$YMAX_p= 423595706
##$YMIN_p= -2469929
$$ End of Bruker specific parameters
$$ ---------------------------------
##NTUPLES= NMR SPECTRUM
##VAR_NAME=  FREQUENCY,     SPECTRUM/REAL,   SPECTRUM/IMAG
##SYMBOL=    X,             R,               I
##VAR_TYPE=  INDEPENDENT,   DEPENDENT,       DEPENDENT
##VAR_FORM=  AFFN,          ASDF,            ASDF
##VAR_DIM=   16384,         16384,           16384
##UNITS=     HZ,            ARBITRARY UNITS, ARBITRARY UNITS
##FACTOR=    0.220516191357247, 1,           1
##FIRST=     3097.18202359506, 0,            0
##LAST=      -515.53473941072, 0,            0
##MIN=       -515.53473941072, -2469929,     0
##MAX=       3097.18202359506, 423595706,    0
$$ Real data points
##PAGE= N=1
##DATA TABLE= (X++(R..R)), XYDATA
$$ [...]
7676b04022J50333k45777J8972P2959j67999j37764o1845K20524K52403k16018
$$ -204022 -53689 -299466 -280494 -207535 -375534 -513298 -575143 -354619 -102216 -318234
7666c18234q0364j16276L31641O211j81084K3157Q8012j24989r2891J0897k4450
$$ -318234 -398598 -514874 -183233 -177022 -358106 -334949 -246937 -371926 -464817 -453920 -478370
7655d78370R41K19161R2283j3041J74716l40845n3019K326M3916n0003J49785
$$ -478370 -477429 -258268 -165985 -179026 -4310 -345155 -398174 -395848 -351932 -401935 -252150
7644b52150K5084J48602q3312j30569k06529K8880K04122J49974p6463k37226
$$ -252150 -227066 -78464 -161776 -292345 -498874 -469994 -265872 -115898 -192361 -429587
7634d29587o0247L66075R7928k7661j58436k3100L1049J124j79951M8974J40562
$$ -429587 -489834 -123759 -25831 -53492 -211928 -235028 -203979 -202855 -382806 -333832 -193270
7623a93270k78132L95374j15651q8921O6988k78855K11012J23804l0683O7136
$$ -193270 -471402 -76028 -191679 -280600 -213612 -492467 -281455 -157651 -188334 -121198
7613a21198j57769j8774K1922R5514l7797J80940n3001m53503R9589M09574m9271
$$ -121198 -278967 -297741 -275819 -180305 -218102 -37162 -90163 -543666 -444077 -34503 -83774
7602h3774j30423J34609K761m9065P2858M6029j58188J87721j62823J48163j18636
$$ -83774 -214197 -79588 -76827 -125892 -53034 -7005 -165193 22528 -140295 7868 -110768
7591a10768p4022K63859k08012j06290q1951j21980J28378j02064l03902K39002
$$ -110768 -184790 79069 -128943 -235233 -317184 -439164 -310786 -412850 -716752 -477750
7581d77750K75513K4769L4862p725k11519J38927J20742J04262k59206m8769J34521
$$ -477750 -202237 -177468 -142606 -150331 -361850 -222923 -102181 2081 -257125 -305894 -171373
7570a71373R8185n4026j05128K45066L7392p0566o9717n773r4914k45214L15113
$$ -171373 -73188 -127214 -232342 12724 50116 -20450 -90167 -95940 -190854 -436068 -120955
7559a20955k767k84115J83459J90733J64967K5763k41935K5289k57507J69910
$$ -120955 -123722 -407837 -224378 -33645 131322 157085 -84850 -59561 -317068 -147158
7549a47158J67517k12680j9167Q3766k10991J0766K31224P947K1937j62929o7548
$$ -147158 20359 -192321 -211488 -127722 -338713 -327947 -96723 -88776 -66839 -229768 -297316
7538b97316J80225J78072j01648l0938j15563Q4242l710j75802j05042J23312
$$ -297316 -117091 60981 -40667 -71605 -187168 -102926 -106636 -282438 -387480 -264168
7528b64168p4744p5420O4431O4898o2535J29581J91185q5354n9337J7499j07886
$$ -264168 -338912 -414332 -349901 -285003 -347538 -217957 -26772 -112126 -171463 -153964 -261850
7517b61850j40554K78051J7064m5043r9686J31218r0607P476J82227n4037J878
$$ -261850 -402404 -124353 -107289 -152332 -252018 -120800 -211407 -203931 -21704 -75741 -73863
7506g3863J59214q6239k03771K36862k6143l13610J36243j72460Q0250J52986
$$ -73863 85351 -888 -204659 32203 6060 -307550 -171307 -343767 -263517 -110531
7496a10531j59568J86151j42759j86819j07802J17487K04337J70713n8619M9941
$$ -110531 -270099 -83948 -226707 -413526 -521328 -403841 -199504 -28791 -87410 -37469
7486c7469o4215M859j56162j41554j42104j00884J09574K92837J17857M9783o7562
$$ -37469 -101684 -96825 -252987 -394541 -536645 -637529 -527955 -235118 -117261 -67478 -135040
7475a35040k71886p5898K61285J25928P5597j16148j33720K98395J90036m55022
$$ -135040 -406926 -482824 -221539 -95611 -20014 -136162 -269882 28513 218549 -236473
7465b36473j68963J51104L8544k68759q0720J43258o770O8817K00402j69858J01621
$$ -236473 -405436 -254332 -215788 -484547 -565267 -422009 -428779 -359962 -159560 -329418 -227797
7454b27797Q1425j30399O8807o1463J56784j53685M6120j52310K75448L4860k6741
$$ -227797 -146372 -276771 -207964 -269427 -112643 -266328 -220208 -372518 -97070 -62210 -88951
7443h8951j17509p9353K00838J95549m2124k45085K18454j69680j59675j34667
$$ -88951 -206460 -285813 -84975 110574 68450 -176635 41819 -127861 -287536 -422203
7433d22203k4577L13934R658j89616o9905L12753l095j27149P1350J07388k12422
$$ -422203 -446780 -132846 -123188 -312804 -382709 -69956 -73051 -200200 -128850 -21462 -233884
7422b33884l83375J18962J65731K18109J52415R2119j43313r2271j17309k3213
$$ -233884 -617259 -498297 -332566 -114457 37958 130077 -13236 -105507 -222816 -246029
7412b46029J50823j84960k62715L39712R8276p8722K60725N8897k81085l4353
$$ -246029 -95206 -280166 -542881 -203169 -104893 -183615 77110 136007 -145078 -179431
7402a79431P7005k05370K2088J62706L78637k87288P5336J02546j94463j01527
$$ -179431 -102426 -307796 -285708 -123002 255635 -31653 43683 146229 -48234 -149761
7392a49761J75587k72747J7557J01357J95212J29336j53960r198k76539J80172
$$ -149761 25826 -246921 -229364 -128007 67205 196541 42581 33383 -243156 -62984
7382f2984j03046n7786J57510K33374j45l37806J61227N5368k50838L404M3733
$$ -62984 -166030 -223816 -66306 167068 166923 -170883 -9656 45712 -205126 -201722 -157989
7371a57989j60096J06382J21684k23449k47420J87564K6656K20661m4571j24839
$$ -157989 -318085 -211703 -90019 -313468 -560888 -373324 -346668 -126007 -170578 -295417
7361b95417O4134M1812N0797j85023K00140j88835K14283j10146K12299n0656
$$ -295417 -231283 -189471 -138674 -323697 -123557 -312392 -98109 -208255 4044 -46612
7351d6612o835p562j58466J08168l1683J99325l70974j74498K34326J63726k07477
$$ -46612 -53447 -61009 -219475 -111307 -142990 56335 -314639 -489137 -254811 -91085 -298562
7340b98562J41872K08291l804j67728j83696J8312k4750L83927l8416l83509J33680
$$ -298562 -156690 51601 47797 -119931 -303627 -285315 -310065 73862 35446 -348063 -214383
7329b14383M9488k08274J25866r6047L79894R4060j53550l35888N1523J10137
$$ -214383 -164895 -373169 -247303 -343350 36544 130604 -22946 -358834 -307311 -197174
7319a97174O7014K334o4045L5919J02835K25686j50572q9855L65581J68032l12893
$$ -197174 -130160 -127826 -191871 -155952 -53117 172569 21997 -67858 297723 465755 152862
7308A52862j63889J01655J72858l39203K9855j9075L0388q4802l1575j71307j5257
$$ 152862 -11027 90628 263486 -75717 -45862 -64937 -34549 -119351 -150926 -322233 -337490
7297c37490J53094M35704j7312k74013J04852K24319R3369j05581j38921k64620
$$ -337490 -184396 251308 233996 -40017 64835 289154 382523 276942 138021 -126599
7287a26599k95218K12860J75843M7511J46309k05436j4317o2468L73321k79233
$$ -126599 -421817 -208957 -33114 14397 160706 -44730 -59047 -121515 251806 -27427
7277b7427l44169j59924q84L48612N404n3561J27456m3142j77322k8247J16055
$$ -27427 -371596 -531520 -532404 -183792 -178388 -231949 -104493 -147635 -324957 -353204 -237149
7266b37149K16427l42909n947Q8813j9665M56884R2622k02540l475j69899M2283
$$ -237149 -20722 -363631 -369578 -280765 -300430 156454 249076 46536 43061 -126838 -84555
7255h4555J05301N2339j81723K0339J57558l38219j12793K27159P0052p5641m03785
$$ -84555 20746 73085 -108638 -88299 69259 -268960 -381753 -154594 -84542 -160183 -563968
7244e63968K31004J91754j7810K28673k40325N2277R0094P2925P9080L0136j73778
$$ -563968 -332964 -141210 -159020 69653 -170672 -118395 -28301 44624 123704 153840 -19938
7233a9938J47790N2852o5564q1520j18854p1719K35651N8498q2653N6094j94944
$$ -19938 127852 180704 115140 33620 -85234 -156953 78698 137196 54543 110637 -84307
7222h4307Q1436j7942J60103j70033J96099o9730o5278j7908k46454M3637m6846
$$ -84307 -2871 -20813 139290 -30743 165356 95626 30348 12440 -234014 -190377 -237223
7211b37223J87741j55048j3997K60023K0265l5733j1138k72491K49621R8232k2810
$$ -237223 -49482 -204530 -218527 41496 61761 26028 14890 -257601 -7980 90252 67442
7200F7442k13578N9789J32010k50419L70818L34936k93114l02240J9518j29926
$$ 67442 -146136 -86347 45663 -204756 166062 500998 207884 -94356 -74838 -204764
7190b04764l6512J21328J1929M35822N0942k65463Q2005O1732J42341j82207n0193
$$ -204764 -241276 -119948 -108019 327803 378745 113282 195287 257019 399360 217153 166960
7179A66960o5107r1372j31601J48556q1571j4993N0802j65099K79960K7078o2577
$$ 166960 101853 10481 -121120 27436 -54135 -69128 -18326 -183425 96535 123613 61036
7168F1036K17988K19343r4285k50704J52617M7980k09051l5884P7076O7198J3894
$$ 61036 279024 498367 404082 153378 305995 353975 144924 109040 186116 253314 267208
7157B67208o5317Q0094j444L31893L70486j37789M3778J74418L64688J90313L7818
$$ 267208 201891 281985 280541 612434 982920 845131 888909 1063327 1428015 1618328 1656146
7146A656146N76258L32956K88677O70600L0832k86728n0977k34995l04028o35309
$$ 1656146 2232404 2565360 2854037 3524637 3555469 3268741 3217764 2982769 2678741 2043432
7136B043432l62805k78374k36237p6453j24086M9334j21366j77651q6261P5805
$$ 2043432 1680627 1402253 1166016 1089563 965477 1014811 893445 715794 629533 705338
7126G05338m8298l3065j10235l4911l7157m5943j01363J88821J53691j88169l76601
$$ 705338 657040 623975 513740 478829 441672 395729 294366 483187 636878 448709 72108
7115G2108K72922j47911Q3535K78258m65505J57373M4913m9756R4292j38846j03499
$$ 72108 345030 197119 280654 558912 93407 250780 295693 245937 340229 201383 97884
7104I7884l09066K96761K10995o8675m29507N3743J88878n2727j79022L07469
$$ 97884 -211182 85579 296574 227899 -201608 -147865 41013 -11714 -190736 116733
7094A16733K90440j97103O8120k28681J20249q1181J61324k30942j57139m4405
$$ 116733 407173 210070 278190 49509 169758 88577 249901 18959 -138180 -182585
7084a82585J90041J36298o9806n056j90783J5456O0856K30796P0172j24120j82653
$$ -182585 7456 143754 73948 68892 -121891 -106435 -45579 185217 255389 131269 -51384
7073e1384j01061J01626J2996k2922J35842k26882n8507K44654J19530P4676j49371
$$ -51384 -152445 -50819 -37823 -60745 75097 -151785 -210292 34362 153892 228568 79197
7062G9197j20605M302k2902L9007J06095j18468J22421j63200J806J60190J14341
$$ 79197 -41408 -37106 -60008 -21001 85094 -33374 89047 -74153 -72347 87843 202184
7051B02184o2085p8395n1006Q9663L359J6994j3603j7608R1508p4479j04450k8998
$$ 202184 140099 61704 10698 100361 103720 120714 107111 89503 181011 106532 2082 -26916
7039b6916J53770J91148l41621n5794K44899j49034q9343J1426O8816O5339L2211
$$ -26916 126854 318002 -23619 -79413 165486 16452 -72891 -61465 7351 72690 104901
7028A04901L1649J47669J19944j96438j10395j27994K13545J88074j11991Q1801
$$ 104901 136550 284219 404163 207725 97330 -30664 182881 370955 258964 340765
7018C40765K9543j99900R4882P236m7797J5110L5147J79779n4784k61325k40863
$$ 340765 370308 170408 265290 272526 224729 239839 274986 454765 399981 138656 -102207
7007a02207p0186m8855N37344r0804m1878k52314R0804k6741K73877L9854R4774
$$ -102207 -172393 -221248 316096 225292 183414 -68900 21904 -4837 269040 308894 403668
6996D03668j77041k83042P7663J5320m9451o2662J36198J08147L6470j52429P7212
$$ 403668 226627 -56415 21248 36568 -12883 -75545 60653 168800 205270 52841 130053
6985A30053j81500K38468j69363K38353Q1029k68701J67238j30349k5525p1941
$$ 130053 -51447 187021 17658 256011 337040 68339 235577 105228 79703 7762
6975G762j45172k6958J72115J39309K2544k898Q7637k04926L8537l9342l18322
$$ 7762 -137410 -164368 7747 147056 169600 166702 254339 49413 87950 48608 -269714
6964b69714O6300M61307k3563l13792R225n4705M17640k12801m5805Q9552r0179
$$ -269714 -203414 257893 234330 -79462 -70237 -124942 292698 79897 34092 123644 33465
6953C3465P0711K27740j21661n1675k5803j00905L2297k34867j94142N9431K47639
$$ 33465 104176 331916 210255 158580 132777 31872 64169 -170698 -364840 -305409 -57770
6942e7770l103R765K10783J12073m0271p9499J88229l70385r0381N2110J6990
$$ -57770 -60873 -51108 159675 271748 231477 151978 340207 -30178 -120559 -68449 -51459
6931e1459o0261Q8906O0906o7325m2272j68200N7116K5778J85033o8463K95111
$$ -51459 -111720 -22814 38092 -29233 -71505 -239705 -182589 -156811 28222 -40241 254870
6920B54870r723k32177Q699K23751m3996j5414K66189p1218m2798k33064k02594
$$ 254870 245147 12970 21669 245420 201424 186010 452199 380981 338183 105119 -97475
6909i7475K07917o789Q3553o2950O2626j68583J12739l4149q3011L03631k20884
$$ -97475 110442 103653 187206 124256 186882 18299 131038 96889 13878 317509 96625
6898I6625m35933J38606O53066j85479n48264j3871J43253m2576o2297K22546
$$ 96625 -339308 -200702 452364 266885 -281379 -295250 -151997 -194573 -256870 -34324
6888c4324J32941K7450j17827M3433J14921J14306k55833k95624K06216J83183
$$ -34324 98617 126067 8240 51673 166594 280900 25067 -270557 -64341 118842
6878A18842R2765j25558n4807K5274o8951o3455r5337Q9120L6717k5359J07479
$$ 118842 211607 86049 31242 56516 -12435 -75890 -171227 -82107 -45390 -70749 36730
6867C6730J82929J22893j36521j53585k55226m1396N7769L8077p2076K94023K5857
$$ 36730 219659 342552 206031 52446 -202780 -244176 -186407 -148330 -220406 73617 99474
6856I9474l8494J01878k2943k39476J26225J86668j76466k04915M2445K28001
$$ 99474 60980 162858 139915 -99561 26664 213332 36866 -168049 -125604 102397
6846A02397o150j78680j32942o7525n3280M14349Q6315O4641N3833p6913j72857
$$ 102397 96247 -82433 -215375 -282900 -336180 78169 164484 229125 282958 206045 33188
6835C3188j15499l4993j28277J59609K23935J36624P829j67121J55389K1221P5731
$$ 33188 -82311 -117304 -245581 -85972 137963 274587 282416 115295 270684 291905 367636
6824C67636M2714m71038J01688M24223l73345k3501r0903n0902J42843O2147p809
$$ 367636 410350 -60688 41000 465223 91878 68377 -22526 -73428 69415 131562 123753
6813A23753l11410L68199J00156j50993p4636j50281N3786m4461j28068n265O7856
$$ 123753 -187657 180542 280698 129705 55069 -95212 -41426 -85887 -213955 -219220 -151364
6802a51364L22353Q0080k60311J79000m732q8183j3684k84750R3361j13966k7667
$$ -151364 170989 251069 -9242 169758 165026 76843 63159 -221591 -128230 -242196 -269863
6791b69863J83930J13028j8696j86749k9062L03341K0851j1212k21163J65077
$$ -269863 -85933 27095 8399 -178350 -207412 95929 116780 105568 -115595 49482
6781D9482j9718j30622J7910j40795M5920J78063j9674L51293J424k54277M5335
$$ 49482 29764 -100858 -82948 -223743 -177823 240 -19434 331859 333283 79006 124341
6770A24341j53865L1367J19972J1009J12089O6699k20626L34914j8257j86097
$$ 124341 -29524 1843 121815 132824 244913 311612 90986 425900 407643 221546
6760B21546p4687j11043J12000J72414l78363j57510L39379J7173M8834p8612
$$ 221546 146859 35816 147816 320230 -58133 -215643 123736 140909 189743 111131
6750A11131J6268j90869P5624k50284j1420R1960m3558K2679J76908K23855k45352
$$ 111131 127399 -63470 12154 -238130 -249550 -157590 -201148 -178469 -1561 222294 -23058
6739b3058j1093r3486k7429J75550j6987N1268L94821j34426j41307k7694P2575
$$ -23058 -34151 -127637 -155066 20484 3497 54765 449586 315160 173853 146159 218734
6728B18734j05049j41983O2296J24787p736Q8495J1476q3752j6027n1116O4402
$$ 218734 113685 -28298 33998 158785 151049 239544 251020 167268 151241 100125 164527
6717A64527J04632k16108r2097j3836K087J02249J36169l12577K72941J16362
$$ 164527 269159 53051 -39046 -52882 -50795 51454 187623 -124954 147987 264349
6707B64349q2345J4199J50433l93162J23897k4392O8038L60373k32677k93788
$$ 264349 182004 196203 346636 -46526 77371 52979 121017 481390 248713 -45075
6697d5075j96511K39476N3688Q434j08723k00411J66650n2277p8438K21004k14160
$$ -45075 -241586 -2110 51578 60012 -48711 -249122 -82472 -134749 -213187 7817 -206343
6686b06343J6617K68913r8476l9775K75056q6779o741q1759J21725Q3434k25157
$$ -206343 -189726 79187 -19289 -59064 215992 129213 122472 40713 162438 245872 20715
6675B0715R5017Q616l06348J00376J10010m166j08373K79603J45795j70826l24274
$$ 20715 115732 124348 -182000 -81624 28386 24220 -84153 195450 341245 170419 -153855
6664a53855k79523J53781n1707n418J50288J71752O2168M5270K1472O325k14107
$$ -153855 -433378 -279597 -331304 -336722 -186434 -14682 47486 92756 114228 120553 -93554
6653i3554J43401j7652O878K67081m7904N7997J1666j38544m4438N04906j41861
$$ -93554 49847 32195 39073 306154 258250 316247 327913 189369 144931 649837 507976
6642E07976m37672m4374K0861o6126P3299M1673O0777K9468k2495K1480q7108
$$ 507976 70304 25930 46791 -19335 53964 95637 156414 185882 163387 184867 97759
6631I7759o564K25172p5594q1179m9385m7571L188j04261q1888K64378Q5391k4282
$$ 97759 91195 316367 240773 159594 110209 62638 65826 -38435 -120323 144055 229446 205164
6619B05164m7680J81037l4977K0487N9965k67877q3763J20386j85o5981K05060
$$ 205164 157484 338521 303544 324031 383996 116119 32356 152742 152557 86576 291636
6608B91636J17059J55574L6768m38541j1607K65874j02812j56242k13762L12083
$$ 291636 408695 564269 601037 162496 150889 416763 313951 157709 -56053 256030
6598B56030J04966K96297K77556n06281j58168J2446P4165j39655r1200J62128
$$ 256030 360996 657293 934849 428568 270400 282846 357011 217356 126156 288284
6588B88284J5167r2249M90m143K45850j42541k15044K75349N9574r0342m23566
$$ 288284 303451 211202 211692 207549 453399 310858 95814 371163 430737 340395 -83171
6577h3171J7058J70914r1261Q1021j82140Q5589j07316J68336J44126J99503p4090
$$ -83171 -66113 104801 13540 94561 -87579 -1990 -109306 59030 203156 402659 328569
6566C28569j2871k9461j36544Q2827K29772j63540k89692K8387J87999j23991
$$ 328569 315698 286237 149693 232520 462292 298752 9060 37447 225446 101455
6556A01455N0304P4697L9109Q5409l8507q8786n8673J15072l03302K27570N9486
$$ 101455 151759 226456 265565 350974 312467 223681 165008 280080 -23222 204348 263834
6545B63834J45456r8598j52343j51181K48841M9596o9548J82185L7351m62101
$$ 263834 409290 310692 158349 7168 256009 305605 236057 418242 455593 -6508
6535f508j7188M9226K29494J09549P169l5380q8360m4068j30175J72752J91931
$$ -6508 -23696 25530 255024 364573 371742 336362 248002 203934 73759 246511 438442
6524D38442m0730J43982j97582O538k335k5250M9657p796j14178J45399k9971
$$ 438442 397712 541694 344112 350650 348315 323065 372722 364926 250748 396147 366176
6513C66176J99731k10496j87608j8566k57364k1447J50114q483P0195K7169m9951
$$ 366176 565907 355411 167803 149237 -108127 -129574 20540 12057 82252 109421 59470
6502E9470p7207J22463J06017J06142K02916L1918o1414m8378l31317P1836P9045
$$ 59470 -17737 104726 210743 316885 519801 551719 490305 441927 110610 182446 261491
6491B61491J53270k56859p195J92286P647P7261j99114J51727l69338M49277q322
$$ 261491 414761 157902 150707 342993 350640 427901 228787 380514 11176 460453 452131
6480D52131k45486R0606R9860p0303m4048j42105K00324j65658P0693J8061k85526
$$ 452131 206645 297251 397111 326808 282760 140655 340979 175321 246014 264075 -21451
6469b1451M2420L44451n7760R9560J30620L0273k37819p1042N189J10366K27332
$$ -21451 20969 365420 307660 407220 537840 568113 330294 259252 264441 374807 602139
6458F02139l4821o465p8105l9587j29894J7753l806m3126o6389n8181Q2561K00078
$$ 602139 567318 560853 482748 443161 313267 331020 327214 284088 217699 159518 242079 442157
6446D42157J07547J77083M7153m53946q2521K407k8248K21908L7468k44650j68866
$$ 442157 549704 726787 773940 319994 237473 239880 211632 433540 471008 226358 57492
6435E7492o5529M42491J0535m14575j11156L02923K00239Q2709r8010J60430j55249
$$ 57492 -8037 434454 444989 30414 -80742 222181 422420 505129 407119 567549 412300
6424D12300m4143n1964j22967J49353J05103n3129P2957O5374j07615j97585K741
$$ 412300 368157 316193 193226 342579 447682 394553 467510 532884 425269 227684 230425
6413B30425j34513j99772L12198L42015O3028j35963r8628l08089N9430R1190
$$ 230425 95912 -103860 208338 550353 613381 477418 378790 70701 130131 221321
6403B21321L0070N4911J43967Q1766R1838l12318j63544J42305O3923K8528K1638
$$ 221321 251391 306302 450269 532035 623873 311555 148011 290316 354239 382767 404405
6392D04405J91746J60641K9949k41910l92468J96458p9079Q4520J30169N2191
$$ 404405 596151 756792 786741 544831 152363 348821 269742 354262 484431 536622
6382E36622n4839J48399J13118l92464j29188j98627J26362m9078P0712J68809
$$ 536622 481783 630182 743300 350836 221648 23021 149383 100305 171017 339826
6372C39826J77928p2262l07812N3514J3154R4883O5489j63021k46745n5453K0691
$$ 339826 517754 445492 137680 191194 204348 299231 364720 201699 -45046 -100499 -79808
6361g9808R0214K66596J95027j23192r8821k347J59082k55624J47267K831R985
$$ -79808 10406 277002 472029 348837 250016 247669 406751 151127 298394 301225 311210
6350C11210n0580J68490P2928j96370j61874q307K20421l0178j28106K72326L4767
$$ 311210 260630 429120 502048 305678 143804 135497 355918 325740 197634 469960 504727
6339E04727n8349j19511r7337L7724L5287J48315j70459Q7627j0638j6618j38702
$$ 504727 446378 326867 229530 267254 302541 450856 280397 368024 357386 340768 202066
6328B02066J96414o291k65166P6254M5024R5037J43774P8342k73253K93400k78735
$$ 202066 398480 392189 127023 203277 248301 343338 487112 565454 292201 585601 306866
6317C06866O2339j1259j27760K86279p9838m3181j15321K88996l8660j99945r6288
$$ 306866 369205 357946 230186 516465 436627 393446 278125 567121 528461 328516 232228
6306B32228K5719L64499M0545Q399j64292k55363J69717K04537k2493j25342Q390
$$ 232228 257947 622446 662991 671390 507098 251735 421452 625989 603496 478154 486544
6295D86544r7749j1942j0580j31819J9437J00081M4748J73015l2799j26702o5168
$$ 486544 388795 376853 366273 234454 253891 353972 398720 571735 538936 412234 347066
6284C47066J2052J27105j91200n9804J58716j53780R4830J16773J7086q2522R6678
$$ 347066 359118 486223 295023 235219 393935 240155 334985 451758 468844 386322 483000
6273D83000p8016q5836J76744Q6604k6622J30439j49070O4943O5293K08565P9235
$$ 483000 404984 319148 495892 582496 555874 686313 537243 602186 667479 876044 955279
6262I55279j12255j73112k3992J5690J15657k47640N760J10686l09890N05149
$$ 955279 843024 669912 645920 661610 777267 529627 535387 646073 336183 841332
6252H41332j77644k49899L15428J0851j45952j33668l5255L9897K95292r5623
$$ 841332 663688 413789 729217 740068 594116 460448 425193 465090 760382 664759
6242F64759K10222J0469o25591m6400M53412j36817n3889J4722P0610O0389j61724
$$ 664759 874981 885450 259859 213459 666871 530054 476165 490887 561497 621886 460162
6231D60162o43K14355J77636m2297n38822k65652J43154J82646Q4884l7182K08270
$$ 460162 459519 673874 851510 809213 270391 4739 147893 330539 415423 378241 586511
6220E86511j22387K8510J06885K34584p2781q5242l21571K48431O1055k78794
$$ 586511 464124 492634 599519 834103 761322 676080 354509 602940 663995 385201
6210C85201k18088P2494L26040O7551j17030l6946r3969Q3053Q1089q8132L2871
$$ 385201 167113 239607 565647 633198 516168 479222 385253 468306 549395 461263 494134
6199D94134N8192K5282O9879J2414j63523L7966J18614k275P4503K11564j01903
$$ 494134 552326 577608 647487 659901 496378 534344 652958 650683 725186 936750 834847
6188H34847j31142k29719M9416j7920k3592J6363N6765J30993o6246K30673m3343
$$ 834847 703705 473986 523402 505482 481890 498253 555018 686011 619765 850438 807095
6177H07095m55270k66999J52758n185J73756J55497K17452J60989k68793J16299
$$ 807095 351825 84826 237584 232399 406155 561652 779104 940093 671300 787599
6167G87599m15598J64250L51946j58202k65127O0465K08670k73253j2520j15670
$$ 787599 372001 536251 888197 729995 464868 525333 734003 460750 448230 332560
6157C32560j0775J67655K95293k28328k73179N1913p4709K23349q6445P0333N5737
$$ 332560 321785 489440 784733 556405 283226 335139 260430 483779 397334 467667 523404
6146E23404J69160o1852k67599K35612J97710M0787k18797K3240J8043j24550
$$ 523404 692564 630712 363113 598725 796435 837222 618425 641665 659708 535158
6136E35158q8925k1347N5935J54620j81148O6165J8980k02281K19257M15293l96845
$$ 535158 446233 424886 480821 635441 454293 520458 539438 337157 556414 971707 574862
6125E74862m1444L24034L22534r7611l65932p1207j16085J60578r2614j83199
$$ 574862 533418 857452 1179986 1082375 716443 645236 529151 689729 597115 413916
6115D13916J55947M54841J11476l49258l30794j33594K11030J46007q4105k8806
$$ 413916 569863 1024704 1136180 786922 456128 322534 533564 679571 595466 566660
6105E66660K84443k32175J35315L05061l57817l50723l0850L41560J07944j13196
$$ 566660 851103 618928 754243 1059304 701487 350764 319914 661474 769418 656222
6095F56222L9497J15132j01757n2768J56896P6387k34117K1728J26671k73634
$$ 656222 695719 810851 709094 656326 813222 889609 655492 677220 803891 530257
6085E30257k09303M97561J33459j84392q0265J41179k3000k33106j42640J25964
$$ 530257 320954 818515 951974 767582 687317 828496 805496 572390 429750 555714
6075E55714N767J49379N7852P2448J2606l5983N8687R2955j59969N2228J3020
$$ 555714 561481 710860 768712 841160 853766 817783 876470 969425 809456 861684 874704
6064H74704J65526l61764n24675L23102L11720P5965k15210J95285K64868j42254
$$ 874704 1040230 678466 153791 476893 788613 864578 649368 844653 1109521 967267
6054I67267j80954o6532j86106N9617J95394l2991K02410o5360k70304q0907j01800
$$ 967267 786313 719781 533675 593292 788686 755695 958105 892745 622441 541534 439734
6043D39734K0423J79467P8376j1521o6136j68151K52997K05507k05674p4273N704
$$ 439734 460157 639624 718000 706479 640343 472192 725189 930696 725022 650749 656453
6032F56453q7694J02861j21411J97416L21388j05435j15956n5735o8067L373K96345
$$ 656453 568759 671620 550209 747625 1069013 963578 847622 791887 723820 727193 1023538
6021A023538m3786l82712N9864k6980J45289J14981j44834J70593M0862k69914
$$ 1023538 979752 597040 656904 629924 775213 890194 745360 915953 956815 686901
6011F86901M6622k00066J77612J09444J2508j6100J50036N3137j09347l8181j13799
$$ 686901 733523 533457 711069 820513 833021 816921 966957 1020094 910747 872566 758767
6000G58767m3135J57590J65351k23407l89197J83536J84901J49L33782j7149J0835
$$ 758767 715632 873222 1038573 815166 425969 609505 794406 794555 1128337 1111188 1122023
5989A122023l41834J51865k4723j67198J87947K07677k05259j71948O0547K3516
$$ 1122023 780189 932054 907331 740133 928080 1135757 930498 758550 819097 842613
5979H42613K33739q9033j12898N5024o5957O7007J39187n5271K04782j19153j7096
$$ 842613 1076352 987319 874421 929445 863488 930495 1069682 1014411 1219193 1100040 1082944
5968A082944q766P3435j93757O9290k4279R3548J29341k15441K81187k38596J37973
$$ 1082944 1074178 1147613 953856 1023146 998867 1092415 1221756 1006315 1287502 1048906 1186879
5957A186879J6566k02225R144J93711m1840K4497P6988P114K62418P6894r0050
$$ 1186879 1203445 1001220 1010364 1204075 1162235 1186732 1263720 1270834 1533252 1610146 1520096
5946A520096K1294O7906l0063J08062J98231p4307k46001K54706O3973K981M8071
$$ 1520096 1541390 1609296 1579233 1687295 1885526 1811219 1565218 1819924 1883897 1886878 1934949
5935A934949k3826J17741P5143J73549K1611n0777l88043J56345M06492j43806
$$ 1934949 1911123 2028864 2104007 2277556 2299167 2248390 1860347 2016692 2423184 2279378
5925B279378R647K36935j58290L0240Q8683j25056j13746j61263l8515j77156
$$ 2279378 2289025 2525960 2367670 2397910 2486593 2361537 2247791 2086528 2048013 1870857
5915A870857n1161N4137J87020k46610k39550O3913o8423l4830k08773m3664J14999
$$ 1870857 1819696 1873833 2060853 1814243 1574693 1638606 1570183 1535353 1326580 1282916 1397915
5904A397915J86566o4817l10826J1547j87338J25004M89981j42588K1230J4665
$$ 1397915 1584481 1519664 1208838 1220385 1033047 1158051 1648032 1505444 1526674 1541339
5894A541339j04494J73538K53505m11022J34391j1617l46322J95934J47030p9083
$$ 1541339 1436845 1610383 1863888 1452866 1587257 1575640 1229318 1425252 1572282 1493199
5884A493199K3961N5785m22230m0852J87594M2870k99296k7578K13196K14519
$$ 1493199 1517160 1572945 1150715 1109863 1297457 1340327 1041031 1013453 1226649 1441168
5874A441168J61157R8186j72436k10733j73233j03371J35235J78561P5996k62998
$$ 1441168 1602325 1700511 1528075 1317342 1144109 1040738 1175973 1354534 1430530 1167532
5864A167532M704M02K56351K60660l01100o6705L47791j11257o4225j23912j72364
$$ 1167532 1172236 1172638 1428989 1689649 1388549 1321844 1669635 1558378 1494153 1370241 1197877
5853A197877R6826J25915J52859J37442N7399k9513j16515k47463J85539o0970
$$ 1197877 1294703 1420618 1573477 1710919 1768318 1738805 1622290 1374827 1560366 1499396
5843A499396m4757N868J0520j56034J55911L46252k00530o9579Q8151j60167K77607
$$ 1499396 1454639 1460507 1471027 1314993 1470904 1817156 1616626 1547047 1635198 1475031 1752638
5832A752638O5952m3671M985P6653j50451R0934J8729J22740K99380j94038K8516
$$ 1752638 1818590 1774919 1779904 1856557 1706106 1797040 1815769 1938509 2237889 2043851 2072367
5821B072367j34700J09479J33139k20492j91550o9333L18605m077P1768k9206
$$ 2072367 1937667 2047146 2180285 1959793 1768243 1698910 2017515 2013438 2085206 2056000
5811B056000M2701K2849l5604k923o3220j00639n5179O9821j2551L6143K38369
$$ 2056000 2098701 2121550 2085946 2083023 2019803 1919164 1863985 1933806 1921255 1957398 2195767
5800B195767k443L01855J58415N476k16829k40109J93858j63664m4212L3447j62965
$$ 2195767 2193324 2495179 2653594 2659070 2442241 2202132 2395990 2232326 2188114 2221561 2058596
5789B058596K48470K07741J00359k28107k24873K13146o0755M9998P4332M46649
$$ 2058596 2307066 2514807 2615166 2387059 2162186 2375332 2314577 2364575 2438907 2885556
5779B885556r0217j8595n9316P879j15075O6560m7919m9137K05017K07277J79418
$$ 2885556 2795339 2776744 2717428 2725307 2610232 2676792 2628873 2579736 2784753 2992030 3171448
5768C171448K6893m23525J01540J97424J62731j82850n6617J36879J39353J48752
$$ 3171448 3198341 2774816 2876356 3073780 3236511 3053661 2997044 3133923 3273276 3422028
5758C422028l5124M4346K85516J9371M6007l24169J43822k4665J31369J03287
$$ 3422028 3386904 3431250 3716766 3736137 3782144 3457975 3601797 3577132 3708501 3811788
5748C811788r356J81746k52983O5077K00260K277k84691K03520K34654P5830m2249
$$ 3811788 3802432 3984178 3731195 3796272 3996532 3998809 3714118 3917638 4152292 4228122 4185873
5737D185873J89781k85120L25062J81685o0352p1102o8307L39145J2642L10353
$$ 4185873 4375654 4090534 4415596 4597281 4536929 4465827 4397520 4736665 4749307 5059660
5727E059660L1379k28777J51339R5623J86221p23j58248j6918L49405L1962N9755
$$ 5059660 5091039 4862262 5013601 5109224 5295445 5294722 5136474 5119556 5468961 5500923 5560678
5716E560678o5764O441L30384j22185j11944L16462J68136L23832K01626O7714
$$ 5560678 5494914 5501355 5831739 5709554 5597610 5914072 6082208 6406040 6607666 6675380
5706F675380K70954J66701K65101Q2579N3714L27720K41932J33263J6160K98322
$$ 6675380 6946334 7113035 7378136 7460715 7514429 7842149 8084081 8217344 8233504 8531826
5696H531826R7980J73722l5694R3567L867j81578J18462L24386K13991J15700
$$ 8531826 8629806 8803528 8767834 8861401 8865268 8683690 8802152 9126538 9340529 9456229
5686I456229K00132L12075J62195J14051L6794K57367M67726K87131K73786M49970
$$ 9456229 9656361 9968436 10130631 10244682 10281476 10538843 11006569 11293700 11567486 12017456
5676A2017456M58604L17379N22763K57351M14080P45436P03868L53164P71659
$$ 12017456 12476060 12793439 13316202 13573553 13987633 14733069 15436937 15790101 16561760
5667A6561760P58196O46757Q15354M94799O30087K49308N10953R74643M43953
$$ 16561760 17319956 17966713 18782067 19276866 19906953 20156261 20667214 21641857 22085810
5658B2085810J225370J473690J238224J352060J195233J575467J561951J575286
$$ 22085810 23311180 24784870 26023094 27375154 28570387 30145854 31707805 33283091
5650C3283091J919045K434499K578456K656785L059478L278262M144647M866506
$$ 33283091 35202136 37636635 40215091 42871876 45931354 49209616 53354263 58220769
5642E8220769M883849N267358O281536P085803P859085R113477J0240230J0592231
$$ 58220769 63104618 68371976 74653512 81739315 89598400 98711877 108952107 119544338
5634A19544338J0765365J1067396J0753184J0226097R758046R088148Q666970
$$ 119544338 130309703 141377099 152130283 162356380 172114426 181202574 189869544
5627A89869544Q220135P308097M503932J896876j752068n251802p841222r315647
$$ 189869544 198089679 205397776 209901708 211798584 210046516 204794714 196953492 187637845
5619A87637845r615132r619545r021164j0172924j0655487j1366862j1011589
$$ 187637845 178022713 168403168 159382004 149209080 138553593 127186731 116175142
5612A16175142j0000373q755261p951472p320294n745693n416060m900451m146909
$$ 116175142 106174769 97419508 89468036 82147742 76402049 70985989 66085538 61938629
5604F1938629m274294l680574l072185k880098k548564k782063k149918j948080
$$ 61938629 57664335 53983761 50911576 48031478 45482914 42700851 40550933 38602853
5596C8602853k127045j599902j516654j530050j441949j514826j258098r44331
$$ 38602853 36475808 34875906 33359252 31829202 30387253 28872427 27614329 26669998
5588B6669998j158006j292030r36022r60328q45457j063702r75435q27258l12897
$$ 26669998 25511992 24219962 23283940 22323612 21478155 20414453 19439018 18611760 18298863
5579A8298863p91637j104253p63448k72257o38408n09501k83665p34137o06024
$$ 18298863 17507226 16402973 15639525 15367268 14728860 14219359 13935694 13201557 12595533
5570A2595533l79175n15382J951j38113o19843l92402m13055j78826j74566l25796
$$ 12595533 12216358 11700976 11702927 11564814 10944971 10552569 10139514 9960688 9786122 9460326
5560I460326k70545n35902o2078j92349j47779j42506m18930j85499l19650P5075
$$ 9460326 9189781 8653879 8591801 8399452 8251673 8109167 7690237 7504738 7185088 7260163
5550G260163l48987k02917l03362K8772k48767J9943J0596k12160r7649p5894
$$ 7260163 6911176 6708259 6404897 6433669 6184902 6204845 6215441 6003281 5905632 5829738
5540E829738j2759m99978j41009J93264n1226j33623j21051N7515k11832K72121
$$ 5829738 5816979 5317001 5175992 5369256 5318030 5184407 5063356 5120871 4909039 5181160
5530E181160j01889n26787j89208k30985J24543p0854J61820K38870k98327J82530
$$ 5181160 5079271 4552484 4363276 4132291 4256834 4185980 4347800 4586670 4288343 4470873
5520D470873p1675k4207k44990O9766o6606J0204j90176m82306K59951K14180
$$ 4470873 4399198 4374991 4130001 4199767 4133161 4143365 3953189 3470883 3730834 3945014
5510C945014Q6496o4237m5965l65596k13323q6675p099O818K0280L1703K31590
$$ 3945014 4031510 3967273 3921308 3555712 3342389 3255714 3248615 3255433 3275713 3307416 3539006
5499C539006p0002k00761l29991k00307L6446j86693J18047j44709J43487m7647
$$ 3539006 3469004 3268243 2938252 2737945 2774391 2587698 2705745 2561036 2704523 2656876
5489B656876j4129j36113n1310J16695K06135j02787k29702K19124p5621p5524
$$ 2656876 2642747 2506634 2455324 2572019 2778154 2675367 2445665 2664789 2589168 2513644
5479B513644q8876j30269l3514P6733r4167l01564Q3046J35131n3549J62972R7300
$$ 2513644 2424768 2294499 2260985 2337718 2243551 1941987 2025033 2160164 2106615 2269587 2366887
5468B366887J28871k90972K0928j45162l5005J21851J15061N3749m42086n1639
$$ 2366887 2495758 2204786 2225714 2080552 2045547 2167398 2282459 2336208 1894122 1842483
5458A842483L72179j29881k22540K23083K8563j95796J35950J22296J54481j52178
$$ 1842483 2214662 2084781 1862241 2085324 2113887 1918091 2054041 2176337 2330818 2178640
5448B178640j84469k2367K88185j05113m9178j07503k21805j91686L874L44692
$$ 2178640 1994171 1971804 2259989 2154876 2105698 1998195 1776390 1584704 1588578 1933270
5438A933270O9314J18137q5616l15919K2160J01136K9182K67985o5090j22280
$$ 1933270 2002584 2120721 2035105 1719186 1741346 1842482 1871664 2139649 2074559 1952279
5428A952279m7846k06806J61691q8485N0167j19101p4115j21853K5279R4682K3079
$$ 1952279 1904433 1697627 1859318 1770833 1821000 1701899 1627784 1505931 1531210 1625892 1648971
5417A648971o8660p2362r8050P4541J33208N4064K17397l8243k67851l8855J47934
$$ 1648971 1580311 1507949 1409899 1484440 1617648 1671712 1889109 1850866 1583015 1544160 1692094
5406A692094l7383L998l32757N0350j20401J40154L7594o7120k22261J12993K1858
$$ 1692094 1654711 1658709 1325952 1376302 1255901 1396055 1433649 1366529 1144268 1257261 1279119
5395A279119J24J93264K27524k74029k85366Q8549k50194L021J73971j110r4387
$$ 1279119 1279243 1472507 1700031 1426002 1140636 1229185 978991 982012 1155983 1154873 1060486
5384A060486R4234K61724n4673k9045O2663l4k9655j40224J17890k174J07931
$$ 1060486 1154720 1416444 1361771 1332726 1395389 1395355 1365700 1225476 1343366 1341192 1449123
5373A449123J40086j05206n4474k77199K7400K74648n7620P7421J46173k6936
$$ 1449123 1589209 1484003 1429529 1152330 1179730 1454378 1396758 1474179 1620352 1593416
5363A593416o8697J47934j67191j69914k15637K7789P9426Q0991o716j43805M0861
$$ 1593416 1524719 1672653 1505462 1335548 1119911 1147700 1227126 1308117 1301401 1157596 1198457
5352A198457J76347j34982l19133J70110J01219J22998M0700j66435k09430k601
$$ 1198457 1374804 1239822 920689 1090799 1192018 1315016 1355716 1189281 979851 977250
5342I77250L19425J02060k78956J8533k6468N6553Q3528J59156J76500R0683l8198
$$ 977250 1296675 1398735 1119779 1138312 1111844 1168397 1251925 1411081 1587581 1678264 1640066
5331A640066O8429k14408r2617Q6572K5138n0547k9306K87116P1359O7645R9220
$$ 1640066 1708495 1494087 1401470 1488042 1513180 1462633 1433327 1720443 1791802 1859447 1958667
5320A958667L66K63602K38897p3381L0894j09191L8270R2622k03634m93920j02715
$$ 1958667 1959033 2222635 2461532 2388151 2419045 2309854 2348124 2440746 2237112 1743192 1640477
5309A640477L57749O0732m02838o8870O0640m3817k5880M8441J53260k81904j64814
$$ 1640477 1998226 2058958 1656120 1587250 1647890 1604073 1578193 1626634 1779894 1497990 1333176
5298A333176N7810J4438j1761J16463l11781k45969l2548L29181j29531K59061
$$ 1333176 1390986 1405424 1393663 1510126 1198345 952376 919828 1249009 1119478 1378539
5288A378539Q8478j38935j02898j1949j74539J97214L8055k46795J03327J27169
$$ 1378539 1467017 1328082 1225184 1213235 1038696 1235910 1273965 1027170 1130497 1257666
5278A257666N4742j22966l0475Q3294J14165n5694j28097J21982N8296l52978
$$ 1257666 1312408 1189442 1158967 1242261 1356426 1300732 1172635 1294617 1352913 999935
5268I99935J52975r8063J1382q5472K17238L8970K69502J4400k22005k18458N9417
$$ 999935 1152910 1054847 1066229 980757 1197995 1236965 1506467 1520867 1298862 1080404 1139821
5257A139821q213K32201M3992j24849m42295l2530L39980M3643Q0618p5019k67631
$$ 1139821 1131608 1363809 1407801 1282952 840657 808127 1148107 1191750 1272368 1197349 929718
5246I29718l6219k54478K37701P2320J12884q599p6959L403J11832k04750l2125
$$ 929718 893499 639021 876722 949042 1061926 1053327 976368 979771 1091603 886853 854728
5235H54728K38860J66222K18657k29000k0414K66671O6316k71581q7612j08587
$$ 854728 1093588 1259810 1478467 1249467 1229053 1495724 1562040 1290459 1202847 1094260
5225A094260j66382J44153N8542q0089L9996k29312L4659N2999L04486r0116J7418
$$ 1094260 927878 1072031 1130573 1050484 1090480 861168 895827 948826 1253312 1163196 1180614
5214A180614k24363J93612N2425Q519l4790L71204n5516k09503m4580n039J8236
$$ 1180614 956251 1149863 1202288 1210807 1176017 1547221 1491705 1282202 1237622 1232583 1250819
5203A250819R9262J32211K45620n0527m46023K3846K37630K16911n7364J8053
$$ 1250819 1350081 1482292 1727912 1677385 1231362 1255208 1492838 1709749 1652385 1670438
5193A670438p1232J92894J7701j01695K00464l0744j24247j09003j8228L1320
$$ 1670438 1599206 1792100 1809801 1708106 1908570 1877826 1753579 1644576 1626348 1657668
5183A657668p6230p1020j24358Q8605j21054o4921p2964J2886J02473r3331K84681
$$ 1657668 1581438 1510418 1386060 1474665 1353611 1288690 1215726 1228612 1331085 1237754 1522435
5172A522435R2132j15689L43087j8059K34997P0066j5350k50248J45356K50315
$$ 1522435 1614567 1498878 1841965 1823906 2058903 2128969 2113619 1863371 2008727 2259042
5162B259042K6536k03820Q427J51195j6191L646M5825K20458k67917j63825m6921
$$ 2259042 2285578 2081758 2090185 2241380 2225189 2228835 2274660 2495118 2227201 2063376 2016455
5151B016455K02264k05188j19225Q8967J24215j81995r8317j42812n7213K90862
$$ 2016455 2218719 2013531 1894306 1983273 2107488 1925493 1827176 1684364 1627151 1918013
5141A918013k3997J33517J03373k25230J50788k27485j88975N0726K91285K11391
$$ 1918013 1894016 2027533 2130906 1905676 2056464 1828979 1640004 1690730 1982015 2193406
5131B193406q3331P5864O9146j92544k15113J45378J6453j53040N1964K16580
$$ 2193406 2110075 2185939 2255085 2062541 1847428 1992806 2009259 1856219 1908183 2124763
5121B124763m8859j97133l9304r4928K10585J47058J39898j25425k8910Q2541
$$ 2124763 2075904 1878771 1839467 1744539 1955124 2102182 2242080 2116655 2087745 2170286
5111B170286k08135p1658j7784n7072j07662P6381J43622j3356j80057J76721
$$ 2170286 1962151 1890493 1872709 1815637 1707975 1784356 1927978 1914622 1734565 1911286
5101A911286K42095r9075k93449J27051L232L15348Q6039j95472K012J07999K33586
$$ 1911286 2153381 2054306 1760857 1887908 1891140 2206488 2292527 2097055 2099067 2207066 2440652
5090B440652O9413j42674J27578p6717k29627m7464O9339J14531L680P4998N226
$$ 2440652 2510065 2367391 2494969 2418252 2188625 2141161 2210500 2325031 2328711 2403709 2408935
5079B408935N0198m1123K090Q4558N5005R8911L17609n7749k64754l41877J04532
$$ 2408935 2459133 2418010 2420100 2504658 2559663 2658574 2976183 2918434 2653680 2311803 2416335
5068B416335J44053k7953J80854N4649k03634k99718q7698N74722K19714m99029
$$ 2416335 2560388 2532435 2713289 2767938 2564304 2264586 2176888 2751610 2971324 2472295
5058B472295p9603L09248J29242P5169n116m8554P3047j07022K14832j25510n1680
$$ 2472295 2392692 2701940 2831182 2906351 2901235 2852681 2925728 2818706 3033538 2908028 2856348
5047B856348O5090L78108R3350j9848Q1685P9095M3779J81902K21761m69468K06236
$$ 2856348 2921438 3299546 3392896 3373048 3454733 3533828 3577607 3759509 3981270 3511802 3718038
5036C718038r4457q6077J44705q9201p8420j23219J9004o8421j78842J27663J81529
$$ 3718038 3623581 3537504 3682209 3593008 3514588 3391369 3410373 3341952 3163110 3290773 3472302
5025C472302j54573j4482O3959J33808P7525J11531L7960Q7457j22878J0312Q1988
$$ 3472302 3317729 3303247 3367206 3501014 3578539 3690070 3728030 3815487 3692609 3702921 3784909
5014C784909N6169J9345K57970r7845m2148j46849o8655L18173n4118P3252K2067
$$ 3784909 3841078 3860423 4118393 4020548 3978400 3831551 3762896 4081069 4026951 4100203 4122270
5003D122270k50782l530K33372k4748j63664J84620Q2145J82496m3599l57011
$$ 4122270 3871488 3867958 4101330 4076582 3912918 4097538 4179683 4362179 4318580 3961569
4993C961569K98073K1375L08667J5669k74004N0741l72086J53294K96422k26833
$$ 3961569 4259642 4281017 4589684 4605353 4331349 4382090 4010004 4163298 4459720 4232887
4983D232887J271K52966L30640J58502J87384j47708K33838J47837j15310J3685
$$ 4232887 4234158 4487124 4817764 4976266 5163650 5015942 5249780 5397617 5282307 5295992
4973E295992P7415L96261R144m2049L35804k82959J43726N77495L46415L9001
$$ 5295992 5373407 5769668 5778812 5736763 6072567 5789608 5933334 6510829 6857244 6896245
4963F896245M3158N39427Q1688j80462k16352L4867q9408J0082J28586l84127
$$ 6896245 6939403 7478830 7560518 7380056 7163704 7198571 7109163 7119245 7247831 6863704
4953F863704L3784J05907K62106j72832o9988L35527m18869K96337J43099n0289
$$ 6863704 6897488 7003395 7265501 7092669 7022681 7358208 6939339 7235676 7378775 7328486
4943G328486O5316K6803k08647L08758J33603l6918M15590P2172J79377j7310
$$ 7328486 7393802 7420605 7211958 7520716 7654319 7617401 8032991 8105163 8284540 8267230
4933H267230J0414J39077K23328K02417J52284J94693J09742K42516J69972o6080
$$ 8267230 8277644 8416721 8640049 8842466 8994750 9189443 9299185 9541701 9711673 9645593
4923I645593L40582K36158L45701L99661L57453J25799L17933P65912M31309K11542
$$ 9645593 9986175 10222333 10568034 10967695 11325148 11450947 11768880 12534792 12966101 13177643
4913A3177643L83334J77363N18282O29028L41079N81789N63807P88094P82296
$$ 13177643 13560977 13738340 14256622 14885650 15226729 15808518 16372325 17160419 17942715
4904A7942715N24304J080178J017316Q18268J350775R14975J535939J984794J906150
$$ 17942715 18467019 19547197 20564513 21382781 22733556 23648531 25184470 27169264 29075414
4895B9075414K062875J939192K221510K160601K592602K779849K911218K303636
$$ 29075414 31138289 33077481 35298991 37459592 40052194 42832043 45743261 48046897
4887D8046897J997368K206440J699457J163755J064347R52765Q80191Q26389P0551
$$ 48046897 50044265 52250705 53950162 55113917 56178264 57131029 58011220 58837609 58908160
4878E8908160j20738m0671N94291N33636J046675J423032J956319K137184L083268
$$ 58908160 58787422 58746751 59341042 59874678 60921353 62344385 64300704 66437888 69521156
4869F9521156L849647M429677M690938M766977N053712M893462M988605M880192
$$ 69521156 73370803 77800480 82491418 87258395 92312107 97205569 102194174 107074366
4861A07074366N099183M854773M675161M179519L203093J069049r62338l326049
$$ 107074366 112173549 117028322 121703483 125883002 129086095 130155144 129192806 125866757
4853A25866757n555888o853100o969275o026192m663738l276128k548963j670332
$$ 125866757 120310869 113457769 106488494 100462302 95798564 92522436 89973473 88303141
4845H8303141j95457R0131J071779J711058K362662L107771L889991M186830M267450
$$ 88303141 88107684 88197815 89269594 90980652 93343314 96451085 100341076 104527906 108795356
4836A08795356M109664L608410K383321P95363j327335l024040m253530n562979
$$ 108795356 112905020 116513430 118896751 119692114 118364779 115340739 111087209 105524230
4828A05524230o333089o982026o597778o295846n541759m720473l842281l805237
$$ 105524230 99191141 92209115 85611337 79315491 73773732 69053259 65210978 61405741
4820F1405741l230922k786365k766867k176509k104231j959639j808178j633280
$$ 61405741 58174819 55388454 52621587 50445078 48340847 46381208 44573030 42939750
4812D2939750j444180j161779j055956j136268o53545o28898l31061n54004m81271
$$ 42939750 41495570 40333791 39277835 38141567 37488022 36859124 36528063 35974059 35492788
4803C5492788m81489k99378m4417K66417L16801L4870L10668L40662M70273N16239
$$ 35492788 35011299 34711921 34667504 34933921 35250722 35285592 35596260 35936922 36407195 36923434
4793C6923434N95235P28340J231452J273425J487155J601610J923719K068342
$$ 36923434 37518669 38247009 39478461 40751886 42239041 43840651 45764370 47832712
4785D7832712K449450K593431L136880L577651L314347L550529M135652M446709
$$ 47832712 50282162 52875593 56012473 59590124 62904471 66455000 70590652 75037361
4777G5037361M358334M059859L961928L978138L635133L218951K548717K077362
$$ 75037361 79395695 83455554 87417482 91395620 95030753 98249704 100798421 102875783
4769A02875783J171077P51949K84067r1574q11518r62541j206260r90089q61507
$$ 102875783 104046860 104798809 105082876 104991302 104179784 103217243 102010983 101020894 100159387
4760A00159387l88101r4892J62316N14435J074517J345499J907709K098784J975625
$$ 100159387 99771286 99676394 99838710 100353145 101427662 102773161 104680870 106779654 108755279
4751A08755279K424297K034324K110548J939511J644180J169349M84229k09507
$$ 108755279 111179576 113213900 115324448 117263959 118908139 120077488 120561717 120352210
4743A20352210j240387j634572k115931k720421k790897k839847l261292l609908
$$ 120352210 119111823 117477251 115361320 112640899 109850002 107010155 103748863 100138955
4735A00138955l684861l181934l207498l050930k623219k261343j820182j899829
$$ 100138955 96454094 93272160 90064662 87013732 84390513 82129170 80308988 78409159
4727G8409159j807382j800443p89381q53589r71940o64343n36105p35770j010429
$$ 78409159 76601777 74801334 74011953 73158364 72186424 71522081 70985976 70250206 69239777
4718F9239777r35666r96980j222606j082712j183088j317374j291070j782190
$$ 69239777 68304111 67307131 66084525 65001813 63818725 62501351 61210281 59428091
4710E9428091j970151j768231j504731j192364j058085q43307j016967j050940
$$ 59428091 57457940 55689709 54184978 52992614 51934529 51091222 50074255 49023315
4702D9023315m22299m44705j71821j98214O8174K05359M94335M00720P11481J071816
$$ 49023315 48601016 48156311 47984490 47786276 47854450 48059809 48554144 48954864 49666345 50738161
4692E0738161R15449J440068J610747J805099K078844K304019K664800K774354
$$ 50738161 51653610 53093678 54704425 56509524 58588368 60892387 63557187 66331541
4684F6331541L195741L577678M135317M779901N020519N929893O775886P904480
$$ 66331541 69527282 73104960 77240277 82020178 87040697 92970590 99746476 107650956
4676A07650956R048560J0383687J1762386J3426702J5196560J7129808J8875477
$$ 107650956 116699516 127083203 138845589 152272291 167468851 184598659 203474136
4669B03474136K1581280K5291738K9782421L4375389L6964103L3972283K4703785
$$ 203474136 225055416 250347154 280129575 314504964 351469067 385441350 410145135
4662D10145135J3331659J18912j8676744l5550923m2194990l9867851l4022937
$$ 410145135 423476794 423595706 404918962 369368039 327173049 287305198 253282261
4655B53282261k7529535k1949990j7661911j4655590j2663228j0921150j0066631
$$ 253282261 225752726 203802736 186140825 171485235 158822007 147900857 137834226
4648A37834226r870854q755735p851191p577744o667904n922542n470870m826984
$$ 137834226 127963372 119207637 111356446 103778702 97110798 91188256 85717386 80890402
4640H0890402m497968m163660l968089l156945l014187l030944k582397k624072
$$ 80890402 76392434 72228774 68260685 65103740 62089553 59058609 56476212 53852140
4632E3852140k420712k013290k250203j957939j848093j875271j353266j322509
$$ 53852140 51431428 49418138 47167935 45209996 43361903 41486632 40133366 38810857
4624C8810857j613723j304879j311336j540579j536621j380567j245528r77320
$$ 38810857 37197134 35892255 34580919 33040340 31503719 30123152 28877624 27900304
4616B7900304j048190j487250r26292q18168r45836p43324p76352p11759o05999
$$ 27900304 26852114 25364864 24438572 23620404 22674568 21931244 21154892 20443133 19837134
4607A9837134n51307o32023o72666n77549l72064m35886n06768m14431l18392
$$ 19837134 19285827 18653804 17981138 17403589 17031525 16595639 16088871 15674440 15356048
4598A5356048k79911n51816m04326n09008M2036l33203l73752m04949l53935l15555
$$ 15356048 15076137 14524321 14119995 13610987 13653023 13319820 12946068 12541119 12187184 11871629
4588A1871629k3797k43241j67500k80314k96439l24366k93100k57101k05696l03100
$$ 11871629 11847832 11604591 11437091 11156777 10860338 10535972 10242872 9985771 9780075 9476975
4578I476975J55521k58809l09120j56544j14135j65231k86981L7366j3042l22587
$$ 9476975 9632496 9373687 9064567 8908023 8793888 8628657 8341676 8379042 8366000 8043413
4568H043413l07812q3316K59366n2331k18523k02109j23393l8070k13119p9903
$$ 8043413 7735601 7652285 7911651 7859320 7640797 7438688 7315295 7277225 7064106 6984203
4558F984203K07384K76245O4989n7403l19197O531K26481p4257k01921k50570
$$ 6984203 7191587 7467832 7532821 7475418 7156221 7162752 7389233 7314976 7113055 6862485
4548F862485L3276j4948k53154L3405j69551m80492l35064P9394j31050n8765
$$ 6862485 6895761 6880813 6627659 6661064 6491513 6011021 5675957 5755351 5624301 5565536
4538E565536l28496O0053J66446l60409R1281O5336m67023k1299n1372l39054
$$ 5565536 5237040 5297093 5463539 5103130 5194411 5259747 4792724 4771425 4720053 4380999
4528D380999n4083K11016q6003j33016l42259r0182J74969j27106R8303q6075
$$ 4380999 4326916 4537932 4451929 4318913 3976654 3886472 4061441 3934335 4032638 3946563
4518C946563o3633K961J59121J49290m03624q4403j08413m02773J15551k23832
$$ 3946563 3882930 3885891 4045012 4194302 3790678 3706275 3597862 3195089 3310640 3086808
4508C086808k09180j04253p9618k2105J50468P3324M4372K58812k03621O3984
$$ 3086808 2877628 2773375 2693757 2671652 2822120 2895444 2939816 3198628 2995007 3058991
4498C058991k97406J09522M9526l25710Q7511k5354L4087j85810p3181K85873
$$ 3058991 2761585 2871107 2920633 2594923 2682434 2657080 2691167 2505357 2432176 2718049
4488B718049j26713K2809k7543J9166J64475n5025K88j51352m8166k8309Q1561
$$ 2718049 2591336 2614145 2586602 2605768 2770243 2715218 2715506 2564154 2515988 2487679 2569240
4477B569240j05773j16951J15222j88165N8130r7712j16844J01336M9406j1646
$$ 2569240 2463467 2346516 2461738 2273573 2331703 2233991 2117147 2218483 2267889 2256243
4467B256243l0306n9205K8587J27999j88695J07512K93589l80489L7866O1579
$$ 2256243 2225937 2166732 2195319 2323318 2134623 2242135 2535724 2155235 2193101 2254680
4457B254680m4040l95329Q0580K59P7796J04260l745n7269j95417j90222L39789
$$ 2254680 2210640 1815311 1895891 1896150 1973946 2078206 2074461 2017192 1821775 1631553 1971342
4446A971342l4869k73500R2811K05072j78475r6239L20584l14812j26768j50107
$$ 1971342 1936473 1662973 1755784 1960856 1782381 1686142 2006726 1691914 1565146 1415039
4436A415039o1444L6636J34810N9792j10418K85154J34789l89660J03191J40806
$$ 1415039 1353595 1390231 1525041 1584833 1474415 1759569 1894358 1504698 1607889 1748695
4426A748695p5142j94247R0166k35416m7488r1136J29071r104k54323J25425j8399
$$ 1748695 1673553 1479306 1569472 1334056 1286568 1195432 1324503 1315399 1061076 1186501 1168102
4415A168102j733n5950K6998Q2806k29417j013J60327L0791J7226k05304Q8689
$$ 1168102 1166369 1110419 1137417 1220223 990806 989793 1150120 1180911 1198137 992833 1081522
4404A081522J63492j00603k48442K55461l0705L6160K57456j35966j16580o0702
$$ 1081522 1245014 1144411 895969 1151430 1120725 1156885 1414341 1278375 1161795 1101093
4394A101093M7450k53830R4722q7665K57759K11355r9588k75932j21933J10794
$$ 1101093 1148543 894713 989435 901770 1159529 1370884 1271296 995364 873431 984225
4384I84225J4096R3160q1830j01618N6151r5732J73768J82034k7924o5181l2635
$$ 984225 998321 1091481 1009651 908033 964184 868452 1042220 1224254 1196330 1131149 1098514
4373A098514J68493m0050M4402K22044J05023J01871j38060J17537K86535M8847
$$ 1098514 1267007 1226957 1271359 1493403 1598426 1700297 1562237 1679774 1966309 2015156
4363B015156J47493L2408K06993L65687Q2981J21766j27741j78711J08729j46107
$$ 2015156 2162649 2195057 2402050 2767737 2850718 2972484 2844743 2666032 2774761 2628654
4353B628654k69875k70623k70070m1588O7697J72176q2426q9958o9114J46975
$$ 2628654 2358779 2088156 1818086 1776498 1844195 2016371 1933945 1843987 1774873 1921848
4343A921848L763j22845m9962l79107O1201j94303K56221J18125j50510L53006
$$ 1921848 1925611 1802766 1752804 1373697 1434898 1240595 1496816 1614941 1464431 1817437
4333A817437k4558k90978O027N0754J24918N1472j16321J99742l9215j64777K15
$$ 1817437 1792879 1501901 1507928 1558682 1683600 1735072 1618751 1818493 1779278 1614501 1614716
4322A614716J2167o4929R1575J19997J53431j62396P770N2992O8577k24585O0373
$$ 1614716 1626883 1561954 1653529 1773526 1926957 1764561 1772331 1825323 1893900 1669315 1729688
4311A729688K39816N1391M8126j46304q7503n467Q6040j08488J30447q8649J19409
$$ 1729688 1969504 2020895 2069021 1922717 1835214 1829747 1915787 1807299 1937746 1849097 1968506
4300A968506j21181l2561J65408l6150K32155L4769J4561J58700m8617k13693
$$ 1968506 1847325 1814764 1980172 1944022 2176177 2210946 2225507 2384207 2335590 2121897
4290B121897j87222K18838J24353N8807J26305K61582Q5975j24419J57863J60125
$$ 2121897 1934675 2153513 2277866 2336673 2462978 2724560 2810535 2686116 2843979 3004104
4280C004104q3696l94896O8680J73120j04955K40026J07599K93926K44774j41195
$$ 3004104 2920408 2525512 2594192 2767312 2662357 2902383 3009982 3303908 3548682 3407487
4270C407487J47991K02952N0715L60292J61222j79955m1099N5726L34624L35700
$$ 3407487 3555478 3758430 3809145 4169437 4330659 4150704 4109605 4165331 4499955 4835655
4260D835655J45693J38292M61848J43535l7926J19881M9451K57516M28011M87655
$$ 4835655 4981348 5119640 5581488 5725023 5687097 5806978 5856429 6113945 6541956 7029611
4250G029611L89350J14867L35101M31865K18180n9673M12029P92816L86036L09839
$$ 7029611 7418961 7533828 7868929 8300794 8518974 8459301 8871330 9664146 10050182 10360021
4240A0360021O16402N39025M61202N22731N17515P43996N21295P53104O82385
$$ 10360021 10976423 11515448 11976650 12499381 13016896 13760892 14282187 15035291 15717676
4231A5717676R07000J103764R37747R72293Q79705J150845J149074R40391J119242
$$ 15717676 16624676 17728440 18666187 19638480 20518185 21669030 22818104 23758495 24877737
4222B4877737J121042J233732J414846J238680J126618R90523P89349R30202P68362
$$ 24877737 25998779 27232511 28647357 29886037 31012655 32003178 32792527 33722729 34491091
4213C4491091M32291J44689J09392l75813l56655o63930q78799q16071j000302
$$ 34491091 34923382 35068071 35177463 34801650 34444995 33781065 32902266 32086195 31085893
4204C1085893j292582j357369j091773j095905j096019r50182j103716j160314
$$ 31085893 29793311 28435942 27344169 26248264 25152245 24202063 23098347 21938033
4196B1938033j093463p30589q55879r10425p80365n79467q17578q92297n81589
$$ 21938033 20844570 20113981 19258102 18347677 17567312 16987845 16170267 15277970 14696381
4187A4696381l79337p72625o16384o49044n44590n13330m71255k38857n19189
$$ 14696381 14317044 13544419 12928035 12278991 11734401 11221071 10749816 10510959 9991770
4178I991770n7149l05321l98476l77426m08220k25569l39504m12607k98380j74101
$$ 9991770 9934621 9629300 9230824 8853398 8445178 8219609 7880105 7467498 7169118 6995017
4168F995017O389m28522m70707n3125l6258k38228k45771j48345k87856J7123
$$ 6995017 7001406 6572884 6102177 6049052 6012794 5774566 5528795 5380450 5092594 5109717
4158E109717j58534k44220J21500l57376k02619j89208k89522o4659k75549k04113
$$ 5109717 4951183 4706963 4828463 4471087 4268468 4079260 3789738 3725079 3449530 3245417
4148C245417J2070k49038J00028n8742l7338J91782o0100n499r6698m15507O1501
$$ 3245417 3257487 3008449 3108477 3049735 3012397 3204179 3144079 3138580 3041882 2626375 2687876
4137B687876k08683r5808j6338n3087o8768l400M3360m1687J38954p408k98766
$$ 2687876 2479193 2383385 2367047 2313960 2245192 2241792 2285152 2243465 2382419 2375011 2076245
4126B076245J5130k84407j07744R4119P5638j90785L4744j69122p6479K3760j15551
$$ 2076245 2091375 1806968 1699224 1793343 1868981 1678196 1712940 1543818 1467339 1491099 1375548
4115A375548l5642J91491J50612n906r3266k1525l47146J12859J18211j50978
$$ 1375548 1339906 1531397 1682009 1676103 1582837 1561312 1214166 1327025 1445236 1294258
4105A294258j30881n2614p5768j43003J95675L67412M2047k28246k45008q7091
$$ 1294258 1163377 1110763 1034995 891992 1087667 1455079 1497126 1268880 1023872 936781
4095I36781m7759j25898k3415J3549K43125j13308J03765J11149M24848k98380
$$ 936781 889022 763124 739709 753258 996383 883075 986840 1097989 1522837 1224457
4085A224457k07129p144m7733m10703L6561J0424J2359Q2237l8547K2858j63840
$$ 1224457 1017328 1010184 962451 551748 588309 598733 611092 693329 654782 677640 513800
4074E13800J37921n33709L0602M43486J0511K11971K1090k33778k27592m3657
$$ 513800 651721 118012 148614 592100 602611 814582 835672 601894 374302 330645
4064C30645J7107P8603m3443j13098L1787J09777R7240L8830m5493k32261Q8951
$$ 330645 347752 426355 382912 269814 301601 411378 508618 547448 501955 269694 358645
4053C58645J73972q4401R715K0315j51912Q5892J55455j82988o8767J04398j83459
$$ 358645 532617 448216 457931 478246 326334 412226 567681 384693 315926 420324 236865
4042B36865M0770K3959j89500K61950n0461M7850l19934O2968j9716Q7038K17798
$$ 236865 277635 301594 112094 374044 323583 371433 51499 114467 94751 181789 399587
4031C99587M023j27795K95956k19180j27872Q8817K0125j07402M9665n8384j95698
$$ 399587 403610 275815 571771 352591 224719 313536 333661 226259 275924 217540 21842
4020B1842r4352K17319j4522j86449L296m9526L60335R6303l7720l11023J71330
$$ 21842 -72510 144809 130287 -56162 -52866 -102392 257943 354246 316526 5503 176833
4009A76833j42710r501J54943O0963l9513j47599Q548M3260N0191j72074M6560
$$ 176833 34123 24622 179565 240528 201015 53416 61964 105224 155415 -16659 29901
3998B9901J7316j46856M873N8402m30186k5022L8532K47042J63491J96945J4186
$$ 29901 47217 -99639 -94766 -36364 -466550 -491572 -453040 -205998 -42507 154438 168624
3987A68624j87753K8110N5852K3741j05860Q4249m1630L5505m1942j38344q6488
$$ 168624 -19129 8981 64833 88574 -17286 66963 25333 60838 18896 -119448 -205936
3976b05936K29507j10102k7557J80746o8707k54841k28269L60308K69510k46761
$$ -205936 23571 -86531 -114088 66658 -2049 -256890 -485159 -124851 144659 -102102
3966a02102l327j90804j3717J63288J99517k94238j36697P3868J22588M1821J756
$$ -102102 -105429 -296233 -309950 -146662 52855 -241383 -378080 -304212 -181624 -139803 -138047
3955a38047n4420m0355r9853Q5411k26213j16207J922L47221K6860k576J83802
$$ -138047 -192467 -232822 -332675 -247264 -473477 -589684 -587762 -240541 -213681 -216257 -32455
3944c2455j08829L07833n0318k49821k03664J95945q9652k45899O7853L17235
$$ -32455 -141284 166549 116231 -133590 -337254 -141309 -230961 -476860 -409007 -91772
3934i1772L81673j38967k43289O4910P5430k2448p0157k00835k04637K25407K7357
$$ -91772 289901 150934 -92355 -27445 47985 25537 -44620 -245455 -450092 -224685 -197328
3923a97328j07197q8968k22798K69717M3241K77334r0200J2030p0300l29663K18347
$$ -197328 -304525 -393493 -616291 -346574 -303333 -25999 -116199 -104169 -174469 -504132 -285785
3912b85785J1092K0888K15037j54138K0450J37180J30482j61035l12837K39357
$$ -285785 -274693 -253805 -38768 -192906 -172456 -35276 95206 -65829 -378666 -139309
3902a39309K31958k20921k02112p8584L89178N9148j06274P8469j15001m79371
$$ -139309 92649 -128272 -330384 -408968 -19790 39358 -66916 11553 -103448 -582819
3892e82819J62859K57365J68943J25757k31616J9980o3994k07804j51691K68484
$$ -582819 -419960 -162595 6348 132105 -99511 -79531 -143525 -351329 -503020 -234536
3882b34536J34631n7867j19554j20630K46998k8712J39480j19175K5707J04597
$$ -234536 -99905 -157772 -277326 -397956 -150958 -179670 -40190 -159365 -133658 -29061
3872b9061j11411J64764K25290J90721k17655j74788n0227O9352j29589j52131
$$ -29061 -140472 24292 249582 440303 222648 47860 -2367 66985 -62604 -214735
3862b14735K1313K97181m32031J71185K13995m11957j22371K55421j64933J68045
$$ -214735 -193422 103759 -328272 -157087 56908 -355049 -477420 -221999 -386932 -218887
3852b18887q2200j11338J52974K53801l07053j55636o0831K20432L45121N3659
$$ -218887 -301087 -412425 -259451 -5650 -312703 -468339 -529170 -308738 36383 90042
3842I0042k59534q871k12789O5904J51694J87038K86201J65213n42777k00448
$$ 90042 -169492 -178363 -391152 -325248 -173554 13484 299685 464898 -77879 -278327
3832b78327O3217J23873R5643k21498O6226K94899L1679k22198q0010j17943K3648
$$ -278327 -215110 -91237 4406 -217092 -150866 144033 175712 -46486 -126496 -244439 -220791
3821b20791J63784M5217o8216j2930k13107J36515N6396l3103J8683k41597r1508
$$ -220791 -57007 -11790 -80006 -92936 -306043 -169528 -113132 -146235 -127552 -369149 -460657
3810d60657N07652j60100o1882k3567P3213m0673J0053J24306m8244p5682M628
$$ -460657 46995 -113105 -174987 -198554 -125341 -166014 -155961 -31655 -79899 -155581 -150953
3799a50953N8456j02035j08061K62128K8707k19009k5183J62640k24918J35971
$$ -150953 -92497 -194532 -302593 -40465 -11758 -230767 -255950 -93310 -318228 -182257
3789a82257j51730J29425L32541J8576j02958l9139L81992l06129j74983K8348
$$ -182257 -333987 -204562 127979 146555 43597 4458 386450 80321 -94662 -66314
3779f6314k69544K43273K7292j83057J24298J37165k5532J90726J53630r3823
$$ -66314 -335858 -92585 -65293 -248350 -124052 13113 -12419 178307 331937 238114
3769B38114r6493p5600J89440p003l62452J32349M85342J9568n88205L844m1796
$$ 238114 141621 66021 255461 248458 -113994 18355 503697 523265 -64940 -61096 -102892
3758a02892J7134k45253R4675q4726j31644P9206n4299N6038L640J22364o6690
$$ -102892 -85758 -331011 -236336 -321062 -452706 -373500 -427799 -371761 -368121 -245757 -312447
3747c12447o7572m2471J97332K24366J96975L8017o7039j83953J57721o6866j25808
$$ -312447 -380019 -422490 -225158 -792 196183 234200 167161 -16792 140929 74063 -51745
3736e1745Q418M16943k15405L7482L9639l67364l45926J45956K52854N2283J35110
$$ -51745 -43327 373616 158211 195693 235332 -132032 -477958 -332002 -79148 -26865 108245
3725A08245J56471J97780k95158J49175j0876J3813J67387Q5944k86927k45450
$$ 108245 264716 462496 167338 316513 305637 319450 486837 572781 285854 40404
3715D0404J43498j76071J60128j86256K32348m47331r3499N3137k55355J53339
$$ 40404 183902 7831 167959 -18297 214051 -233280 -326779 -273642 -528997 -375658
3705c75658k12219Q5883K6649j65146o336J65819K12738l2200r4138J44651q2533
$$ -375658 -587877 -501994 -475345 -640491 -646827 -481008 -268270 -300470 -394608 -249957 -332490
3694c32490N9103q5496o9115J89087N4971j66628N3009L6502J75251J7932p6342
$$ -332490 -273387 -358883 -427998 -238911 -183940 -350568 -297559 -261057 -85806 -67874 -144216
3683a44216J27877p4874o4217J79976P0275j02669o2947Q3118R2151o9537j31772
$$ -144216 -16339 -91213 -155430 24546 94821 -7848 -70795 12323 104474 34937 -96835
3672i6835P9785L32234p0300k33665J9706m6463K6248k45411N5934Q2407Q18P3055
$$ -96835 -17050 315184 244884 11219 30925 -15538 10710 -234701 -178767 -96360 -95542 -22487
3660b2487J0036K4621J90252n17325j48395J22468N0446o7545Q5918K09907P707
$$ -22487 -12451 12170 202422 -314903 -463298 -340830 -290384 -357929 -272011 -62104 -54397
3649e4397k67236m3148J16561K6277k14984j52198N6984O1938P5614L38917K68504
$$ -54397 -321633 -364781 -248220 -221943 -436927 -589125 -532141 -470203 -394589 -55672 212832
3638B12832m09621j9404J42658J52965j33353J09321j84770J08610j86433l9072
$$ 212832 -196789 -216193 -73535 79430 -53923 55398 -129372 -20762 -207195 -246267
3628b46267o189P8290P2J00928j61948J90877j01284J11064L0619j40544K87325
$$ -246267 -252456 -174166 -174094 -73166 -235114 -44237 -145521 -34457 -3838 -144382 142943
3617A42943r9667K1014r9716j3667p9657K45808J69455j84659K1091j96155o0099
$$ 142943 43276 64290 -35426 -49093 -128750 117058 286513 101854 122945 -73210 -133309
3606a33309L19140k49838k4366Q783P4401K09763j2024k81819J0235J76749O9595
$$ -133309 185831 -64007 -88373 -79590 -5189 204574 192550 -89269 -79034 97715 167310
3595A67310k54573J30017K31521j09271k28976R0260n387K43190J3117L223l6191
$$ 167310 -87263 42754 274275 165004 -63972 26288 20901 264091 277208 280431 244240
3584B44240j78252R896k71596J06016K46989o792k5742O6628n3073J03634L9674
$$ 244240 65988 75884 -195712 -89696 157293 150501 124759 191387 138314 241948 281622
3573B81622J41790J75275o3551q4927p4063k12805N2766J57392m3915j37857k28940
$$ 281622 423412 598687 535136 450209 376146 163341 216107 373499 329584 191727 -37213
3562c7213m1025K95928J11405L7048j7609O087j09030k22012j65628L14195R2054
$$ -37213 -78238 217690 329095 366143 348534 354621 245591 23579 -142049 172146 264200
3551B64200J82727k87428j72956J9666O0315J04398J17273r4752q6164l2108K18852
$$ 264200 446927 159499 -13457 6209 66524 170922 288195 193443 107279 75171 294023
3540B94023r5728j33005m871n649n5865J16371K9884Q8890K57432j64163J53020
$$ 294023 198295 65290 60419 54770 -1095 115276 145160 234050 491482 327319 480339
3529D80339J55502j05036j8444J72587r4858n8824j66448J10271j03180J80311
$$ 480339 635841 530805 512361 684948 590090 531266 364818 475089 371909 552220
3519E52220j95755n0994O2845k1103L49991j57648o9623J12479k70337J69843
$$ 552220 356465 305471 368316 347213 697204 539556 469933 582412 312075 481918
3509D81918j64786K44095K37632l6081M12562J96493l94915J72494K773k163r5274
$$ 481918 317132 561227 798859 762778 1175340 1371833 976918 1149412 1152185 1150022 1054748
3498A054748O5337O9979j59228K04592L19466j38961J83847R7895j92520L72996
$$ 1054748 1120085 1190064 1030836 1235428 1554894 1415933 1599780 1697675 1505155 1878151
3488A878151K9788q7091K4090K30870L22710J01739O2985L39287j7741J84243
$$ 1878151 1907939 1820848 1844938 2075808 2398518 2500257 2563242 2902529 2884788 3069031
3478C069031M49289J76845N5975o336M76869P4124j12044J35267K113j92840n89910
$$ 3069031 3518320 3695165 3751140 3744804 4221673 4295797 4183753 4319020 4321133 4128293 3538383
3467C538383m35969m50858P4560l503j62589j69520L16089L5222n9562j39598
$$ 3538383 3102414 2651556 2726116 2722613 2560024 2390504 2706593 2741815 2682253 2542655
3457B542655J7537j13641k42704r4381j95445J79139P8937K97110J2504K37293
$$ 2542655 2560192 2446551 2203847 2109466 1914021 2093160 2172097 2469207 2481711 2719004
3447B719004N2318J99269L87108M57736L06246P4420J79795J41415K88206j11727
$$ 2719004 2771322 2970591 3357699 3815435 4121681 4196101 4375896 4517311 4805517 4693790
3437D693790p36992n27162m12910k38757k6547m57389j25793l5080j64198k61124
$$ 4693790 3956798 3429636 3016726 2777969 2751422 2294033 2168240 2133160 1968962 1707838
3427A707838J6994J71247k52880r6373j4189J67519K0065j9333k60721K9685L56483
$$ 1707838 1724832 1896079 1643199 1546826 1532637 1700156 1720221 1700888 1440167 1469852 1826335
3416A826335k36984J87695j36399J16927M60344J97727O778J52250M026Q5837
$$ 1826335 1589351 1777046 1640647 1757574 2217918 2415645 2422423 2574673 2578699 2664536
3406B664536k47666j05130l15964l49619j08285L8132q6780j31728J9545j85933
$$ 2664536 2416870 2311740 1995776 1646157 1537872 1576004 1489224 1357496 1377041 1191108
3396A191108m6282j46447l29587P5469J17577J06659m770n1353j00906O671l5045
$$ 1191108 1144826 998379 668792 744261 861838 968497 963727 912374 811468 818139 783094
3385G83094k30261j81232J30169J46899J01969K9011O2642j27998j14681j33179
$$ 783094 552833 371601 501770 648669 750638 779649 842291 714293 599612 466433
3375D66433p596J15902j23622k2820N9919J14851j35450K95624p2971j40785k20966
$$ 466433 458837 574739 451117 428297 488216 603067 467617 763241 690270 549485 328519
3364C28519K2531l20428J03038N4026K45335k6662l27755J31645o0042o2044R6617
$$ 328519 351050 30622 133660 187686 433021 406359 78604 210249 150207 88163 184780
3353A84780K22336j13333p9800K682L7795M0996J47880P698l6038k22528j93089
$$ 184780 407116 293783 213983 216665 254460 295456 443336 451034 414996 192468 -621
3342f21J00546J23929r3985m7776N35465o2248j68662j39859p1467m2975p1694
$$ -621 99925 223854 129869 82093 617558 555310 386648 246789 175322 132347 60653
3331F0653J69029l167M6930J4690L515J48104j97208J47369j7529M416K9241q3051
$$ 60653 229682 226515 273445 288135 291650 439754 242546 389915 372386 376802 406043 322992
3319C22992o6610J10818j7239K61796j059j95361j890j74086o1172j33460M7306
$$ 322992 256382 367200 349961 611757 610698 415337 413447 239361 178189 44729 92035
3308I2035K55777q4987j33213n937q1188K84533L56977j80909j80556J29634j382
$$ 92035 347812 262825 129612 123675 42487 327020 683997 503088 322532 452166 450784
3297D50784j41433k48007R7520k6969Q645q9506j42643p5013J97693J87125K49329
$$ 450784 309351 61344 158864 131895 140540 51034 -91609 -166622 31071 218196 467525
3286D67525r3150j11456j33029j11607j66645M04228j3996k19205p6563K22620
$$ 467525 374375 262919 129890 18283 -148362 255866 241870 22665 -53898 168722
3276A68722o5820M4231L6825k48554j314J56268M5078J8955J17810j72123m07567
$$ 168722 102902 147133 183958 -64596 -65910 90358 135436 154391 272201 100078 -307489
3265c07489p7185K24451J81243L4066l2343r6952K0530N3697k36650K9693J46266
$$ -307489 -384674 -160223 21020 55086 22743 -74209 -53679 18 -236632 -206939 -60673
3254f0673L20384m4315j3671j75231k33857K71908j8132j14907J30769J95422
$$ -60673 259711 215396 201725 26494 -207363 64545 46413 -68494 62275 257697
3244B57697o3962k54618j2154q0365K69678o9309l61629j50465M3697P5902J28316
$$ 257697 193735 -60883 -73037 -153402 116276 46967 -314662 -465127 -421430 -345528 -217212
3233b17212J02982K36480K089k10450k24769J21248J36533r5677k06978J78169
$$ -217212 -114230 122250 124339 -86111 -310880 -189632 -53099 -148776 -355754 -177585
3223a77585j05293J43827K06670m20381j42196J67336K5172M49093j27760l50553
$$ -177585 -282878 -139051 67619 -352762 -494958 -327622 -302450 146643 18883 -331670
3213c31670J61544J26600K2383O1430J59853j35477J7292k3539J3385J3611o2649
$$ -331670 -170126 -43526 -21143 40287 200140 64663 81955 58416 71801 85412 22763
3202B2763K9697q0291j89559k9920J49208L70520k26450k86043j1983J91415j95431
$$ 22763 52460 -27831 -217390 -247310 -98102 272418 45968 -240075 -252058 -60643 -256074
3191b56074r3199L10112J63657k95163l8013K05290k16692o2542J80397L630L3281
$$ -256074 -349273 -39161 124496 -170667 -208680 -3390 -220082 -282624 -102227 -98597 -65316
3180f5316N2952j63101J51347l458P1124K01543o3469n7278O452k0030j03182
$$ -65316 -12364 -175465 -24118 -27576 43548 245091 181622 124344 130796 110766 7584
3169G584j71918j08175L46032M25k09769L27788l6466j82197j08654j67251J27467
$$ 7584 -164334 -272509 73523 73948 -135821 191967 155501 -26696 -135350 -302601 -175134
3158a75134K88671k0736j06563J75973L0364K39401k17108J25567n8955M4363
$$ -175134 113537 92801 -13762 162211 192575 431976 214868 340435 281480 325843
3148C25843n6672j05825J57050K47071j4463k57001j17621K7732J07762q345J7846
$$ 325843 269171 163346 320396 567467 553004 296003 178382 206114 313876 305531 323377
3137C23377j32855J55496K37603j2469k0338J02732k24535k71498M886R0499L5412
$$ 323377 190522 346018 583621 571152 550814 653546 429011 157513 162399 252898 288310
3126B88310J87913k41763q3608M775k23154L39924J15767p1178J56074k12826
$$ 288310 476223 234460 150852 155627 -67527 272397 388164 316986 473060 260234
3116B60234j16624J04113L45072Q8355n7543k0563k89150n7872M12819j58523
$$ 260234 143610 247723 592795 681150 623607 603044 313894 256022 668841 510318
3106E10318l6621j71890J08102M5554L8641L2237K9211K30713K508J67088j46278
$$ 510318 473697 301807 409909 455463 494104 526341 555552 786265 788773 955861 809583
3095H09583j6061L65925Q945j10797P4017K30960n2180o810k08972l0349J77742
$$ 809583 793522 1159447 1168392 1057595 1131612 1362572 1310392 1303582 1094610 1064261 1242003
3084A242003N0820J22691O9400j20562J20074m7152L20830L2197m06885k0351
$$ 1242003 1292823 1415514 1484914 1364352 1484426 1437274 1758104 1790301 1383416 1363065
3074A363065j85950m0149j4796l88142q5210J17897o1847j49789k41025K5884
$$ 1363065 1177115 1136966 1122170 734028 648818 766715 704868 555079 314054 339938
3064C39938K0570r6563j87535L77183L35678j78379m07091J11588j01024l5341
$$ 339938 360508 263945 76410 453593 789271 610892 203801 315389 214365 179024
3054A79024l25029J67131L50757k44q5058m9682j17289q6723L7585J80404N1878
$$ 179024 -146005 21126 371883 371639 286581 236899 119610 32887 70472 250876 302754
3043C02754o3409j51491q7873L9752l27972K02738J73344j84427R931O6945M1138
$$ 302754 239345 87854 -19 39733 -288239 -85501 87843 -96584 -86653 -19708 21430
3032B1430m2714M5489k09790J9466o914j44166l9067J87467K59346k44794J06685
$$ 21430 -21284 24205 -185585 -166119 -173033 -317199 -356266 -168799 90547 -154247 -47562
3021d7562K0257j22758R0116K9157J50822m14460j15256K62930J53044J19979
$$ -47562 -27305 -150063 -59947 -30790 120032 -294428 -409684 -146754 6290 126269
3011A26269r5425m9778n1084l3953J69289J26512j32900k69177J57434J67951
$$ 126269 30844 -18934 -70018 -103971 65318 191830 58930 -210247 -52813 115138
3001A15138L9453r5530j38768m4434j70426j6872K23434N2909j7121K5494J06371
$$ 115138 154591 59061 -79707 -124141 -294567 -311439 -88005 -35096 -52217 -26723 79648
2990G9648K61047P1735l66982j18785M4533p2398j91737Q0133O4441j44549J65272
$$ 79648 340695 412430 45448 -73337 -28804 -101202 -292939 -212806 -148365 -292914 -127642
2979a27642r8625k2361K35176J83879l70336r5650P4550J25921q214M5532K09253
$$ -127642 -226267 -248628 -13452 170427 -199909 -295559 -221009 -95088 -103302 -57770 151483
2968A51483j89783o42K17357k65887j73278k43118L45447L624m3446j04840J09029
$$ 151483 -38300 -38942 178415 -87472 -260750 -503868 -158421 -154797 -198243 -303083 -194054
2957a94054l6219M8753L8717p6947K65737j06364j24347j67503N3182j99407M20250
$$ -194054 -230273 -181520 -142803 -219750 45987 -60377 -184724 -352227 -299045 -498452 -78202
2946g8202o7017p4655K13282j35026j70942M12175r4981k26395J77012l50417
$$ -78202 -145219 -219874 -6592 -141618 -312560 99615 4634 -221761 -44749 -395166
2936c95166K66692j57729j16132M79602J72240j62139n5794k95857o457l4195
$$ -395166 -128474 -286203 -402335 77267 249507 87368 31574 -264283 -270740 -304935
2926c04935K33961m2290j84640R0386R9381K13756J11566j00035k78705J21119
$$ -304935 -70974 -113264 -297904 -207518 -108137 105619 217185 117150 -161555 -40436
2916d0436L38930r8498j78201k04286K07435K70485j63393K0004J09400p3399
$$ -40436 298494 199996 21795 -182491 24944 295429 132036 152040 261440 188041
2906A88041m02771J22425J0427Q2026J42070j33556j15959j31801j1574J15191
$$ 188041 -214730 -92305 -81878 148 142218 8662 -107297 -239098 -250672 -135481
2896a35481J57287j14562l6511M06683j51021j84877m0529J88576k3776j01699
$$ -135481 21806 -92756 -129267 277416 126395 -58482 -99011 89565 65789 -35910
2886c5910J16211m4560k96666j21610J80735L3251J48079R19j13606O2687K52395
$$ -35910 80301 35741 -260925 -382535 -201800 -168549 -20470 -19551 -133157 -70470 181925
2875A81925j49305k86879J60251J10998k6100j20317K12544j23935m89076J72742
$$ 181925 32620 -254259 -94008 16990 -9110 -129427 83117 -40818 -529894 -357152
2865c57152K60192L5108J12174L30725l19111j30680k2202j37675K16382j05494
$$ -357152 -96960 -61852 50322 381047 61936 -68744 -90946 -228621 -12239 -117733
2855a17733j35837M8566J78679J19007M6094j86651r9913M9368L25960k2424m42700
$$ -117733 -253570 -205004 -26325 92682 138776 -47875 -147788 -98420 227540 205116 -237584
2844b37584m9284j79391J62160J57604j26609K32307J6061j01390K57208k12866
$$ -237584 -286868 -466259 -304099 -146495 -273104 -40797 -24736 -126126 131082 -81784
2834h1784k22159N9054k1596N9515l2747l20L26929J67586k82699j57436N9410
$$ -81784 -303943 -244889 -266485 -206970 -239717 -240037 86892 254478 -28221 -185657 -126247
2823a26247K32383J94588J37625m32885j26075l7726K9349J47586O6303k51477
$$ -126247 106136 300724 438349 5464 -120611 -158337 -128988 18598 84901 -166576
2813a66576j72598j33448J54932J75761N4093k35040k4529J28921N7398P6587
$$ -166576 -339174 -472622 -317690 -141929 -87836 -322876 -347405 -218484 -161086 -84499
2803h4499j51718L44310R034L2285p8667K04954j66606k71163R686J30481j19127
$$ -84499 -236217 108093 117127 149412 70745 275699 109093 -162070 -152384 -21903 -141030
2792a41030n329K86481j67951J41287r1623k11972m689J6259k42086K32581n844
$$ -141030 -146359 140122 -27829 113458 21835 -190137 -194826 -178567 -420653 -188072 -193916
2781a93916N8817J20759k44865K10239j81527j2334R2440q5713K18601j41391
$$ -193916 -135099 -14340 -259205 -48966 -230493 -242827 -150387 -236100 -17499 -158890
2771a58890q1577J61877P1440J5006j04566J37771o5614Q8361J60835k38709o1183
$$ -158890 -240467 -78590 -7150 7856 -96710 41061 -24553 63808 224643 -14066 -75249
2760g5249M7532j88533J54552O0653j48610Q1641j24393m3025J73090J25525J59130
$$ -75249 -27717 -216250 -61698 -1045 -149655 -68014 -192407 -235432 -62342 63183 222313
2749B22313k62605k9406L04872r1294k27760j06526J81413n9801o742K4338k84685
$$ 222313 -40292 -69698 235174 143880 -83880 -190406 -8993 -68794 -75536 -51198 -335883
2738c35883K17825K14621j93661j70819K01796J16326m944J23334l8170K689j58322
$$ -335883 -118058 96563 -97098 -267917 -66121 50205 45261 168595 130425 133114 -25208
2727b5208l32176Q1901J23259q5502J6773J9293k01557N0678m5515J17378J76553
$$ -25208 -357384 -275483 -152224 -237726 -220953 -201660 -403217 -352539 -398054 -280676 -104123
2716a04123m6367q5935J25245P7505k0038j45447R9489k23512M8879J09604j52130
$$ -104123 -150490 -236425 -111180 -33675 -53713 -199160 -99671 -323183 -274304 -164700 -316830
2705c16830o288j02430K01570j8073r3793r4343R522J02470J36711J65083m1081
$$ -316830 -323118 -425548 -223978 -242051 -335844 -430187 -420665 -318195 -181484 -16401 -57482
2694e7482J46602l5166j39364n2536j62709L5574q8404J2767K96162j13627J47607
$$ -57482 89120 53954 -85410 -137946 -300655 -265081 -353485 -340718 -44556 -158183 -10576
2683a0576J37546l02066Q763o4675J33781M9307p2529J80123L4510n7824J87452
$$ -10576 126970 -175096 -166333 -231008 -97227 -47920 -120449 59674 94184 36360 223812
2672B23812k22824j36679J46693o4022K9619J49464r1941N7607J50603k34108
$$ 223812 988 -135691 11002 -53020 -23401 126063 34122 91729 242332 8224
2662H224J01847J59612p7259j18785k1151J4676l42866K33185O4690K4830n2384
$$ 8224 110071 269683 192424 73639 52488 67164 -275702 -42517 22173 47003 -5381
2651e381l9790K04411j66800R9399R6456j82437j77753K7972Q547p0832J71153
$$ -5381 -45171 159240 -7560 91839 188295 5858 -171895 -143923 -135376 -206208 -35055
2640c5055j26444j77270p1561L85518r8989j93275l0504j79011J83653R0599K25153
$$ -35055 -161499 -338769 -410330 -24812 -123801 -317076 -347580 -526591 -342938 -252339 -27186
2629b7186j66301r790J03136J18317M4262o4730P7131k36874J14023K65527q2875
$$ -27186 -193487 -203277 -100141 18176 62438 -2292 74839 -162035 -48012 217515 134640
2618A34640j43849k18541P1015J31648p3078q8973R0123J85731J82536q6323r7371
$$ 134640 -9209 -227750 -156735 -25087 -98165 -187138 -97015 88716 271252 184929 87558
2607H7558J20034N7029r8900P7604k7491k21977n8114P3103p3640Q1964N2069
$$ 87558 207592 264621 165721 243325 215834 -6143 -64257 8846 -64794 17170 69239
2596F9239j98923L44286j35380J13650j4657j7989j65173j09336K28705o2274
$$ 69239 -129684 214602 79222 192872 178215 160226 -4947 -114283 114422 52148
2586E2148O5483j96637Q256L08437p6164R6515j60160j53721m5886j00572J56690
$$ 52148 117631 -79006 -70750 237687 161523 258038 97878 -55843 -101729 -202301 -45611
2575d5611l6530K65590j5596m13622K15994N4009j75439K84646J51056L9280j89193
$$ -45611 -82141 183449 167853 -245769 -29775 24234 -151205 133441 284497 323777 134584
2564A34584k24069J44871R266j91276l6559R7254K24519k32950m89512K12929
$$ 134584 -89485 55386 64652 -126624 -163183 -65929 158590 -74360 -563872 -350943
2554c50943M56363q555j11032L8886K6415L8612O4508j33306M6676j86880k66397
$$ -350943 105420 96865 -14167 24719 51134 89746 154254 20948 67624 -119256 -385653
2543c85653j33329j04117L64982J24319k8542R9947J09160Q5507j56202N1214
$$ -385653 -518982 -623099 -258117 -133798 -162340 -62393 46767 132274 -23928 27286
2533B7286k23216J39004j50151j86859L15112L13337L5968J98934j95427k49177
$$ 27286 -195930 -56926 -207077 -393936 -78824 234513 270481 469415 273988 24811
2523B4811m4142l7763K77434q244j95534p428J77670K6483k67562K7180L05335
$$ 24811 -19331 -57094 220340 212096 16562 9134 186804 213287 -54275 -27095 278240
2512B78240j86115J7755J65508K17248l77519j88958q4191K7080l963K49334O4401
$$ 278240 92125 109880 275388 492636 115117 -73841 -158032 -130952 -134915 114419 178820
2501A78820K1415j00866p3537J78772M981j20094m9570J9570k1880o3039l83365
$$ 178820 200235 99369 25832 204604 209585 89491 39921 59491 37611 -25428 -408793
2490d08793K89902J52347J11177L6936k43928k05942J20034J10793L37619P9889
$$ -408793 -118891 33456 144633 181569 -62359 -268301 -148267 -37474 300145 380034
2480C80034m30395j07017J58719J16142Q104j28932K36358q444N834k5750J58026
$$ 380034 -50361 -157378 1341 117483 125587 -3345 233013 224569 230403 204653 362679
2469C62679l47810r9707N9165J32338J43980j54098j67634J10250j4984P6694
$$ 362679 14869 -84838 -25673 106665 250645 96547 -71087 39163 24179 100873
2459A00873J77407j47688N1007J46081J97341j11388j71278k21380P5552K6640
$$ 100873 278280 130592 181599 327680 525021 413633 242355 20975 96527 123167
2449A23167N428L9606J67598k4807r8552j38860p2987K11009K00072p9726M6855
$$ 123167 128595 168201 335799 310992 212440 73580 593 211602 411674 331948 378803
2438C78803J71143p0514J12377j53998j97949j12162J48891J37906q2197K11928
$$ 378803 549946 479432 591809 437811 239862 127700 276591 414497 332300 544228
2428E44228K4617m4853J29749m1952l95003l3461J28772J25167P082K5977P4876
$$ 544228 568845 523992 653741 611789 216786 183325 312097 437264 444346 470323 545199
2417E45199k1455l1354R6360j98257J4802J42244P5202j82530L52315j13041J73728
$$ 545199 523744 492390 588750 390493 405295 547539 622741 440211 792526 679485 853213
2406H53213j08097j54720J08318j83410M39990n9350k37237J36260q183j6756
$$ 853213 745116 590396 698714 515304 955294 895944 658707 794967 786784 770028
2396G70028K62869R3065j12279j25340j95146J44310K32720p6454L10695m7966
$$ 770028 1032897 1125962 1013683 888343 693197 837507 1070227 993773 1304468 1256502
2386A256502J49183J45390o2992J7551k89756K03250K22843R8900j94037J70190
$$ 1256502 1405685 1551075 1488083 1505634 1215878 1419128 1641971 1740871 1546834 1717024
2376A717024J91895O143k2865j04001N34696J31373K26261L47102K4883L76925
$$ 1717024 1908919 1915062 1892197 1788196 2322892 2454265 2680526 3027628 3052511 3429436
2366C429436J94166L58332K45382L10707K95617M28613L02010M55462O48131N86662
$$ 3429436 3623602 3981934 4227316 4538023 4833640 5262253 5564263 6019725 6667856 7254518
2356G254518P62151P99740J001822R33276J183933Q66081Q03838J790580K057424
$$ 7254518 8016669 8816409 9818231 10751507 11935440 12801521 13605359 15395939 17453363
2347A7453363J718867K277038K727634L099784M198564N375101N775851M095769
$$ 17453363 19172230 21449268 24176902 27276686 31475250 36850351 42626202 46721971
2339D6721971K224648K097541o37522m898174p144765n717613m629546l830784
$$ 46721971 48946619 51044160 50406638 45508464 38363699 32646086 28016540 24185756
2331B4185756k603557j897143j228874j288791j071581j098615j073086p68648
$$ 24185756 21582199 19685056 18456182 17167391 16095810 14997195 13924109 13155461
2323A3155461q53952j055450p75072n53098n55690n53091p01461o16982n39739
$$ 13155461 12301509 11246059 10470987 9917889 9362199 8809108 8107647 7490665 6950926
2314F950926j23941k92548l46405k89864o0920l05200l77385M7910l03596j90112
$$ 6950926 6826985 6534437 6188032 5898168 5837248 5532048 5154663 5202573 4898977 4708865
2304D708865j59186l67998j10364j36454q6001j61970l63871k28151o4747m2921
$$ 4708865 4549679 4181681 4071317 3934863 3848862 3686892 3323021 3094870 3030123 2987202
2294B987202l47393j61337R7445J26451l25882m1768K19660j42534l16700k2901
$$ 2987202 2639809 2478472 2575917 2702368 2376486 2334718 2554378 2411844 2095144 2072243
2284B072243q9020L7469J1373k16271k2584l22491N0794N9646P6396n5205l41191
$$ 2072243 1983223 2020692 2032065 1815794 1793210 1470719 1521513 1581159 1657555 1602350 1261159
2273A261159j96501J51247J98139j2970j27309p0389l34587j71432J83928K22357
$$ 1261159 1064658 1215905 1414044 1401074 1273765 1203376 868789 697357 881285 1103642
2263A103642j76971j98156K10515J23631m06872j92119o3904J46881J99485L1522
$$ 1103642 926671 728515 939030 1062661 655789 463670 399766 546647 746132 777654
2253G77654J72551K64369k22376l89156J66168l173P8704j07176j77214J54482
$$ 777654 950205 1214574 992198 603042 769210 766037 844741 737565 560351 714833
2243G14833K37243j53931m14207P5033J50080j73174K96920J8252l93698N23139
$$ 714833 952076 798145 383938 458971 609051 435877 732797 751049 357351 880490
2233H80490K7453Q8074k47987k08155N9229k27330J63151p0074j96523j36796
$$ 880490 907943 996017 748030 539875 599104 371774 534925 464851 268328 131532
2223A31532J9571K52971j71487k37095L22282K50636n0016k6431R8239j34515
$$ 131532 151103 404074 232587 -4508 317774 568410 518394 491963 590202 455687
2213D55687K06057k21119l85538L95103l7015q7202K91810l78339M810k97582
$$ 455687 661744 440625 55087 450190 413175 325973 617783 239444 244254 -53328
2203e3328L4999p2095K09235j82518L80082L6843r5358J03303J04153o7864Q2788
$$ -53328 -18329 -90424 118811 -63707 316375 353218 257860 361163 465316 397452 480240
2192D80240J90836M4335k06309o9037P0931j25662J6019j40809j66712N8537J77920
$$ 480240 671076 715411 509102 440065 510996 385334 401353 260544 93832 152369 330289
2181C30289O8832J9415K8700k2555p7418J24813j90140j02116k35439L15516P2481
$$ 330289 399121 418536 447236 424681 347263 472076 281936 179820 -55619 259897 332378
2170C32378j79891j71852O1699Q3122M2077q6280K27444O3383K2584J2020k01389
$$ 332378 152487 -19365 42334 125456 167533 81253 308697 372080 394664 406684 205295
2159B05295Q8319j37109n6213N7026K2716r2995J66871J25400K6125J29338O0492
$$ 205295 293614 156505 100292 157318 180034 87039 253910 379310 405435 534773 595265
2148E95265n27398k12372J18222o2041L2533j8398j21017L66292K89391j2878
$$ 595265 67867 -144505 -26283 -88324 -55791 -74189 -195206 171086 460477 447599
2138D47599j88290r3689j32144j20331J02447K2854J60347k27300K91135l05353
$$ 447599 259309 165620 33476 -86855 15592 38446 198793 -28507 262628 -42725
2128d2725J25286J32233r2266k75118R0899j84817J27159j7099p7329k46032K59401
$$ -42725 82561 214794 122528 -152590 -61691 -246508 -119349 -136448 -213777 -459809 -200408
2117b00408L4929q0409M29778j27727r3094j74238L13280n5826n1608J24456k59098
$$ -200408 -165479 -245888 183890 56163 -36931 -211169 102111 46285 -5323 119133 -139965
2106a39965j42820L6805n9279l3071J41585J3177j06573j13872M1810K14637L9268
$$ -139965 -282785 -245980 -305259 -338330 -196745 -183568 -290141 -404013 -362203 -147566 -108298
2095a08298N8977j8751R2123M2287j578j33205m3063j74900K74070j51764K46941
$$ -108298 -49321 -68072 24051 66338 64760 -68445 -111508 -286408 -12338 -164102 82839
2084H2839L41040l21589p3340K00978r5561k76594J29155O914j7359Q7969L67872
$$ 82839 423879 102290 28950 229928 134367 -142227 -13072 -6158 -23517 64452 432324
2073D32324m7551l07947J66076J45029r0196M9338k1071j47992j05834P9225J29213
$$ 432324 384773 76826 242902 387931 297735 347073 326002 178010 72176 151401 280614
2062B80614k1945j73763k98333J69969K72214J7388Q1007j20520o2163j49058
$$ 280614 258669 84906 -213427 -43458 228756 246144 327151 206631 144468 -4590
2052d590j3213L55279r3359j33235j66559K48274q2963j45413k4197j00247o8889
$$ -4590 -17803 337476 244117 110882 -55677 192597 109634 -35779 -59976 -160223 -229112
2041b29112j0876k5413N1558R1620M3232J10065r9829M0105J59423m9775R829
$$ -229112 -239988 -265401 -213843 -122223 -78991 31074 -68755 -28650 130773 80998 90827
2030I0827k830p5212j09911r6120j04522J03643K74488p0190q0494k52604K7449
$$ 90827 87997 12785 -97126 -193246 -297768 -194125 80363 10173 -70321 -322925 -295476
2019b95476K6780L16803j88435l2920K81496R7884k98291r7203j02502M8164J69601
$$ -295476 -268696 48107 -140328 -173248 108248 206132 -92159 -189362 -291864 -243700 -74099
2008g4099q979L0769k92919J8040P3177O5653q1244L13459J85736l53135J72983
$$ -74099 -83078 -52309 -345228 -327188 -254011 -188358 -269602 43857 229593 -123542 49441
1997D9441K10762O094j58889n9719K794n447R2128o4701K03269n2734L19060Q3754
$$ 49441 260203 266297 107408 47689 50483 45036 137164 72463 275732 222998 542058 625812
1985F25812j54020k61402r4771j34953J66352J66006Q0566l04794O3773j98370
$$ 625812 471792 210390 115619 -19334 147018 313024 393590 88796 152569 -45801
1975d5801k12866K69555k1610Q7296j92957l4104J42157m9747K3939N04368J41687
$$ -45801 -258667 10888 -10722 76574 -116383 -150487 -8330 -58077 -34138 470230 611917
1964F11917l18845k50719j03673O9118j95864M8580j30176l837q3564J63053J99376
$$ 611917 293072 42353 -61320 7798 -188066 -139486 -269662 -273499 -357063 -194010 5366
1953E366j66388J54852j25633k16872N7976J70259O3564O6679l04429p9600K08258
$$ 5366 -161022 -6170 -131803 -348675 -290699 -120440 -56876 9803 -294626 -374226 -165968
1942a65968J63712o4176R2392o9674J10266J80562J42672k67019l70753j40990
$$ -165968 -2256 -66432 25960 -43714 66552 247114 389786 122767 -247986 -388976
1932c88976J42125K37398J70307k3213p1830m48281j29553K53388K04894o2561
$$ -388976 -246851 -9453 160854 137641 65811 -382470 -512023 -258635 -53741 -116302
1922a16302O9951j06287j24934J93520j52324O3251J977j47058K77320r1046R442
$$ -116302 -46351 -152638 -277572 -84052 -236376 -173125 -171148 -318206 -40886 -131932 -122490
1911a22490J25481J34690j01956o2859K4050n2028j5470r0940J27722K05992k4971
$$ -122490 2991 137681 35725 -27134 -3084 -55112 -70582 -161522 -33800 172192 147221
1900A47221j74257k29590j6798L50882M8560j68595l13520J06641m9520p0579
$$ 147221 -27036 -256626 -273424 77458 126018 -42577 -356097 -249456 -298976 -369555
1890c69555L6188m1742M1528J24945L34683N3162j65998k5036J04308j57970n0521
$$ -369555 -333367 -375109 -333581 -208636 126047 179209 13211 -11825 92483 -65487 -116008
1879a16008K31564j42862P7685J38498R3537j10982k2853l54460p342J44858J63113
$$ -116008 115556 -27306 50379 188877 282414 171432 148579 -205881 -213223 -68365 94748
1868I4748k4978k1544l9892j84373J49557l6014L04144k10001j85529j11917j29937
$$ 94748 69770 48226 8334 -176039 -26482 -62496 241648 31647 -153882 -265799 -395736
1857c95736m522n5462L33372J83008n1496j88955k209m2545K05544J1461l8698
$$ -395736 -400258 -455720 -122348 60660 9164 -179791 -182000 -224545 -19001 -7540 -46238
1846d6238j52048O4391J58647j37105O4032N9930K3737r411n0548l07638p142
$$ -46238 -198286 -133895 24752 -112353 -48321 11609 35346 25935 -24613 -332251 -339393
1835c39393J98104J16910Q7988l2602k25344k00905J98059K68170P4773P1481
$$ -339393 -141289 -24379 63609 31007 -194337 -395242 -197183 70987 145760 217241
1825B17241j9138j44523n4768L6650j07776j00123N8536J77284J06397o7839k29702
$$ 217241 198103 53580 -1188 35462 -72314 -172437 -113901 63383 169780 101941 -127761
1814a27761q5485J11870J46963K00224o9855j25866j6454r2985N8376j3804l2252
$$ -127761 -213246 -101376 45587 245811 175956 50090 33636 -59349 -973 -14777 -47029
1803d7029K76382l88600R3711J51559J87808L8108j85670j30680q526k6290o7429
$$ -47029 229353 -159247 -65536 86023 273831 311939 126269 -4411 -12937 -39227 -106656
1792a06656J72890Q3869p18k08757N8918Q4568l4410r9573l9863J96826l04778
$$ -106656 66234 150103 149385 -59372 -454 84114 49704 -49869 -89732 107094 -197684
1781a97684k01193L54262M4885J10027l36629J33748K30707j96264j1441N7402
$$ -197684 -398877 -44615 270 110297 -226332 -92584 138123 -58141 -69582 -12180
1771a2180J59866K0806j91240P4134k19450J10028K51160q2271j60484M6225j00923
$$ -12180 147686 168492 -22748 51386 -168064 -58036 193124 110853 -49631 -3406 -104329
1760a04329k16627O6041L20864R4102R9254k63905p1463L29519j45588k71243
$$ -104329 -320956 -254915 65949 160051 259305 -4600 -76063 253456 107868 -163375
1750a63375Q1881j03494Q3675K44174J20367l38236o0184n1377N5676p2372j7745
$$ -163375 -81494 -184988 -101313 142861 263228 -75008 -135192 -186569 -130893 -203265 -221010
1739b21010J97087J64474k47728l74328K04932J66168K03185J97212j48560l19890
$$ -221010 -23923 140551 -107177 -481505 -276573 -110405 92780 289992 141432 -178458
1729a78458J50492j03809q1052j01140L7327K48399P1593j77625j38517q7403
$$ -178458 -27966 -131775 -212827 -313967 -276640 -28241 43352 -134273 -272790 -360193
1719c60193J23579L15843J77507k04017k82016K6391P4988j63852j93162L8277
$$ -360193 -236614 79229 256736 52719 -229297 -202906 -127918 -291770 -484932 -446655
1709d46655K55290J26222N1605Q2016j92986J33988m8523P9487j30887o5158Q4174
$$ -446655 -191365 -65143 -13538 68478 -124508 9480 -39043 40444 -90443 -155601 -71427
1698g1427j18573P8246n025J24354p0625O3589o9986k81311o783K10822j482K5589
$$ -71427 -190000 -111754 -116779 7575 -63050 539 -69447 -350758 -357541 -146719 -148201 -122612
1686a22612j42673K21726k87075O1992P9995L2462k57997L21653p4596J70669
$$ -122612 -265285 -43559 -330634 -268642 -188647 -156185 -414182 -92529 -167125 3544
1676C544p1648m7225R6229k54599j96566L08998K16355k4846L7642r5065j60902
$$ 3544 -68104 -115329 -19100 -273699 -470265 -161267 55088 30242 67884 -27181 -188083
1665a88083k5024J1124R0931p0966j53590L9728o2182j96180M0250M56237q4647
$$ -188083 -213107 -201983 -111052 -182018 -335608 -295880 -358062 -554242 -513992 -57755 -142402
1654a42402j15698K80793J31010p680k21007N282J92001j34721J93114K383j75155
$$ -142402 -258100 22693 153703 146023 -74984 -69702 122299 -12422 180692 183075 7920
1643G920P7986K51515l74068j61150J54480L2542j51562J55339j13455L92195
$$ 7920 85906 337421 -36647 -197797 -43317 -10775 -162337 -6998 -120453 271742
1633B71742l23462o8506J40236K59048N9348l71476K32207J82130l00259N3108
$$ 271742 -51720 -120226 20010 279058 338406 -33070 199137 381267 81008 134116
1623A34116J2741O7348k00816L9283J69305J64781o2410j46147k74914j23830
$$ 134116 146857 214205 13389 52672 221977 386758 324348 178201 -96713 -220543
1613b20543K07509j83895o9104J89644J49328j87787j08012m0635Q4195N0021
$$ -220543 -13034 -196929 -266033 -76389 72939 -114848 -222860 -263495 -179300 -129279
1603a29279k16522J53637L00438j36435j18760K54155o9189n5396j45882k44266
$$ -129279 -345801 -192164 108274 -28161 -146921 107234 38045 -17351 -163233 -407499
$$ [...]
##END NTUPLES=NMR SPECTRUM
##END=
