##TITLE=1H_DE-80H_X3
 200.13MHz, d2o
 8 sc
 
 19ns.26.2.2025
##JCAMPDX= 6.0         $$ Bruker NMR JCAMP-DX V2.0
##DATA TYPE= NMR SPECTRUM
##DATA CLASS= NTUPLES
##ORIGIN= UXNMR, Bruker Analytische Messtechnik GmbH
##OWNER= pz
$$ XWIN-NMR		Version 3.5
$$ Tue Sep 16 10:32:44 2025 Russian Standard Time (UT+4h)  Yarkov@DPX200
##.OBSERVE FREQUENCY= 200.1313
##.OBSERVE NUCLEUS= ^1H
##.ACQUISITION MODE= SIMULTANEOUS
##.ACQUISITION SCHEME= undefined
##.AVERAGES= 8
##.DIGITISER RES= 18
##SPECTROMETER/DATA SYSTEM= spect
##.PULSE SEQUENCE= zg30
##.SOLVENT NAME= CDCl3
##.SHIFT REFERENCE= (INTERNAL, CDCl3, 0, 15.5298)
##AUDIT TRAIL= $$ (NUMBER, WHEN, WHO, WHERE, WHAT)
$$ ##TITLE= Audit trail, XWIN-NMR		Version 3.5
$$ ##JCAMPDX= 5.01
$$ ##ORIGIN= Bruker BioSpin GmbH
$$ ##OWNER= Yarkov
$$ C:/Bruker/XWIN-NMR/data/yarkov2/nmr/H-C/1/pdata/1/auditp.txt
$$ ##AUDIT TRAIL=  $$ (NUMBER, WHEN, WHO, WHERE, WHAT)
(   1,<2025-09-16 10:31:04.79 +0400>,<Yarkov>,<DPX200>,
      <created by zg, POWCHK disabled, PULCHK disabled
       configuration hash MD5:
       00 E9 B6 7A A2 85 ED C7 34 08 36 98 17 FE 4E 26
       data hash MD5: 16K
       FC B8 25 62 A9 AD 88 72 76 01 F2 30 7A 72 9D 0D>)
(   2,<2025-09-16 10:31:22.31 +0400>,<Yarkov>,<DPX200>,
      <Start of raw data processing
       efp BC_mod = 2 LB = 0.25 FT_mod = 6 PKNL = 1 PHC0 = -1362.576 PHC1 = 17.99092 SI = 16K 
       data hash MD5: 16K
       7D D2 4B 71 11 A5 6F 00 64 63 3A E8 68 56 8E B6>)
(   3,<2025-09-16 10:31:26.60 +0400>,<Yarkov>,<DPX200>,
      <abs ABSG = 5 
       data hash MD5: 16K
       DC 29 8A 5F 5C 99 56 86 56 55 5A 46 99 E1 4A 29>)
(   4,<2025-09-16 10:31:56.51 +0400>,<Yarkov>,<DPX200>,
      <pk PHC0 = 10.84944 PHC1 = -13.2 
       data hash MD5: 16K
       8C FE 41 4B A1 72 5B 65 E8 FB BB D9 1D A9 1A C5>)
$$ ##END=
$$ 
$$ hash MD5
$$ C7 B2 FF 1B 7D 9F B7 8B 2B 2F 39 60 BB E3 0E E9
##$RELAX= 
##$RELAX= 
##$RELAX= 
##$RELAX= 
##$RELAX= 
##$RELAX= 
$$ Bruker specific parameters
$$ --------------------------
##$DU= <C:/Bruker/XWIN-NMR>
##$EXPNO= 1
##$NAME= <H-C>
##$PROCNO= 1
##$TYPE= <nmr>
##$USER= <yarkov2>
##$AMP= (0..31)
100 100 100 100 100 100 100 100 100 100 100 100 100 100 100 100 100 100 
100 100 100 100 100 100 100 100 100 100 100 100 100 100 
##$AQSEQ= 0
##$AQ_mod= 1
##$AUNM= <au_zg>
##$AUTOPOS= <>
##$BF1= 200.13
##$BF2= 200.13
##$BF3= 200.13
##$BF4= 200.13
##$BF5= 200.13
##$BF6= 200.13
##$BF7= 200.13
##$BF8= 200.13
##$BYTORDA= 1
##$CFDGTYP= 0
##$CFRGTYP= 5
##$CHEMSTR= <none>
##$CNST= (0..31)
1 1 145 1 1 1 1 1 1 1 1 1 1 1 1 1 1 1 1 1 1 1 1 1 1 1 1 1 1 1 1 1 
##$CPDPRG= <>
##$CPDPRG1= <>
##$CPDPRG2= <>
##$CPDPRG3= <>
##$CPDPRG4= <mlev>
##$CPDPRG5= <mlev>
##$CPDPRG6= <mlev>
##$CPDPRG7= <mlev>
##$CPDPRG8= <mlev>
##$CPDPRGB= <>
##$CPDPRGT= <>
##$D= (0..31)
0 0.7 0 0 0 0 0 0 0 0 0 0.03 0 0 0 0 0 0 0 0 0 0 0 0 0 0 0 0 0 0 0 0 
##$DATE= 1758004264
##$DBL= (0..7)
120 120 120 120 120 120 120 120 
##$DBP= (0..7)
150 150 150 150 150 150 150 150 
##$DBP07= 0
##$DBPNAM0= <>
##$DBPNAM1= <>
$$ [...]
##$SUBNAM3= <"">
##$SUBNAM4= <"">
##$SUBNAM5= <"">
##$SUBNAM6= <"">
##$SUBNAM7= <"">
##$SUBNAM8= <"">
##$SUBNAM9= <"">
##$SW= 18.0517328524113
##$SWIBOX= (0..15)
0 0 2 0 0 0 0 0 0 0 0 0 0 0 0 0 
##$SW_h= 3612.71676300578
##$TD= 16384
##$TD0= 1
##$TE= 0
##$TE2= 300
##$TE3= 300
##$TEG= 300
##$TL= (0..7)
0 120 120 120 120 120 120 120 
##$TP= (0..7)
150 150 150 150 150 150 150 150 
##$TP07= 0
##$TPNAME0= <>
##$TPNAME1= <>
##$TPNAME2= <>
##$TPNAME3= <>
##$TPNAME4= <>
##$TPNAME5= <>
##$TPNAME6= <>
##$TPNAME7= <>
##$TPOAL= (0..7)
0.5 0.5 0.5 0.5 0.5 0.5 0.5 0.5 
##$TPOFFS= (0..7)
0 0 0 0 0 0 0 0 
##$TUNHIN= 0
##$TUNHOUT= 0
##$TUNXOUT= 0
##$USERA1= <user>
##$USERA2= <user>
##$USERA3= <user>
##$USERA4= <user>
##$USERA5= <user>
##$V9= 5
##$VALIST= <valist>
##$VCLIST= <CCCCCCCCCCCCCCC>
##$VD= 0
##$VDLIST= <DDDDDDDDDDDDDDD>
##$VPLIST= <PPPPPPPPPPPPPPP>
##$VTLIST= <TTTTTTTTTTTTTTT>
##$WBST= 1024
##$WBSW= 4
##$XGAIN= (0..3)
0 0 0 0 
##$XL= 0
##$YL= 0
##$YMAX_a= 142954
##$YMIN_a= -170380
##$ZGOPTNS= <>
##$ZL1= 120
##$ZL2= 120
##$ZL3= 120
##$ZL4= 120
##$ABSF1= 15.47585
##$ABSF2= -2.575999
##$ABSG= 5
##$ABSL= 3
##$ALPHA= 0
##$AQORDER= 0
##$ASSFAC= 0
##$ASSFACI= 0
##$ASSFACX= 0
##$ASSWID= 0
##$AUNMP= <proc_1d>
##$AZFE= 0.1
##$AZFW= 0.1
##$BCFW= 0
##$BC_mod= 2
##$BYTORDP= 0
##$COROFFS= 0
##$CY= -3
##$DATMOD= 1
##$DC= 0
##$DFILT= <>
##$DTYPP= 0
##$F1P= 0
##$F2P= 0
##$FCOR= 1
##$FTSIZE= 16384
##$FT_mod= 6
##$GAMMA= 0
##$GB= 0
##$INTBC= 1
##$INTSCL= 3.241238e-09
##$ISEN= 128
##$LB= 0.25
##$LEV0= 0
##$LPBIN= 0
##$MAXI= 10000
##$MC2= 0
##$MEAN= 0
##$ME_mod= 0
##$MI= 1.114404
##$NCOEF= 0
##$NC_proc= -7
##$NLEV= 6
##$NOISF1= 3.799351
##$NOISF2= 2.8
##$NSP= 0
##$NTH_PI= 0
##$NZP= 0
##$OFFSET= 15.52984
##$PC= 1
##$PHC0= -1351.727
##$PHC1= 4.790919
##$PH_mod= 1
##$PKNL= yes
##$PPARMOD= 0
##$PSCAL= 0
##$PSIGN= 0
##$REVERSE= no
##$SF= 200.129998373167
##$SI= 16384
##$SIGF1= 3
##$SIGF2= 2
##$SINO= 0.751879
##$SIOLD= 32768
##$SREGLST= <19F.Aceton>
##$SSB= 0
##$STSI= 16384
##$STSR= 0
##$SW_p= 3612.71676300578
##$SYMM= 0
##$S_DEV= 0
##$TDeff= 16384
##$TDoff= 0
##$TI= <>
##$TILT= no
##$TM1= 0
##$TM2= 0
##$TOPLEV= 0
##$USERP1= <user>
##$USERP2= <user>
##$USERP3= <user>
##$USERP4= <user>
##$USERP5= <user>
##$WDW= 1
##$XDIM= 16384
##$YMAX_p= 275259717
##$YMIN_p= -711362
$$ End of Bruker specific parameters
$$ ---------------------------------
##NTUPLES= NMR SPECTRUM
##VAR_NAME=  FREQUENCY,     SPECTRUM/REAL,   SPECTRUM/IMAG
##SYMBOL=    X,             R,               I
##VAR_TYPE=  INDEPENDENT,   DEPENDENT,       DEPENDENT
##VAR_FORM=  AFFN,          ASDF,            ASDF
##VAR_DIM=   16384,         16384,           16384
##UNITS=     HZ,            ARBITRARY UNITS, ARBITRARY UNITS
##FACTOR=    0.220516191357247, 1,           1
##FIRST=     3107.98694786863, 0,            0
##LAST=      -504.72981513715, 0,            0
##MIN=       -504.72981513715, -711362,      0
##MAX=       3107.98694786863, 275259717,    0
$$ Real data points
##PAGE= N=1
##DATA TABLE= (X++(R..R)), XYDATA
$$ [...]
7579c36897M594O027J088M59Q99j1968o0541M8802J2156K0457M6090q0529J0887
7566c38476J0382j8709l625l5031M8231k5838m3094O667j0116p0510M6542M7428
7554c86149j375L6641L2464m4832r09K9176O9123k3254p9061l0078M654N9322
7542c34278K9067q1554M0891K0515K4012m213K6743J1159j33597M3141O1195n3519
7530c50438l1424M5964K6191l654n0631K0940k0254Q656J7614K072j2012K5070
7518c21906p4079J136k077J7174J02104p6820j46150L5838Q8106L2089J4934l3335
7506c62986J0143p4464K0441O6171m6037J7030M089o4820K2275Q5594L4051K2027
7494b66486j1573n2995m921j3788M1978K5041l1263L0724k4872l1385J26900n0298
$$ y = [-336897, -332303, -326276, -325188, -324729, -323830, -335798, -396339, -347537, -335381, -314924, -268834, -349363, -338476, -328094, -346803, -350428, -385459, -337228, -363066, -406160, -399493, -409609, -480119, -433577, -386149, -387524, -350883, -318419, -363251, -364160, -334984, -265861, -289115, -368176, -398254, -393600, -334278, -305211, -386765, -345874, -325359, -301347, -305560, -278817, -267658, -401255, -358114, -296919, -350438, -381862, -335898, -309707, -313361, -363992, -343052, -363306, -354650, -337036, -334964, -346976, -321906, -395985, -394849, -396926, -379752, -277648, -354468, -500618, -464780, -376674, -344585, -329651, -362986, -352843, -427307, -406866, -340695, -386732, -369702, -365613, -430433, -408158, -322564, -288513, -266486, -278059, -331054, -335975, -349763, -307785, -282744, -314007, -283283, -308155, -339540, -212640, -262938]
7482b62938m3360r428k2291L4192l3219J6206J6295K7155K4795j10514K1587M5667
7470b95853m957k506j4479r3946k4233R5545k3461q0434O1670P9793l8860j4224
7458c55945q826M2906l8319j9360P2930J8595r4104K056M1616j6907L3500k4006
7446c45864j0090O4853J969l4017M7765J3354M913K11P722o9079N807J8824l365
7433b96997O945j7772l4539L9110N1325o5508j7312J0587M1114l6270n3431k8756
7421d01504L4723K2307k882L5220K7159N8722m2615L2290p498k6678N8473o7141
7409b79424j1260K3733j9878k8573J5756J3219j7674N958j3716k4472J2506k6180
7397c50005K4096j9719L3441M853j7606J1374n287p06j875p133o9210K9032N5174
$$ y = [-262938, -306298, -315726, -338017, -303825, -337044, -320838, -304543, -277388, -252593, -363107, -341520, -295853, -300810, -303316, -317795, -411741, -435974, -340429, -363890, -444324, -382654, -302861, -341721, -355945, -364771, -321865, -360184, -379544, -306614, -288019, -382123, -380067, -338451, -355358, -321858, -345864, -355954, -291101, -289132, -323149, -275384, -262030, -257117, -256906, -249184, -318263, -312456, -293632, -296997, -290052, -307824, -342363, -303253, -251928, -317436, -334748, -324161, -283047, -319317, -372748, -401504, -366781, -344474, -347356, -312136, -284977, -226255, -268870, -236580, -244078, -270756, -212283, -279424, -290684, -266951, -286829, -315402, -299646, -286427, -304101, -298143, -311859, -336331, -323825, -350005, -325909, -345628, -312187, -307334, -324940, -313566, -318853, -319559, -321434, -328567, -397777, -368745, -313571]
7384c13571K747m4866j5917K5007m057L0062q024J9191P926L9763k2629N2598
7372b31770K2931j12228k1916K8413j7090L4789O4247J0395L8449p4850m2032
7361c00662o3814N1977J7505m9242l3206m456L6174L532l854m398J5162p269N4649
7348b87902o1562K6786M3938L6358n9155r1256O0701O4391n1014n7197M9181J7195
7336c09536l2872M8915p0278L2261J8353j6336P7980o2740m0790K9340L0913K4758
7324b70032K8330n4277O6008m4363k2628O850J9917n015m6008J3497j9972L8726
7312b88967l5474l9337M0193J8450j5389l1938l2116K1186M1793m08J3112J4541
7300b94354M1960l4787m3887j3346j3569K5956P0736j842K0254L6251m5148N652
$$ y = [-313571, -310824, -355690, -371607, -346600, -350657, -320595, -328619, -309428, -301502, -261739, -284368, -231770, -208839, -321067, -342983, -314570, -331660, -296871, -232624, -222229, -183780, -258630, -300662, -364476, -312499, -294994, -344236, -377442, -381898, -345724, -342192, -346046, -350444, -335282, -342551, -287902, -349464, -322678, -278740, -242382, -301537, -392793, -332092, -267701, -318715, -375912, -326731, -309536, -342408, -293493, -363771, -331510, -313157, -329493, -251513, -314253, -355043, -325703, -294790, -270032, -241702, -295979, -229971, -274334, -296962, -290112, -270195, -275210, -321218, -307721, -327693, -288967, -324441, -363778, -323585, -305135, -320524, -352462, -384578, -363392, -321599, -322007, -308895, -294354, -252394, -287181, -331068, -344414, -357983, -332027, -261291, -263133, -242879, -206628, -251776, -246124]
7288b46124l2589L7452N245o8932N085O2392j9496q0024n299j0626J1156M8808
7276b92952N936m6883J7671Q3k47l1470O5511K4536p0271Q200M5412m6098j9214
7263c39786J7257J6771j2458L022J2057K4436J7404m470L3574N5046N317j5903
7251a87733M8733q3427o9722j7177M927R530l146O025O1638l0339N901K0431l4095
7238b68454J3632j218q862J2040n771o700j202J6979N7207o4370j8749K7010J6651
7225b31807L3322p7493j1636N2288O6361m3827r7654l1647Q6567N6153o5017K6076
7213b38314M1205n7270K5022k3054k7230k5076J5000M4283j5415n2450n044O0386
7201b57957M1218J2236m8484J8477Q377k5386O362J296n4130L7601J6510L8289
$$ y = [-246124, -278713, -241261, -236016, -304948, -299863, -237471, -256967, -336991, -342290, -352916, -341760, -292952, -287016, -333899, -316228, -316145, -316392, -347862, -282351, -257815, -328086, -319886, -274474, -320572, -339786, -322529, -305758, -318216, -315194, -303137, -278701, -261297, -265767, -232193, -177147, -171830, -187733, -139000, -222427, -292149, -309326, -304399, -294869, -298015, -291990, -230352, -260691, -254790, -234359, -268454, -254822, -256040, -264902, -252862, -258633, -265333, -266535, -249556, -192349, -256719, -275468, -248458, -231807, -198485, -275978, -287614, -235326, -168965, -212792, -310446, -342093, -255526, -199373, -264390, -238314, -197109, -254379, -229357, -252411, -279641, -304717, -289717, -245434, -260849, -313299, -318343, -257957, -216739, -204503, -252987, -234510, -226133, -251519, -245157, -243861, -297991, -260390, -243880, -205591]
7189b05591j8495j8763o847o3220J085N7624L6057q9364J5877K0389M8608K6134
7177a96506J4032m3582m9841L0585j3386L8845M8515k4890l7134M1403N217j6671
7165b03413p674k7924n333M7503M9557p5612n8126L8817L0709Q0460n6160l3790
7153b20986O3510K3501j3336j02193O573K7724n2070N8393J4927j8143k4267K4359
7141b12008O7913m603n7649m56J8440q778L1789M4917p7549P9540j2350l7471
7129a68265k7147M146r557m295o223k2356j8620M8556N6867J3017m0440k6343
7117b00660P873N318L0632R313l7461l7730o93o908N1814R436L3628l7688n714
7104a78840l1425J4190N7392M9540k9548n4357J4243M4629k2346k1022k6299J6700
$$ y = [-205591, -224086, -242849, -249696, -312916, -311831, -254207, -218150, -307514, -291637, -271248, -222640, -196506, -182474, -226056, -275897, -245312, -258698, -219853, -171338, -196228, -233362, -191959, -186742, -203413, -211087, -239011, -244344, -196841, -147284, -222896, -281022, -242205, -211496, -131036, -187196, -220986, -157476, -133975, -147311, -249504, -242931, -215207, -267277, -208884, -193957, -212100, -236367, -212008, -144095, -148698, -206347, -206803, -188363, -197141, -165352, -120435, -197984, -118444, -130794, -168265, -195412, -191266, -200823, -205118, -211341, -233697, -252317, -203761, -146894, -133877, -174317, -200660, -192787, -187469, -156837, -147524, -184985, -222715, -223408, -230316, -178502, -169066, -135438, -173126, -178840, -210265, -196075, -138683, -89143, -118691, -173048, -158805, -114176, -136522, -157544, -183843, -167143]
7092a67143n227P1356o7740O5744N672J8234m7860J7416L824j5909n9065P0002
7080a10696O8692r7086K6644k068j4454M9764J0860m0279k4669R465l74j7179
7068a41380K0396k5149M8580J2908N8653m4769n7818J1467K0570l6478O2190j7349
7056h8179m0211R7091l8367j460k4063K5533K0916j8331k6822R271o8061K6952
7044a25731L3181J0128J8760o924k4231m9582P9246P698j5891k6887L5076j6267
7032h1424M2124k2854l514m1407L2296K3994O751o4375K5531K2172P67k9138K8534
7019f0543J5514K6469L5498J9707r5151o3411Q5824N45L1114Q8103l2915m5580
7007E174l1761j115J2133n1259J48323K4567o5979j0839j32J9304j8426K0302
$$ y = [-167143, -172370, -101014, -168754, -103010, -97338, -79104, -126964, -109548, -105724, -121633, -180698, -110696, -42004, -139090, -112446, -114514, -128968, -79204, -68344, -108623, -133292, -123827, -124201, -141380, -120984, -146133, -97553, -84645, -25992, -70761, -128579, -117112, -96542, -133020, -70830, -88179, -128390, -31299, -69666, -71126, -95189, -69656, -48740, -67071, -93893, -84622, -152683, -125731, -92550, -82422, -63662, -70586, -94817, -144399, -65153, -57455, -73346, -100233, -65157, -81424, -39300, -62154, -65668, -107075, -74779, -50785, -44034, -108409, -82878, -60706, -59939, -89077, -60543, -45029, -18560, 16938, 36645, -58506, -121917, -36093, -35548, -4434, 83669, 50754, 5174, -26587, -27702, -15569, -66828, 81495, 106062, 40083, 29244, 29112, 48416, 29990, 50292]
6995E0292J004k5668j4821m1165K017O0237L9624L757J5056k1247j5807L7507
6983I0786k1199J502L5629m1472O7255N3299j10519J58j6582J500L1322M0658
6971A32337j7704J5660J3689O291N5060k6647n0706n3601Q0644L5757m1978l3304
6959A15498J26147p5219m1052M0392J0860M3766k9418k9427k4622K6248k5956
6948A37217K4715N388m7030J27524n6483l6345J1736N347N8392j599R5126o1704
6936B62284n9502k371M8824P9297l1300m7061j0360m0227Q7132m8667k9901o660
6924B01488J7935L3572M4761J0172m9680L7550m4823J3479N7408m2844K2169K5841
6912C27028m5168M9820o4693O845k347J2873J8241K0659N124L3563P782m18p0049
$$ y = [50292, 51296, 25628, 10807, -30358, -28341, 31896, 71520, 75277, 90333, 69086, 53279, 90786, 69587, 71089, 106718, 65246, 132501, 185800, 75281, 75439, 58857, 60357, 91679, 132337, 114633, 130293, 143982, 150273, 205333, 178686, 127980, 74379, 155023, 190780, 148802, 115498, 241645, 166426, 125374, 165766, 176626, 220392, 190974, 161547, 136925, 163173, 137217, 161932, 167320, 120290, 247814, 191331, 154986, 166722, 172069, 230461, 228862, 323988, 262284, 202782, 200411, 249235, 328532, 297232, 250171, 239811, 199584, 286716, 238049, 208148, 201488, 219423, 252995, 297756, 307928, 258248, 295798, 250975, 264454, 321862, 279018, 301187, 327028, 281860, 331680, 266987, 273832, 271485, 284358, 302599, 323258, 328382, 361945, 369727, 369309, 299260]
6899B99260O910n254j5920L5681P2500l2832K6908M9368j7778l0504M319L8221
6887D30879J9829m1318m4287M6514R869J0889J6124j3613j04842N3265J25670
6876E08979K4797o4659j3545k9924J4228J9236K3709N0124m858m9671p23j0999
6864D66694J4907J6603l0689O1339L9248K4164q285P929n0243m4407p703K7186
6852E16743L560l0254K1977j8704k5301L8196M5107L1437n2288j6766L0415o3106
6840D81016o881j0373J6917N2973j0391l2820J8054N8445K8746j169o3337j5670
6828E15510l0546K8320R0656k9312N168m4207J1234m8965L2118K2561P4329n303
6816F21563m1853P521n7039L9904O923p8900m4924K0288J9721P8070K7201l8074
$$ y = [299260, 306170, 300916, 284996, 320677, 393177, 360345, 387253, 436621, 418843, 388339, 392658, 430879, 450708, 409390, 365103, 411617, 421486, 432375, 448499, 434886, 330044, 383309, 508979, 533776, 469117, 455572, 425648, 439876, 459112, 482821, 532945, 528087, 478416, 477693, 466694, 481601, 498204, 467515, 528854, 568102, 592266, 583981, 591910, 541667, 497260, 489557, 516743, 520303, 490049, 512026, 493322, 468021, 506217, 551324, 582761, 530473, 513707, 544122, 481016, 474135, 463762, 480679, 533652, 523261, 490441, 508495, 566940, 595686, 594517, 531180, 515510, 484964, 513284, 603940, 574628, 579796, 535589, 546823, 497858, 529976, 552537, 626866, 621563, 579710, 587231, 530192, 570096, 577019, 498119, 453195, 473483, 493204, 571274, 598475, 560401]
6804E60401m3497j3628M6745N1145l5192r26Q422l177k0566n5191j4842J02121
6792E81815p0896m4225K890k6297L9101m4354j5838R755L389J1065K5162l5809
6780D35758r956j3345j9985K2749N4643k5509o1279k828O7431j8183j1352N5982
6768D74126j7650o8926p9k9365P6530k4457m2729l4877k2298O27k1534O9028K3322
6755C81718J2019J6411k1703P2762r4494r4720Q880j247O9426j0690l2909j1329
6743B94124k0944M265J2058M1695o0676l2098L2840j847R311j559K7844q0067
6731B24946K3377r927N2443k1802l8169Q8856j9264m3907l1779N5789l0733m8259
6719B01571l4900K4409M418J1408j6102K5714o054m0390J8413l9067j6378M5793
$$ y = [560401, 516904, 503276, 550021, 601166, 565974, 565048, 573470, 570293, 549727, 494536, 479694, 581815, 510919, 466694, 469584, 443287, 482388, 438034, 422196, 431951, 435340, 446405, 471567, 435758, 425802, 412457, 392472, 415221, 469864, 444355, 383076, 380248, 447679, 429496, 418144, 474126, 456476, 387550, 387471, 358106, 434636, 410179, 367450, 332573, 310275, 310902, 289368, 358396, 381718, 393737, 410148, 388445, 461207, 366713, 271993, 280873, 279626, 349052, 338362, 305453, 294124, 273180, 277445, 289503, 331198, 270522, 238424, 271264, 269417, 278728, 277169, 305013, 224946, 248323, 238396, 290839, 269037, 230868, 319724, 300460, 256553, 224774, 280563, 249830, 201571, 166671, 191080, 195498, 206906, 190804, 216518, 210464, 170074, 188487, 149420, 133042, 178835]
6707A78835O087m7496M2119J0874j883r8871j146J9837N0125r772o064o311L6512
6694A72846j9935M4475q9507L4680K261L6360k4133m4059N8357n8134j6405K4990
6682A21796o088q2745j0971K7584J2775J9273O333K2133K0780q6820m4246N6086
6670E5890J05524n4166j7570L331k4547k7910n1202P823O0890R8827n8735n4279
6658D3876j2766P2M785k6602N1493K6881p179j9700O507n4179m7069P3390j9525
6645A9984n1494J6031j1316Q9872P3391l9807o3797J6096j1952m3855J2817l9917
6633c3947j3210j0285R6805j5452l4121J3685k0591J2026N0410l8218K1337J8300
6621D6739p4470K8048l3246n102P66J2310o9951P5657j155l9501j4090L028j1815
$$ y = [178835, 184922, 137426, 179545, 190419, 188536, 89665, 88519, 108356, 158481, 148709, 142645, 136334, 172846, 152911, 197386, 107879, 142559, 144820, 181180, 157047, 112988, 171345, 113211, 96806, 121796, 115708, 32963, 21992, 49576, 62351, 81624, 87957, 110090, 130870, 44050, -196, 55890, 161414, 107248, 89678, 93009, 68462, 40552, -10650, -2827, 58063, 156890, 98155, 43876, 31110, 31182, 35967, 9365, 60858, 87739, 80560, 60860, 67367, 13188, -33881, 39509, 19984, -31510, -15479, -26795, 63077, 136468, 96661, 32864, 48960, 37008, -6847, 5970, -33947, -47157, -57442, 39363, 23911, -10210, 3475, -17116, -5090, 45320, 7102, 28439, 46739, -27731, 317, -32929, -38031, -37265, -24955, -94906, -19249, -20404, -59905, -73995, -70967, -82782]
6608h2782j3634K7365L7162p8409N6409N8662O103k3538m4021k3580k8438J1502
6596i7199j4891J7251l929N6383k2028J150p060K0731M9014J6707l3345J7923
6584G07j8658l2243n2601n2869Q0161J5247l9032q5974J0611P7959l4319l7497
6572a68508P0289k0808K974J2982J2890j796k8307o948J889j7032j6961O0136
6560i9200K5046J2683J5107p1089K6423L4649k2047J7525P437j5090k2493k8050
6548a19099M0599l7536M65P9782n7779j7531J7907J1189M5425K0481m5607l3501
6536i5205j8804p632M2361j0993l3513L7217j9973l6825N3903N7592m5582n4966
6524a32420k5514R929j698M1963J3121l73l9819K3298P8777l1431R659N498o4767
$$ y = [-82782, -96416, -69051, -31889, -110298, -53889, 4773, 10876, -12662, -56683, -80263, -108701, -97199, -112090, -94839, -98768, -42385, -64413, -63263, -70323, -49592, -578, 16129, -17216, 707, -17951, -50194, -102795, -155664, -75503, -60256, -99288, -185262, -174651, -96692, -131011, -168508, -98219, -119027, -116053, -103071, -90181, -91977, -120284, -127232, -125343, -142375, -159336, -99200, -74154, -61471, -46364, -117453, -91030, -56381, -78428, -60903, -53466, -68556, -91049, -119099, -78500, -116036, -115571, -35789, -93568, -111099, -93192, -82003, -36578, -16097, -61704, -95205, -114009, -121641, -79280, -90273, -123786, -86569, -106542, -143367, -89464, -31872, -77454, -132420, -157934, -148005, -149703, -107740, -94619, -94992, -134811, -111513, -32736, -64167, -54508, -49010, -113777]
6511a13777q3356M2298J0503M723K7096l0387m047K6653p1382N8615K9374J5134
6499h8553L9703r4511n3471k7927P5505q121j3366L4361P8347J582l6575m9108
6487a42134N998O733m7062L3467J9650J886m5268m8219P7900o2039k1851J04072
6475a16867o8917j7663O9290j9583N553k4512k3828L955J486L9613J3163k8914
6463a67224N515m2750O8460O6114k9208k2088k4880j1309j4649M5683k3456p5885
6451b25677J1069J4975j7153M5431K9720o0073J888K8688O3462K5214o6014k5888
6439a74358m1124J7515M3366j9230N0656K621j1666J1708O55J4290k3487M858
6427a24196k233k6841Q1294l1925l927j567J6249J4111j2561J0388j8440K4853
$$ y = [-113777, -197133, -154835, -144332, -139609, -112513, -142900, -146947, -120294, -191676, -133061, -103687, -88553, -48850, -143361, -196832, -224759, -149254, -157375, -170741, -136380, -58033, -56451, -93026, -142134, -136136, -129403, -176465, -142998, -123348, -121462, -166730, -214949, -137049, -199088, -220939, -116867, -185784, -203447, -134157, -153740, -148187, -172699, -196527, -192572, -191086, -151473, -138310, -167224, -161709, -204459, -135999, -69885, -99093, -121181, -146061, -157370, -172019, -126336, -149792, -225677, -214608, -199633, -216786, -171355, -141635, -201708, -199820, -171132, -107670, -82456, -148470, -174358, -215482, -197967, -154601, -173831, -123175, -120554, -132220, -120512, -119857, -105567, -129054, -124196, -126429, -153270, -71976, -103901, -107828, -109395, -93146, -79035, -91596, -81208, -99648, -74795]
6415g4795j484J4461k6239J6724j9613K0561M2417o2781k6506J5374j1795k6583
6403a40259l731P7678n729n5949j6215k1535N1742j31j7873j3406k271K8794l7833
6390a56718J1509J9502k9447L173o9938R988P5409l9257o5943K453m793O835J9034
6377b18193p322j1898k1915Q1580J9590J7349o7880o559L0808l9250M5561N0179
6365a27950m0135Q66m1437R829L6246K5333n8273O7518m0336n9689O9334j0109
6353a68803n4170J9488N1480k0197k2077k2060J4783k1501j9749M6406J9364K3215
6341a53821l726n6589J7863k2455r110O8912k0486J6630p564j2441l380o7138
6329b53305k2022l0327J18835O4762m4835j5651J6810m2263M5198J7139k7537
$$ y = [-74795, -76279, -61818, -88057, -71333, -90946, -70385, -27968, -90749, -117255, -101881, -113676, -140259, -143990, -66312, -72041, -127990, -144205, -165740, -113998, -114129, -132002, -145408, -147679, -118885, -156718, -145209, -125707, -155154, -151981, -221919, -211931, -136522, -175779, -241722, -239269, -244062, -237227, -218193, -225515, -237413, -259328, -177748, -158158, -140809, -208689, -215248, -184440, -223690, -178129, -127950, -168085, -167219, -208656, -198827, -162581, -137248, -195521, -128003, -168339, -228028, -158694, -168803, -222973, -203485, -152005, -172202, -194279, -216339, -201556, -223057, -242806, -196400, -177036, -153821, -157547, -214136, -196273, -218728, -227838, -158926, -179412, -162782, -170346, -182787, -186167, -253305, -275327, -305654, -186819, -122057, -166892, -182543, -165733, -207996, -162798, -145659, -173196]
6318a73196N9141k5420L0753p3370k6179L1741L362n1544l7601M84K4201k5017
6306b62645m095k6352J10778J4581K6918m0323k6359J03985Q956N3229p5135o3593
6294a80055n1649M3143K5468K2692l7985J062N345M8832n5675l1002K9585K7944
6282a52295j5754o479j9999L3328N365j7787k8862r024M6661q38K5398j0893j4960
6269a66139o497L162L946j5555N9354m1976o8037M164J5776m4707J3673l6526
6257b79362R082Q5757K5254n1250j8762R1224N8805k7048R233o8591n3598r811
6245b29067O124R0144p6925j6845K2806l7783m3557M7810P0228k0372L7786l2678
6233a82329l1984J1455K9981P0116l7999K3233p2854m4299O8312l8136L1445J2638
$$ y = [-173196, -114055, -139475, -108722, -182092, -208271, -176530, -173168, -224712, -262313, -261829, -237628, -262645, -266740, -293092, -182314, -167733, -140815, -181138, -207497, -103512, -94556, -41327, -116462, -180055, -231704, -188561, -163093, -140401, -178386, -177324, -171979, -123147, -178822, -209824, -180239, -152295, -168049, -174528, -194527, -161199, -155834, -173621, -202483, -211507, -164846, -165684, -140286, -151179, -166139, -172636, -169474, -165528, -181083, -121729, -163705, -231742, -227578, -211802, -256509, -242836, -279362, -270280, -184523, -159269, -210519, -229281, -138057, -79252, -106300, -97067, -165658, -219256, -229067, -222943, -132799, -209724, -226569, -203763, -241546, -285103, -237293, -167065, -187437, -149651, -182329, -214313, -202858, -172877, -102761, -140760, -117527, -190381, -234680, -166368, -204504, -173059, -160421]
6221a60421O507K7511m2543m7274M9892m5914M0899J9650k4637N7168K0580j26572
6209b25154l4367Q657L7089N2000m0650l1796k6624O6876j0195o5007L2066k5781
6197b62886j8640K9260P6622J6697q538O0378m0895M2500j2972o3498m4142K2977
6185b03137k3287Q564P5086k373j09483Q1247j1650J7401K4752K8558j5213L3349
6173i6186k4256l8764j8150l5066m5936N0280M011N2693k4417j5912k7330l7507
6161b56540L6648J8895O8892j2065K5891m0024N8214R419m9758o1503j2710O7553
6149a47088l8038m7630P2468M6014m0513K619O5031l7633n8015L1253j8501Q532
6137a61501j4218p0620K6416O950L5959M2554O279p8246K0283L7813n5403J1777
$$ y = [-160421, -153914, -126403, -168946, -216220, -166328, -212242, -171343, -151693, -176330, -119162, -98582, -225154, -259521, -250864, -213775, -161775, -202425, -234221, -260845, -193969, -204164, -269171, -237105, -262886, -281526, -252266, -175644, -158947, -167485, -107107, -148002, -105502, -118474, -181972, -226114, -203137, -226424, -217860, -142774, -145147, -254630, -173383, -185033, -167632, -142880, -114322, -129535, -96186, -120442, -159206, -177356, -212422, -258358, -208078, -204067, -151374, -175791, -191703, -219033, -256540, -219892, -200997, -132105, -144170, -118279, -158303, -100089, -90670, -140428, -201931, -214641, -147088, -185126, -232756, -160288, -114274, -154787, -152168, -87137, -124770, -182785, -151532, -170033, -161501, -175719, -246339, -219923, -212973, -177014, -134460, -128181, -206427, -186144, -148331, -203734, -191957]
6125a91957K5213j1418j3534q197j0868P235j5180k8348m71J4079M8806K0545
6113a64095M8551j6931r251j9290j3580J5995J3213o094j2720l6413l9294k1668
6101b61577L9556m385J2759J6544K2987p225L6862J0595j8487j1524l5257L6622
6089a62530j0882O6016r0553l2330J07808j8654m7369l6454j825L4433R3873L232
6077i5235o6462J6064l7864K6910O8416j1034N40l1459k4444J9713m3143l7834
6065b15832k0880M3587N8940j1147m6800l3191j9250M4768L9400j9595L952r0
6053a76138K2006L3568J0448l9732L15k754o3963L113J9157j7092N7836K4464
6041a28772N5389n1794j3211q620n298J7328M15n9399l8583Q7456m6654L0425
$$ y = [-191957, -166744, -178162, -191696, -199893, -210761, -203526, -218706, -247054, -247525, -233446, -184640, -164095, -115544, -132475, -141726, -161016, -174596, -158601, -145388, -151482, -164202, -200615, -239909, -261577, -222021, -226406, -213647, -197103, -174116, -181341, -144479, -133884, -152371, -163895, -199152, -162530, -173412, -107396, -197949, -230279, -122471, -141125, -188494, -224948, -226773, -192340, -98467, -95235, -161697, -145633, -183497, -156587, -88171, -99205, -98665, -130124, -154568, -134855, -177998, -215832, -236712, -193125, -134185, -145332, -192132, -225323, -244573, -199805, -160405, -180000, -176048, -176138, -154132, -120564, -110116, -149848, -149533, -152287, -216250, -213137, -193980, -211072, -153236, -128772, -73383, -125177, -138388, -147008, -152306, -134978, -134563, -193962, -232545, -145089, -191743, -161318]
6029a61318J1088m3584J4881k3446K7157Q6190l0657n2101m0361N9095K8997j0270
6017a34329j2121m6842J1728M3856N6129l3080l6759j1279N1959m8021k9040l263
6005a91062L4905M2719o6569J0145O9943n1264j8932Q764L2423k9303l8156n866
5993b02253m487K2416k1669O7003k880K2224k9109k0485r245j2043k1410J292
5981b10646k1702N3008Q0145n8929n7389K4844r170J5092L7254m0071J6906Q6370
5969h4288K7261l9630o0500J6967k8125N2536r768l9916J07067j5352o5157N952
5957a32953n5422J2212K4311K7552n589j9413J6904M5704L7764k3379l452J145
5945g4616L008k0174k841j0132k2119j8559K1419K3786M842L0861N3465R065k8795
$$ y = [-161318, -150230, -193814, -178933, -202379, -175222, -89032, -119689, -171790, -212151, -153056, -124059, -134329, -146450, -193292, -181564, -137708, -81579, -114659, -151418, -162697, -110738, -158759, -187799, -191062, -156157, -113438, -180007, -169862, -99919, -151183, -170115, -161351, -128928, -158231, -196387, -202253, -206740, -184324, -205993, -138990, -141870, -119646, -148755, -169240, -178485, -190528, -211938, -210646, -232348, -179340, -99195, -158124, -215513, -190669, -199839, -184747, -147493, -187564, -170658, -84288, -57027, -96657, -157157, -140190, -168315, -115779, -125547, -165463, -58396, -73748, -138905, -132953, -188375, -176163, -151852, -124300, -129889, -149302, -132398, -86694, -48930, -72309, -75761, -74616, -71608, -91782, -94623, -104755, -126874, -145433, -124014, -100228, -95386, -64525, -11060, -1995, -30790]
5932c0790r3997k7822K4437k0878O2150K8889k4119K810J537j1735o4385p3775
5920b27678k2276R9712L8216L7325J365m2263L8868j9857l2507J4589k8334K981
5908a39859K9150R444J8868n254l6251L8226l461j8208m0463q074k6884L8015
5896a44751K4464L150K1355p427p0099l0292K2710j6721m3540R2868P3985p1797
5884a46095m3720M9103k1087N9599K0237J7408l8537l174M9960o73K0041J7249
5872a9689p2717k7936K7337j5738n4599j0165N2897j3439J7257N465M6965n029
5860f9391J188l7332L8149m30o3254n982Q8310n3378k7182k7625k4631J3218J0587
5847a57753K9209M5106p1825K5324M8219r960n6998L740n1097K563M9736l4774
$$ y = [-30790, -124787, -152609, -128172, -149050, -86900, -58011, -82130, -79320, -77783, -89518, -153903, -227678, -249954, -150242, -112026, -74701, -73336, -115599, -76731, -96588, -129095, -114506, -142840, -139859, -110709, -101265, -82397, -87651, -123902, -85676, -89137, -107345, -147808, -155882, -182766, -144751, -120287, -117137, -95782, -103209, -173308, -203600, -180890, -197611, -241151, -148283, -74298, -146095, -189815, -140712, -161799, -102200, -81963, -64555, -103092, -106266, -56306, -56979, -36938, -19689, -92406, -120342, -93005, -108743, -163342, -173507, -120610, -134049, -116792, -111327, -64362, -69391, -68203, -105535, -67386, -67816, -131070, -137052, -48742, -102120, -129302, -156927, -181558, -168340, -157753, -128544, -83438, -155263, -129939, -81720, -91680, -148678, -144938, -196035, -193472, -143736, -178510]
5835a78510k6164O8743R079J4353M0280J2344K1n9047n3084J8722M4622M6152
5823f2489K3899L3292j1880q5823N2684r172q3408J7248L9296j753K1547M8986
5811a7573k9418m1531l1621m800R646J8777k4309L2329L3899J2517l9859m008
5799h5951P3668p1418j4667J8348q622o786N0849m4743j433N327j4916N3960J5105
5786c1279l4271l9582k9503K3822j5511N3306L5015j9478k9364M7832J2183r578
5774c6408q3512M0356l502n6167o3195K2958M8823q034L0678J737J5974Q609j4134
5761i5817Q757n562K2381K0194r6682N9451O609K2297L2052N4198j2150r0237
5749g4509K8962l3656l5089M1289j4960R354N6889j780k2538j2715M7095M0128
$$ y = [-178510, -204674, -135931, -126852, -112499, -72219, -59875, -59854, -118901, -171985, -153263, -108641, -62489, -38590, -5298, -17178, -103001, -50317, -59489, -142897, -125649, -86353, -88106, -66559, -17573, -46991, -88522, -120143, -124943, -115297, -96520, -120829, -88500, -54601, -42084, -81943, -85951, -12283, -83701, -98368, -80020, -88642, -95428, -44579, -89322, -90755, -85428, -100344, -46384, -31279, -65550, -105132, -134635, -110813, -126324, -73018, -38003, -57481, -86845, -39013, -26830, -36408, -119920, -79564, -83066, -139233, -202428, -179470, -130647, -138681, -108003, -106266, -90292, -81683, -95817, -87060, -92622, -70241, -50047, -146729, -87278, -80669, -58372, -26320, 27878, 15728, -74509, -45547, -79203, -114292, -73003, -87963, -78609, -21720, -23500, -46038, -58753, -11658, 28470]
5737B8470J3350r8535l353J996R1O5689P76j1769M8918l4388k8285J2431K5496
5724B0887r1973r469O957K9549J4144k394P845k5034M7480k7822L8005r505j9152
5711b0482j9866j7145k2441M7881L0446K2302J919m5986J0939L2433K4782K6883
5699G1665k0890j10901O0438M504q6336R7181J744M7445l7777j7460r218J619
5687B014J3682P3576m872l7900J6115J5787L4249j9233K5165J1883o173P9338
5675B03631p5980Q678p864j9854K1655m8988l2975j1425M3861k9201M0031K2269
5663A13838j0096M3329J2227J6927O3236m6103j291j6616l9807L7137L8629n8130
5651A53280m663M039M6473k9728k0807N3660l6487N8885r571J01424K0075o7401
$$ y = [28470, 41820, -56715, -60068, -58072, -57981, 7708, 8484, -3285, 45633, 11245, -17040, -4609, 20887, -71086, -80555, -73598, -44049, -29905, -32299, -24454, -49488, -2008, -29830, 8175, -1330, -20482, -40348, -57493, -79934, -32053, -1607, 20695, 22614, -23372, -12433, 20000, 44782, 71665, 50775, -60126, 312, 4816, -81520, 15661, 17405, 64850, 27073, 9613, 395, 2014, 15696, 89272, 84400, 46500, 62615, 78402, 112651, 93418, 118583, 130466, 124293, 203631, 127651, 136329, 128465, 108611, 130266, 81278, 48303, 36878, 80739, 51538, 91569, 113838, 103742, 147071, 159298, 176225, 239461, 193358, 192067, 175451, 135644, 172781, 211410, 153280, 148617, 152656, 199129, 169401, 148594, 202254, 165767, 224652, 215081, 316505, 336580, 269179]
5639B69179r7594M2338N4334n1125j4950K6068M0427j0854m1507k5447L0807m472
5627B17204J2875N9123n599K8188K9545p8688j3850L7687J0893L0877L9901m4915
5615C23241L4447J7570R566j422K6958k999N3041k9411o5728K8723N8567J3702
5603D66255r126R94L0815j2244M3813m1547o9816M6409Q0892j5713o0101L9061
5591D99692o1058o0895K2960O6276l40M6774j5822K3171k8640Q793O8825N967
5579E75703j0010N2651P868K1705L8160M3002J07236L0897N1848K6604J1350R5754
5567A052768R8666J0939K7225N3993P0970K9574K1625k2135k642l0079m3970q2476
5555A184458l9098o4633J0202l5328q0286k7042n6111j7371k9629r6907o7175
$$ y = [269179, 171585, 213923, 268257, 217132, 202182, 228250, 268677, 257823, 216316, 190869, 221676, 217204, 230079, 289202, 283603, 311791, 341336, 262648, 248798, 286485, 297378, 328255, 368156, 323241, 357688, 375258, 384824, 383402, 410360, 407361, 460402, 430991, 365263, 393986, 452553, 466255, 457129, 458123, 488938, 476694, 520507, 478960, 409144, 455553, 536445, 520732, 460631, 499692, 438634, 377739, 400699, 466975, 466635, 513409, 497587, 520758, 492118, 500911, 569736, 575703, 565693, 618344, 626212, 647917, 686077, 729079, 836315, 867212, 919060, 945664, 957014, 1052768, 1151434, 1162373, 1189598, 1243591, 1314561, 1344135, 1365760, 1343625, 1340983, 1310904, 1266934, 1184458, 1145360, 1080727, 1090929, 1055601, 975315, 948273, 892162, 874791, 845162, 748255, 681080]
5544F81080o6922L1761O4348n4234q0362N4192L1608n9348R270n3100n0657n2795
5532D54841k772q287K328k8068O2586l5043k5988l3870j6902M8998j8783l8282
5520C60758k8584K8607j0246l3187k2738p347J6551m799K194J7536K4599N861
5508C49205J6871J210n0527J6543k3500p0137P2832K3751j097j1161j7953J5350
5496C21387m7599K2762k0012r7796j6522N6356J6898O244L079O027M826N2696
5484C08346M4165J0124L6649n9133m0839J6517m3462J3727J4764k5350n8967J6659
5472B33200J2451n0986L5449J09141K5558k8069l028L8783J2720R868J9470l6866
5460C77691n6795O3538O4740L3658j9489n6236n808L7062K0873K5845P8761L1886
$$ y = [681080, 614158, 645919, 710267, 656033, 575671, 629863, 661471, 602123, 611393, 558293, 507636, 454841, 452069, 443782, 446110, 418042, 480628, 445585, 419597, 385727, 368825, 417823, 399040, 360758, 332174, 360781, 350535, 317348, 294610, 287263, 303814, 299015, 301209, 318745, 343344, 349205, 366076, 367286, 316759, 333302, 309802, 239665, 312497, 336248, 335151, 323990, 306037, 321387, 273788, 296550, 276538, 178742, 162220, 218576, 235474, 241718, 244797, 250824, 255650, 308346, 352511, 362635, 399284, 340151, 299312, 315829, 272367, 286094, 300858, 275508, 216541, 233200, 245651, 194665, 230114, 339255, 364813, 336744, 333716, 372499, 385219, 395087, 414557, 377691, 320896, 384434, 449174, 482832, 463343, 407107, 401299, 438361, 459234, 485079, 563840, 595726]
5448E95726l9604k2301k2822L5468K5172K9111K8916M9502L8147m0701j3629K3964
5436F86949m175j422L6197K5448O9385k3635l1787J1818J2941J8299Q0681K9597
5424I10296L4254m887O8584K2495q2185m4152Q7719J6412k3037j0888K0866n171
5412I90306Q683J05107n116k0022L6799M7210q111J4094O3532R02K9710m6181
5400A216913N774l5439o9096K7980N0148K2859k4221J4575Q483L7088l0901m8619
5388A175544N3891j353K0232m1362L4901L6754j6530L8465O426J9314j7424o804
5376A302054k3773N4647L0737q0393m6995M2178L1138k8626J0711L3874k4672
5365A300880M3722K6880m2734m7070Q6247J3000p1765j829l4982l731K7914l4778
$$ y = [595726, 556122, 533821, 510999, 546467, 571639, 600750, 629666, 679168, 717315, 676614, 662985, 686949, 682774, 681352, 717549, 742997, 812382, 788747, 756960, 768778, 781719, 800018, 880699, 910296, 944550, 939663, 1008247, 1030742, 948557, 904405, 992124, 1008536, 985499, 974611, 995477, 990306, 998989, 1104096, 1098980, 1078958, 1115757, 1162967, 1154856, 1168950, 1232482, 1233384, 1263094, 1216913, 1222687, 1187248, 1118152, 1146132, 1196280, 1219139, 1194918, 1209493, 1217976, 1255064, 1224163, 1175544, 1229435, 1228082, 1248314, 1206952, 1241853, 1278607, 1262077, 1300542, 1306968, 1326282, 1308858, 1302054, 1278281, 1332928, 1363665, 1283272, 1236277, 1278455, 1309593, 1280967, 1291678, 1325552, 1300880, 1344602, 1371482, 1328748, 1281678, 1367925, 1380925, 1309160, 1307331, 1272349, 1268618, 1296532, 1261754]
5353A261754N1440O8120N405K9602J3564M6719m1796q295J04459J3251n0763n029
5341A488431m691n8720O2222K7100L0684M3682k8074m6214K3989Q059m16j530
5329A544522k7939J679J418m4256K1891J8443o8800m6296o6395L0203O8401N966
5317A438837R384m7l744o2386L2027k091J7817K3749J0824j6522Q1576L1651M038
5304A565113P2328Q8881L1748L3312L6587P771N9368O5931Q9240R1517J10353
5293B252149O389N8632K9579J9288J3221O9905J0532m745j0380L9797j6865j13230
5281B354272l4862r8012o0978j12604n3232k8863n6191k0382n7164K7837j2713
5270A847108m3390q3482l6330K6395l0876J5504Q8227r596n7608J5418M4821O1297
$$ y = [1261754, 1313194, 1381314, 1386719, 1416321, 1429885, 1476604, 1434808, 1426513, 1530972, 1544223, 1493460, 1488431, 1483740, 1425020, 1487242, 1514342, 1545026, 1588708, 1560634, 1514420, 1538409, 1546468, 1546052, 1544522, 1516583, 1518262, 1519680, 1475424, 1497315, 1515758, 1446958, 1400662, 1334267, 1364470, 1432871, 1438837, 1448221, 1448174, 1444430, 1382044, 1414071, 1411980, 1429797, 1453546, 1464370, 1447848, 1529424, 1561075, 1565113, 1637441, 1726322, 1758070, 1791382, 1827969, 1835740, 1895108, 1961039, 2050279, 2141796, 2252149, 2258538, 2317170, 2346749, 2366037, 2379258, 2449163, 2459695, 2454950, 2444570, 2484367, 2467502, 2354272, 2319410, 2221398, 2160420, 2047816, 1994584, 1965721, 1909530, 1889148, 1831984, 1859821, 1847108, 1803718, 1720236, 1683906, 1710301, 1679425, 1694929, 1783156, 1773560, 1715952, 1731370, 1776191, 1837488]
5258A837488N7218L2155N6546N9423L9699Q0027J31231O4272R1480J30209J40202
5247B719950J05977J82571J51868J62042K20975J62362Q0789R7761O4386N3744
5237D002425m2907q0372j8756j83865j76413n5515j39782j87710j72437q3824
5227B860844j32105j59804o5371r9967r4091o7727p7632j33039o4445k1096r2076
5216A853491k1239o6966j08768l2644m2244R449L9951n3428n8688j00224l8048
5205A380642L5513l1280J0873p0149N801o757j10036l8870O8346L9740K1381p4803
5193A230401m509N5315J1807k8627j105q248k1845J634L7404l482N6663m4343
5181A281065L3054k020j5751n1750j05979l6526p538J05892l1493j5170L075j112
$$ y = [1837488, 1894706, 1926861, 1983407, 2042830, 2082529, 2162556, 2293787, 2358059, 2449539, 2579748, 2719950, 2825927, 3008498, 3160366, 3322408, 3543383, 3705745, 3786534, 3884295, 3948681, 4002425, 3959518, 3879146, 3860390, 3676525, 3500112, 3444597, 3304815, 3117105, 2944668, 2860844, 2728739, 2568935, 2503564, 2403597, 2309506, 2241779, 2164147, 2031108, 1966663, 1945567, 1853491, 1832252, 1765286, 1656518, 1623874, 1581630, 1591079, 1631030, 1577602, 1518914, 1418690, 1380642, 1416155, 1384875, 1395748, 1325599, 1331400, 1324643, 1214607, 1175737, 1244083, 1283823, 1305204, 1230401, 1225892, 1281207, 1293014, 1264387, 1263282, 1255034, 1233189, 1234823, 1272227, 1268745, 1325408, 1281065, 1314119, 1312099, 1296348, 1244598, 1138619, 1102093, 1094555, 1200447, 1168954, 1153784, 1156859, 1155747]
5169A155747K3473n3204J1524J3011k2006m5369K0617L7053o0853j0464M1032
5158A110561k3983j0744j4236m9550J24732l2860m692Q641n2255K9620L5100o0567
5146A059767m424j3271M4776q8375o375M2123L265L3506o169o4971R168l8101
5134I70919L6252P9685j4804q022p6838p303M4243N1924p5276q884L6529k4759
5122A003666l2494n149K7038Q734L4069K3606k9450K9577k0002K1181M6703m9723
5110A057756J093M1125n7534j1649o922O2557k4236k742O4216o0848l2888K5003
5098A054931J206K7900J3680j0886M2461k136K3285K0455L7922r0281j4117M7816
5086A152236L2853j4277l4207P4894q748K0596R243K6160m0506L2930O4017N3179
$$ y = [1155747, 1179220, 1126016, 1137540, 1150551, 1128545, 1083176, 1103793, 1140846, 1079993, 1069529, 1110561, 1086578, 1075834, 1061598, 1012048, 1136780, 1103920, 1099228, 1107869, 1055614, 1085234, 1120334, 1059767, 1055343, 1042072, 1086848, 998473, 992098, 1034221, 1037486, 1070992, 1064823, 999852, 1009020, 970919, 1007171, 1086856, 1072052, 1064030, 987192, 979889, 1024132, 1076056, 1000780, 991896, 1028425, 1003666, 971172, 966023, 993061, 1001795, 1035864, 1059470, 1030020, 1059597, 1039595, 1060776, 1107479, 1057756, 1058849, 1099974, 1042440, 1030791, 1023869, 1086426, 1062190, 1059448, 1123664, 1062816, 1029928, 1054931, 1056137, 1084037, 1097717, 1086831, 1129292, 1127156, 1150441, 1170896, 1208818, 1118537, 1104420, 1152236, 1185089, 1170812, 1136605, 1211499, 1202751, 1223347, 1232590, 1258750, 1218244, 1251174, 1315191, 1368370]
5074A368370j2482l8502J7361l187o8738N9038J2892j2829P5200J2709j9486q193
5062A382153m00K2247M5040l1583O323j2542L9594L6494k469m6466j8152M6175
5050A466414K5847M7198m4066N2686J5757M4368O3148k4180j8282j0030J3310
5039A632170M5056Q558L5864j1647k1301N1330m8117L0056L926l5048M6444K7570
5027A764861R842N4086k4367O038L4025P8785K3729J5453l9393L2776J1470p9672
5015A887633j8092P6569J16998l1769L6968K0328n365M2716J2828L197n336N408
5003B142083O5236L0185P615J23132K4236K0552j4217M4795N6146L7970P746k9837
4991B515642p508Q8405k7177J645k6828j2496J02527J7813J03964j0728L8175
$$ y = [1368370, 1355888, 1317386, 1334747, 1331560, 1262822, 1321860, 1334752, 1321923, 1397123, 1409832, 1390346, 1382153, 1381753, 1404000, 1449040, 1417457, 1423780, 1411238, 1450832, 1487326, 1484857, 1438391, 1420239, 1466414, 1492261, 1539459, 1495393, 1548079, 1563836, 1608204, 1671352, 1647172, 1628890, 1618860, 1632170, 1677226, 1685784, 1721648, 1710001, 1688700, 1740030, 1691913, 1721969, 1725895, 1690847, 1737291, 1764861, 1774703, 1828789, 1804422, 1810460, 1844485, 1923270, 1946999, 1962452, 1923059, 1955835, 1967305, 1887633, 1869541, 1946110, 2063108, 2031339, 2068307, 2088635, 2083270, 2125986, 2138814, 2142011, 2136675, 2142083, 2207319, 2237504, 2245119, 2368251, 2392487, 2413039, 2398822, 2443617, 2499763, 2537733, 2545479, 2515642, 2508134, 2596539, 2569362, 2571007, 2544179, 2531683, 2634210, 2652023, 2755987, 2745259, 2783434]
4980B783434L3400M5022N6698p738O6153J6027R81O9963M6537N6986J1365M5338
4968C224166M907M6822M4645O9063J54131M6767K9419K4617P3342J33011M6236
4957C897126J01216J18906O7902P0223J02054Q4372R5959J07237J83035J25389
4947D953419Q1155R1780R3785Q3955J31254N0816J22224J34378J77021J40403
4937F060190Q3949R0481J34799J49589J26751J48063J38298J26185J78381K52918
4927G489604J60604K31725Q2684J57169K12672K06377J18644J96017J55658J98128
4917I209282J74940K08935K67908K42710K06015K62842J71887K21273L03914K59982
4907A1529688K00824K46951K97397K60294L55405L94179K07494L38408L70347
$$ y = [2783434, 2816834, 2861856, 2918554, 2910816, 2976969, 2992996, 2993977, 3063940, 3110477, 3167463, 3178828, 3224166, 3229073, 3275895, 3320540, 3389603, 3543734, 3590501, 3619920, 3644537, 3717879, 3850890, 3897126, 3998342, 4117248, 4185150, 4255373, 4357427, 4441799, 4537758, 4644995, 4828030, 4953419, 5034574, 5126354, 5220139, 5304094, 5435348, 5486164, 5608388, 5742766, 5919787, 6060190, 6144139, 6234620, 6369419, 6519008, 6645759, 6793822, 6932120, 7058305, 7236686, 7489604, 7650208, 7881933, 7964617, 8121786, 8334458, 8540835, 8659479, 8855496, 9011154, 9209282, 9384222, 9593157, 9861065, 10103775, 10309790, 10572632, 10744519, 10965792, 11269706, 11529688, 11730512, 11977463, 12274860, 12535154, 12890559, 13284738, 13492232, 13830640, 14200987]
4898A4200987L82770M30515M07310M22524M16610M12540L28094M59398M78509
4889A7939257N33097M33288M50925N11055N81237N15865N83283N97951O97595
4880B2843553O60331O29895O88489O10989O85304P21411O36890P17369P22001
4871B8916232O00879O69590O73646N30066N64808N19248M19945M19429L39686
4862C3653529K35931J40557M095o2359j59163l82106n53615n37134n97062o58021
4852C1084652p61179q09834q03487q58359q20180q04348q39982p96372o84605
4843B3906306p84253q07126p02939o45698o68013o11821o62928o24632n77273
4834A7821623n13856m67290m67358m93694m91956l43345l96924m32391m54088
$$ y = [14200987, 14583757, 15014272, 15421582, 15844106, 16260716, 16673256, 17001350, 17460748, 17939257, 18472354, 18905642, 19356567, 19867622, 20448859, 20964724, 21548007, 22145958, 22843553, 23503884, 24133779, 24822268, 25433257, 26118561, 26839972, 27476862, 28194231, 28916232, 29517111, 30186701, 30860347, 31390413, 31955221, 32474469, 32894414, 33313843, 33653529, 33889460, 34030017, 34034112, 33971753, 33812590, 33430484, 32876869, 32339735, 31742673, 31084652, 30323473, 29513639, 28710152, 27851793, 27031613, 26227265, 25387283, 24590911, 23906306, 23122053, 22314927, 21611988, 20966290, 20298277, 19686456, 19023528, 18398896, 17821623, 17307767, 16840477, 16373119, 15879425, 15387469, 15044124, 14647200, 14214809, 13760721]
4825A3760721m04707l83823l02412l46439k24919k76650l18641k95173j86801
4816A1021156j46734k14616k76927k05282j87985k48927k29687j65965j69134
4807I175899j41807j53867j79505j68918j52366j01227j44519j13735j26709j13700
4797G779546j43736p3622p3559k4510r0426n9053l7710M4049j9809l8642j9285
4786G243243k9431n7679O9084m3155o7916J6138o9169p489J6737J4472m2555k6951
4774G015329m2248L941L6075k55p6051m7195m4927N69j8527n7459O7467l4431
4762F802288j3303n1463L8783L3912Q360O3026L4124K158P1844O1779L729J04138
4750G159375R8167K2489k411J6901j5362p983K5780k3556o4925l0577j2237m2620
$$ y = [13760721, 13356014, 12972191, 12669779, 12323340, 12098421, 11821771, 11503130, 11207957, 11021156, 10874422, 10659806, 10382879, 10177597, 9989612, 9740685, 9510998, 9345033, 9175899, 9034092, 8880225, 8700720, 8531802, 8379436, 8278209, 8133690, 8019955, 7893246, 7779546, 7635810, 7562188, 7488629, 7464119, 7373693, 7314640, 7276930, 7320979, 7301170, 7262528, 7243243, 7213812, 7156133, 7225217, 7182062, 7114146, 7130284, 7061115, 7053626, 7070363, 7084835, 7042280, 7015329, 6973081, 6977022, 7013097, 7012842, 6936791, 6889596, 6844669, 6845238, 6826711, 6769252, 6836719, 6802288, 6788985, 6737522, 6776305, 6810217, 6818577, 6881603, 6915727, 6917885, 6989729, 7051508, 7055237, 7159375, 7257542, 7280031, 7277620, 7294521, 7279159, 7271176, 7296956, 7273400, 7208475, 7177898, 7165661, 7123041]
4738G123041o8222m3265L2652q705l3592J2554L5662L5016J6605R4251L9528J24513
4726G360038Q4014J18556J13546O9998J44599J67211J01823Q7515R0679J52748
4716H490727J01620Q1108N6507R0382j6604J1462J04904o1580J8844m9154r129
4705H819087o8378o8054p3443j3163n3551l6873M8560m8347k543K6647N2107M7957
4693H630006N8314N9091L4671J06810J46179K3603J19544J22762J17593J07932
4683I526505J46305J23955Q6915K01329K11944K02342J34074K51643K28247K97168
4673A1410427K88495K50948L17129L60423L35938M10464M40758N20756M81057
4664A4816395N04623O00910O13340O20734P27533P95406Q19339R12523R25497
$$ y = [7123041, 7054819, 7011554, 7044206, 7035501, 7001909, 7014463, 7050125, 7085141, 7101746, 7195997, 7235525, 7360038, 7444052, 7562608, 7676154, 7746152, 7890751, 8057962, 8159785, 8247300, 8337979, 8490727, 8592347, 8673455, 8729962, 8820344, 8803740, 8815202, 8920106, 8858526, 8877370, 8828216, 8819087, 8750709, 8682655, 8609212, 8596049, 8542498, 8505625, 8554185, 8505838, 8503295, 8529942, 8582049, 8630006, 8688320, 8747411, 8782082, 8888892, 9035071, 9058674, 9178218, 9300980, 9418573, 9526505, 9672810, 9796765, 9883680, 10085009, 10296953, 10499295, 10633369, 10885012, 11113259, 11410427, 11698922, 11949870, 12266999, 12627422, 12963360, 13373824, 13814582, 14335338, 14816395, 15321018, 15921928, 16535268, 17156002, 17883535, 18678941, 19498280, 20410803, 21336300]
4655B1336300R42009R10152R36283R41959R54805Q77630Q86577Q96563R74030
4646B9656308J036154J143796J257468J338981J422855J517020J409973J373663
4638D0156218J299669J238845J205678J095606P63409O91198P06455Q85869J102171
4629D9145118J287041J629700J904612K212934K678101L043643L397537L816693
4621F9115379M057793M270705M499468M524126M586221M495241M197099L869193
4613A03615225L421662L076185K780174K655855K528462K611496K939461L520765
4605A27149285M151690M775889N418504N854466O180682O350463O152431N781243
4597A71814653N096562M280608L313856K287106J381086P52814M33505L90343
$$ y = [21336300, 22278309, 23188461, 24124744, 25066703, 26021508, 26899138, 27785715, 28682278, 29656308, 30692462, 31836258, 33093726, 34432707, 35855562, 37372582, 38782555, 40156218, 41455887, 42694732, 43900410, 44996016, 45759425, 46450623, 47157078, 48042947, 49145118, 50432159, 52061859, 53966471, 56179405, 58857506, 61901149, 65298686, 69115379, 73173172, 77443877, 81943345, 86467471, 91053692, 95548933, 99746032, 103615225, 107036887, 110113072, 112893246, 115549101, 118077563, 120689059, 123628520, 127149285, 131300975, 136076864, 141495368, 147349834, 153530516, 159880979, 166033410, 171814653, 176911215, 181191823, 184505679, 186792785, 188173871, 188926685, 189360190, 189750533]
4589A89750533Q65325J658155K323830K809928L254597L569788L796529L470582
4581B11499267K437077J052537j54034p49885j747871k927265l498248l406176
4573B02505402l137068k720510k142646j604283r58559k95814N97133J389294
4565A93632949J922592K011947J774225J494600J230931R25512M42425k71573
4557B03163608j142957j918274k469015k721721l188131l552274l341197k843771
4549A81986268k071110j213244m24206J10229N11909O47785N37170L29712k93650
4540A80120863j377568k840234l934844m831572n567861o234296o353579n795138
4532A43185771n004190m188326l535606k795075k198099j732888j476056j324959
$$ y = [189750533, 190615858, 192274013, 194597843, 197407771, 200662368, 204232156, 208028685, 211499267, 213936344, 214988881, 214834847, 214084962, 212337091, 209409826, 205911578, 202505402, 199368334, 196647824, 194505178, 192900895, 191942336, 191646522, 192243655, 193632949, 195555541, 197567488, 199341713, 200836313, 202067244, 202992756, 203435181, 203163608, 202020651, 200102377, 197633362, 194911641, 191723510, 188171236, 184830039, 181986268, 179915158, 178701914, 178277708, 178387937, 178899846, 179547631, 180084801, 180414513, 180120863, 178743295, 175903061, 171968217, 167136645, 161568784, 155334488, 148980909, 143185771, 138181581, 133993255, 130457649, 127662574, 125464475, 123731587, 122255531, 120930572]
4524A20930572j443072j732458k098633k746728l437264l905360m263972m570592
4516I6732493m692753m624231m366252l970756l679214l134850k701564k446488
4508F7116385k012154j756615j610878j253438j027924r24366q96454q86005q49842
4499E5898709p90369q49770j068620j202330j351005j443296j434894j444330
4491D6314095j247435j134030j028053q06968p45902o27215n17431m58968l65814
4482C9382279l98899l95263n50561o81146o31116o47007n62431m88165m30422
4473C4597269n87526q41286q94154q05831p30981o54978n99962m84140m22647
4464B8575764l89760l27390l30059k46821k14223k28919k76272k99110k36915
$$ y = [120930572, 119487500, 117755042, 115656409, 112909681, 109472417, 105567057, 101303085, 96732493, 92039740, 87415509, 83049257, 79078501, 75399287, 72264437, 69562873, 67116385, 65104231, 63347616, 61736738, 60483300, 59455376, 58531010, 57634556, 56748551, 55898709, 55108340, 54258570, 53189950, 51987620, 50636615, 49193319, 47758425, 46314095, 45066660, 43932630, 42904577, 42097609, 41351707, 40724492, 40207061, 39748093, 39382279, 38983380, 38588117, 38037556, 37356410, 36725294, 36078287, 35515856, 35027691, 34597269, 34009743, 33168457, 32274303, 31468472, 30737491, 30082513, 29482551, 28998411, 28575764, 28186004, 27858614, 27528555, 27281734, 27067511, 26838592, 26562320, 26263210, 26026295]
4455B6026295j91589j6286l8434J5106J95764K38761K50138L60060M01467M29559
4445B7670841N78132P24843P83341R51402J024982J066723J109944J288752J340702
4436C6539662J511462J537266J761500K019058K290462K649611K976028L357940
4428E4642989L863630M438646N075283N606526O289419P187915Q358583R747439
4420A05210430J1098683J2201384J3647715J5308000J6799893J7850981J7793181
4413B09910267J6067083J3331979J0598699R234641Q822083P294965k548569j6858643
4405B55852505k1144231j8793803j7120527j8298493j7556978j5044240j2876521
4398A35017712j1095829r835576r002347q604094q010809p027229o114962n272974
$$ y = [26026295, 25834706, 25818420, 25779986, 25795092, 25990856, 26229617, 26479755, 26839815, 27241282, 27670841, 28248973, 28973816, 29757157, 30708559, 31733541, 32800264, 33910208, 35198960, 36539662, 38051124, 39588390, 41349890, 43368948, 45659410, 48309021, 51285049, 54642989, 58506619, 62945265, 68020548, 73627074, 79916493, 87104408, 95462991, 105210430, 116309113, 128510497, 142158212, 157466212, 174266105, 192117086, 209910267, 225977350, 239309329, 249908028, 259142669, 267964752, 275259717, 272711148, 255852505, 234708274, 215914471, 198793944, 180495451, 162938473, 147894233, 135017712, 123921883, 114086307, 105083960, 96479866, 88469057, 81441828, 75326866, 70053892]
4390G0053892m661134m049523l607611l387289k983347k724658k521500k366801
4382D3752029k155525j897182j812028j635322j509207j453229j223526j213392
4374C0852618j103030j018925j052159r68802r84159j043827q97040p56612p52046
4365B2276018o91507o45051o22791n59964n58722m68803n26989m84839n23928
4356A7193424n45074n21460l87160m11510l85630l61953l09476l70345l24300
4347A3576516l17772k86312k03428k28095k51248j89487k51891j57794k16689
4338A1473800j56740j25788k31604j60984k11350j72397j59606j70029j72467
4329I912835j59126j41130j42225j33904k00430j39008j15602j49058j16922j33005
$$ y = [70053892, 65392758, 61343235, 57735624, 54348335, 51364988, 48640330, 46118830, 43752029, 41596504, 39699322, 37887294, 36251972, 34742765, 33289536, 32066010, 30852618, 29749588, 28730663, 27678504, 26709702, 25725543, 24681716, 23784676, 23028064, 22276018, 21584511, 20939460, 20316669, 19756705, 19197983, 18729180, 18202191, 17717352, 17193424, 16648350, 16126890, 15739730, 15328220, 14942590, 14580637, 14271161, 13900816, 13576516, 13258744, 12972432, 12769004, 12540909, 12289661, 12100174, 11848283, 11690489, 11473800, 11317060, 11191272, 10959668, 10798684, 10587334, 10414937, 10255331, 10085302, 9912835, 9753709, 9612579, 9470354, 9336450, 9136020, 8997012, 8881410, 8732352, 8615430, 8482425]
4319H482425p3426j29930m6051r5418j39271j03078k0171j08246j09207r4764
4309G562863n1703n7981r2836r5291r2428o6419m4498j1544m4408q4843r9901
4298F821011j37163o9350m4275j29380j16493j16105q3845j70717q9229q8498
4288E775956j05065r9744j60661m4412q6744j35335p7981r0879o0584j9415o645
4277D888491k5491K0186j11031o8487q092P9132J0154j0658p0921n4543k3166
4266D625574o5015l2619o1772p7608p4843l4903k5058j4090o3191n892l71j03276
4254D066936m1586n1939p150r8716j09421j4713j2850j8530m3456l4459n0877
4243C583239p4358n1246j799p733j6256l7133n0246j4122K5209K7588j24863n0568
$$ y = [8482425, 8408999, 8279069, 8233018, 8137600, 7998329, 7895251, 7875080, 7766834, 7657627, 7562863, 7511160, 7453179, 7360343, 7265052, 7172624, 7106205, 7061707, 7050163, 7005755, 6920912, 6821011, 6683848, 6614498, 6570223, 6440843, 6324350, 6208245, 6124400, 5953683, 5864454, 5775956, 5670891, 5571147, 5410486, 5366074, 5279330, 5143995, 5066014, 4975135, 4914551, 4895136, 4888491, 4863000, 4883186, 4772155, 4703668, 4695576, 4774708, 4784862, 4774204, 4703283, 4648740, 4625574, 4560559, 4527940, 4466168, 4388560, 4313717, 4278814, 4253756, 4239666, 4176475, 4170583, 4170212, 4066936, 4025350, 3973411, 3966261, 3867545, 3758124, 3743411, 3730561, 3712031, 3668575, 3634116, 3583239, 3508881, 3457635, 3455836, 3448103, 3431847, 3394714, 3344468, 3330346, 3355555, 3383143, 3258280, 3207712]
4231C207712L505k8221j10045m8753K848P438q8045m2743r1592j2545L5516k5122
4219B809953j742p6335p406l6835J1209p5271J2579n6903J7227k7409K465j13417
4207B458115o8090L5271m8539K8730p323o7089p7411m0213N916k7344N2405j24005
4195B120423J7029k5236l4864J9323l3800q5742m503n3511M8897o0142n3425J0065
4183A864514m393m9486l1461n1745o3942J113j8937m2605m8191N3388M4033K7642
4171A679930J8567J6092m1962j2424M382l303J5587m5250j00425k6358K3267m8001
4159A480102j0640l3411q5198O1382m1592k3420k2600k709j9133L0121m9549l497
4147A279856L239O9366m8659p6908k2755n8595K1034O7449J8845n7993j1335P235
$$ y = [3207712, 3211217, 3182996, 3072951, 3024198, 3027046, 3034484, 2946439, 2903696, 2812104, 2799559, 2835075, 2809953, 2808211, 2731876, 2724470, 2687635, 2698844, 2623573, 2636152, 2579249, 2596476, 2569067, 2571532, 2458115, 2390025, 2425296, 2376757, 2405487, 2398164, 2331075, 2253664, 2213451, 2219367, 2192023, 2244428, 2120423, 2137452, 2112216, 2077352, 2096675, 2062875, 1977133, 1972630, 1919119, 1968016, 1907874, 1854449, 1864514, 1860121, 1810635, 1779174, 1727429, 1663487, 1664600, 1645663, 1603058, 1554867, 1608255, 1652288, 1679930, 1698497, 1714589, 1672627, 1660203, 1664585, 1661282, 1676869, 1631619, 1531194, 1504836, 1528103, 1480102, 1469462, 1436051, 1350853, 1412235, 1370643, 1347223, 1324623, 1321914, 1302781, 1332902, 1283353, 1279856, 1283095, 1352461, 1303802, 1226894, 1204139, 1145544, 1166578, 1234027, 1252872, 1194879, 1183544, 1190779]
4135A190779n5784o747O1499j7778n1040q845k3694N6282P4507j0467R333M6996
4123A265041l1628k5128m2804Q4632P3227P7224N99P6039O1745j1553P0548Q6375
4111A684317J17694Q1937j9121M9770N9726Q6663P9967J9257k0998p0617j68372
4100A900223j23851m0383m6800j35424q7707p6427n5998m7357o4172l9712k3294
4089A159098q4048j6373Q481p4548m7304q5961J382N2579M136r8024J04629o2387
4077H61660p4210n6627k0490O4922J3221p3311K133J9820r202O050o702J9920
4065G47184n1114k3287J0137j1898m2257j6511K4081m8852M6881O8236j2659l0587
4053F59354o3728N0734J6219o9393N1639k5549m2911j9596N7705M0787j0545m1465
$$ y = [1190779, 1134995, 1128248, 1189747, 1171969, 1120929, 1112084, 1088390, 1144672, 1219179, 1208712, 1218045, 1265041, 1233413, 1208285, 1165481, 1250113, 1323340, 1400564, 1401163, 1477202, 1538947, 1527394, 1597942, 1684317, 1802011, 1883948, 1864827, 1914597, 1974323, 2060986, 2140953, 2160210, 2139212, 2068595, 1900223, 1776372, 1735989, 1689189, 1553765, 1466058, 1389631, 1333633, 1286276, 1222104, 1182392, 1159098, 1075050, 1058677, 1067158, 992610, 945306, 859345, 860727, 913306, 917442, 819418, 924047, 861660, 787450, 730823, 710333, 775255, 788476, 715165, 717298, 737118, 727916, 733966, 727264, 747184, 696070, 672783, 682920, 671022, 628765, 612254, 636335, 587483, 634364, 702600, 689941, 659354, 595626, 646360, 662579, 593186, 644825, 619276, 576365, 556769, 614474, 655261, 644716, 603251]
4041F03251L272K547l156L484q5072J9961O204n7533N4730O6054n2258q3126O3940
4028E42298o6180N7651N5335k0915L693l2450l0693J7379k0662k9268P8507r9099
4016D55596j763j962j511J9432p3004O117N31J1177j0966r756j7078m9191K3019
4003C50641J1960j3188j2486J7939K2956n085p7612k949K8132r255l6669J0648
3991B85032j4148q053O437K7708O983J8810N6168j4441m7882O7076j2870q3799
3979B87021k769R23L6253K7498r794J4290k423P3392l2240r4564j2122N5667p5621
3966B65511p8346O1552M2937k3012n1897R978M0974P9225j1442o0248p4401l7588
3954A63243q429K5341k843j9626l4543k3152J7467K6497K0175j9236R827L0563
$$ y = [603251, 606523, 609070, 605914, 609398, 524326, 544287, 550491, 492958, 547688, 613742, 561484, 478358, 542298, 476118, 533769, 589104, 568189, 571882, 539432, 508739, 526118, 505456, 476188, 554695, 455596, 453833, 451871, 450360, 469792, 396788, 402905, 403436, 414613, 403647, 393891, 376813, 327622, 350641, 362601, 349413, 336927, 354866, 377822, 372737, 295125, 292176, 320308, 311053, 274384, 285032, 270884, 262831, 269268, 296976, 303959, 322769, 378937, 364496, 316614, 383690, 370820, 287021, 284252, 285175, 321428, 348926, 339132, 353422, 350999, 424391, 392151, 297587, 285465, 341132, 265511, 187165, 248717, 291654, 268642, 216745, 226723, 267697, 346922, 335480, 275232, 200831, 163243, 154814, 180155, 177312, 157686, 123143, 99991, 117458, 143955, 164130, 144894, 154721, 185284]
3942A85284r92j5518Q6208K1381q4779L7502K0746m1967m7113j1033k7406K1705
3930A44018N6215l7106n4814L1930J6626j2614k0192k3823N9944N0189o607K2545
3918B26311p9534L401p802N341l4497j08472J2852N7415J8462j6777P6914l6493
3906A17121J381j6486o831L8104K8478j0538j5327M1474l725K232o0527K0406
3894A35762J3994j7615k1696M5480L616O331l9963k6264P9146O958Q075m674l6605
3881A52545l6107O0051N0L4831k3356p6422n4522L9468K9773L6575q770l286k4638
3868A26192j3874L4021L3342R021n0278J3828o6580R09j5884L4537Q4370L7478
3856B27082k7237l0366N3355j2185j8565j06125L0238N8850M0509J9869l3310
$$ y = [185284, 184292, 168774, 254982, 276363, 191584, 229086, 249832, 207865, 160752, 149719, 122313, 144018, 200233, 163127, 108313, 140243, 156869, 144255, 124063, 100240, 160184, 210373, 203766, 226311, 146777, 150178, 142376, 147717, 113220, 4748, 17600, 75015, 93477, 76700, 153614, 117121, 118502, 102016, 95185, 133289, 161767, 151229, 135902, 177376, 173651, 175883, 115356, 135762, 149756, 132141, 110445, 155925, 159541, 165872, 125909, 99645, 178791, 185749, 193824, 189150, 152545, 116438, 176489, 176539, 211370, 188014, 111592, 57070, 96538, 126311, 162886, 154116, 150830, 126192, 112318, 146339, 179681, 188702, 138424, 152252, 85672, 86581, 70697, 105234, 189604, 227082, 199845, 169479, 222834, 210649, 192084, 85959, 116197, 175047, 215556, 235425, 202115]
3845B02115j8537q702L0348n1771r208n3261N1956m6503r6664L6210P014k5385
3833A7612M4917L3548r8251P6922O4980l9370J9902k2592L0665M2408m2436o068
3821A22237L5806O348l5965l2906j1949K6560k4228L2572L2204n317O761L397
3809A55520m711q297O2797m5470l7535j0590m838M3364p679M9343j1493m2189
3797A38222J7950m0102K8089J6368N4073j6971n6614J2161K4982Q346l830L095
3785A85769j4544k8258K6645j83J678M5637K3847L5705N541j5407k5823j0992
3773B29615M9405n394m9019J9249M4908O5038O3026m5704l4150P4094j7421n7874
3761C35773L2729L1253P690M5600P196K1468l830R778M0221r45j1639Q6989P2043
$$ y = [202115, 183578, 174876, 205224, 153453, 144245, 90984, 142940, 96437, -227, 35983, 42997, 17612, 62529, 96077, -2174, 74748, 139728, 100358, 120260, 97668, 128333, 170741, 128305, 122237, 158043, 164391, 128426, 95520, 83571, 110131, 85903, 118475, 150679, 145362, 152123, 155520, 150809, 142512, 205309, 159839, 122304, 111714, 106876, 150240, 142561, 191904, 180411, 138222, 156172, 116070, 144159, 160527, 214600, 197629, 141015, 153176, 178158, 186504, 182674, 185769, 171225, 142967, 169612, 169429, 171107, 216744, 240591, 276296, 281837, 266430, 240607, 229615, 279020, 273626, 224607, 243856, 288764, 353802, 416828, 371124, 336974, 411068, 393647, 335773, 368502, 399755, 407445, 453045, 460241, 481709, 477879, 487657, 527878, 526933, 515294, 602283, 674326]
3748F74326O5082k0451j4743P9136k9255j493P0743J2482J440L4803O4009N8424
3736I94503r157L408L8779O7772L0431L0558l1865j508J2629R578L3246j0194
3724A168180k6789l8337q030J5505M545M590j7066k7064J650O2126N4898n4408
3712A139800J6157j7273q6878p229k4793N4846K4916m0242n4059o741L3193m7843
3700I83854l1022k5745J1850J9192P8691k3828O505j9031k8035K2838N8990J2697
3688A066956k1442l3330n547M2732k7237P295o653J5862n5297O187P5564J6416
3676A081506l061r208k8413J0389N8095M3924j04002l8889O1666j1430l048j6863
3664A040666p9509K5957L7629m6349m244l1096r9143Q2269K9741j38471j4601
$$ y = [674326, 739408, 718957, 704214, 783350, 754095, 752602, 823345, 835827, 837267, 872070, 936079, 994503, 985346, 988754, 1027533, 1095305, 1125736, 1156294, 1124429, 1122921, 1135550, 1145128, 1178374, 1168180, 1141391, 1103054, 1095024, 1110529, 1115074, 1119664, 1102598, 1075534, 1077184, 1139310, 1194208, 1139800, 1155957, 1138684, 1051806, 1044577, 1019784, 1074630, 1099546, 1059304, 1005245, 998504, 1031697, 983854, 952832, 927087, 938937, 958129, 1036820, 1012992, 1019497, 1000466, 972431, 995269, 1054259, 1066956, 1045514, 1012184, 1006637, 1049369, 1022132, 1029427, 1022774, 1038636, 983339, 989526, 1065090, 1081506, 1078445, 1069237, 1040824, 1051213, 1109308, 1153232, 1049230, 1010341, 1072007, 1060577, 1057529, 1040666, 961157, 987114, 1024743, 978394, 974150, 943054, 843911, 926180, 955921, 817450, 802849]
3653H02849J663p0592M6800J4125p2223L3050m7017j5257J1025N606J0311p4530
3641F45810l1200o1783l0327j8824p0059o601p429P3820p4232o1460j9209n6402
3629B82104O444J621O4047o6879n7212O3033M5233L0271k7984m8804l6039r018
3617B46817k5617l2612j1462l067r898j1176O7685q2407k4741R3589J8927m2485
3605A83553m9051M3408J614k1520k9809j102k0571M6215m640J7358K2490k2173
3593A65772L0030L5488L7772j3295n3378q6894j835L0826k249j6305l4592m7725
3581D3615M4953N9692M1489j5427O9Q3424L3532m9197L5595j8033P163L9436m8845
3568B57466q022M1369J12116n7043p9966K8949p962L399l2647N501J8592m0103
$$ y = [802849, 804512, 733920, 780720, 794845, 722622, 755672, 708655, 693398, 704423, 710029, 720340, 645810, 614610, 552827, 522500, 503676, 433617, 427016, 419587, 493407, 419175, 357715, 338506, 282104, 288548, 290169, 354216, 287337, 230125, 293158, 338391, 368662, 340678, 291874, 255835, 246817, 221200, 188588, 177126, 174059, 164161, 152985, 220670, 138263, 113522, 207111, 226038, 183553, 134502, 177910, 179524, 158004, 128195, 127093, 106522, 152737, 148097, 165455, 187945, 165772, 195802, 231290, 269062, 255767, 202389, 115495, 113660, 144486, 142237, 125932, 91340, 43615, 88568, 148260, 189749, 174322, 174391, 257815, 291347, 242150, 277745, 259712, 266875, 306311, 257466, 249444, 290813, 402929, 345886, 265920, 294869, 286907, 290306, 257659, 263160, 281752, 241649]
3556B41649l5213N4709k1243J2025P7585l0851l0821q7756j3171Q2413n7541j0994
3544A80791P7576n7876k0391J2706n7797R968M8911n2742n5624O3415O9477q498
3532B09916k8110M0353N535k3342M1583J0053m753j8478R493K3680O8444Q251
3520C42625n0625J5146k912k0984O5633n262k9370N2872M8073N4072J6249J7486
3508E03003O3318o7471r5492N4316O6620M0394L5879k1642k4856l1800r687N9722
3496E72304l6665J208M1043o5124p5222j9882L6555J6756l8269l1645R89M1896
3484D43944k9348j02365l267j2246j0148Q2142K4708j7576M2840R972o1686l202
3472C63768K0295J3002J0736j4318M9465L084M3275r583l8620l4757N8651J6429
$$ y = [241649, 206436, 261145, 239902, 251927, 329512, 298661, 267840, 180084, 166913, 249326, 191785, 180791, 258367, 200491, 180100, 192806, 135009, 144977, 193888, 141146, 85522, 148937, 218414, 209916, 181806, 222159, 227694, 204352, 245935, 255988, 251235, 232757, 242250, 265930, 334374, 342625, 292000, 307146, 304234, 283250, 348883, 343621, 314251, 367123, 415196, 469268, 485517, 503003, 566321, 498850, 403358, 457674, 524294, 564688, 600567, 578925, 554069, 522269, 512582, 572304, 535639, 536847, 577890, 512766, 437544, 417662, 454217, 470973, 432704, 401059, 402048, 443944, 414596, 312231, 308964, 296718, 286570, 368712, 393420, 375844, 418684, 428656, 366970, 363768, 384063, 397065, 407801, 393483, 442948, 446032, 489307, 479724, 441104, 406347, 464998, 481427]
3460D81427J0058M5853j0889n6403J5415N6844Q2604l5188q607J8051o0392P8163
3448F16936J8192P4004J0083R229K8052r492j1855J6796k2937Q3774J55452J7741
3436I85975L0725P1436K8988L6687Q3258K3499j4379J5756K3668O9441J7465j5829
3424A356690q5627j5427r9308l2916j35296j01296k6271P4683r3350n4161m3849
3413G43872j9393l3374q3269l3478o0410j3791o2618k9718L0250L6311l0865K4064
3401D67581l0574j7590l6530j0397L2926j0259l7865P2779j04298O662k779l5304
3389B94352L3774p5566J483O3980r9664M8902J1430o7732o7616P3869J2024n8614
3377A70622K2282K3713o6278j9028n276K9321L2683o8306M42J0995K1356j5698
$$ y = [481427, 491485, 537338, 526449, 470046, 485461, 542305, 624909, 589721, 581114, 599165, 538773, 616936, 635128, 709132, 719215, 728444, 756496, 747004, 735149, 751945, 729008, 812782, 968234, 985975, 1016700, 1088136, 1117124, 1153811, 1237069, 1260568, 1246189, 1261945, 1285613, 1355054, 1372519, 1356690, 1271063, 1255636, 1156328, 1123412, 988116, 886820, 860549, 935232, 841882, 787721, 743872, 724479, 691105, 607836, 574358, 513948, 500157, 437539, 407821, 438071, 474382, 443517, 467581, 437007, 419417, 382887, 372490, 405416, 395157, 357292, 430071, 325773, 332435, 329656, 294352, 328126, 252560, 254043, 318023, 218359, 267261, 278691, 210959, 143343, 217212, 229236, 170622, 192904, 216617, 150339, 131311, 126035, 155356, 188039, 119733, 120175, 131170, 152526, 136828]
3365A36828J04232k7656n5516k775k0122M4885l8381l8860P3619l1324J6314O0784
3353B22028n430n384p8911j03840O3449M9849j9095j9071J9646K6887j3533M71
3341A37066L840R922l1297K6781o969j5675l748k7716j9944p9315L4756N0449
3329G8150n7827O6452j5664q1503K2886N5251K4738m2600l1193N7813n0889j3982
3317A1632L7264k0337L2095m8111k4432J4177J03792N2967m1971j14291k9992
3306b7207J11581p0471l0968j7546l208J21066J612l5271m9826J7290L2950K0347
3294G0349l3106J1155M8908l1127o829P486k9675o9875r252M7279L9104K455J3403
3281F0275K1561n4588m1964K3729n4917J0613L3927j6445m6577L1285l8338k3797
$$ y = [136828, 241060, 213404, 157888, 155113, 134991, 179876, 141495, 102635, 176254, 144930, 161244, 222028, 216598, 211214, 132303, 28463, 91912, 141761, 122666, 103595, 123241, 150128, 136595, 137066, 140906, 150828, 119531, 146312, 139343, 123668, 119920, 92204, 72260, -7055, 27701, 78150, 20323, 86775, 71111, -10392, 12494, 67745, 92483, 49883, 18690, 76503, 25614, 11632, 48896, 28559, 60654, 12543, -11889, 2288, 106080, 159047, 117076, 2785, -27207, 84374, 13903, -17065, -34611, -37819, 83247, 84859, 49588, -238, 17052, 50002, 70349, 37243, 48398, 97306, 66179, 59350, 66836, 37161, -32714, -41966, 5313, 44417, 46872, 60275, 81836, 27248, -14716, 9013, -45904, -35291, -1364, -17809, -64386, -33101, -71439, -95236]
3269i5236O3616J4633J0092j6031q006J8723p224k6716J1915K2873j4296m627
3257c0284j2459M1663J473r0786N9278P686m52O4851L8784j15670l8082J4425
3245e9573j5728m2948K8828L7053M2259P6478m3749k6574o8813M5601N5949n6957
3233b8174n875J5697n9313O23j0631O7312l769p8913M6447J0974J6336o3649P82
3220i2153l628j5202j2304R8302m5413Q691J6963o8844J5701J1798L2974q5770
3208a38885L2870K0828K4181O219m6415j3764J4474L3661K8788J0473o1789l0925
3196a20284J1749m2600O3803K6606o4655K8037L0786q808k1059j4351o979O3076
3184e4679R764J0647P4619m441q0000l741K0381k3261K0715P052L826k5849J4078
$$ y = [-95236, -31620, -16987, -6895, -22926, -30932, -12209, -19433, -46149, -34234, -11361, -25657, -30284, -42743, -1080, 393, -90393, -31115, -23429, -23881, 40970, 79754, -35916, -73998, -59573, -75301, -118249, -89421, -52368, -10109, 66369, 22620, -3954, -72767, -27166, 28783, -28174, -34049, -18352, -77665, -77042, -87673, -20361, -24130, -103043, -56596, -45622, -29286, -92935, -92153, -95781, -110983, -123287, -24985, -70398, -61707, -44744, -113588, -97887, -86089, -53115, -138885, -106015, -85187, -61006, -54787, -101202, -114966, -100492, -66831, -38043, -27570, -89359, -120284, -108535, -151135, -87332, -60726, -125381, -97344, -66558, -75366, -96425, -110776, -117755, -54679, -44915, -34268, 40351, 35910, -44090, -47831, -27450, -50711, -29996, -22944, -19118, -44967, -30889]
3171c0889M1673n2600j7404M831O029j0542j1353J0551m692j1666q567k540j6110
3158a03279N3684M0645l4181q025K0853n5105J6539j9584m291L2150K9451L6636
3146E493q931m5237O2386P20k8646P581l6784M201J0240O3846Q998n5161n1022
3133f2316R547p138k4107N0807N9403j03o4954O2659M3624J9584l806k2795K4000
3120H4405K8574N2799o0266j7281Q438L4683j8629l0329N8523P9212j6654L314
3108B06789L4243p1241J535O652j6818l7007L6693N9522n9517J1190M0302Q4289
3096B96632M169N589Q1398j4134P3707K8745l6957n4786n431l5219M010P3949
3084D21672k6522l7570q3211l0316K3296k2166Q116J6862j7942n316k0130n7159
$$ y = [-30889, 10784, -41816, -59220, -54389, -48360, -58902, -70255, -59704, -64396, -76062, -84629, -87169, -103279, -49595, -8950, -43131, -51156, -30303, -85408, -68869, -88453, -92744, -60594, -31143, 5493, -3438, -48675, 13711, 14431, -14215, -6634, -43418, -39217, -28977, 34869, 43867, -11294, -62316, -52769, -59907, -84014, -33207, 26196, 26093, -38861, 23798, 67422, 87006, 83200, 60405, 84405, 112979, 165778, 105512, 88231, 96669, 131352, 112723, 82394, 140917, 220129, 203475, 206789, 241032, 169791, 171326, 177978, 161160, 124153, 160846, 220368, 160851, 172041, 212343, 296632, 300801, 306390, 387788, 373654, 447361, 476106, 439149, 384363, 378932, 343713, 347723, 421672, 395150, 357580, 274369, 244053, 267349, 245183, 253299, 270161, 252219, 246903, 226773, 169614]
3072A69614M5326O2690o849O1907m769m5464O983L1018l3223o0056j0780o405
3060B09992Q4149J6534L593k0302k4788L3023L4435p437J7625M1532k0951k5455
3048C41950l4772L6560n311k5731q6048j2902j5447P531N4756q431n5033l1664
3036A65458o1402L2053O395l6192O4768k8739j515J1786m2112L1596o6668K5796
3024A01224l0294M326L348k4803N3324l6150r2146P0113L4142m2429R908J4273
3012F4836N5268n9045l1462o3764n9868K5214L6321M449m7728J2857L9975L034
3000a9913m1149k657O3071n5107j2737m9325j5532M907N0426j2314L8393J3922
2988c8015j0337n268J4528P1936L7445q4110m6521k5367J7128K1002J9941L9920
$$ y = [169614, 214940, 277630, 270781, 332688, 327919, 282455, 289438, 320456, 287233, 227177, 216397, 209992, 294141, 310675, 314268, 293966, 269178, 302201, 336636, 329199, 346824, 388356, 367405, 341950, 307178, 343738, 338427, 312696, 226648, 213746, 198299, 205830, 260586, 252155, 197122, 165458, 104056, 136109, 142504, 106312, 171080, 142341, 140826, 152612, 110500, 142096, 75428, 101224, 70930, 75256, 78604, 53801, 107125, 70975, -21171, 48942, 83084, 40655, 50563, 64836, 120104, 61059, 29597, -34167, -94035, -68821, -32500, -28051, -75779, -62922, -22947, -19913, -61062, -63719, -648, -55755, -68492, -117817, -133349, -128442, -78016, -90330, -51937, -38015, -48352, -53620, -39092, 32844, 70289, -13821, -60342, -85709, -68581, -47579, -27638, 12282]
2976A2282k033o6700l5864k3882n511Q0063J713Q121j7997J3244j9789p9066R4044
2963d1375N6454r8461m1049j8236O5484L4138K852o094L871k0665m2220L1495
2951g3806l918p817k1893L4017j0615l1095M429L2829k441J4460M6775r3085k5867
2938a38027O5084j7130n7010J5169K4039L5761j9487j4513k7021R802J537J8071
2926a03725j5785O2387K4057K5532N736p7175J8353O514J1274k0702l2112j2230
2914a07876k018K1393l6865J8370N5509m9867J109k8389J21L5301j5836l3807
2902a42855O7122M849Q125K4594K886n0146m7429K103o731k5151N4967J4782j6328
2889a09212j7146M484K2069M752o9089M0365K7475p6546l089R1550N9590o2782
$$ y = [12282, 10249, -56451, -92315, -116197, -121708, -41645, -39932, -31811, -49808, -36564, -56353, -135419, -41375, 15079, -83382, -124431, -142667, -77183, -43045, -40193, -46287, -42416, -63081, -105301, -73806, -77724, -85541, -107434, -73417, -84032, -115127, -110698, -77869, -80310, -65850, -19075, -112160, -138027, -72943, -90073, -147083, -131914, -107875, -72114, -91601, -106114, -133135, -123333, -121796, -103725, -119510, -57123, -33066, -7534, -1798, -78973, -60620, -54106, -42832, -63534, -95646, -107876, -109894, -88501, -125366, -106996, -51487, -101354, -100245, -128634, -128513, -93212, -109048, -142855, -75733, -70884, -62759, -38165, -35279, -85425, -132854, -130751, -137482, -162633, -107666, -92884, -109212, -126358, -121874, -99805, -95053, -164142, -123777, -96302, -172848, -175937, -84387, -24797, -87579]
2877h7579j7193J3712m8747J2851p807p2143R3308j2591N3253l6649j5502l635
2865a28722J22692n8638n9189L1270n8535K3244J9055k4337M172l5243J3969k368
2853a52630M6557J1980j4912R747K4669l980o3565N5584M4383m2042m0351q2513
2841b07073J8319Q8287O292n3275l070K1482j7608M4927J8686k3032l9027R481
2829a35611L2398J6768o6089L0694L0755K533j0918l0797P373j62j757K508p3806
2816a96111O6616M6323k365j5774k2598L860K7058j3099P2434l8281o9948j1789
2804a53674K6953L835L498j2500J7023j6628L219l444k6954P723L2000P3160k5919
2791g1708j1949J2823n4016J3103n2201J9683P8320l3462J3194O0330k7475j7337
$$ y = [-87579, -104772, -91060, -139807, -126956, -134763, -206906, -113598, -126189, -72936, -109585, -125087, -128722, -6030, -64668, -123857, -92587, -151122, -127878, -108823, -133160, -128988, -164231, -150262, -152630, -106073, -94093, -109005, -99258, -74589, -78569, -142134, -86550, -42167, -84209, -124560, -207073, -188754, -100467, -94175, -147450, -150520, -129038, -146646, -101719, -83033, -106065, -145092, -135611, -103213, -86445, -152534, -121840, -91085, -88552, -99470, -130267, -122894, -123056, -124813, -122305, -196111, -129495, -83172, -85537, -101311, -123909, -120049, -92991, -106090, -33656, -71937, -141885, -153674, -126721, -122886, -119388, -131888, -114865, -131493, -128274, -131718, -158672, -150949, -118949, -45789, -71708, -83657, -70834, -124850, -111747, -163948, -144265, -65945, -99407, -86213, -25883, -53358, -70695]
2779g0695O965n7802M1181m3622N1689J9513l4625Q446n864P659K2828n7613q384
2766a20324R629R0573P660o5914K1648n8082m8136P4878P9943j7985p600k5397
2754e9107o2132M9194k193p847k3603n4053L6459k17L5948L746J0488n5348j1749
2741a40414P669J2261R766N0369K6484k4263l7641M0400m7258l9875Q2287J916
2729e8299K6362K5511l4315k6766K350R303l9040J2975O5895o1786k7996o218
2717a12024K9960l5329n021k5765R1378L2366m6954j1472o444J3739K5342J5460
2705c4764j1151p5752m880J8765j9812K2438L073j3355O5805K0916J4942k8960
2693d2735m4417O7279N7m9072l2631K0354J5722J8823q2579m6841O7454o7299
$$ y = [-70695, -63730, -121532, -80351, -123973, -72284, -52771, -87396, -78950, -84814, -77155, -54327, -111940, -120324, -110695, -20122, -12462, -78376, -56728, -114810, -162946, -88068, -8125, -26110, -33710, -59107, -121239, -72045, -74238, -82085, -105688, -159741, -123282, -123499, -87551, -83805, -73317, -128665, -140414, -132745, -120484, -110718, -60349, -33865, -58128, -95769, -55369, -102627, -142502, -60215, -58299, -31937, -6426, -40741, -67507, -65157, -55854, -94894, -81919, -16024, -77810, -105806, -112024, -82064, -117393, -122414, -148179, -56801, -24435, -71389, -82861, -89305, -75566, -50224, -34764, -45915, -121667, -126547, -107782, -127594, -105156, -102083, -115438, -49633, -28717, -13775, -42735, -87152, -19873, -19816, -68888, -101519, -81165, -65443, -46620, -129199, -176040, -108586, -175885]
2681a75885K6615J06248k5455k3049K2436K1634j6867j2288j598l0993L7604k2156
2669i3754p2201j3499N9207o563L9794L0764j8807N311n7887m7947J4743o594
2657a67433n538P4507K0339O619n5082l4820L1356L2458j6131Q079K5751J1974
2645f7921r0482N6516M4525j4872o9621l6060M4664j1037M7403l7226k8795M876
2633a58030L2698M4250k1578L5625p715K694l0539o1508j5158P0716L0595L112
2621g4838p2132K59P0428k537O8254K9856l6378k0390L4432l3285j7922O7470
2609A3217k1071n3820k024m8049L3826M4925n1731k490p480L4995l7189Q938N4157
2596c3796J8743j2106l1205K1616m3610K4216M7888l2866k0930L1485l801N864
$$ y = [-175885, -149270, -43022, -68477, -91526, -69090, -47456, -64323, -76611, -78209, -109202, -71598, -93754, -165955, -179454, -120247, -126810, -87016, -56252, -75059, -69748, -127635, -175582, -160839, -167433, -172971, -98464, -78125, -71506, -126588, -161408, -130052, -97594, -113725, -105646, -79895, -67921, -158403, -101887, -57362, -72234, -141855, -177915, -133251, -144288, -96885, -134111, -162906, -158030, -125332, -81082, -102660, -67035, -74750, -72056, -102595, -164103, -179261, -108545, -77950, -74838, -146970, -146711, -76283, -78820, -10566, 19290, -17088, -37478, -3046, -36331, -54253, 13217, -7854, -61674, -63698, -111747, -77921, -32996, -84727, -87217, -94697, -59702, -96891, -87953, -33796, -15053, -27159, -58364, -36748, -80358, -56142, -8254, -41120, -62050, -30565, -34366, -28502]
2584b8502L990l0749m393J1512j6842L7657m8604l6636M1426N7394l3397K957
2572d4187P9904J9337P401q8774m5324N4077m2831j6691J08090J8397m1617O8038
2560G5820O1441m0969k4810j2099m3841p891k064L2538N8981q1112O3186p901
2548G1279m5240J0954M9650N356n7248k5090j5382J8463l8719L4566K5405l5826
2536a832k2789k4982J3964K221m0971j681M758l0524J2578J6390j0953J3298M6916
2523b3607J4919j9122l1492K5643N0945j6408M6456N299m1150k2135q5706m6062
2511a42420P9475N7860K2516L8857J4081k1227r403l2831K2141r8489K33n99O3296
2498f510l9346k9989K3519M3001N23K6669O9553p6261p303l9557l8113P8246K5183
$$ y = [-28502, -24512, -55261, -59654, -48142, -64984, -27327, -75931, -112567, -71141, -13747, -47144, -44187, 35717, 55054, 62455, -26319, -71643, -17566, -60397, -77088, 31002, 49399, 7782, 75820, 137261, 96292, 71482, 59383, 15542, 7651, 5587, 38125, 97106, 15994, 79180, 71279, 26039, 36993, 86643, 91999, 34751, 9661, -5721, 12742, -25977, 8589, 33994, -1832, -24621, -49603, -35639, -33418, -74389, -76070, -71312, -101836, -89258, -72868, -83821, -70523, -23607, -8688, -27810, -59302, -33659, 17286, 878, 47334, 52633, 11483, -10652, -96358, -142420, -62945, -5085, 17431, 56288, 70369, 49142, 39739, 6908, 29049, -69440, -69207, -69806, -6510, -45856, -75845, -52326, -9325, -8802, 17867, 87420, 11159, 3856, -35701, -73814, 4432, 29615]
2485B9615o4620j7346P277q532k7213K9467q46K3978m4272L4812R1694k7364p9190
2472e2540M046N3145J3678j684m0196l900J1995L6957q010J8960L4443j10049
2460d3155n1159J0592K3435P9082L2950r483m6297L221l0010O7981j2114J645
2448B6688J1799l9057p652m2648O5911M0154m6295J2189P0915j4194k8606N1896
2436A01100M0565o1199m988L9726L34n4791J006n52K496M6476M6753k2891L1232
2423A65267n466k4133l6990l208L4616k6785q4169J6311N8596N6488m5615j5888
2411H9024J6656O870j8317N7320l532k6163M309K4015K8770o9373k3044P8200
2399A64735J8357M236l7271k794Q40K0469Q255M8535k4007o0181M123J4835L0306
$$ y = [29615, -35005, -52351, -45074, -53606, -80819, -51352, -52198, -28220, -72492, -37680, 54014, 26650, -52540, -48494, 4651, 18329, 16645, -23551, -27451, -15456, 21501, 13491, 32451, 66894, -43155, -94314, -83722, -60287, 18795, 51745, 42262, -4035, -814, -30824, 37157, 25043, 26688, 38487, -570, -8222, -50870, 15041, 55195, 8900, 21089, 92004, 77810, 49204, 101100, 141665, 80466, 75478, 115204, 115538, 60747, 61753, 61201, 63697, 110173, 156926, 134035, 165267, 159801, 135668, 98678, 95470, 130086, 103301, 19132, 35443, 94039, 150527, 104912, 89024, 105680, 112550, 94233, 151553, 148021, 121858, 126167, 150182, 178952, 109579, 86535, 164735, 183092, 187328, 150057, 147263, 148103, 168572, 176827, 225362, 201355, 141174, 145297, 160132, 190438]
2386A90438o3908K2939M7824k1344p6386P8402J6022J1694k0129k2655L6254J9746
2374B18897N592k6002K474J02250O4875R120K4699o176l3894l0872K1045k3924
2362C28084O2064p196k3015P8421L2847q597l8610P272j3429n071M5607J6588
2350D74965K9865K7793m5728J3362l9431O660J07873O5887M3102M315N599R1791
2338G86053K6998k0957j9875Q8626K9797J6182R5139O9254Q3468L8596k2019O9921
2326A241183J10681N5633J32076J25285J17284J08260J40446J31789J17497J73551
2316B453685J85639K14462J86228K44222K33928K93393L66498L46442M08833N66617
2306E499947N68700N60322O44962P55274Q47453J082377J097674J364060J508804
$$ y = [190438, 126530, 149469, 197293, 175949, 99563, 177965, 193987, 205681, 185552, 162897, 199151, 218897, 224489, 198487, 200961, 303211, 368086, 377206, 401905, 395729, 361835, 330963, 352008, 328084, 390148, 382952, 359937, 438358, 471205, 462608, 423998, 431270, 417841, 412770, 458377, 474965, 504830, 532623, 486895, 500257, 460826, 467486, 575359, 641246, 684348, 688663, 694262, 786053, 813051, 792094, 772219, 860845, 890642, 906824, 1001963, 1071217, 1154685, 1193281, 1171262, 1241183, 1351864, 1407497, 1539573, 1664858, 1782142, 1890402, 2030848, 2162637, 2280134, 2453685, 2639324, 2853786, 3040014, 3284236, 3518164, 3811557, 4178055, 4524497, 4933330, 5499947, 6068647, 6628969, 7273931, 8029205, 8876658, 9959035, 11056709, 12420769, 13929573]
2297A3929573J685228J798530J945920J557350J339105Q10216Q10299R38203J681215
2288B6495639k98678l075661k523079j759133j351417k143445j793629j301004
2280A2249593j108548r59330p87255p73027q46418p61720m99203m75401m64649
2271E574042l24976l70186l31738l15383l42379k24872k90181j78336j66621j85229
2261B844141k06576j20577j55620j23036q2540q1535o6897j83q3423q9724j08320
2250A725710j16214r9282r2175n2453l9261o9438P339k9322o0021j35623k4191
2239A015069O462m9790p606r0831J3308n495r2282m9795k8505K9677k1106q5000
2227F34106j1742K8012l4575m2477L8292L6801k5176o8013q6397J0676K8123r0789
$$ y = [13929573, 15614801, 17413331, 19359251, 20916601, 22255706, 23065922, 23876221, 24814424, 26495639, 26196961, 23121300, 20598221, 18839088, 17487671, 15344226, 13550597, 12249593, 11141045, 10181715, 9394460, 8621433, 7775015, 7013295, 6514092, 6038691, 5574042, 5249066, 4878880, 4547142, 4231759, 3889380, 3664508, 3374327, 3195991, 3029370, 2844141, 2637565, 2516988, 2361368, 2238332, 2155792, 2074257, 2007360, 2007177, 1923754, 1834030, 1725710, 1609496, 1510214, 1418039, 1365586, 1326325, 1256887, 1264226, 1234904, 1174883, 1039260, 1015069, 1021531, 971741, 964135, 873304, 886612, 881117, 788835, 739040, 710535, 740212, 719106, 634106, 622364, 650376, 615801, 573324, 611616, 648417, 623241, 555228, 468831, 479507, 507630, 416841]
2215D16841K6336R30K4544k7459m0701k042O6246K9025j3167j1459j177k6385
2203D41532L3n7480j2655j5942l4123k3915j1058P094m7338L0555j259K0440O761
2190C02645n9427j4714l9440K4207p035j7350m316M4013o967J0495m9572l0932
2178A51607J2835L1190J3123j4331m4669k627L0787q54o6601L6051l5737N7821
2166A68595O5776l5078Q875l9511n0155m7969j8885l9869j3461K7368m7613L5429
2154A3502K6988n4168K4129J3049L2843j1012j6043k1963M5347k9958q20Q0988
2142A02882L8583M9812o3886q4331Q547j1352L2537M7035q6128k3516o822M2942
2130D6303K7281n8700k0288j868N1300m070J0419m2471K757J9112J9086k2551
$$ y = [416841, 443177, 444107, 468651, 441192, 400491, 398449, 464695, 493720, 480553, 469094, 467917, 441532, 441565, 384085, 371430, 355488, 321365, 297450, 286392, 293486, 246148, 276703, 275444, 295884, 302645, 243218, 228504, 189064, 213271, 206236, 188886, 184570, 228583, 221616, 232111, 182539, 151607, 164442, 195632, 208755, 194424, 149755, 147128, 177915, 177061, 110460, 146511, 110774, 168595, 234371, 199293, 208168, 168657, 118502, 70533, 51648, 11779, -1682, 25686, -21927, 13502, 40490, -13678, 10451, 23500, 56343, 45331, 29288, 7325, 52672, 22714, 21894, 102882, 141465, 191277, 127391, 43060, 51607, 40255, 72792, 119827, 33699, 10183, 3361, 46303, 73584, 14884, -5404, -7272, 44028, 39958, 50377, 7906, 10663, 29775, 48861, 26310]
2118B6310K1183K098n7652L7803O410j2113O009j0126k5532R739l5525K2562K8279
2105A9445J864M476o1225n643J5413O6909k5591n8378n0413Q0008M2683n072k6935
2092b459L6123k3609m4008j2131M3151l369n3065l4442L7801J31961n9133m6426
2080b9606j9759j2426J8415j534R625R562J8431p061M2113j6444j4052l2244m6269
2067h1249L0363K6470K2133J4977J8513K323p3259k990M5680l7484p29p5130K7274
2054h3108N2275K5825k3082k2508q851q0278N3275M9709K4668K5275O9085q081
2042G4204o9007m1461k7927j3720K1735O1865l3234J5732J5996L9727k5292q930
2030I688M6026J8991r739L774k1711J3252k4427K6453k6531o6645L3588K2577
$$ y = [26310, 47493, 49591, -8061, 29742, 36152, 24039, 30048, 19922, -5610, 4129, -31396, -8834, 19445, 21309, 25785, -35440, -41083, -25670, 41239, 15648, -42730, -93143, -13135, 29548, 24476, -2459, 33664, 10055, -33953, -46084, -2933, -6302, -59367, -93809, -56008, 75953, 16820, -29606, -49365, -61791, -43376, -44910, -35285, -25723, -7292, -14353, 27760, 11316, -2736, -34980, -81249, -50886, -24416, -2283, 12694, 31207, 33530, -39729, -42719, 2961, -34523, -35252, -110382, -83108, -30833, -5008, -28090, -50598, -59449, -139727, -86452, -36743, -12075, 13200, 82285, 74204, 5197, -36264, -64191, -77911, -56176, 5689, -27545, -11813, 4183, 43910, 18618, 9688, 55714, 74705, 64966, 68740, 47029, 60281, 35854, 62307, 35776, -30869, 2719, 25296]
2018B5296J2871j9387j2131j8956O168J1396M362M9296k6070j0827L4193q00J1725
2005F7136p7426N7240m6994j03032J9898P287J1630J4155k170j4776j8562n6904
1993a42518O8192L076L3202k9032m2395O112K8520L8052L5781n8797l5124j8639
1981a13570l4098q239J2819K3037M6276K2603K9095P838m9710K5516J1629j6260
1969d3064J6947k1432j01997N3048k3330L2026l8550M974M0484L7070m3256m9266
1957a36346N3805M07N316l610j0606L0277O115L4948R059j4479L281j4383O2085
1944B5869n6935m6424M2960j6504J6899m2306J1461M0747m676M4355J9323m830
1932B9939p3196K9080J02458l1712o774r4876r6857L2078L0166J1497l1549j2204
$$ y = [25296, 38167, 18780, 6649, -12307, -6139, 5257, 9619, 58915, 32845, 22018, 56211, 55411, 67136, -10290, 46950, -44, -103076, -83178, -75891, -64261, -50106, -52276, -67052, -85614, -142518, -74326, -71250, -38048, -67080, -109475, -103363, -74843, -36791, -1010, -59807, -94931, -113570, -147668, -155907, -143088, -120051, -73775, -51172, -22077, -14239, -63949, -38433, -26804, -43064, -26117, -47549, -149546, -96498, -119828, -87802, -126352, -121378, -80894, -43824, -87080, -136346, -82541, -82134, -76818, -80428, -91034, -60757, -54642, -19694, -10635, -25114, -21833, -36216, 25869, -31066, -77490, -34530, -51034, -34135, -76441, -64980, -24233, -28909, 15446, 34769, 29939, -43257, -14177, 88281, 56569, 49795, -45081, -141938, -109860, -79694, -68197, -99746, -111950]
1920a11950L9769L2211k7867J4J8471J0063m1588O1725j4320l2864n1106L6564
1908h0878K6557o680m361R084R034K645M550L1367l1955p0888k3730M4125L6426
1895e4704M0436L9403n6318m0476m7329m10N3439M511m2797L2184j6517J5094
1883g3484J354j7487k4267J5785j2592K1847N6299L080n4699j4374N7643k6843
1871f7738j00740j8665J01643R7260l4838m070l1395m0034K246N9185j5497o0146
1859a12789J6594L1011n2575j0028L0613N509K3245j9042J2268K7489j3365J6150
1847d4920L9023j757o2047j5565M2552M5272n0170j8922o3536M5143n2627K2415
1835a15139Q3093j5888K927q883m2445J5480R5333n1270j5987k6991J1383p3014
$$ y = [-111950, -72181, -39970, -67837, -67823, -49352, -39289, -80877, -19152, -33472, -66336, -117442, -80878, -54321, -61001, -65362, -56278, -47244, -44599, -40049, -8682, -40637, -111525, -135255, -91130, -54704, -14268, 25135, -31183, -71659, -118988, -119398, -65959, -61448, -104245, -72061, -88578, -73484, -72130, -89617, -113884, -98099, -110691, -88844, -32545, -29465, -84164, -98538, -40895, -67738, -168478, -187143, -85500, 11760, -23078, -27148, -58543, -98577, -96331, -37146, -52643, -112789, -96195, -65184, -117759, -127787, -97174, -91665, -68420, -87462, -75194, -47705, -61070, -44920, -5897, -7654, -69701, -85266, -42714, 2558, -47612, -66534, -130070, -84927, -137554, -115139, -32046, -47934, -45007, -53890, -96335, -80855, 14478, -36792, -52779, -79770, -68387, -141401]
1823a41401L9440L4425j8450p9375K4745L3192J0825k2768O946O5926K2529m2131
1811f6097k1345k2988M1814J4073r0560j8561O6929j1952K3868K4987L8049K3822
1799B039l4667m612l4669K0877O0737m6041j975N0419m2992N144m7958L4836J6126
1786b2736l3360j6987K7989l1089L7646n939J9388o0484o0486L1234J4819M5163
1774e4842k7493k9080r972Q6682J6795q8111l1290K4321P0152O0617k7511j03462
1762a13194k3139O2575l5997r261O4562l4422o922M3260j2233j6480m7835m6204
1750a75290J0653K1753M6462J8652M7951N2701q8648k6919K8212j0215K0338j211
1738e5561j5250n938n9773J8873P180N7259r1996O77J9997P4082m5336l367O4314
$$ y = [-141401, -101961, -67536, -85986, -165361, -140616, -107424, -96599, -119367, -112421, -46495, -23966, -66097, -87442, -110430, -68616, -54543, -145103, -163664, -96735, -108687, -84819, -59832, -21783, 2039, -32628, -37240, -71909, -51032, 9705, -36336, -38311, 12108, -30884, -25740, -73698, -38862, -22736, -56096, -73083, -45094, -76183, -38537, -44476, -25088, -85572, -146058, -114824, -100005, -54842, -82335, -111415, -121387, -34705, -17910, -106021, -137311, -112990, -42838, 17779, -9732, -113194, -136333, -73758, -109755, -119016, -54454, -88876, -95798, -52538, -64771, -81251, -129086, -175290, -164637, -142884, -96422, -77770, -29819, 22882, -65766, -92685, -64473, -74688, -54350, -55561, -70811, -76749, -136522, -117649, -110469, -53210, -145206, -144529, -124532, -50450, -95786, -99153, -34839]
1725c4839j8855q920J5828l643J8487J1895O145l2647p3385J0502k1279k7948
1713a58659Q9346P464q5943J4933n4173O8435n8320P7847P3114L6602m5117o5990
1701a00461k462m0694J8584R9003o0007j8746M3939k2305K7305Q111L7998m007
1689a3742m0034k2025m6243R869M7588n4490k8261N6970K2095M1262l8541Q353
1677e7199K7105j9133N346k8787j9483M3686q0672Q5965m9234o2248N8854j10246
1665b06046K7715O4546n076p1118k53N231N5386L5249m745K0442J1182j7722k7912
1652a13121L0197Q4537n4077o3338K4469L3196q2479k5982J2035J2331O637o145
1640a41740Q842N5195R62K7009j2973o5320P290K7865O0338o507o659k1179L7693
$$ y = [-34839, -53694, -62614, -46786, -50429, -31942, -20047, -13902, -46549, -119934, -109432, -130711, -158659, -69313, -61849, -147792, -132859, -187032, -118597, -176917, -99070, -25956, 10646, -34471, -100461, -102923, -143617, -125033, -26030, -86037, -104783, -60844, -83149, -55844, -47733, -9735, -13742, -53776, -75801, -122044, -112175, -64587, -119077, -147338, -90368, -68273, -27011, -65552, -57199, -30094, -49227, -43881, -72668, -92151, -48465, -129137, -43172, -92406, -154654, -95800, -206046, -178331, -113785, -118861, -189979, -190232, -185001, -129615, -94366, -99111, -78669, -67487, -85209, -113121, -82924, 1613, -52464, -115802, -91333, -58137, -140616, -166598, -154563, -142232, -135595, -141740, -132898, -77703, -76741, -49732, -62705, -128025, -120735, -92870, -32532, -39039, -45698, -66877, -29184]
1627b9184J2776L7224J173k3690j2410J1899m3280o4191K0835M8034l3119K1727
1615e2206k5123N0351p725o1517j5411J11021J5780j07931K823R340N664q7997
1603a62931N4570M5899L5064k7148P447k830j5187M6636p2469n7240k0439M6985
1591a21643j8597O435J0903m3624R3597J3545m4905Q048M3400L042J879K3339
1579b4581n9863p6592M1253J7331L716O148o2685l6425L9278j8665J1802N3156
1567a06127K4963K2017o8601l3963K8002M5316K5157j09765q327N7052j9262j27
1555a43665K5687m2417L6957L2445N339J2229N7697l5786j9139n4602K233M3495
1543g9527r882L3948K4585p964n3491j7270K2059m8599J6014K6170L8018j2881
$$ y = [-29184, -16408, 20816, 21989, -1701, -14111, -2212, -45492, -109683, -88848, -40814, -73933, -52206, -77329, -26978, -34703, -96220, -111631, -610, 15170, -92761, -89938, -80598, -74934, -162931, -108361, -62462, -27398, -54546, -47099, -49929, -65116, -18480, -90949, -148189, -168628, -121643, -140240, -133805, -122902, -166526, -72929, -59384, -104289, -96241, -52841, -49799, -47920, -24581, -84444, -161036, -119783, -102452, -98736, -92588, -155273, -191698, -152420, -171085, -159283, -106127, -81164, -59147, -127748, -161711, -133709, -88393, -63236, -173001, -181328, -124276, -143538, -143665, -117978, -160395, -123438, -90993, -85654, -73425, -15728, -51514, -70653, -125255, -123022, -79527, -89409, -55461, -30876, -38840, -92331, -109601, -87542, -136141, -120127, -93957, -55939, -68820]
1531f8820j8733L0951j0263l7583j4203L0771j3212k9338Q2142J2283l7553k2073
1519i5631L0017L1197J4680l4775m3891r402n1678N4891o503K7534m3601J7023
1507a10139M081K0173O417m8406p0829O7056J02724p634n5383j0005N7494R018
1495c5433j8366l0867N78j7453l1721M6385K2791J4594k5554N672Q626p3211J5645
1482a18314J07287n9793J4562k4657j8296J9954O5440K648l0161q0035j2866O5893
1470f8338K9386O6949o654m2485n6433m694o583R844O124J6580L2758o5413K997
1457h5962j6356J3230K2393k1092n1102K5909K4963P601K2302l4897L5101K9125
1445b8785L5696k7522m7881k0405J4237k5158m7495p632j879J3826R0622o259
$$ y = [-68820, -87553, -56602, -66865, -104448, -118651, -87880, -101092, -130430, -48288, -36005, -73558, -95631, -65614, -34417, -19737, -54512, -98403, -107805, -159483, -104592, -111095, -83561, -127162, -110139, -106058, -85885, -79468, -127874, -198703, -131647, -28923, -36557, -91940, -101945, -44451, -35433, -53799, -84666, -84088, -101541, -133262, -86877, -64086, -49492, -75046, -69374, -60748, -133959, -118314, -11027, -70820, -56258, -80915, -99211, -79257, -13817, -11169, -41330, -121365, -134231, -68338, -38952, 27997, 21343, -21142, -77575, -82269, -88852, -79008, -72884, -56304, -23546, -88959, -85962, -102318, -89088, -66695, -87787, -138889, -112980, -88017, -80416, -58114, -93011, -57910, -28785, 6911, -20611, -68492, -88897, -74660, -99818, -147313, -154945, -156824, -142998, -52376, -58635]
1433e8635k6414J7479O3187o1505J3056N4192J1152n8555m8977k0802O5748L1802
1421a8272l0234n0547M3208J8413l6708J2406J1783K7168k6587k9527M7863N0440
1409A9406K4140k4508m9845m7311k5129L8955m5525M007P830j8565L9325K1620
1397e5600j0980m2408L603J3955m8328l2769j0482L5695Q5921J361p7742N5722
1385h2052L723k8016O440L0190l1814o595N1356q887m1770L7302m2054L5072N4025
1372b3080n1634J6070j1626j4146j8390k7187Ok3251M4066K7437L689m0802k5520
1359a44368L9534j7657l505J35663J9284j30886L716J1535L3050m7860J1725j741
1347i1510k0470K093l8697j5492K0787j0388O089j5396P590M934L2289l4489K68
$$ y = [-58635, -85049, -67570, -4383, -65888, -52832, 1360, 12512, -46043, -95020, -115822, -50074, -18272, -48506, -99053, -55845, -37432, -74140, -61734, -49951, -22783, -49370, -78897, -31034, 19406, 43546, 19038, -30807, -78118, -103247, -64292, -109817, -105810, -97980, -116545, -77220, -55600, -66580, -108988, -105385, -91430, -139758, -172527, -183009, -147314, -61393, -60032, -137774, -82052, -78329, -106345, -99905, -69715, -101529, -108124, -56768, -65655, -107425, -70123, -112177, -77105, -23080, -74714, -58644, -70270, -84416, -102806, -129993, -129987, -153238, -109172, -81735, -78046, -118848, -144368, -104834, -122491, -125996, 9667, 28951, -101935, -98219, -86684, -53634, -101494, -89769, -91510, -111980, -109887, -148584, -164076, -143289, -153677, -147588, -162984, -155394, -150460, -118171, -152660, -152392]
1334a52392K8266J6048O521l9609l9980L6481P0761j7475j6248K5874n2743l1960
1322a66456M0755J0474J5870K5211m1814j3890L08J1810K6487k5185L9123j0815
1310h8122n9308Q607j7299L5036k7783j9167M1370J4896K3398O605L7194l8776
1298h3349J607k880L1571q6040M6588k5520j5102R440r564Q5527j2317n8839m4147
1285a63025M9721L1947o0949J2387L4204O198k0213j3096M8636j6282J4265L0080
1273d6127j9869J9273q819k445K0793N0195q7034l3145M2485j8996r498M5425
1261d7762k8810L4421K5978j07342L3588K1580j0715N6601j0020J8836M8703q0713
1249d5655J4746r8899J0107P0246o5686m2104J09299J9197m0819n8950J8392J06
$$ y = [-152392, -124126, -108078, -101557, -141166, -181146, -144665, -73904, -91379, -107627, -81753, -134496, -166456, -125701, -115227, -99357, -74146, -115960, -129850, -129542, -117732, -91245, -116430, -77307, -88122, -147430, -138823, -156122, -121086, -148869, -168036, -126666, -111770, -88372, -81767, -44573, -83349, -81742, -84622, -53051, -139091, -92503, -118023, -133125, -123685, -133249, -47722, -60039, -118878, -163025, -113304, -81357, -142306, -129919, -95715, -89517, -109730, -122826, -74190, -90472, -76207, -46127, -65996, -46723, -55542, -57987, -37194, 13001, -74033, -107178, -64693, -83689, -93187, -47762, -76572, -42151, -16173, -123515, -89927, -68347, -79062, -22461, -32481, -13645, 35058, -45655, -30909, -129808, -119701, -49455, -115141, -157245, -47946, -28749, -69568, -128518, -110126, -110020]
1237a10020L0651j4891j1966L0915m062K1894m3280o886M8372q6364j0572M4447
1225a11762j8539j517m9312P487R1707J2946l6384Q3408J0872k3286p8719M3612
1213f9487r9393Q020O0997k910N191l8321L2172N2737J5049o3090J6800M4173
1201c8062j2609N8963q6029p5594O7064j3994P310J4188M1449j6640o3518M1345
1189g6127m9442J2110k4031M6108K4417k6400K3409p9199j2294R7294k7134n1346
1177a42635N8468J8997n949o6175Q424m948M4999m5536O341j2023m9677N3372
1165a36342j3980P2170L8123l1780m819K9493K3245l0836j3337K2349L0631k1467
1153c6550k8960m7186K3204m2969J1848N1898P7990m9150M097l5170o8838N18
$$ y = [-110020, -79369, -94260, -106226, -75311, -79373, -57479, -100759, -107645, -59273, -145637, -156209, -111762, -130301, -131818, -181130, -173643, -81936, -68990, -105374, -21966, -11094, -34380, -113099, -69487, -168880, -160860, -99863, -102773, -97582, -135903, -103731, -50994, -35945, -99035, -82235, -38062, -50671, 8292, -77737, -153331, -86267, -100261, -92951, -78763, -37314, -53954, -117472, -76127, -125569, -113459, -137490, -91382, -66965, -93365, -69956, -149155, -161449, -64155, -91289, -142635, -84167, -65170, -71119, -137294, -128870, -133818, -88819, -134355, -128014, -140037, -189714, -136342, -150322, -78152, -40029, -71809, -76628, -47135, -23890, -54726, -68063, -45714, -15083, -36550, -65510, -112696, -89492, -132461, -120613, -68715, 9275, -39875, -35778, -70948, -139786, -139268]
1141a39268O3816j1135j8127L5288n9970M2739J3464k0180n020M663j6634L9154
1129g1210o1431R3275l6583o3118J1267N125R950O7152M322k2902k6036q948M0963
1116e8174O6076m8780l3369j3563o9722j6183P361N5477O461j955q49O094o6763
1103a67889K1158j2452J6392Q4293R5238k9534R847n9955j5315J7318j2345p218
1091f0462k6558k6924j761L3904j0069m0403K5905l3140n6764L0256M4283J7503
$$ y = [-139268, -75452, -86587, -104714, -69426, -129396, -86657, -73193, -93373, -98393, -93730, -110364, -71210, -132641, -39366, -75949, -139067, -127800, -122675, -112725, -45573, -41251, -64153, -90189, -99137, -58174, 7902, -40878, -74247, -87810, -157532, -173715, -166354, -110877, -104416, -106371, -107220, -101126, -167889, -146731, -159183, -142791, -58498, 36740, 7206, 17053, -42902, -58217, -40899, -53244, -60462, -87020, -113944, -115705, -81801, -91870, -132273, -106368, -139508, -196272, -166016, -121733, -104230]
$$ [...]
##END NTUPLES=NMR SPECTRUM
##END=
