##TITLE=1H_DE-80H_X3
 200.13MHz, d2o
 8 sc
 
 19ns.26.2.2025
##JCAMPDX= 6.0         $$ Bruker NMR JCAMP-DX V2.0
##DATA TYPE= NMR SPECTRUM
##DATA CLASS= NTUPLES
##ORIGIN= UXNMR, Bruker Analytische Messtechnik GmbH
##OWNER= pz
$$ XWIN-NMR		Version 3.5
$$ Wed Oct  1 10:22:23 2025 Russian Standard Time (UT+4h)  Yarkov@DPX200
##.OBSERVE FREQUENCY= 200.1313
##.OBSERVE NUCLEUS= ^1H
##.ACQUISITION MODE= SIMULTANEOUS
##.ACQUISITION SCHEME= undefined
##.AVERAGES= 8
##.DIGITISER RES= 18
##SPECTROMETER/DATA SYSTEM= spect
##.PULSE SEQUENCE= zg30
##.SOLVENT NAME= DMSO
##.SHIFT REFERENCE= (INTERNAL, DMSO, 0, 15.4924)
##AUDIT TRAIL= $$ (NUMBER, WHEN, WHO, WHERE, WHAT)
$$ ##TITLE= Audit trail, XWIN-NMR		Version 3.5
$$ ##JCAMPDX= 5.01
$$ ##ORIGIN= Bruker BioSpin GmbH
$$ ##OWNER= Yarkov
$$ C:/Bruker/XWIN-NMR/data/yarkov2/nmr/H-C/1/pdata/1/auditp.txt
$$ ##AUDIT TRAIL=  $$ (NUMBER, WHEN, WHO, WHERE, WHAT)
(   1,<2025-10-01 10:21:32.14 +0400>,<Yarkov>,<DPX200>,
      <created by zg, POWCHK disabled, PULCHK disabled
       configuration hash MD5:
       00 E9 B6 7A A2 85 ED C7 34 08 36 98 17 FE 4E 26
       data hash MD5: 16K
       AA 1A 86 B2 75 AB 7D CC FC A6 0F 32 20 AB B9 9C>)
(   2,<2025-10-01 10:21:36.04 +0400>,<Yarkov>,<DPX200>,
      <Start of raw data processing
       efp BC_mod = 2 LB = 0.25 FT_mod = 6 PKNL = 1 PHC0 = -2078.854 PHC1 = 16.19097 SI = 16K 
       data hash MD5: 16K
       B0 4D 46 82 63 12 C1 51 81 D0 45 3F 1E 59 FB 7D>)
(   3,<2025-10-01 10:21:41.28 +0400>,<Yarkov>,<DPX200>,
      <abs ABSG = 5 
       data hash MD5: 16K
       87 E7 58 7B 93 9A CD 1E 97 CB AD 90 25 D7 92 AF>)
(   4,<2025-10-01 10:21:56.71 +0400>,<Yarkov>,<DPX200>,
      <pk PHC0 = 2.6 PHC1 = 0 
       data hash MD5: 16K
       33 65 22 74 85 A7 28 B5 2C CC C3 33 1A 5A 85 29>)
$$ ##END=
$$ 
$$ hash MD5
$$ CD 02 08 D1 B4 82 63 B1 FF 3A 5A 4C 97 07 70 63
##$RELAX= 
##$RELAX= 
##$RELAX= 
##$RELAX= 
##$RELAX= 
##$RELAX= 
$$ Bruker specific parameters
$$ --------------------------
##$DU= <C:/Bruker/XWIN-NMR>
##$EXPNO= 1
##$NAME= <H-C>
##$PROCNO= 1
##$TYPE= <nmr>
##$USER= <yarkov2>
##$AMP= (0..31)
100 100 100 100 100 100 100 100 100 100 100 100 100 100 100 100 100 100 
100 100 100 100 100 100 100 100 100 100 100 100 100 100 
##$AQSEQ= 0
##$AQ_mod= 1
##$AUNM= <au_zg>
##$AUTOPOS= <>
##$BF1= 200.13
##$BF2= 200.13
##$BF3= 200.13
##$BF4= 200.13
##$BF5= 200.13
##$BF6= 200.13
##$BF7= 200.13
##$BF8= 200.13
##$BYTORDA= 1
##$CFDGTYP= 0
##$CFRGTYP= 5
##$CHEMSTR= <none>
##$CNST= (0..31)
1 1 145 1 1 1 1 1 1 1 1 1 1 1 1 1 1 1 1 1 1 1 1 1 1 1 1 1 1 1 1 1 
##$CPDPRG= <>
##$CPDPRG1= <>
##$CPDPRG2= <>
##$CPDPRG3= <>
##$CPDPRG4= <mlev>
##$CPDPRG5= <mlev>
##$CPDPRG6= <mlev>
##$CPDPRG7= <mlev>
##$CPDPRG8= <mlev>
##$CPDPRGB= <>
##$CPDPRGT= <>
##$D= (0..31)
0 0.7 0 0 0 0 0 0 0 0 0 0.03 0 0 0 0 0 0 0 0 0 0 0 0 0 0 0 0 0 0 0 0 
##$DATE= 1759299691
##$DBL= (0..7)
120 120 120 120 120 120 120 120 
##$DBP= (0..7)
150 150 150 150 150 150 150 150 
##$DBP07= 0
##$DBPNAM0= <>
##$DBPNAM1= <>
##$DBPNAM2= <>
$$ [...]
##$SUBNAM3= <"">
##$SUBNAM4= <"">
##$SUBNAM5= <"">
##$SUBNAM6= <"">
##$SUBNAM7= <"">
##$SUBNAM8= <"">
##$SUBNAM9= <"">
##$SW= 18.0517328524113
##$SWIBOX= (0..15)
0 0 2 0 0 0 0 0 0 0 0 0 0 0 0 0 
##$SW_h= 3612.71676300578
##$TD= 16384
##$TD0= 1
##$TE= 0
##$TE2= 300
##$TE3= 300
##$TEG= 300
##$TL= (0..7)
0 120 120 120 120 120 120 120 
##$TP= (0..7)
150 150 150 150 150 150 150 150 
##$TP07= 0
##$TPNAME0= <>
##$TPNAME1= <>
##$TPNAME2= <>
##$TPNAME3= <>
##$TPNAME4= <>
##$TPNAME5= <>
##$TPNAME6= <>
##$TPNAME7= <>
##$TPOAL= (0..7)
0.5 0.5 0.5 0.5 0.5 0.5 0.5 0.5 
##$TPOFFS= (0..7)
0 0 0 0 0 0 0 0 
##$TUNHIN= 0
##$TUNHOUT= 0
##$TUNXOUT= 0
##$USERA1= <user>
##$USERA2= <user>
##$USERA3= <user>
##$USERA4= <user>
##$USERA5= <user>
##$V9= 5
##$VALIST= <valist>
##$VCLIST= <CCCCCCCCCCCCCCC>
##$VD= 0
##$VDLIST= <DDDDDDDDDDDDDDD>
##$VPLIST= <PPPPPPPPPPPPPPP>
##$VTLIST= <TTTTTTTTTTTTTTT>
##$WBST= 1024
##$WBSW= 4
##$XGAIN= (0..3)
0 0 0 0 
##$XL= 0
##$YL= 0
##$YMAX_a= 302883
##$YMIN_a= -244225
##$ZGOPTNS= <>
##$ZL1= 120
##$ZL2= 120
##$ZL3= 120
##$ZL4= 120
##$ABSF1= 15.49238
##$ABSF2= -2.559469
##$ABSG= 5
##$ABSL= 3
##$ALPHA= 0
##$AQORDER= 0
##$ASSFAC= 0
##$ASSFACI= 0
##$ASSFACX= 0
##$ASSWID= 0
##$AUNMP= <proc_1d>
##$AZFE= 0.1
##$AZFW= 0.1
##$BCFW= 0
##$BC_mod= 2
##$BYTORDP= 0
##$COROFFS= 0
##$CY= -3
##$DATMOD= 1
##$DC= 0
##$DFILT= <>
##$DTYPP= 0
##$F1P= 0
##$F2P= 0
##$FCOR= 1
##$FTSIZE= 16384
##$FT_mod= 6
##$GAMMA= 0
##$GB= 0
##$INTBC= 1
##$INTSCL= 3.241238e-09
##$ISEN= 128
##$LB= 0.25
##$LEV0= 0
##$LPBIN= 0
##$MAXI= 10000
##$MC2= 0
##$MEAN= 0
##$ME_mod= 0
##$MI= 1.114404
##$NCOEF= 0
##$NC_proc= -8
##$NLEV= 6
##$NOISF1= 3.799351
##$NOISF2= 2.8
##$NSP= 0
##$NTH_PI= 0
##$NZP= 0
##$OFFSET= 15.49238
##$PC= 1
##$PHC0= -2076.254
##$PHC1= 16.19097
##$PH_mod= 1
##$PKNL= yes
##$PPARMOD= 0
##$PSCAL= 0
##$PSIGN= 0
##$REVERSE= no
##$SF= 200.130005868436
##$SI= 16384
##$SIGF1= 3
##$SIGF2= 2
##$SINO= 0.751879
##$SIOLD= 32768
##$SREGLST= <19F.Aceton>
##$SSB= 0
##$STSI= 16384
##$STSR= 0
##$SW_p= 3612.71676300578
##$SYMM= 0
##$S_DEV= 0
##$TDeff= 16384
##$TDoff= 0
##$TI= <>
##$TILT= no
##$TM1= 0
##$TM2= 0
##$TOPLEV= 0
##$USERP1= <user>
##$USERP2= <user>
##$USERP3= <user>
##$USERP4= <user>
##$USERP5= <user>
##$WDW= 1
##$XDIM= 16384
##$YMAX_p= 488170897
##$YMIN_p= -1943269
$$ End of Bruker specific parameters
$$ ---------------------------------
##NTUPLES= NMR SPECTRUM
##VAR_NAME=  FREQUENCY,     SPECTRUM/REAL,   SPECTRUM/IMAG
##SYMBOL=    X,             R,               I
##VAR_TYPE=  INDEPENDENT,   DEPENDENT,       DEPENDENT
##VAR_FORM=  AFFN,          ASDF,            ASDF
##VAR_DIM=   16384,         16384,           16384
##UNITS=     HZ,            ARBITRARY UNITS, ARBITRARY UNITS
##FACTOR=    0.220516191357247, 1,           1
##FIRST=     3100.49012877691, 0,            0
##LAST=      -512.226634228869, 0,           0
##MIN=       -512.226634228869, -1943269,    0
##MAX=       3100.49012877691, 488170897,    0
$$ Real data points
##PAGE= N=1
##DATA TABLE= (X++(R..R)), XYDATA
$$ [...]
9358 60353 343412 169026 8265 -203297 -87395 60203 185166 217467 350158 345366
9348 345366 212285 349387 318635 20827 127120 -128064 5715 186354 240115 180811
9338 180811 275598 156993 220837 371116 204793 153919 418372 370333 430676 355528 380877
9327 380877 461756 479895 246706 151416 212021 117335 175496 65522 309736 320725 474441
9316 474441 376080 505720 553690 446615 392236 318747 172135 188610 357830 552526 676726
9305 676726 835752 779826 587591 580499 610158 450468 442605 499098 523489 339362 752292
9294 752292 704854 882663 661453 489222 675678 670349 441980 615776 399443 326446
9284 326446 304619 405782 659264 704966 667641 408645 467200 220261 123898 176546 286329
9273 286329 151181 322932 343346 327506 450074 201043 85634 139563 395018 427114
9263 427114 311208 393337 470613 485807 336815 480102 598374 569125 705433 630760 494970
9252 494970 232970 524207 602028 500683 459442 525784 585016 567366 492307 677618 736051
9241 736051 667100 727103 498383 432888 629784 559276 549421 398254 141729 328230 401667
9230 401667 412488 577130 654897 340607 352750 696745 473360 379555 655294 600674 682345
9219 682345 820541 719664 781942 933767 673774 471545 604172 614098 936750 819632
9209 819632 863781 1104893 901988 816798 949965 1101993 1047131 887231 932085 1041612
9199 1041612 986885 1273248 1487134 1421690 1156560 1323037 1295340 1463453 1452562 1337354
9189 1337354 1282199 1525908 1772475 1831530 1885687 1790506 1795033 1774180 1557071 1853519 1826705
9178 1826705 1843962 1756716 1496683 1404766 1514578 1559067 1544552 1442197 1558605 1558797 1463134
9167 1463134 1479204 1297893 1284565 1250971 1468697 1391951 1519795 1548304 1523419 1616548 1521745
9156 1521745 1426361 1324041 1477906 1455433 1427851 1463480 1693882 1649153 1581258 1532970 1578412
9145 1578412 1432662 1484137 1647224 1712812 1685425 1568900 1770413 1622430 1563697 1430685
9135 1430685 1603227 1431703 1389950 1827923 2019395 2191777 1962764 1957030 1901255 2216861
9125 2216861 2265364 2097790 2049257 2302740 2664174 2717739 2606984 2765184 2841107 2718479
9115 2718479 2254292 2380300 2529176 2541811 2611043 2807732 2837230 2738692 3047748 3192751
9105 3192751 3103725 2879635 3167902 3112553 2857831 2744188 3294358 3493314 3295896 2858356
9095 2858356 3228760 3234613 3200441 3337362 3432718 3460723 3535667 3637908 3709818 3694302 3755802
9084 3755802 3898699 4027331 3896685 3912250 3798128 3919319 4126851 4230820 3959692 3851213
9074 3851213 4167420 4484046 4597868 4561967 4502525 4447158 4587821 4441219 4508232 4483055
9064 4483055 4569698 4747260 4740593 4765701 4389831 4300891 4338525 4428984 4734002 4824284 5078823
9053 5078823 5206342 5249421 5354125 5713822 6061782 5835840 5575668 5624714 5856021 6036719
9043 6036719 5981127 6295696 6394269 6406617 6527965 6660389 6524870 6629823 6854875 6581551
9033 6581551 7065399 6928369 6680019 6969596 6935309 6699122 6906146 7034736 6810730 6948573
9023 6948573 7319089 7154757 6725267 7084848 7266089 7155871 7108345 7055855 7057178 7130386
9013 7130386 7174024 7228076 7764442 7724744 7504256 7605699 7628894 7899156 7796443 7912470
9003 7912470 7933395 7970853 8108243 8558391 8599868 8490783 8280361 8474301 8779818 8723057
8993 8723057 8950048 8940978 9029168 9233047 9572680 9784042 9681917 9740483 10090186 10546077
8983 10546077 10583066 10693672 10990319 11376712 11520512 11840517 11773255 12161400 12660648 12779019
8973 12779019 12952272 13293660 13692627 14038110 14485258 15072544 15721288 16130217 16299525
8964 16299525 16816377 17811968 18706533 19271906 19979788 20791802 21642843 22340849 23010741
8955 23010741 24133614 24992559 25405609 26134962 27116323 27423419 27761612 28080560 28337015
8946 28337015 28677453 28492526 28278440 28635822 28954616 29409690 29484635 29964908 30237721 30769819
8936 30769819 31989935 32888267 34163753 35203103 36547752 38838102 41797418 44603608
8928 44603608 48361997 52964368 55577250 55485186 53566441 51908810 50528950 49791931 48246001
8919 48246001 45175263 42596522 41141896 39957139 39023900 39055710 39084974 39027243 39098429
8910 39098429 39263207 39525324 39849250 40161119 40382250 40885748 41313333 42165526 42890512
8901 42890512 43484743 43879245 44184666 44081195 43629400 42858387 41705375 40640242 39321662
8892 39321662 38377306 37538750 36367512 35228922 34460789 33832613 33627452 33377520 33240819
8883 33240819 33371269 33137117 33151595 33270674 33669695 34115023 34236249 34556837 35411679 36569277
8873 36569277 37339668 38467961 40016225 41744008 43211873 45278339 47496372 49898075
8865 49898075 52790427 55338212 57895245 60400095 62268752 63805673 65155643 66488660
8857 66488660 67718761 68680702 69780503 71270336 72633545 74600688 77032447 80226271
8849 80226271 83864707 87840555 92478144 97417313 103045908 109031855 115204829 121477788
8841 121477788 127270903 132213412 136968329 140808494 143720473 145695736 146585402 146542382
8833 146542382 144961350 142082188 137957403 133042291 127536637 121341805 114956506 108295928
8825 108295928 101881165 95522497 89473905 84060318 79185333 74572840 70666151 67525241
8817 67525241 65061917 62806704 60908034 59627509 58664930 57888678 58100148 58723707 59795327
8808 59795327 61766886 64026809 66396090 68593457 70392437 71610852 71799352 70745287
8800 70745287 68515472 65866579 63201749 59821229 56153730 52870180 49961371 47286684
8792 47286684 44879120 42675283 41034728 39892914 39082717 38560447 37705565 36917627 36876766
8783 36876766 37253663 37304980 37665892 38056711 38808291 40141256 41375378 42786754 44756740
8774 44756740 47438738 50468604 54226447 58651757 63808674 69152748 74159525 78478570
8766 78478570 81549651 83071622 83223704 81363100 78349045 74281904 69380389 64662137
8758 64662137 59432758 54784775 50111194 45882290 42638411 40046700 37083600 34796916
8750 34796916 32808572 31061741 30035992 28531216 27052234 25722313 24885809 23850154
8742 23850154 23052844 22049858 21664463 21324120 20576187 20148093 19766506 19353289 19052534
8733 19052534 18596498 18338011 18549111 18720517 18955169 19129664 18829138 18656900 18600741 18580954
8723 18580954 18206408 17827750 17392212 16937487 16685719 16422613 15970337 15652708 15481596
8714 15481596 14976300 14689329 14420870 14077600 13611544 13436057 13505362 13096824 12921268 12766117
8704 12766117 12630547 12548694 12565964 12388126 12496332 12530289 12398197 12427163 12608455 12882262
8694 12882262 12901655 13129353 13341986 13587369 14024766 14273600 14569623 15144606 15643090 16242868
8684 16242868 16699666 17337344 17795600 17921389 18562209 19142234 19537645 20194534 21030278
8675 21030278 21783632 22317098 23475809 24590326 25658199 27113993 28447526 29487355
8667 29487355 30309612 31140577 31948494 32661911 33380924 33997763 34377426 34408242 34129587 33649518
8657 33649518 33245670 32683679 32391134 31918030 31381949 31312650 31111190 30567920 30787175 30996672
8647 30996672 31131406 31715990 32126780 32737668 33301278 34228034 35309769 36400757 37599571
8638 37599571 39124941 40586875 42255543 44249484 46036725 48224411 51059446 53900375
8630 53900375 56617703 59837367 63554651 67017574 70665599 74433770 77765635 80760265
8622 80760265 82883572 84294212 84736608 85129603 85225429 84296424 82813111 80840862 77930559
8613 77930559 74828197 71585205 68118035 64462292 60660992 57400706 54442745 51693325
8605 51693325 49459210 47293271 45702919 44195383 43225654 42677658 42337303 42188908 42190570
8596 42190570 42168349 42278470 42832125 43411062 44182733 45200419 46873488 48541398 50353799
8587 50353799 51760901 52941582 54185558 55067473 55294877 55047245 54773870 54527525 53587239
8578 53587239 52376692 50750827 48438564 46278866 43795488 41065647 38546558 35906438
8570 35906438 33637173 31368955 29523761 27962685 26358573 24799725 23346945 22531586
8562 22531586 21612841 20949554 20194134 19452231 18642712 17935623 17222913 16890968 16388519
8553 16388519 15321186 14661663 14132025 13473240 12863076 12466049 11991064 11514868 11061415
8544 11061415 10545515 9961059 9611022 9174679 8773667 8323273 8183221 8034133 7762678
8535 7762678 7357486 7067607 6783557 6756810 6455986 6259989 6096181 5582710 5573699 5600909
8525 5600909 5409249 5202150 5150794 4927280 4670424 4396851 4178925 4087544 4040699 3883226
8515 3883226 3763271 3800514 3765613 3620869 3563066 3585105 3444700 3220607 2885412 2858444
8505 2858444 2885641 2919800 2988480 2724942 2330763 2561856 2559114 2388529 2328080 2425270 2664040
8494 2664040 2733776 2671430 2368875 2275856 2274564 2427697 2471167 2301782 2601828 2410451 2185357
8483 2185357 2096772 2058951 2195508 1886299 1841217 1641385 1597111 1409126 1386380 1684096
8473 1684096 1521864 1398508 1492015 1521408 1598546 1226324 1153277 1324103 1039700 999610
8463 999610 1025153 1149555 1092453 1006044 1006220 1149739 1444275 1512596 1369558 1295676 1382106
8452 1382106 1425686 1413055 1401690 1381539 1402344 1152727 905379 811244 752755 889683 772512
8441 772512 732145 642446 756213 650751 677679 619230 569513 647713 545087 414067 382666
8430 382666 513345 622607 505553 621847 260986 303059 389702 506682 526745 271585
8420 271585 300167 367663 618702 725368 806056 720266 758699 599528 403319 547710 519084
8409 519084 429133 507417 201373 -1886 124040 190427 204861 87449 -121059 -12175
8399 -12175 -21365 -115448 -176493 5633 294802 477213 263228 -144209 21912 28260 -348675
8388 -348675 -104666 -268233 -297365 -361736 -324415 -236171 -272208 -334354 -343832 -399478 -587249
8377 -587249 -226918 -289423 -471562 -285978 -243597 -343166 -259617 -190775 -340060 -353133 -428944
8366 -428944 -597643 -513631 -514881 -476296 -429966 -459407 -510705 -481546 -682737 -636748 -644420 -779832
8354 -779832 -576326 -231840 -522383 -632619 -509688 -581213 -737763 -816976 -775493 -273637
8344 -273637 -68377 -402176 -556176 -697978 -422829 -649059 -902828 -943994 -623347 -548202
8334 -548202 -792007 -749619 -701275 -608029 -603295 -385450 -648362 -620524 -635505 -557320 -327183
8323 -327183 -726045 -758498 -566127 -433352 -665031 -534914 -516280 -246372 -443070 -784816
8313 -784816 -975740 -819712 -642581 -718414 -662239 -537468 -511311 -482108 -485496 -627043 -398509
8302 -398509 -224020 -266323 -468712 -213604 -231917 -546201 -508547 -697204 -899954 -290095
8292 -290095 -294756 -195810 -69712 -87039 -356158 -712349 -507630 -432898 -179550 -144550 -62225
8281 -62225 -117326 -181995 -279518 -269068 -446436 -702573 -436996 -260266 -321316 -476586 -362223
8270 -362223 -392315 -167297 44240 7273 -146431 -236553 -193339 -123182 -205222 -207001 10466
8259 10466 106868 -180179 -140417 38163 -225980 -147867 205122 276311 96939 -108143 -309292
8248 -309292 -165632 -129046 -114012 -167846 -126333 -385307 -533919 -176191 -138711 -371512 -648774
8237 -648774 -669136 -359214 -125905 -93698 -171741 -131227 -440452 -399163 -549359 -470232 -285142
8226 -285142 -123127 -45114 -25262 215461 -94820 -513879 -546535 -564537 -194029 88456
8216 88456 -25326 -90525 -173328 -361112 -409494 -180074 -204676 -106543 -133426 -106592 -148546
8205 -148546 -169108 -326007 -365695 -538133 -379913 -505530 -332101 -128262 221066 153943
8195 153943 350894 245784 1669647 585059 -1943269 -1201684 -1246253 -939213 -831884
8186 -831884 -463668 -223455 -561198 -1149419 -1152484 -1064199 -850278 -814324 -658240 -702541 -851440
8175 -851440 -449582 -494748 -542063 -864282 -768065 -758025 -740194 -719886 -819695 -616347 -473098
8164 -473098 -825444 -871930 -624285 -616692 -672799 -931806 -950282 -809735 -603490 -890003 -773677
8153 -773677 -798618 -962916 -910570 -994454 -819038 -687505 -607733 -647114 -830931 -756281 -808598
8142 -808598 -707295 -740729 -835403 -872513 -716838 -634177 -840476 -1092802 -699091 -796987 -895366
8131 -895366 -866584 -710506 -671546 -788974 -541235 -857496 -890774 -802339 -630723 -704906 -628742
8120 -628742 -684034 -1000565 -1009995 -903293 -814903 -680372 -862563 -791497 -936541 -789154 -1015434
8109 -1015434 -1168847 -967675 -486131 -431096 -686191 -571061 -565130 -659180 -646830 -682214 -863930
8098 -863930 -592397 -373362 -587449 -506322 -461937 -632968 -875633 -1005955 -813882 -749276
8088 -749276 -782680 -939182 -943331 -716327 -527054 -637932 -497894 -387716 -635845 -606490
8078 -606490 -697923 -833000 -738987 -1042527 -915750 -700250 -604078 -878416 -923553 -695113
8068 -695113 -757967 -672788 -627155 -656498 -359198 -416551 -652808 -680938 -754517 -468640 -462614
8057 -462614 -521490 -606334 -775794 -797137 -733188 -659125 -678829 -894792 -687448 -595051 -559443
8046 -559443 -600119 -664791 -787588 -846346 -645727 -742868 -921486 -818216 -753496 -850295 -864877
8035 -864877 -876798 -653723 -800619 -1006424 -899989 -521146 -736103 -843796 -819533 -822168
8025 -822168 -669770 -481413 -468089 -730556 -640125 -427982 -555835 -541874 -739750 -326551
8015 -326551 -515942 -599125 -560230 -669688 -408212 -626577 -687978 -576221 -652857 -705471 -672848
8004 -672848 -654409 -632757 -547157 -420089 -463054 -669615 -535581 -555754 -739270 -693170 -526079
7993 -526079 -547121 -532226 -28609 -137638 -424906 -522468 -651928 -466797 -433561 -537360
7983 -537360 -328456 -333088 -470604 -548976 -286407 -475840 -339197 -471133 -309424 -312415 -734291
7972 -734291 -591271 -650241 -757463 -391941 -297122 -593233 -514488 -434402 -541009 -852216
7962 -852216 -524652 -441719 -606091 -882816 -1004915 -750862 -908708 -938117 -836045 -452329
7952 -452329 -402879 -152395 -305602 -357866 -221842 -414664 -507168 -512832 -295994 -350139 -609078
7941 -609078 -710107 -722134 -546893 -525737 -358813 -449597 -428744 -349867 -418880 -449217 -381146
7930 -381146 -462400 -398291 -345620 -438387 -602299 -686770 -716095 -528937 -425867 -615849 -562384
7919 -562384 -758940 -779604 -475790 -457361 -460573 -186256 25262 -195290 -477940 -463376 -642309
7908 -642309 -662325 -274354 -114742 -188365 -453635 -574319 -419860 -669396 -364959 -190284
7898 -190284 -118385 -332846 -227817 -289442 -202452 -175456 -80077 -26791 -269814 -299059 -207240
7887 -207240 -383459 -308144 13220 -115 164541 -39158 -55488 -136903 -271682 -48842
7877 -48842 -42092 -169216 -213271 -387208 -295072 -124584 73705 -43072 -404279 -400142 -207192
7866 -207192 -102204 76526 -72086 -330164 -255767 -215520 -62073 -446848 -484095 -162834
7856 -162834 -276468 -254288 -219073 -312370 -395166 -437515 -302792 -260598 -287987 -98704 -6002
7845 -6002 -351372 -474653 -297257 -387442 -429603 -310701 -127849 -121779 -253982 -189201 -164875
7834 -164875 -432863 -396095 -86598 -66246 -305527 -415622 -300072 -287867 -14091 10412
7824 10412 -207459 -157721 226637 334046 303593 227266 149725 306511 304466 267744 145837
7813 145837 170458 255246 180804 -235567 -755246 -241216 202996 280920 137064 175670 177355
7802 177355 39128 15522 106519 167781 -170030 -146189 -395996 -381724 -107172 -81544 159856
7791 159856 239498 -134743 -273128 -225498 -80079 107029 73309 -54692 30175 159090
7781 159090 32428 -51377 -35064 -53549 69966 16669 -309540 -252998 -346387 -384614 -236467
7770 -236467 -106817 -21269 -190290 -33434 -92445 -157917 -112943 -263521 1263 217141
7760 217141 70103 203668 79245 -128204 -138233 49969 307888 418638 293043 42540
7750 42540 -130552 -189471 18804 234773 43219 143766 231097 52773 84866 156919 75118
7739 75118 9593 -37575 85361 126032 306785 248624 224190 55012 203295 316651 388537
7728 388537 217477 -59142 90350 -89917 -151835 58507 -48492 28643 225597 286371
7718 286371 112342 40380 -48580 -28074 -64326 -23385 190985 93063 11648 315546 231352
7707 231352 97402 4658 -110522 293111 345974 142534 139252 363492 490258 459487 317691
7696 317691 307005 105536 145077 534653 495005 395721 815079 707979 392040 -60351
7686 -60351 90726 259597 303104 164370 517265 676422 336848 93427 206908 321143
7676 321143 496577 506167 331341 105281 62843 78851 302171 398535 202874 219276 397041
7665 397041 652320 492956 375443 385322 182619 190337 472744 297907 250654 474831 489349
7654 489349 392290 362790 342814 257473 449922 288029 482447 340507 72138 297893
7644 297893 388678 484283 563396 604207 739609 566903 474603 411613 288661 263780 164406
7633 164406 277702 399384 552536 319422 361464 348711 332428 267429 629324 646950 479632
7622 479632 418634 352953 387789 475520 865717 1028674 786576 1038413 906675 883602 903153
7611 903153 781982 871830 824245 884745 637815 724637 816589 838904 948047 1011877 868052
7600 868052 854211 857877 457159 657807 748365 629773 547421 613581 783481 872097 981609
7589 981609 948549 934943 835426 717749 759013 1103509 1123857 917782 553716 487509 492720
7578 492720 633117 621898 617521 707339 642948 520644 637425 601401 614188 637924 769329
7567 769329 819903 827706 787021 739665 626984 571407 410721 486280 644674 849422 955295
7556 955295 843951 836510 433916 527734 699356 1154037 990377 1131844 932744 758649
7546 758649 781403 1080910 1121282 869540 800958 905782 1206016 1237181 916946 975686 909106
7535 909106 928093 1056260 1270416 1464326 1236597 1353961 1412902 1166658 1238829 1496140
7525 1496140 1281726 1206971 1162939 1077210 1067669 917361 1117411 984204 1032950 1151491 1054920
7514 1054920 1024263 936943 1100395 1171394 1071734 1045142 1022299 1032166 1108606 1226784 1174869
7503 1174869 827269 786499 799375 936801 865655 1018192 1086507 1050322 873118 966700 1038272
7492 1038272 1144024 1179398 1157685 1131604 1107455 1048965 1061899 1144090 1034661 1030185 1049175
7481 1049175 1037896 879566 1123299 1257785 1443510 1523321 1129744 1258526 1059698 967568
7471 967568 1033268 944877 1312987 1473919 1130762 954330 1112595 1346866 1093894 1043879
7461 1043879 1441279 1582424 1387501 1008368 1062080 1070690 1086092 1214991 1285725 1126490
7451 1126490 1099562 1206071 1073771 1317053 1545914 1664217 1632886 1523183 1592795 1627478
7441 1627478 1507203 1514324 1391666 1549415 1304135 1233061 1291777 1361894 1420652 1340208 1509566
7430 1509566 1583808 1445767 1392567 1493497 1802703 1633974 1574243 1674588 1626927 1651317
7420 1651317 1791996 1921459 1953909 1928019 1645504 1717248 1964555 1538294 1662578 1761226
7410 1761226 1592036 1541551 1494649 1491868 1544630 1963045 2033482 2059172 1854345 1940485 1965292
7399 1965292 1960534 2001088 2085900 2161269 2211505 2175150 2103230 2053297 2060626 2202948 2292060 1863520
7387 1863520 1978370 2007114 2078903 2105212 2089859 2028188 2239048 2159773 1936517 1959188 2178478
7376 2178478 2013348 2138359 2151391 2104425 2437525 2496093 2519569 2567034 2600811 2308149 2346260
7365 2346260 2417105 2619013 2468940 2305348 2272753 2449364 2436531 2324053 2420743 2589928
7355 2589928 2670765 2376569 2440085 2270332 2145465 2402813 2820069 2702449 2462548 2517298
7345 2517298 2614770 2775803 2858145 2564102 2470600 2636129 2685824 2776226 2563245 2717917
7335 2717917 3042270 2963527 2845324 2864371 2607895 2656468 2779551 2719725 2885361 2683659
7325 2683659 2942725 3099515 3005478 2917786 2813878 2918595 2797007 2995218 3004895 3094279
7315 3094279 2924440 2823635 3069057 3231210 3149902 3045023 3286265 3319902 3210507 3161893
7305 3161893 3324679 3335131 3435908 3136249 2875163 2902339 3141065 3412957 3347538 3071103
7295 3071103 3237573 3401229 3399126 3404356 3494910 3477509 3421850 3624923 3703441 3688148 3727158
7284 3727158 3940256 3753489 3680954 3691241 3916503 3707764 3999449 4002337 4067779 4178188
7274 4178188 4000700 4088592 4154184 3865940 4147658 4134068 4260586 4174725 3972286 4168073
7264 4168073 4312217 4307508 4357500 4327068 4424998 4497686 4557719 4658169 4506438 4552755 4738917
7253 4738917 4769643 4504570 4819839 4817650 4770974 4576532 4642376 4883926 4918640 5071383 4871394
7242 4871394 4892853 5095440 5093489 4961827 4908902 5184441 5300819 4975051 4942123 5038065 5054775
7231 5054775 5293221 5344205 5435857 5520854 5710831 5908863 5907581 5964153 5975526 5972023 5804792
7220 5804792 5885377 5715740 5736783 6327410 6542552 6744489 6620142 6472734 6626781 6813442
7210 6813442 6932226 6975425 6793629 6675516 6739521 7147677 6991260 6940593 6966641 6883234
7200 6883234 7004442 6906648 6776844 6829724 6928079 6898274 6846514 6935281 7326302 7459417 7414417
7189 7414417 7434455 7506139 7567874 7277267 7297860 7340695 7666910 7696284 7853679 8028579 7859782
7178 7859782 7897741 8020198 8244643 8129754 8100556 8436020 8500154 8612844 8792034 9136218
7168 9136218 9357565 9269979 9155286 9727635 10195120 10160283 10471926 10758027 11243827 11667090
7158 11667090 11813700 12091100 12503051 12996694 13259541 13848589 14492820 15099249 15935892
7149 15935892 16736169 17785514 19154259 20237432 21450415 23060887 24492320 26618017
7141 26618017 28908817 31202103 34504616 38161100 41870117 46359223 52090074 58462086
7133 58462086 66379490 76139488 84460789 86559930 82823518 78582492 74951930 71959274
7125 71959274 68622634 61546970 54029254 48702298 43918778 40247471 37144494 34411459
7117 34411459 32002159 30290014 28426936 26723968 25130460 23840987 22535672 21228536
7109 21228536 20090710 19037521 17941036 17017320 16259056 15627027 14774383 14572340 13984900
7100 13984900 13563915 12981444 12465104 12367236 12087306 11731945 11616365 11354895 11153931 11035342
7090 11035342 10613248 10644073 10351693 10243038 10245052 9864994 9766427 9649055 9408078 9414855
7080 9414855 9205868 9189683 9078444 9237431 9236350 9132455 9081089 9038766 9093286 9044637 8823390
7069 8823390 8976811 8815849 8570924 8277064 8342680 8377053 8485562 8549452 8431340 8687402
7059 8687402 8613726 8535666 8303834 8161703 8423724 8300329 8332004 8239213 8238523 8383023 8170311
7048 8170311 8436266 8458785 8127049 8329763 8309432 8294132 8426089 8428384 8556231 8429784
7038 8429784 8419345 8613612 8479031 8325886 8437858 8527632 8400111 8232700 8586063 8621572
7028 8621572 8698457 8870560 9003373 8745466 8480902 8588099 8419192 8638315 8764483 8795982
7018 8795982 8624802 8720438 8955245 9177350 9076640 9054865 8899097 9262551 9309816 9429524
7008 9429524 9415295 9495170 9525455 9287841 9351272 9285625 9614977 9677899 9615358 9692832 9623599
6997 9623599 9642941 9802530 9658240 9744082 10051818 10132353 10065308 10080335 9943712 10038499 9958756
6986 9958756 10067872 10003621 10262087 10127854 10266352 10540842 10334416 10247889 10423636 10698251
6976 10698251 10739521 10503475 10440470 10829183 10773988 10916346 11157223 11009213 11099874 11182445
6966 11182445 11141005 11136017 11461090 11637991 11837248 11927046 12038003 12000823 11599498 11524721
6956 11524721 11847627 11735855 11816720 11747599 11953845 12080997 12055053 12132998 12318067 12332502
6946 12332502 12224286 12249075 12065420 12291332 12519751 12580775 12685904 12593874 12603600 12489333
6936 12489333 12399553 12682317 12720378 12782948 12927518 13095881 12904620 13227339 13237784 13287894
6926 13287894 13318347 13289305 13342401 13377911 13357240 13596720 13868217 13959896 13589934 13891761
6916 13891761 14005692 13977850 14169621 14270235 14355148 14379013 14427127 14765362 14842914 14828724
6906 14828724 14737828 14815889 15004602 15016181 15221620 15182790 15052396 15363733 15353449 15128178
6896 15128178 15208482 15396391 15290192 15223729 15253092 15423947 15628845 15691833 15892652 15973760
6886 15973760 16235332 16055596 16197948 16067432 16077149 16176373 16371144 16607856 16468965 16384420
6876 16384420 16537069 16578000 16901529 17154203 16876885 16830067 17132019 16992177 17097279 16892316
6866 16892316 17049090 17346822 17509528 17471794 17366859 17354471 17586828 17599204 17520752 17623882
6856 17623882 17931605 18005920 17684616 17668921 17893220 17971087 18110317 18417797 18187168 18163983
6846 18163983 18320772 18390897 18411367 18511361 18569655 18957628 18794228 18635731 18896210 18846053
6836 18846053 18690770 18997720 19122700 18807739 18849231 19113569 19242871 19142651 19230745 19347105
6826 19347105 19429021 19480806 19613496 19766457 19484115 19515817 19510735 19375886 19471419 19541225 19547126
6815 19547126 19868401 19923813 20077759 19922620 19727348 19666750 19674626 19921312 20018729 19825561
6805 19825561 19691960 19902159 19833023 20147659 20028997 19902635 20042864 20339405 20272690 20008002
6795 20008002 20182492 20158937 20008449 20153691 20317389 20025713 20212435 20478730 20651236 20646083
6785 20646083 20602259 20783337 20711315 20565337 20266957 20020181 19854222 20024748 20196381 20061561
6775 20061561 20105329 19757693 19868533 19985322 19716118 19682155 20107282 20099795 20195714 20255192
6765 20255192 20010194 20026954 20094112 19974679 19815331 19712595 19577255 19688275 19556947 19496103
6755 19496103 19585518 19689935 19711577 19675587 19175818 19294156 19325632 19402127 19379397 19147166
6745 19147166 19252194 19347621 19569097 19484349 19154964 19067035 18853425 18749323 18970791 18884200
6735 18884200 18643092 18891859 18978487 18585869 18666092 18899649 18762385 18510396 18860478 19074132
6725 19074132 18905620 18908497 18728125 18865595 18726830 18257030 18262375 18297384 18132211 17847209
6715 17847209 17817500 17876291 17833972 17775731 17837314 17744196 17800183 17764680 17392922 17359021 17222121
6704 17222121 17173192 17017510 17058924 17200157 16883458 16815938 16998296 16838045 16801954 16664420
6694 16664420 16727520 16831681 16538453 16515623 16256708 16366247 16462025 16458534 16508460 16130179
6684 16130179 15951656 16063389 15927767 15780153 15658864 15613912 15843049 15754930 15785845 15732524
6674 15732524 15546841 15435507 15445378 15579626 15333147 15250708 15141271 15253458 15246175 15358626
6664 15358626 15137548 15033374 15050978 14705037 14726221 14810706 14935339 14923423 15159772 14667168
6654 14667168 14595098 14683116 14512249 14520634 14204321 14216981 14140058 14233620 13900428 14040169 13973439
6643 13973439 13757075 13834836 13763808 13835945 13634558 13483866 13544260 13309422 13490104 13649504
6633 13649504 13465041 13511768 13310971 13122024 12952083 13205924 13265287 13202507 13223727 13210774
6623 13210774 13024367 12957472 12827973 12891645 12834640 12607012 12515475 12723263 12594055 12298497
6613 12298497 12092917 12342526 12502824 12434650 12417837 12378463 12336170 12152583 12618665 12630264
6603 12630264 12426308 12126691 12065218 11940298 11905391 12012779 12097455 12120055 12031203 11992837
6593 11992837 12266583 12276750 12110363 11908394 12035494 12183254 12233727 12008998 11931653 12028122
6583 12028122 12077203 12368455 12676802 12674050 12595820 12791773 12876324 12944091 12638603 12860028
6573 12860028 12925945 12868636 12811345 12612653 12947553 12756124 12449292 12725040 12437707 12643075
6563 12643075 12951714 12466340 12459884 12452242 12706637 12761867 12850903 13046627 12937777 13128268
6553 13128268 13100640 13301031 13378235 13448952 13621851 13996124 14008341 14425061 15069899 15706358
6543 15706358 15991761 16100948 16674472 17316883 18048277 18551694 18912851 19210518 19692923
6534 19692923 20255853 20469353 20506627 20460567 20725805 20914933 21176864 21459886 21841292 22321406
6524 22321406 22749151 23137286 23629789 24026408 24259502 24731373 24793918 24378953 24367020 23985422
6514 23985422 23591405 23122559 22440010 21693775 21346848 20975295 20123256 19747008 19430720
6505 19430720 18890107 18725021 18481507 17866211 17761582 17419699 17122157 16670347 16378719
6496 16378719 16045512 15850212 15340809 14905928 14428953 13699753 13589541 13551889 13399504 13349379
6486 13349379 13079405 12679360 12364813 12120902 12170434 11881715 11472393 11349772 10919307 10899143
6476 10899143 10892421 10627438 10471969 10504621 10240256 10030548 9620455 9508651 9587591 9610990
6466 9610990 9439597 9312115 9407408 9269194 9119527 8970420 8882405 8688310 8582294 8355239
6456 8355239 8148037 8145699 8013822 7948182 8126185 8140231 7761798 7994508 7974804 7644392
6446 7644392 7519180 7645767 7517867 7315206 7512736 7658089 7596919 7337922 7281069 7228398
6436 7228398 6979585 7068558 7308907 7172856 6996757 7207228 7509862 7100411 6751524 6986956
6426 6986956 7156766 6985333 7176685 7343969 7169163 7273596 7163269 7110781 7361982 7354990
6416 7354990 7600283 7419982 7227330 7223251 7261929 7267062 7295206 7180277 7177968 7116508 7045536
6405 7045536 7166939 7192135 7172157 7234708 7057279 7033089 7025973 7134219 6946119 6869126 6839056
6394 6839056 7096884 7402077 7305224 7166731 7162583 7473973 7445259 7474517 7605881 7680928 7848570
6383 7848570 8198619 8429010 8380576 8829820 9069580 9330676 9707704 9998122 10475214 10968626
6373 10968626 11350547 11599536 11844688 12033701 11609189 11355140 11484462 11132903 10638059
6364 10638059 10033519 9429614 9321224 9160026 8415802 8292157 8183598 8033548 7959524 7729287
6354 7729287 7431068 7386115 7328560 7267537 7040450 6992013 6935520 6829787 6465841 6339057
6344 6339057 6451722 6674494 6377047 6458080 6475817 6223620 6427289 6417279 6042842 5890696
6334 5890696 5981616 6067721 5981387 5922182 6175189 6144502 6258426 6079385 6036372 5977097 6024060
6323 6024060 5850867 5896837 6311238 6338570 6416776 6452475 6543164 6769600 6630537 6645562 6943191
6312 6943191 7101843 7185416 7310193 7288312 7180873 7228932 7291217 7481451 7473350 7345665 7408915
6301 7408915 7558945 7782728 7751637 7984271 8075542 8161531 8288428 8330658 8452497 8672021
6291 8672021 8933770 9130268 9283609 9753893 10024004 10498470 10631667 10563248 10839263 11370054
6281 11370054 11578792 11488816 11676207 11747666 11832313 12123196 12049896 11727942 12170284 11843443
6271 11843443 11575995 11451410 11483807 11344395 11446013 11535357 11422553 11750775 11999287 12209963
6261 12209963 12494053 12880434 13255619 13873407 14208860 14448738 14856903 15364610 15334741 15560072
6251 15560072 15662666 15695252 15617986 15666204 15431357 14923884 14371642 13850731 13754358 13465490
6241 13465490 13383815 13225853 12993819 12826783 12725438 12523390 12838277 12773410 12573525 12532385
6231 12532385 12587519 12675628 12852336 12968364 12914436 13091119 13401953 13431567 13230043 13091385
6221 13091385 12849921 12688232 12632314 12349454 12417383 12232458 11945547 11455832 11153664 10951610
6211 10951610 10742051 10476849 10336791 10327973 9963961 9792287 9729870 9538561 9298262 9136520
6201 9136520 9233600 9223815 9164258 9028293 8800923 8825419 9015914 8845214 8823302 8728216 8624589
6190 8624589 8501555 8600521 8632719 8467571 8456164 8384720 8316650 8250743 8357148 8251119 8434235
6179 8434235 8446408 8288041 7999661 8063386 8201647 8015231 7800825 7892751 7542858 7235103
6169 7235103 7384757 7381360 7027756 7270175 7352891 7295846 7218934 7084394 7319696 7343350 7302586
6158 7302586 7239203 6886308 7078025 7109304 7259705 7573857 7473865 7041453 7035686 6984610 7131556
6147 7131556 7413754 7221834 7424550 7410443 7187563 7218566 7308755 7566510 7512326 7338050
6137 7338050 7394734 7242792 7476407 7495925 7307769 7587637 7526711 7382724 7502910 7404466
6127 7404466 7523583 7308164 6966529 7267821 7437930 7645433 7449547 7206703 7441940 7407928
6117 7407928 7467858 7523692 7189702 7296304 7466088 7504718 7706806 7770179 7531863 7305150
6107 7305150 7353701 7547341 7643087 7705634 8239604 8351904 8288222 8222336 8175794 8300495 8192358
6096 8192358 8298120 8505407 8656080 8850912 8770974 8770342 8919879 8974367 8975848 9080222 9102512
6085 9102512 8994811 9366910 9681270 9723124 9862894 10128583 10208194 9884094 10081120 10476848
6075 10476848 10455348 10407851 10678299 11008419 10943800 11014018 11520651 11872994 11852898 12098808
6065 12098808 12490894 12553953 12892910 13410700 13769333 14228656 14606378 14800719 15277524 15501830
6055 15501830 15838084 16121467 16923224 17384022 17264671 17304631 17500102 17284383 17444183 17718038
6045 17718038 17956441 18052000 17994082 17992680 18385333 18596681 19106426 19561639 20012840 20467627
6035 20467627 20871046 21580425 22526860 23374484 24047445 24753672 25477830 26633340 27255586
6026 27255586 27956926 28699749 29642120 30579478 31452410 31975566 32192880 32207031 31980417 31680480
6016 31680480 31321410 30881530 30205111 29420515 28788218 27925710 27446458 26712346 26344398
6007 26344398 25912579 25490132 24834586 24534866 24205575 23538970 23120676 22634455 22321964
5998 22321964 22028099 21934952 21629072 21478441 21354116 21252108 20839366 20529855 20372830 20307350
5988 20307350 19900907 20191856 20269982 20158254 20427902 20409403 20524311 20661327 20429787 20453182
5978 20453182 20630517 21005004 21697692 22171915 22738648 22774298 23184501 23731639 24412937 25263702
5968 25263702 25805923 26497346 27370642 28341438 29396273 30242622 31386867 32592186 34084121
5959 34084121 35790026 37689013 39552126 41366676 43624980 45838038 48050465 50750115
5951 50750115 53422815 56040502 58674822 61440613 64027087 66621795 68879731 70920368
5943 70920368 72723631 74218615 75202588 76056977 76346356 76515592 76475500 75560167 74561711
5934 74561711 73418758 71998872 70017838 68082700 65701550 63097156 60666263 57900829
5926 57900829 55506884 53431795 50881670 48416137 46048298 43770595 41829863 40084268
5918 40084268 38564267 36971655 35232868 33593534 32261813 31093174 29687930 28706462
5910 28706462 27884928 27004971 26258164 25426240 24691821 23895704 23068738 22538185 22004788
5901 22004788 21237763 20510776 19954088 19586206 19235598 19013724 18767429 18082141 17607196
5892 17607196 17131696 16737669 16456511 16274725 16164610 16167954 16038113 15674436 15380334 15124898
5882 15124898 14835152 14714168 14242594 13852805 13499098 13394384 13018677 12576192 12703553
5873 12703553 12376943 11899096 11634489 11485618 11149702 10970798 10970375 11045256 10803316 10604444
5863 10604444 10321300 10294837 10277051 10140911 10268902 10153569 10022637 10024787 9892247 9882727
5853 9882727 9829121 9437648 9512921 9501177 9319119 9013804 9052003 9362630 9244262 9302909
5843 9302909 9224096 9154443 9222933 9075461 8950682 8768547 8966552 8987620 8977253 8605020
5833 8605020 8373627 8322991 8398046 8330327 8236200 8059511 8287417 8383427 8202277 8443554
5823 8443554 8412469 8553677 8308728 8217800 8194710 8106120 8602317 8754904 8543169 8726295
5813 8726295 8759473 8574442 8457120 8467549 8532238 8639333 8321979 8192666 8308173 8163546
5803 8163546 8316035 8262843 8213668 8199793 8299157 8383050 8130277 7898474 7943385 7778868 7540088
5792 7540088 7753499 7970617 7923656 7798666 7998449 7868966 7946038 8278220 8148705 7920483
5782 7920483 8072700 7897401 8215818 8526213 8414771 8443016 8299103 8026534 8085589 8369558
5772 8369558 8256297 8292493 8095514 8224615 8427082 8134798 8165378 8273573 8221861 8445816
5762 8445816 8651002 8565835 8970627 8991260 9029447 9057751 8894541 8890534 8862179 8871500 8858355
5751 8858355 9052176 9303555 9313554 9282889 9399076 9549787 9745369 9725316 9827710 9837460 9783891
5740 9783891 10132889 10092503 10131201 10184821 10276515 10318907 10348070 10472743 10789270 11020532 11211016
5729 11211016 11286812 11490628 11829244 11835735 11943763 11914085 12272323 12455791 12645299 12603664
5719 12603664 12666914 12882206 12870514 12848055 13091036 13614892 13884608 13898266 14231059 14776786
5709 14776786 15328552 15585106 16133832 16520845 17065137 18042998 18533487 18807157 18798519 18746482
5699 18746482 19044693 19237073 19229611 19342553 19203637 19228639 19283638 19636002 19717910 20019847
5689 20019847 20413387 20684256 20943845 21736668 22255858 22896169 23879753 24490301 25553793
5680 25553793 26673942 27524935 28621063 29506226 30733242 32608715 34532964 36669078
5672 36669078 38913873 40841823 42420706 43073062 43160364 43709812 44362706 44897337 45266508
5663 45266508 45632353 45920636 46709770 47986012 49292472 50600288 52413858 54572756 56658458
5654 56658458 58964862 61295947 63571095 66477941 69627291 72935259 76695694 80657206
5646 80657206 84986207 90169465 96188467 102527549 109773969 117925125 126892414 136276237
5638 136276237 145259060 154072186 162908761 172143973 181345183 190668330 199018094 207070497
5630 207070497 214475450 220767094 224762881 227015083 227922239 226687357 224006312 220138840
5622 220138840 214794728 208437031 201399162 193527343 185579483 177697963 169563547 161333639
5614 161333639 153625928 146014597 138201184 131116567 124437821 118178770 111873439 106029432
5606 106029432 100075807 93883556 88358414 83850478 79012677 74073673 69816310 65789366
5598 65789366 62225432 58792361 55793930 52915623 50286085 47989337 45556978 43717804
5590 43717804 41807181 39964163 38432755 36832210 35580987 34364429 33088689 31799960
5582 31799960 30645880 29547545 29055965 27960749 27197533 26364569 25495311 24492521 23685084
5573 23685084 23023727 22301523 21859038 21412984 20799296 20441597 20065736 19509979 19145344
5564 19145344 19007843 18672217 18110155 17642412 17173113 17041049 16952471 16894339 16704477 16320617
5554 16320617 15863111 15565301 15493826 15334591 14676827 14482675 14433527 14443276 14288644 14277935
5544 14277935 14071488 13809965 13900053 13556657 13574492 13480609 13199075 13167300 13475863 13392170
5534 13392170 13688249 13557178 13417292 13288843 13222890 13245257 13408977 13301546 13660685 13949825
5524 13949825 13852363 14197119 14279101 14224551 14670533 14867709 14975902 15467542 16001904 16427196
5514 16427196 16807228 17434256 18087900 18488609 18650689 19067036 19818500 20114493 20731252
5505 20731252 20950731 20882977 21076555 21396508 21575287 21532860 21595648 21683490 21809870 21370844
5495 21370844 21437176 21381969 21213045 21314718 21128895 21196905 21435588 21400861 21319205 21273992
5485 21273992 21606268 21747878 22169888 22637254 23120194 23574980 24394138 25035391 25509658
5476 25509658 26349434 26960433 27514855 28085117 28598490 29265567 29904183 30369239 30619410
5467 30619410 30751434 30882877 31295669 31291215 31477247 31232149 31226364 31158066 31088597 30848078
5457 30848078 30655813 30370423 29989190 29385089 28682713 28210829 27765371 27205079 26926629
5448 26926629 26634675 26259749 26481093 26766773 26981605 27306002 27757645 28196057 28854566
5439 28854566 29483041 29979454 30609356 31397177 32518229 33398014 33860421 34729310 35845207
5430 35845207 37084184 38200548 39764639 41139820 43064692 44611411 46473213 48701868
5422 48701868 50817904 54142978 57982039 62595199 67489620 73591173 81356314 90764149
5414 90764149 102161892 115772736 126551925 129278570 123998143 117395270 111969709 106593182
5406 106593182 101268176 90833247 79581173 70864129 63759634 57861810 52940732 48554963
5398 48554963 44950174 41795958 39432045 37322367 34940998 32730684 30672534 29045702
5390 29045702 27373140 25857723 24243064 23207415 22264396 21093732 19978009 19352838
5382 19352838 19021761 18464920 18224054 17581130 17011104 16408030 15982787 15504019 15138263
5373 15138263 14688083 14121744 14061405 13783294 13245793 12863092 12652989 12219048 12166075 12115003
5363 12115003 11921458 11386914 10940728 10839047 10749170 10751486 10461828 10630370 10459971 10159279
5353 10159279 10323671 10090090 9950495 9866374 10138187 10242919 10009076 9839014 10166577 10116390
5343 10116390 9929561 9813827 9789796 9618256 9463483 9655936 9550354 9262455 9291108 9269281
5333 9269281 9300371 9207422 9131483 8982847 8944791 9184380 9351113 9536428 9318637 9134567
5323 9134567 9385271 9579232 9565740 9777178 9483830 9518072 9437446 9384611 9381502 9413501 9339931
5312 9339931 9423561 9420061 9256707 9065219 9072872 8898871 8815615 8391393 8166534 8403376 8572973
5301 8572973 8818730 8454125 8486716 8515411 8571086 8414529 8216796 8253313 8124609 8392365
5291 8392365 8516257 8371866 8170573 7907149 8162383 8375432 8275122 8078797 8177418 8384687
5281 8384687 8492808 8454341 8279202 8271892 8280541 8430880 8711624 8890753 8639067 8493972
5271 8493972 8557744 8876688 9116923 9122679 9108400 9039184 9227922 9146042 9018476 9317100 9536952
5260 9536952 9479865 9821551 9693826 9781180 10106819 10230149 10771306 11196379 11272330 11297306
5250 11297306 11582192 12005328 12414582 12841231 13229587 13364438 14176593 14941022 15783300
5241 15783300 16289373 16900919 17610336 18183035 19313978 19856903 20503712 21111876 21476668
5232 21476668 21821713 22004426 22076836 21935370 21935084 21792146 21512134 21676190 21610990 21677664
5222 21677664 21579606 21604053 21339332 21656656 21775705 21807370 21899126 22276536 22830692 23164864
5212 23164864 23609596 24057344 24414034 24947466 25488580 25987489 26167933 26296554 26507629
5203 26507629 26674358 27054788 27004717 26935480 27230288 27261505 27232906 26856993 26609689 26638015
5193 26638015 26562124 26439698 26048708 25786354 25689025 25461156 25052148 24536146 24387100 24149199
5183 24149199 23422253 22925077 22511756 22249356 21755072 21431535 20898442 20714444 20671936 20516682
5173 20516682 20324160 20280469 20033252 20112296 20273060 20151554 20188027 20480985 20538726 20451120
5163 20451120 20636226 20880085 20779569 20710648 20364112 19886846 19558785 19378537 18938455 18458899
5153 18458899 18431112 17774627 16904495 16649242 16112839 15530224 15100552 14771066 14362453 14230906
5143 14230906 14183240 13837687 13576699 13270361 12914164 12815577 12690200 12677088 12633608 12588206
5133 12588206 12464317 12250336 12210912 12356733 12313979 12174475 12406444 12206518 12143861 12148393
5123 12148393 11975923 11980122 12135916 12102666 11947960 12110754 12267882 12088021 12024249 11925958
5113 11925958 11920458 12110273 11803693 11827676 11743783 12103436 11884137 11675194 11723417 11408987
5103 11408987 11553693 11635267 11562573 11831116 11981101 12195714 12301317 11944110 12374329 12404137
5093 12404137 12589842 12575616 12557333 12728197 13070487 13257550 13126880 13105471 12817553 12582953
5083 12582953 12555745 12466381 12692229 12761713 12544970 12062201 12167247 12340333 12064929 12005494
5073 12005494 11862805 11949606 12214169 12245317 12225247 12392798 12437044 12589510 12592774 12394541
5063 12394541 12285194 12283221 12618024 13085656 13328407 13172472 13049985 12949455 13138748 13195160
5053 13195160 13537089 13713984 13689769 13702323 14068531 14268222 14361685 14643680 14529579 14446135
5043 14446135 14851525 15183054 15451065 15254333 15312092 15460031 15359730 15759098 15980431 15747450
5033 15747450 15703654 16110854 16362677 16805706 16955656 16962505 17170627 17264551 17260973 17347851 17688308
5022 17688308 17927920 18248314 18660232 18975137 19065664 19107184 19366155 19696088 20195015 20533446
5012 20533446 21155961 21343449 21692030 22150920 22618713 23007962 23165985 23653476 24450802
5003 24450802 24936442 25653532 26854201 27849215 28716042 29691103 30188354 30094137 29880435
4994 29880435 29397474 28919217 28599918 27919046 27527385 27360089 26996048 26356409 26356438 26321058
4984 26321058 26096582 26104874 26277652 26281870 26513213 26551310 26567637 27253854 27504727 27313959
4974 27313959 27422781 27733546 28140876 28407017 28593556 28914896 29261467 29962670 30245500
4965 30245500 30657277 31060599 31641586 31961413 32232816 32786856 33461496 33942248 34411228
4956 34411228 34924455 35226824 35496975 36411906 37386514 37859015 38827039 39669894 40459908
4947 40459908 41549228 42952573 44546612 46106970 47194217 48452072 49638875 50204199
4939 50204199 50563741 50902824 51366026 51435801 51631663 51665509 51636485 51658028 51730253 51810129
4929 51810129 52132363 52626450 52654269 52580480 52597549 52525605 52268331 52412218 52416731 52043273
4919 52043273 51787482 51772213 51879511 52157820 52368678 52582546 53047291 53585420 54137415 54828391
4909 54828391 55393232 55770382 56818239 57132208 57655773 58520360 59114928 59759985 60326881
4900 60326881 60847144 61629477 62516185 63257746 64079173 65252318 66328960 67299041 68019972
4891 68019972 69036974 70107410 71054272 72285948 73675950 74934278 76341184 77814409
4883 77814409 78777802 79907794 81098894 82178906 83312309 84613450 86150898 87778077
4875 87778077 89130424 90642236 92430423 94386809 96260775 98152024 100294018 102339730
4867 102339730 104455442 106861308 108967783 111202493 113310080 115540336 117888446 120512393
4859 120512393 123092881 126229177 129456484 132798338 136719172 141627865 146857908 152572184
4851 152572184 158987823 166047113 174125737 182927872 192266129 202624231 213801420 225417915
4843 225417915 236644426 247964929 259028872 270130844 281684659 293274767 304887600
4836 304887600 316671445 328133101 338782297 347977035 355398978 360689736 363611578 364239722
4828 364239722 362388879 358202707 352209355 345227018 336647938 327197220 317225847 307090492
4820 307090492 296874958 286452781 276556199 266641346 256584271 247000907 237637348 228511178
4812 228511178 219254254 210723636 202148601 194046163 185856628 178142599 170957889 164386256
4804 164386256 157994973 151755659 145904009 140489972 135453304 131003432 126903210 123127285
4796 123127285 119410561 116094472 112948737 109871405 106971617 104265913 101829358 99338784
4788 99338784 96791421 94625184 92831762 90953311 88898166 86982099 85516815 83848945
4780 83848945 82421845 80984333 79270887 77592184 76162103 74742170 73344073 72069655
4772 72069655 70885566 69597440 68376440 67335812 66163878 64935914 64151800 63386532
4764 63386532 62192567 61246946 60299083 59355244 58263889 57556049 56971268 55996545 55205960
4755 55205960 54321429 53756900 53060729 52639118 51746830 50876661 50538752 50225118 49556569
4746 49556569 48772910 48452414 48345085 47942160 47686484 47504178 47343046 47158837 47137253 47334548
4736 47334548 47386663 47541808 47483819 47677912 48089689 48021252 48340192 48421301 48458847 48799128
4726 48799128 48895930 48745005 48876566 48940970 48654031 48701140 48645857 48316575 48280163 48306480
4716 48306480 48117314 48211308 48371553 48278657 48287069 48379086 48121496 48002306 47948375 47924013 47927003
4705 47927003 48073361 48001188 48002430 47972912 47894245 48061897 47852672 47773033 47643083 47647654 47653590
4694 47653590 47461112 47502779 47397216 47393906 47539434 47752685 47754301 47706394 47609734 47804549 48007187
4683 48007187 48011847 48125907 48685265 49176884 49580071 49883508 50626332 51279387 51575326 52163202
4673 52163202 52892618 53577798 54236441 55073121 55511440 56650114 57952168 58741500 59615369
4664 59615369 60735246 61558474 63076197 64971415 66568193 68328604 70298651 72379732
4656 72379732 74802868 77367784 80050958 82546724 85306360 88683597 92075655 95288117
4648 95288117 98697153 101710474 105277793 109011660 113034998 117410774 122272734 127288875
4640 127288875 132932376 139612151 147262368 155730683 165147247 175566236 187684524 201546273
4632 201546273 216990603 234911886 254915757 277260345 302041191 327762750 350703572
4625 350703572 366461344 371573582 367992481 359084515 347709188 334094265 317304169
4618 317304169 297431544 277607739 259419699 243542063 230079039 219005890 209710214
4611 209710214 201792992 195000995 189397721 184670914 180917183 178277216 176300035 175035636
4603 175035636 174656569 174875857 176381978 178883930 182132501 185906737 190411614 195096650
4595 195096650 199000442 201576138 202420174 201127856 198111722 194107442 189196121 182950101
4587 182950101 175822520 168711350 161782653 154741306 147979931 142222352 137130827 132087094
4579 132087094 128001829 124504020 121290948 118412991 115963042 114067283 112454640 110811082
4571 110811082 109871009 109228729 108877982 108759159 109093853 110145603 111127102 112310157 113608776
4562 113608776 115523791 117619723 120146399 122892398 126034295 129255442 133358068 137725166
4554 137725166 142541504 147860338 154286920 161735169 169599500 178630304 188668392 199275003
4546 199275003 211257277 224327836 238599043 254122553 271135064 290218841 311374943
4539 311374943 333741193 357721620 382524566 408629649 433503043 455297064 472753829
4532 472753829 483748669 488170897 485181131 474904441 457914691 436287680 412024591
4525 412024591 385846601 359784263 334391087 310599323 288700223 269269479 252556823
4518 252556823 237581041 224809866 213600538 203499111 194746680 187103126 180026855
4511 180026855 173841243 168082360 162781078 158291603 154281657 150461437 147525392 145265595
4503 145265595 142806862 140806989 139071736 137409182 135583467 133751142 131765577 129585055
4495 129585055 127433444 124604123 122045151 119715707 116922620 114106931 110975236 107582634
4487 107582634 104517114 101162465 97470749 94296091 91031023 87797095 84888832 81941309
4479 81941309 79173485 76485317 74146796 71618853 69992417 67619901 66283878 64723011
4471 64723011 62724715 61431743 60264133 58810630 57311176 56020681 54712022 53574493
4463 53574493 52356590 51345184 50443002 49561811 48869501 47831618 46956806 46183811 45505749
4454 45505749 44923967 44135283 43580959 43089334 42259675 41660763 41339916 40835869 40480324
4445 40480324 39848803 39505710 39416573 39181319 38850530 38831682 38381024 38303655 38176227 38117665
4435 38117665 38227750 38117009 38066608 38054621 38068757 38181481 38026979 37972595 38047168 37919344
4425 37919344 38012527 38148510 37522989 36967005 36952389 36755857 36439982 36234936 36280765 36121323
4415 36121323 36038376 35856638 35961687 35983029 35748096 35702680 35806041 35821733 35834552 35880456
4405 35880456 35471447 35571757 35793516 35767124 35455852 35727449 35418963 34936578 34417285 33980841
4395 33980841 33508253 33153742 32963529 32487098 32051131 31706752 31485469 31179806 30813902
4386 30813902 30346730 29797864 29616379 29530943 29524157 29359244 29070522 29111298 29015008 29069414
4376 29069414 28570596 28773916 28884916 28731735 28974155 28870212 28712712 28804199 28746679 28860169
4366 28860169 28687477 28308392 28391991 28321584 28076811 27840021 27551073 27152326 26823275 26594327
4356 26594327 26427302 26379443 26050199 25673062 25511420 25587653 25459483 25283662 25118694 25497859
4346 25497859 25407287 25412123 25218347 25048018 25249136 25151446 25272993 25307700 25705309 25812453
4336 25812453 25651675 25431579 25467387 25847020 26078384 25867156 25810414 25934575 26300934 26876060
4326 26876060 26991739 27117889 27438653 27777510 27903765 28072745 28502166 28794207 28972801
4317 28972801 29199588 29286861 29132603 29535535 29650473 29962445 30406882 30621241 30919320 31443354
4307 31443354 31742669 31896015 32046246 32079892 32406220 32758599 32819626 32946313 33498332 33706474
4297 33706474 33962472 34316354 34579826 35082420 35285765 35490620 35762560 36016832 36367680
4288 36367680 36586341 37145244 37524971 37819831 38203768 38663201 39149402 39599466 40115862
4279 40115862 40631785 41412883 42166467 42542655 43042432 43627169 44293300 44865690 45338592
4270 45338592 46002332 46794319 47161821 47681851 48373005 49251603 50165929 50570973 51170673
4261 51170673 51773787 52459303 52964603 53210026 53671242 54175654 54532719 54987536 55429092
4252 55429092 55692026 56070143 56599064 57113031 57582635 57565682 57663289 57680771 57498423 57223074
4242 57223074 57138375 56653588 56160469 56030304 55254349 54524961 54020600 53668920 53032301 52257682
4232 52257682 51711951 51059628 50280076 49628431 48945273 48109075 47419141 46698768 45766029
4223 45766029 44781152 43924398 43059652 42165998 41333003 40581466 39658823 38890990 38261717
4214 38261717 37623228 36654079 35959155 35353503 34431819 33881628 33141240 32556959 32204538
4205 32204538 31819438 31514272 31440324 30851818 30355979 30040724 29795919 29133551 28790451 28613815
4195 28613815 28479685 28430276 28593441 28723573 28556569 28960302 29377614 29492956 30267148 30837349
4185 30837349 31128477 31485453 31663031 31667574 31351196 30923406 30282687 29563597 28642540 27826608
4175 27826608 26794440 25722427 24579036 23525409 22651245 21922053 21116093 20388825 19565484
4166 19565484 18850214 18362764 17749038 17119976 16448949 16175222 15811227 15189972 14865152
4157 14865152 14939536 14777299 14091333 14061545 13705368 13388848 13060014 12958444 12644473 12538329
4147 12538329 12298845 12316040 12123915 11788754 11824809 11489019 11294722 11365078 11167315 11137273
4137 11137273 11000270 10722101 10677989 10450306 10271793 10491244 10430907 10234562 10421187 10104403
4127 10104403 9826514 9928164 10380123 10271850 9980390 9731920 9755175 9768933 9615600 9625430
4117 9625430 9632679 9561241 9668310 9677399 9657084 9450009 9545207 9610487 9458187 9768654 9589391
4106 9589391 9369055 9453633 9449682 9302203 9425809 9504606 9250380 9173173 9307273 9343037 9069494
4095 9069494 9123313 9130534 9176555 8913323 8814121 8775146 8574413 8365594 8576639 8773784 8810395
4084 8810395 8592697 8591643 8674326 8540991 8184892 8127993 8213526 8287847 8271720 7893526 7881251
4073 7881251 8002010 7811087 7976920 7878410 7600816 7562708 7600292 7691637 7914258 8000295
4063 8000295 7922010 8203897 8195469 8584162 8795448 8612485 8705330 8948452 9016042 9081711 9438234
4052 9438234 9607261 9699932 10210345 10338820 10463401 10723413 10650055 10929477 11071649 11236505
4042 11236505 11419024 11454629 11221698 11031377 10856372 10650798 10411459 10572800 10433882 10056484
4032 10056484 9790637 9487197 9632953 9456929 9230859 9225276 9258496 9145153 9239530 8935782
4022 8935782 8866622 8992642 9012866 8851169 8799553 8442870 8523987 8522164 8267561 7910288 7994228
4011 7994228 8026100 7975162 7890816 7666777 7768092 7945829 7911595 7644803 7500709 7387016
4001 7387016 7271074 7479084 7512069 7563612 7555183 7698449 7716557 7670465 7593313 7489856 7380806
3990 7380806 7482884 7549190 7555139 7532333 7597638 7762177 7776274 7445266 7349870 7371762 7314924
3979 7314924 7690838 7935191 8009413 7911729 8078979 8289881 8401097 8157565 7964455 7806885
3969 7806885 7967071 7986020 7996315 8138537 8243313 8012942 8076226 8053027 8170838 8151924
3959 8151924 8204345 8193402 8256057 8107323 7992405 8204983 8291961 8178883 8179877 8217262 7900626
3948 7900626 7591401 7615120 7761072 7583606 7734513 7804372 7528517 7430333 7078742 7393020
3938 7393020 7546289 7511752 7595183 7471177 7373266 7419452 7242084 7192978 7330898 7395972 7080066
3927 7080066 7012877 6990792 7001589 7278779 7287584 7353869 7141498 7517709 7410154 7375551 7047074
3916 7047074 7016839 7148764 7246113 7121534 7088393 7100061 7242513 7140114 7184076 7423816
3906 7423816 7233381 7063387 7199116 7430243 7557423 7356968 7347940 7526001 7516201 7867695
3896 7867695 7718154 7800040 7701628 7984516 8145485 7922949 7769407 7947781 7949224 7850116
3886 7850116 8053768 8211606 8005314 8301134 8300115 8139836 8204030 7992020 8076846 8463883
3876 8463883 8496556 8431105 8409934 8537223 8816864 8804544 8670486 8768305 8918317 8871031 8977935
3865 8977935 8827499 8677577 8910345 9098657 9081763 9191381 9138242 8934997 9216359 9360732
3855 9360732 9230094 9106210 9107370 9357604 9489734 9418153 9229298 9361465 9357139 9295968 9564854
3844 9564854 9730013 9998903 9668555 9358183 9769330 9748803 9732170 9810776 10033878 10120262
3834 10120262 10188443 10312967 10467616 10457826 10158098 10428369 10509048 10639151 10640617 10380217
3824 10380217 10554848 10348695 10596545 10868151 11130890 11012452 10944878 11052690 11160166 11443942
3814 11443942 11521378 11300530 11555512 11573314 11691080 11665077 11662700 11845924 11653339 11857279
3804 11857279 12427744 12353072 12313127 12358435 12427024 12412766 12385958 12411678 12589743 12522572 12508046
3793 12508046 12798890 12962365 13062903 13100616 13304680 13656925 13820528 13934389 14131668 14166525
3783 14166525 14083790 14198460 14514116 14596380 14768379 14878292 14879084 15172871 15843097 16134797
3773 16134797 16335154 16136816 16377732 16793911 16929315 17026764 17360684 17685258 17806334 18103195
3763 18103195 18510429 18744240 18934676 19494670 19889255 20227321 20469394 20757981 21300276
3754 21300276 21513162 21947147 22298081 22806230 22992496 23321665 23614385 23988783 24517687
3745 24517687 24939488 25243746 25630993 25627577 26044967 26286110 26440491 26510157 26896507 27085687
3735 27085687 27252444 27237602 27313026 27428138 27391870 27455771 27570744 27984563 27992886 28064961 28071288
3724 28071288 27714034 27504608 27625622 27555133 27538066 27783080 27845106 27705714 27845374 27936496
3714 27936496 28017695 27677600 27715568 27822700 27962889 27928659 27970259 28303707 28586424 28648762
3704 28648762 28736697 28728745 28741075 28697918 28734185 28838532 29264671 29396655 29376281 29452173 29798821
3693 29798821 30185628 30204660 30372618 30395547 30751107 31105194 31325067 31688237 32168391 32329165
3683 32329165 32460432 33138801 33694766 34529133 35164554 35688511 36646328 37438170 38316235
3674 38316235 39597917 40657420 41996013 43410759 44742290 45979668 47605470 49010132
3666 49010132 50470545 52375100 54165951 55718878 57284514 58967992 60618529 62100595
3658 62100595 63557830 65301177 66913479 68525538 70203005 71536435 72689793 73556419
3650 73556419 74613258 75605851 75846770 76133010 76294337 76733974 76706541 76329981 76026196
3641 76026196 75462681 74597186 74013382 73449762 72157049 71154997 70152956 68740671 67854381
3632 67854381 66634017 65298821 63919099 62315903 60935813 59685888 58217796 56644041
3624 56644041 54995686 53686953 52478805 51189383 49852568 48957414 47852646 46488017
3616 46488017 45564815 44783585 44135852 43195306 43006879 42686581 42075065 41705755 41040186
3607 41040186 40948128 41029974 40839002 40810456 40416588 40488455 40527570 40718431 41142361 41149362 41202240
3596 41202240 41571803 41729673 41877977 42150176 42391596 42688622 43043116 43537479 44023465
3587 44023465 44500982 44386186 44733168 45485490 46230490 46721413 47648692 48066944 48334648
3578 48334648 49066114 49854023 50548215 51091454 51757949 52568011 53570696 54541878 55707041
3569 55707041 56757110 57626214 58811003 60176055 61658975 63287633 64890737 66516803
3561 66516803 68222503 70186801 71890319 73990070 76110300 78160995 79971646 82142548
3553 82142548 84059386 85701338 87425614 88879285 90246074 91589412 92975931 94150483
3545 94150483 95343443 96031255 96955449 97929348 98666600 99624194 100515677 100925400 101152122
3536 101152122 101567385 101690313 101660621 101499354 101001750 100641083 100359078 99733661 99339681
3527 99339681 98598404 97952390 97838154 97485776 97315464 97322982 97444670 98028888 98839566 99680901
3517 99680901 100603145 101644382 102794067 104077446 105341278 106954719 108675418 110368938
3509 110368938 112268138 114474629 116774979 118998000 121509499 124294045 127156745 130288986
3501 130288986 133604341 137305971 141434820 145874640 150479619 155232529 160641374 166263036
3493 166263036 172484100 178760721 185288699 191426611 198030325 204381654 210783726 217024953
3485 217024953 222669212 227727455 232398732 236673293 240146484 243775470 246763548 249501325
3477 249501325 251847881 254012107 256045606 257649307 259710662 261523836 262802954 264177496
3469 264177496 265240431 266105564 266944896 267780076 268374908 269426975 270844521 271867501 272738321
3460 272738321 274381883 276229751 278068372 280211409 281951348 282621909 281798970 280478556
3452 280478556 278459657 275683704 272959308 269040159 264326608 259811334 255275896 250412161
3444 250412161 245498854 240602062 235617819 230974586 226472361 221537106 216686507 212215392
3436 212215392 207676960 202946331 197949932 192992148 188234954 183569183 178773818 174582647
3428 174582647 170994177 167517011 164800959 162555606 159836076 155296311 149805263 144208621
3420 144208621 138911452 134036634 129032179 123064476 117587166 112903508 108773544 105262249
3412 105262249 101932004 98865407 96369867 94160121 91964320 90283156 88746840 87114046
3404 87114046 85872469 84898253 83934366 82972028 82233392 81905861 81476220 81307748 81416963
3395 81416963 81820007 82590138 83430326 83844452 83616583 83014499 82063260 81244648 80904889
3386 80904889 80204759 79191200 78002070 77435678 77246323 77018834 76555729 76615283 76688785
3377 76688785 76612140 76207069 76474711 76686075 76622942 77031968 77537378 77948532 78357718 79048445
3367 79048445 79686235 80625111 81355917 82372433 83686407 84852472 85998916 87769579 89533121
3358 89533121 91461746 93296111 94913896 96497127 98089326 99724411 101318183 102867112
3350 102867112 104222176 105521483 106254480 107136402 107985202 108298924 109129773 110044820 110775256
3341 110775256 111701203 112762127 113602930 114366775 115370686 116655343 117830330 118739806 119775841
3332 119775841 120817899 121982018 122873612 123565942 124594106 125260352 125606128 126260809 126579892
3323 126579892 126568421 126658965 126754324 126566342 125991443 125431377 124755584 124058455 123360238 122450498
3313 122450498 121222124 119992127 118465082 116759563 114846033 112352440 110136523 107800727
3305 107800727 104865820 101609657 98769863 95713834 92586176 89278930 86271741 83394213
3297 83394213 80552797 77752205 75182120 73024933 70646281 68830308 67185647 65603152
3289 65603152 64276440 63148441 62063681 61048899 60388876 59816995 59509134 59455450 59259130
3280 59259130 58860133 58711641 58572884 58110138 58054623 58146184 57759653 57393702 57544035 57067507
3270 57067507 56450881 56416774 56231176 55550306 55256977 54679027 54194283 53600931 52859446 52154861
3260 52154861 51250111 50447893 49645316 48863374 47854312 46365314 45562279 44715346 43570944
3251 43570944 42320296 41127179 40093764 38825562 37595139 36411754 35330078 34072673
3243 34072673 32984051 32307821 31724089 30520536 29850382 29036512 28122282 27326232 26666429
3234 26666429 26276512 25831463 25282485 24701047 24302655 24061392 23691696 23396394 23402736 23344509
3224 23344509 23165880 22852029 22575849 22545917 22468941 22248732 22348179 22560119 22172021 22222812
3214 22222812 22345544 22684547 22720773 22598465 22700538 22738499 23019313 23139894 23219283 23268751
3204 23268751 23427831 23185144 23139510 22782757 22410199 22523346 22485556 22229569 22112820 21906249
3194 21906249 21753034 21605787 21717121 21297081 21158942 21286826 21076608 21070207 20933822 20920399
3184 20920399 20752801 20695180 20670837 20919476 21148159 21286864 21187224 21073070 21041286 21509464
3174 21509464 21812574 21913690 22183004 22392761 22852831 22837384 22935238 23158146 23470400 23918870
3164 23918870 24003579 24599789 25272203 25652289 25958358 26305782 26648304 27123226 27667578 28078796
3154 28078796 28347133 28895127 29455287 30171949 30886298 31684096 32485066 33230853 34080968
3145 34080968 35148935 36432079 37269042 38377726 39308941 40500677 41919532 43352047
3137 43352047 44588640 45930461 47195146 48631396 50156007 51525480 53426100 55404902
3129 55404902 57108138 58858021 60768422 62599093 64520930 67036666 69660867 72026674
3121 72026674 74793875 77964164 81492569 84758600 88216027 92043866 96213034 100517321
3113 100517321 104804478 109297036 113835634 118611896 124043572 129753777 135583116 142121193
3105 142121193 149086555 156293634 164176567 172673898 181739873 191830054 202742974 214798376
3097 214798376 227392692 240811840 255069092 269930904 285823358 302501786 319628573
3090 319628573 337259145 355045479 372007483 386486419 398377810 408919397 418257770
3083 418257770 425890979 431239398 433474538 431962742 425879263 416391390 404186028 389983317
3075 389983317 374294835 357696804 340569178 323486684 307254048 292106022 278390079
3068 278390079 265884794 254428894 244145093 234661466 225969402 217517018 209104581 201484064
3060 201484064 193904570 186604199 179562199 173008952 166743976 161360747 156511004 152527182
3052 152527182 149006492 146298530 144875975 143897614 143221460 143402732 143448944 142319992 139903180
3043 139903180 136359172 131878234 126661997 120850382 115209870 108683899 102237272 96376242
3035 96376242 90785779 85760665 81093296 77144819 73474513 69756172 66406157 63318744
3027 63318744 60706557 58027840 55337297 53273454 51111932 49175515 47495887 45739405
3019 45739405 43864863 42252061 40509803 39166172 38074389 37098109 35857057 34704093
3011 34704093 33729792 32821058 31709865 30536372 29868359 29151315 28117454 27400839 26955909
3002 26955909 26470661 25776963 24990515 24456749 23896621 23269736 22833749 22254182 21953177
2993 21953177 21533100 20988128 20645955 20127606 19717633 19538657 19036173 18818878 18222031
2984 18222031 17769963 17753215 17529369 17069560 16657494 16150321 15826109 15802697 15335294 15073089
2974 15073089 14818153 14374325 14184184 13830140 13198660 13079262 12997108 12735099 12270953 12151678
2964 12151678 12155116 11945265 11730122 11499600 11373034 11211901 11112103 11115111 10907346 10607884
2954 10607884 10568047 10366262 10283488 9892372 9787925 9621916 9465672 9621308 9582518 9478609
2944 9478609 9171010 8993281 8968901 8928675 8642130 8406117 8073893 8533084 8465901 8043099
2934 8043099 7975296 7756679 7947092 7567894 7346737 7464247 7328326 7312380 7204776 7149885
2924 7149885 6735796 6870696 7005724 7242107 7196569 6581263 6682524 6787463 6586291 6495754
2914 6495754 6403288 6466255 6190544 5923669 5640758 5577911 5658255 5473017 5317276 5306234
2904 5306234 5363146 5231866 5065569 5200952 5141065 4983059 4853492 4677331 4935087 4841851
2894 4841851 4756083 4635436 4262229 4405969 4411490 4400427 4430998 4371024 4162634 4175940 4366405
2883 4366405 4669312 4489328 4027105 4251837 4252965 4096411 4267201 4101656 3683116 3875962
2873 3875962 3857197 3882650 3976560 4113883 3882245 3835911 3892752 3864744 3736845 3646903 3651787
2862 3651787 3732920 3888681 3432308 3387018 3550612 3364680 3387541 3378740 3527861 3505858 3755889
2851 3755889 3413589 3236603 3444016 3670007 3654739 3542171 3662750 3613380 3635896 3559739
2841 3559739 3622467 3413971 3394412 3510507 3225102 3073845 3339237 3335744 3367146 3498039
2831 3498039 3132937 3083969 3303684 3423435 3484168 3489217 3420724 3751807 3798600 3790362 3868405
2820 3868405 3886463 3742685 3712814 3737034 3823266 3808597 3742487 3991079 4063376 4012588 3980153
2809 3980153 4087353 4320847 4481808 4386517 4568594 4714322 4713672 4625438 5095870 5045549 5016256
2798 5016256 4985790 4948427 4653323 4495240 4431489 4325123 4339334 4267549 4134654 4060837 4120289
2787 4120289 4039584 4130150 3895023 3850968 3903936 3619179 3458771 3266821 3488903 3562441
2777 3562441 3452292 3343516 3320217 3249197 3043304 3078366 3106707 3063990 3083011 3019190 3214430
2766 3214430 3427443 3285258 2889936 2778122 2947603 2910339 2816189 2806258 2528473 2567562
2756 2567562 2709587 2637594 2605100 2761541 2731906 2287186 2298953 2359630 2422812 2757021 2904937
2745 2904937 2844955 2631862 2281799 2318051 2328015 2393340 2273801 2199643 2134507 2141120 2191256
2734 2191256 2351298 2407820 2161987 2042706 2123592 2167523 2092413 2120633 1991880 2114209
2724 2114209 2449105 2396188 2398594 2079761 2329746 2295440 2262654 2212509 2240180 2222024 2405089
2713 2405089 2565337 2386680 2272315 2067113 2207220 2035481 2064256 2194070 2176617 1954822
2703 1954822 2030286 2108876 2116790 2148974 2129046 1874974 1994517 1911827 2202738 2353767 2086606
2692 2086606 1953165 2074024 1994505 1794315 1907082 2001904 2070859 2018155 2033984 2165541
2682 2165541 2103550 1972144 2157894 1911742 1962828 2181936 2277798 1953565 2091955 1999703
2672 1999703 1931521 1914311 1738244 1732352 2158328 2083883 1877939 1998181 2120127 2122163 1875296
2661 1875296 1795912 1754317 1781686 1878166 1778976 1760067 1956410 1854300 1711336 1442912 1711739
2650 1711739 1851539 1857940 2052381 1875376 1954142 2146796 1938856 2132418 1991662 1860817
2640 1860817 1871512 1930560 1807318 1855506 1863802 2010639 1827794 1747440 1828493 1863864 1825734
2629 1825734 1769685 2032923 2168250 1957539 1859472 2112093 1953089 1689563 1771053 1819138
2619 1819138 1956702 1974496 1789558 2238101 2046501 1849768 2026316 1946049 2052565 1952608
2609 1952608 1972552 2354612 2501450 2376519 2400430 2647704 2482112 2321555 2123474 1947892
2599 1947892 2029466 1960193 2139102 2163260 1851650 1976956 2126039 1930510 1694677 1631581
2589 1631581 1560304 1377606 1549831 1629576 1557951 1733263 1555504 1323809 1541295 1997271
2579 1997271 2147969 2009346 1780894 1524719 1872746 1929090 1523842 1579489 1658208 1698258
2569 1698258 1856862 1946584 1967216 1978228 1997913 1960346 1725426 1728231 1623262 1522312 1575893
2558 1575893 1654487 1597737 1494298 1709959 2029517 1708734 1773894 1700669 1639000 1478820
2548 1478820 1380391 1492479 1525123 1691383 1529214 1440946 1263653 1504988 1801470 1947474
2538 1947474 1693051 1680618 1782504 1982515 2016424 1923849 1689698 1838404 1729226 1424417
2528 1424417 1613284 1603122 1676038 1799675 2050837 1865786 2048352 2144484 2048879 2009067
2518 2009067 1876248 1697646 1542797 1442231 1387193 1492586 1683023 1780589 1566378 1550417
2508 1550417 1748295 1844201 1800969 1777576 1898375 2105258 2126650 1985299 1777643 1960068
2498 1960068 2097668 2178048 2036436 1914066 1970006 1968040 1724478 1604912 1928948 1820081
2488 1820081 1683047 1945668 2122778 2290289 2038193 1915548 1850154 1860243 1945330 1987288
2478 1987288 2098089 2218503 1980893 2137292 2118981 1842776 1883716 1815317 1842915 1884568
2468 1884568 2124738 2012979 2075954 2076700 1894061 1914227 1948672 1895042 1815699 1977430 2194641
2457 2194641 2060547 1713380 1742064 2094767 2068938 1965013 1952991 1765653 1752678 1886789
2447 1886789 2012805 2537287 2174652 2098460 2377511 2422105 2630251 2340215 2526140 2365570
2437 2365570 2152734 2253745 2307962 2268433 2295092 2321906 2141400 2309116 2546319 2646282
2427 2646282 2582812 2425037 2484146 2810297 2749787 2675716 2994644 3036189 2768429 2861503 2591439
2416 2591439 2859349 2922501 2700895 2910736 3129702 3012387 2922365 3029576 3220245 3191172
2406 3191172 3366922 3492228 3650382 3664486 3602259 3605870 3450366 3598525 3861682 3772612
2396 3772612 3567454 3889503 3983663 4186531 4359881 4536884 4584516 4649274 4863351 5347264
2386 5347264 5476573 5666264 5692916 5511795 5746597 6090867 6170629 6454371 6918272 7137015
2376 7137015 7315631 8063581 8424550 8637636 9002755 9489601 10170189 10775919 11457137 12159137
2366 12159137 13075558 13983775 14742513 15646489 16728864 17867832 19402527 21128881 22939937
2357 22939937 25086710 27361524 29832852 32057023 34711326 37774139 41303903 45644656
2349 45644656 50276357 55882600 61881334 68823380 78076146 88891605 101552899 117784398
2341 117784398 133061351 139623484 135337257 127975391 121710473 116184480 111484665 100879665
2333 100879665 87232928 77252558 69457282 62583397 56499265 51856010 48264056 45211526
2325 45211526 42297018 39435805 36635124 34144263 31930669 29829167 27244075 24961450
2317 24961450 22901698 21236167 19786826 18561895 17303048 16192415 15347898 14705668
2309 14705668 14066973 13368338 12487611 12045724 11556034 10921766 10642526 9855114 9618177
2300 9618177 9265972 8999226 8717741 8303720 8202134 8049262 7658706 7041766 6788432 6792567
2290 6792567 6685086 6377635 5826057 5881755 5819830 5678670 5509714 5586808 5323501 4940465
2280 4940465 4812190 5086159 5025858 4662625 4590458 4519645 4444124 4644510 4319503 3974028
2270 3974028 4003239 3883444 3962963 3772426 3543181 3640760 3643379 3501745 3343148 3466251
2260 3466251 3460056 3324444 3188835 3306564 3067276 2864999 2988878 3050618 2771486 2661882
2250 2661882 3006311 3053748 2641975 2985126 2880076 2377100 2594646 2535527 2471358 2424889
2240 2424889 2432808 2458660 2771179 2515062 2261302 2297390 2395334 2418878 2347649 2312913 2279766
2229 2279766 2292754 2362070 2401325 2211370 1900472 1716832 2075496 2120227 2013426 2245316
2219 2245316 2059678 2068324 2035741 2389462 2148998 2036171 1951335 1844294 1968107 2152114
2209 2152114 2025753 1784289 2047990 2013351 1974397 1899571 1865730 1649307 1672208 1884870
2199 1884870 1742583 1736554 1646261 1600924 1547744 1658438 1871027 2118695 1808050 1857416 2174941
2188 2174941 2109783 1879208 1884326 1779623 1534114 1619473 1824821 1722893 1630039 1669801 1682551
2177 1682551 1807567 1835174 1645146 1529111 1675458 1839290 1786353 1752050 1788579 1725279
2167 1725279 1281621 1482283 1667497 1785261 1616196 1537327 1550769 1522231 1491964 1601895
2157 1601895 1684975 1152809 1420603 1708828 1686585 1530558 1860179 1831669 1776624 1861950
2147 1861950 1766357 1747188 1656015 1343373 1444844 1668306 1977841 1789053 1606249 1575099
2137 1575099 1537273 1529262 1530473 1559152 1396442 1347009 1390946 1355457 1525219 1304339 1238850
2126 1238850 1353936 1638639 1837218 1807307 1580380 1295973 1420301 1345376 1379748 1583993
2116 1583993 1635607 1739871 1617328 1566126 1627224 1694654 1715937 1612686 1509780 1574889 1347352
2105 1347352 1409767 1069321 1249108 1280337 1097844 1275177 1137199 1157341 1214172 1374521
2095 1374521 1619949 1539402 1418968 1430000 1632448 1416552 1377529 1595318 1433592 1555949
2085 1555949 1718265 1788385 1654627 1756730 1706468 1841539 1641116 1641168 1806028 2015390 2178124
2074 2178124 2338350 2000702 2071059 2166888 1934639 2177411 1943748 1882467 2172334 1913070
2064 1913070 1501258 1677978 1879077 1500256 1510997 1555532 1382827 1678243 1467827 1391678
2054 1391678 1727871 1850750 1841670 1795024 1406239 1348994 1576527 1587621 1447340 1567367
2044 1567367 1769092 1718291 1786353 1771931 1893756 1740730 1485317 1686089 2016997 1745125
2034 1745125 1602341 1481838 1405309 1419213 1592029 1595255 1431681 1549183 1424219 1242842
2024 1242842 1634676 1598180 1519885 1400944 1255241 914730 1067520 1179760 1373138 1325332
2014 1325332 1198756 1158382 1186186 1277688 1245349 1512009 1454799 1679937 1506013 1519629 1778358
2003 1778358 1733286 1694098 1629642 1522665 1440394 1441785 1421397 1540859 1526386 1314629 1280977
1992 1280977 1402399 1608489 1562880 1643140 1608071 1497855 1654837 1818492 1477291 1182996
1982 1182996 1289396 1431422 1410446 1160513 1293416 1372343 1463536 1584907 1525620 1297896
1972 1297896 1167962 1289993 1088166 1312207 1373950 1415229 1192957 1204221 1270722 1522691
1962 1522691 1453023 1416302 1378620 1140171 1365349 1509432 1646064 1530155 1543483 1421499
1952 1421499 1415771 1483426 1477526 1430595 1490899 1241097 1381070 1240852 1274576 1348603 1127660
1941 1127660 1241766 1275309 1230148 1410011 1555395 1496370 1464894 1598666 1661991 1358580
1931 1358580 1111043 858502 1280322 1170671 1204469 1411931 1414746 1249340 1206485 1171277
1921 1171277 1149548 1466219 1407525 1675165 1503750 1556415 1628374 1588951 1856472 1579620
1911 1579620 1478980 1739685 1471438 1342080 1440451 1388514 1639245 1411681 1191695 1310664
1901 1310664 1307242 1427926 1430092 1229393 1382257 1686291 1774005 1425102 1407754 1309405 1239150
1890 1239150 1325566 1280449 1283622 1348591 1267510 1307454 1309509 1469044 1447120 1312584 1372699
1879 1372699 1386062 1331579 1479061 1488312 1167069 948737 1167886 1166553 1330136 1316409 1222637
1868 1222637 1280542 1234002 1166368 1083753 1242941 1239314 1256275 1120034 939043 1301035 1301223
1857 1301223 1184959 1221682 1620211 1497456 1336337 1345085 1510709 1515708 1201411 1267260 1274640
1846 1274640 1419267 994833 1204146 1187351 998419 1085694 1400778 1493556 1430276 1445165
1836 1445165 1612685 1696405 1753863 1745118 1437825 1164422 1099384 976759 1183598 1179291 1193008
1825 1193008 992102 1028727 1099336 1319792 1267011 1359746 1215411 1421179 1570583 1147400
1815 1147400 1092181 1278691 1424563 1389724 1350198 1317113 1272008 1318243 1323375 1265066 1307427
1804 1307427 1463135 1329492 1342727 1207046 1415197 1217734 1190670 1169261 1191391 1438308
1794 1438308 1527049 1393811 1212831 1498714 1585819 1541409 1271208 1342944 1355028 1248348
1784 1248348 1104151 1372001 1282830 1458019 1372893 1385757 1437813 1320592 1470973 1407349
1774 1407349 1255736 1376248 1461481 1513375 1319810 1477268 1534615 1598960 1449397 1378363
1764 1378363 1130286 1337439 1520264 1418800 1203998 1226122 1212574 1114531 1465346 1360807
1754 1360807 1045898 896227 1342643 1393521 1302178 1436552 1545723 1608662 1417644 1202483
1744 1202483 1236730 1128088 1248923 1410687 1221074 1201924 1161010 1154549 1161339 1347363 1527598
1733 1527598 1187122 1260489 1301968 1384597 1637071 1359601 1344229 1513325 1483556 1210965
1723 1210965 1581682 1480437 1368919 1462617 1374676 1153438 1008147 997672 1190897 1451555
1713 1451555 1354735 1435229 1352330 1357738 1349571 1337427 1288116 1032651 1239903 1471696 1496030
1702 1496030 1351620 1480767 1471388 1419555 1300024 1178021 1150412 1223084 1225869 1228619 1435955
1691 1435955 1306093 1281917 1259183 1444020 1384591 1340523 1367387 1398013 1324385 1385623 1159960
1680 1159960 1242560 1249519 1356890 1442510 1485956 1500406 1416522 1437339 1458161 1249659 1175051
1669 1175051 1306644 1214341 1297590 1209876 1121061 1154905 1412211 1676144 1481422 1324567
1659 1324567 1310720 1230639 1238575 1483411 1627630 1669722 1850462 1573510 1422316 1563760
1649 1563760 1581137 1687242 1772120 1650352 1407228 1270569 1361681 1371878 1234387 1168640
1639 1168640 1285454 1607299 1548554 1350292 1499880 1648924 1538085 1317588 1331657 1278161
1629 1278161 1139498 1393073 1650554 1446371 1288050 1355338 1394267 1405706 1439881 1297194
1619 1297194 1075912 1087897 1278011 1252672 1118087 1097755 1144509 1296801 1406074 1489081
1609 1489081 1568442 1535918 1575821 1466273 1502389 1432801 1189573 1066978 1059333 1203777 1223019
1598 1223019 1394566 1231899 1147138 1155990 1179137 1315684 1053342 1060913 1260512 1304041 1477332
1587 1477332 1243280 1309420 1462796 1297372 1025718 1139665 1298422 1203377 770097 1046620
1577 1046620 1077937 1325601 1576506 1577516 1477417 1179709 1178059 1182921 1273573 1069504 1334870
1566 1334870 1357449 1388263 1277951 1265420 1379594 1107777 1080414 1199202 1192502 1386482 1385414
1555 1385414 1519400 1742039 1777541 1656276 1408114 1434114 1333530 1343916 1445479 1311675
1545 1311675 1232387 1399765 1338288 1337109 1269597 1150591 1013938 1064089 1234810 1132789 1070329
1534 1070329 1194512 1437827 1251651 1489440 1402983 1442074 1311763 1300726 1196856 1226094
1524 1226094 1219288 1262094 1005202 1029132 1322148 1364678 1367897 1194237 1454707 1553018 1276100
1513 1276100 1400639 1407865 1178786 1200215 1370570 1364565 1227942 976917 1302269 1344562 1200131
1502 1200131 1060295 1213952 1245380 1010905 1186859 1283691 1293500 1106142 887111 888391 1102328
1491 1102328 940758 983945 1205882 1299931 1012315 1085055 1422500 1380854 1309996 1073059
1481 1073059 1137180 1270856 1091550 1268662 1219307 996407 945708 1110480 1328862 1344277
1471 1344277 1151301 1119627 1120732 1180426 950836 1095485 1050026 1122684 1430089 1573458 1497092
1460 1497092 1141688 902923 1209466 1107647 924086 1249904 1205398 1098527 1004148 923458
1450 923458 1166790 1241645 887575 788964 1106276 1039213 1239125 1263035 1302102 1186722 1265246
1439 1265246 1118647 926136 1123101 1416286 1104538 988666 1035278 1122507 1212596 975351
1429 975351 933046 890878 880449 1092762 1064440 1207897 1372505 1320024 1290529 1182775 1277807
1418 1277807 1145607 1133007 1186366 1233842 1104804 1271086 1279854 1337147 1165665 996426 1130306
1407 1130306 1350063 1062034 991913 1019872 1105334 1172476 1144300 1316417 1489874 1451933 1390804
1396 1390804 1206509 1414227 1573902 1551570 1260407 1117714 1265470 1160209 932832 961289
1386 961289 1087216 983253 1064088 998773 1154075 1207002 1079688 1184148 1407839 1424227
1376 1424227 1307855 1296731 1155825 1002965 1025779 1372899 1359841 1220037 1151591 1151731 1176284
1365 1176284 1352058 1343799 1289372 1293045 1019353 1351728 1327211 1232092 1420140 1422975 1641623
1354 1641623 1551539 1652703 1817527 1646176 1452014 1150956 1085923 1221357 1318984 1277549
1344 1277549 1471666 1426473 1308365 1318587 1112675 1136538 1007576 1162808 1675215 1665781
1334 1665781 1350882 1323081 1385473 1505912 1429938 1150983 928143 1045998 1258257 1423323
1324 1423323 1368532 1383947 1530683 1554679 1459913 1521190 1565535 1717674 1458794 1221446 1361820
1313 1361820 1381661 1131004 1225234 1407190 1044411 1133218 1477074 1517387 1291590 1219629
1303 1219629 1202966 1226879 1186633 1494754 1568426 1369643 1248306 1385313 1176728 1111325
1293 1111325 1361575 1177246 1030408 1036135 998775 1111652 1147944 1417865 1365198 1259680
1283 1259680 1097015 1215720 1505128 1323649 944889 908361 848487 1029650 1275210 1274113
1273 1274113 1367052 1356561 1241270 1128488 1291167 1462389 1523213 1513243 1364926 1465229
1263 1465229 1163163 1151865 1301477 1369735 1409996 1327471 1369338 1444485 1219599 948863 1087464
1252 1087464 1168946 1050886 1088409 1174141 1245000 1344366 1379985 1363711 1172478 1057843 1026931
1241 1026931 1251897 1279753 1123849 1004002 1166099 1042914 802991 869720 1268778 1341056
1231 1341056 1252609 1162880 1149134 1056142 769075 595838 901895 953107 985899 1011169 1194832
1220 1194832 1183866 1174633 1184596 1349074 1196057 1285456 1300735 1059549 979294 1140310 1292688
1209 1292688 1191323 1268465 1042186 1227771 1281254 1222987 1308784 1218891 1190938 1114682 1015609
1198 1015609 1135602 1090008 1197672 1280543 1336139 1108684 1183920 1226822 1143838 1255947 1338801
1187 1338801 1259719 1262266 1060540 1024145 1074058 1066141 1050027 892965 1011105 1393094 1467156
1176 1467156 1427439 1303766 1082969 885802 891106 1144716 1321169 1411200 1279343 1174390
1166 1174390 1326627 1453695 1088373 1075502 1136993 1164017 1174781 1343719 1312198 1328922 1286816
1155 1286816 1218695 1229390 1247415 1204735 1183699 1090487 1092320 1191452 1297028 1185633 1062034
1144 1062034 1004370 1370137 1409330 1417900 1388602 1337186 1372081 1106605 1064872 890584 1137086
1133 1137086 1328373 1371385 1200580 1190836 1304598 1398552 1278246 1168978 1477900 1747858
1123 1747858 1429906 1494260 1490754 1039214 901820 1064042 1208699 1290819 1174731 1081160
1113 1081160 1218030 1247014 1141723 1307536 1480200 1218558 1105169 1221694 1049711 728610
1103 728610 739655 988920 893644 892528 844381 1257859 1195637 1107476 1221025 1390847 1249841
1092 1249841 915741 827232 729872 663719 860026 970208 1142819 1461926 1207685 1220750
1082 1220750 1129048 1046105 1086242 1180861 1024203 1010238 1018491 1219788 1224071 1218701 1026918
1071 1026918 1009106 1175893 707457 588120 1067062 1272140 1257650 847077 486422 760025
1061 760025 1083600 1073243 1005314 929067 810998 1042068 1207747 1145373 1001815 961061 817348
1050 817348 635430 941007 730991 721851 1041282 1143941 1220071 949473 917847 939115 963634
1039 963634 1223364 1190915 1246882 1145218 1207277 1217755 1107674 1165098 1235850 1550127 1385784
1028 1385784 1338788 1027759 1053611 1150045 1171814 1189423 964534 896215 1291617 1391893 1120367
1017 1120367 1060280 937682 816926 829599 1017802 1002344 1009409 857824 938955 1058379 987626
1006 987626 987033 1068127 1229600 1305335 1085572 1123036 1038979 927317 1089339 1200322 1154471
995 1154471 1123938 1232319 1120761 811355 879407 797361 1201431 1327206 1201950 1277273
985 1277273 834024 945880 1067395 1094203 1054447 1098643 865975 806512 729893 964688 1115939
974 1115939 1232521 1071360 903059 1016193 868279 848188 948161 947063 871294 669709 818644
963 818644 810967 832301 871130 761746 1011654 1018335 1206896 1179384 1062984 1132111 1049795
952 1049795 959742 1071199 1127839 1269413 1216948 1345764 1302254 1172703 1061136 1018613 836084
941 836084 1046860 992148 893240 805365 714484 837097 1113465 1023381 1015910 1219494 1041878
930 1041878 1047995 1149701 954813 723445 653575 793568 1061560 1152202 1086370 1301797 1268225
919 1268225 1116864 1142819 1028084 1108984 1199573 1354255 1187533 1007536 964811 1139117
909 1139117 1036064 967655 924891 758669 658300 1112566 893482 813818 846532 1068859
899 1068859 1358610 1549632 1120331 967005 1091642 1147447 1366992 1237886 1271490 962603
889 962603 711589 911387 1317542 1442599 1189358 989844 972167 931664 1030220 1029139 1215870
878 1215870 1279854 1165314 1066802 1236279 1490531 1156504 1136945 1414270 1189353 1067510
868 1067510 1083765 1047112 1272280 1367769 1040634 891754 808524 958675 1217820 1080638
858 1080638 919461 909261 1115521 1021775 953824 1129643 1237299 1045067 1107948 1582340
848 1582340 1369791 1238709 994594 896931 902234 963645 1033079 828036 910120 944292 1030528
837 1030528 1211690 1321434 1191032 1139635 1297373 900040 978922 1249845 1414065 1113764
827 1113764 1019634 998955 985657 842708 729966 976793 1045366 1018718 893463 986387 1040032
816 1040032 1181594 1278594 1038472 1121844 1131365 1176181 1172722 1286724 1219336 1128858 736010
805 736010 398095 688653 1113875 1164390 1123157 1112088 954797 890162 882213 1078410 836407
794 836407 764814 769680 976973 843281 945101 1138218 1446117 1280833 1125719 1262463
784 1262463 1284988 1206433 1317886 1228144 1308244 1237154 1118161 856693 574230 884274 986435
773 986435 844816 1100685 967923 1035694 1158887 1220130 1173762 1160685 1038094 946589 968373
762 968373 873020 1035757 939988 1103119 1017857 1064608 1328904 1228311 1217943 1157703 1159021
751 1159021 964717 598940 672614 501479 739068 846658 760763 841298 834327 1108694 885164
740 885164 744097 897297 941513 1014197 922927 980200 896613 1031438 792795 706156 669519
729 669519 744624 1008486 1261928 1029339 1188319 1287758 1047588 989329 1144873 1158171 1138947
718 1138947 1095471 859654 950526 856858 854103 560844 588107 769203 763788 891746 682360
707 682360 639580 882559 851873 934898 1037667 1004662 931286 1009838 1029115 846139 1019168
696 1019168 917457 951184 890623 1074929 1222067 1195102 891883 992044 1179133 1041897
686 1041897 943346 925917 1150606 1081784 1041405 921918 962277 1045697 1113201 999701 1031888
675 1031888 912342 681168 586679 660735 497335 822840 933845 823968 1081906 1157719
665 1157719 1204943 1055021 919899 932883 924203 849863 600955 804003 906447 563269 604704
654 604704 787902 723769 942921 1027314 1013499 1137512 788237 916702 1233383 1084859
644 1084859 953893 978644 994537 1127672 1092982 957501 1164870 1273439 1116669 1079155
634 1079155 907175 1053854 825165 822393 994249 924217 995878 1029983 919645 870674 974753
623 974753 956985 717684 614270 711739 942707 749957 748381 1173512 1182190 1019642 1118982
612 1118982 1010002 505791 824837 1012251 982144 684994 798892 657971 803795 757248
602 757248 713952 751470 809679 891743 853012 696997 741120 946010 858206 937295 1053379
591 1053379 1087090 933947 950230 1032879 1044135 1186062 995356 885512 719560 568312
581 568312 858545 785666 813101 872272 844473 874035 776921 743773 799071 686685 794492
570 794492 1151263 1082114 1131570 788305 672676 932565 772234 798358 594976 651721 958101
559 958101 1000953 737385 809899 899954 644265 572502 967683 889505 724084 917154 1176567
548 1176567 1060845 1067457 1331397 1094778 957541 739649 551887 976795 1040534 1003790
538 1003790 828645 719576 803701 632745 628025 544889 759116 832146 656968 606763 936190
527 936190 1082287 765100 560214 354207 740532 766873 1044712 941170 544838 319355
517 319355 488080 335151 445806 789131 743733 598362 758378 1051105 802438 759057
507 759057 790760 627366 779287 768820 488020 499884 605857 726276 600605 541609 551704
496 551704 740658 832002 914390 799975 1051765 763610 780355 836366 885198 594770 11786
485 11786 199294 537445 927958 965916 995732 1094806 940931 791376 478886 550202 822914
474 822914 687575 816971 882236 877704 828499 623929 596733 725635 699691 751529 824316
463 824316 968610 823239 725963 901906 817356 775765 922065 903593 714681 897696 920467
452 920467 601911 683775 496101 329596 526906 637010 963294 903905 419574 230605
442 230605 349180 580425 818235 773755 560354 647285 678163 1011375 967342 704559 607060
431 607060 401781 598418 448324 564486 694944 572715 847764 898539 658385 432885
421 432885 413707 602996 485617 594620 591784 432797 503388 861619 748274 700940 724421
410 724421 505521 687751 547968 509142 394259 489926 761397 628102 686692 892128
400 892128 906119 607265 606916 725523 466611 478421 510476 477161 108212 197637 394138
389 394138 240847 431567 556975 564591 660079 517708 367789 478816 363103 444579 454748
378 454748 492617 657206 776226 697056 659239 359145 477142 642209 752784 618161
368 618161 567980 579396 552296 663271 708706 768886 403124 450471 591486 556071 774063
357 774063 507211 485263 600355 629857 719094 522808 432620 492714 539441 571906 785241
346 785241 517062 367728 513055 572070 566423 510718 436080 285105 527287 396203 677394
335 677394 476878 231227 605657 510597 489168 285194 522182 585776 451778 490980 546681
324 546681 877193 675343 390216 545967 560672 691422 760349 609308 575951 850993
314 850993 847224 499727 482802 806891 799084 693153 590743 569963 562510 555870 319855 162771
302 162771 285242 437128 384324 609202 311053 292008 721956 824062 930864 861034
292 861034 510632 471856 566568 500170 242521 412702 464880 546229 440909 457107 381191
281 381191 487091 548818 281555 121726 220568 276919 250983 386589 301185 79016 157822
270 157822 313477 260523 214015 135114 76307 185198 246051 430386 237866 528487 565170
259 565170 345672 378973 90704 84210 219358 251823 21542 -119044 -9819 259554 462608
248 462608 442044 356652 222450 232061 696093 311589 262901 278222 446182 667123 572607
237 572607 253027 225486 341699 213482 305829 199842 282079 597048 493613 423401 287223
226 287223 646814 540202 659629 551813 294946 133837 528111 841057 564697 393471
216 393471 416159 500961 483160 650659 616571 310349 257685 256426 292289 259873 447831
205 447831 495358 724221 440420 221819 186173 183270 15904 191585 317115 427403 427450
194 427450 358442 348422 199060 263618 420631 459333 578254 528310 490086 549366 359783
183 359783 177328 111081 142459 146007 377540 428979 529588 407748 303769 345999 511282
172 511282 206241 166624 273503 457322 436344 533839 519315 339086 324969 396572 277017
161 277017 674907 505380 242098 45194 106320 261062 201908 133312 147184 164563 148448
150 148448 247056 171858 74807 166411 250234 280538 56352 227854 100855 -15647 -192203
139 -192203 -55862 100460 121900 184113 45613 -42347 -92030 4466 19159 19891 -60538 34181
127 34181 68081 34665 189709 -76891 93630 238322 78285 133939 93283 178851 275914
116 275914 359137 366162 356718 226875 114114 22212 72478 -3270 2748 34553 90268 241747
104 241747 251553 117087 63959 197568 293823 250980 83274 6910 216852 168560 90049
93 90049 94693 161399 -123218 -37216 -27257 -36754 -53907 50120 -10621 -250603 -128621 95717
81 95717 -7044 -226799 -265498 -207124 -173619 -198145 -88806 -131764 -103310 -292668 -119919
70 -119919 95203 -84430 -224770 -270995 -388937 -222440 -122602 -112791 -69684 -118225 -180238
59 -180238 -30271 227373 6674 -88247 -305255 -325910 -113688 -92752 -96795 -9385 43755
48 43755 211123 77607 -223561 -146943 39408 42601 2301 34954 -189632 -89915 -83172 -193028
36 -193028 -113417 -141793 -181254 -77802 -276415 -326207 -44699 -169778 -399843 -391424 -250498
25 -250498 -71206 158594 -101987 -237675 -334264 -224798 -512901 -636979 -389206 -194268
15 -194268 -204594 -289484 -303431 -444835 -307714 -200835 -261378 -482789 -425962 -289654 -192383
4 -192383 -240566 -250985 -301751 -300454
0 -300454
$$ Imaginary data points
##PAGE= N=2
##DATA TABLE= (X++(I..I)), XYDATA
16383 -3934560 -4028892 -4129231 -4016955 -3775880 -3745265 -3522029 -3281611 -3293865 -3493943 -3568695
16373 -3568695 -3511735 -3200143 -3160144 -3053641 -2902867 -2993870 -3080276 -2988797 -2902311 -2743564
16363 -2743564 -2494993 -2268927 -2485925 -2626407 -2262873 -2171154 -2204632 -2336749 -2194100 -2080738
16353 -2080738 -1993280 -1775838 -1687196 -1619938 -1552593 -1512802 -1528460 -1485547 -1193354 -1239562 -1138333
16342 -1138333 -1150611 -1039020 -665524 -611329 -571406 -723144 -707924 -609668 -563894 -483502 -419542
16331 -419542 -423017 -385640 -325902 -313495 -191328 -36055 -2065 137087 175047 76421 159594
16320 159594 320432 305158 141296 415142 523250 394433 110160 310835 792698 735474
16310 735474 752124 629157 718112 1050659 1114363 1234097 1205141 1044224 1122097 1193057 1410431
16299 1410431 1408634 1442244 1511132 1576216 1449118 1558501 1826457 1884217 2001713 1969798 2013871
16288 2013871 2180150 2081901 1986052 1886305 1915549 2031778 2086094 2143650 2452441 2678573
16278 2678573 2806352 2998331 2928846 2688970 2714181 2592049 2755620 2906098 2942384 2788875
16268 2788875 2731371 3106118 3030186 3143984 3363851 3455653 3469058 3501704 3194747 3507611
16258 3507611 3590702 3522323 3672912 3599753 3499008 3317442 3479268 3697275 3877056 3898805
16248 3898805 3927874 3883531 3839810 3683565 3778348 3958292 3972733 4033976 4169530 4230387 4248895
16237 4248895 4191417 4442898 4605870 4507858 4504730 4266003 4472526 4733891 4810389 4958568
16227 4958568 4531936 4434528 4762540 4687822 4670351 4821097 4859929 5184048 5118583 4875702
16217 4875702 4902173 4868009 4573219 4762583 5364376 5290263 5261541 4972392 4877840 4984789
16207 4984789 5335891 5042854 5051909 5075492 5228348 5316398 5383434 5364243 5266410 5228322 5369524
16196 5369524 5451604 5604081 5435837 5643180 5808767 5586746 5786411 5632023 5314797 5497022
16186 5497022 5576754 5597959 5560016 5322886 5599102 5760762 5948269 5804277 5881571 5894573
16176 5894573 5862661 5845866 5717634 5765147 5920640 6083533 6060263 6185038 6076429 6271005
16166 6271005 6456020 6412926 6374141 6344880 6232744 5968920 6226586 6412306 6113976 6095785
16156 6095785 6480691 6255246 6085784 6065329 6147119 6346789 6347000 6405435 6628290 6552779 6399089
16145 6399089 6267324 6415002 6302119 6313353 6310201 6499598 6624839 6714755 6665082 6538999
16135 6538999 6677689 6574189 6421389 6225249 6344882 6803001 6750326 6664821 6667464 6796073
16125 6796073 6623252 6758141 6881674 6901667 7059924 6895836 6732211 6810601 6780513 6957960
16115 6957960 6841932 6616860 6579691 6475141 6717768 7094970 6899119 6872474 6845569 6871383
16105 6871383 6976155 6766102 6792006 6974734 6765508 6633701 6676292 6610772 6956571 7003596
16095 7003596 7058980 7082914 6952924 6775683 6818313 6718769 6813752 7074594 7014341 7072359 6915286
16084 6915286 6653907 6851716 6976640 7322890 7221550 7129627 7030014 7064211 6757534 6734608
16074 6734608 6990598 6861512 6922512 7081722 7251376 7190088 7068615 7064295 6926663 6980960
16064 6980960 7102654 7368440 7316442 7223189 7036456 7232299 7061514 6925388 6976262 6988693
16054 6988693 7124549 7116255 6999965 6753719 6928316 6709673 6707339 6807725 6951524 6984817
16044 6984817 7080648 7220102 7092473 7169910 7337704 7262313 7354800 7294868 7317964 7380079 7201836
16033 7201836 7212628 7314414 7007901 6943831 7101763 7090049 7096811 6898045 7099538 7278835
16023 7278835 7151957 7254904 7480064 7191084 6954940 7045820 7102146 7103689 6947826 6967273
$$ [...]
##END NTUPLES=NMR SPECTRUM
##END=
