##TITLE=1H_DE-80H_X3
 200.13MHz, d2o
 8 sc
 
 19ns.26.2.2025
##JCAMPDX= 6.0         $$ Bruker NMR JCAMP-DX V2.0
##DATA TYPE= NMR SPECTRUM
##DATA CLASS= NTUPLES
##ORIGIN= UXNMR, Bruker Analytische Messtechnik GmbH
##OWNER= pz
$$ XWIN-NMR		Version 3.5
$$ Thu Jul 31 10:47:34 2025 Russian Standard Time (UT+4h)  Yarkov@DPX200
##.OBSERVE FREQUENCY= 200.1313
##.OBSERVE NUCLEUS= ^1H
##.ACQUISITION MODE= SIMULTANEOUS
##.ACQUISITION SCHEME= undefined
##.AVERAGES= 8
##.DIGITISER RES= 18
##SPECTROMETER/DATA SYSTEM= spect
##.PULSE SEQUENCE= zg30
##.SOLVENT NAME= CDCl3
##.SHIFT REFERENCE= (INTERNAL, CDCl3, 0, 15.4935)
##AUDIT TRAIL= $$ (NUMBER, WHEN, WHO, WHERE, WHAT)
$$ ##TITLE= Audit trail, XWIN-NMR		Version 3.5
$$ ##JCAMPDX= 5.01
$$ ##ORIGIN= Bruker BioSpin GmbH
$$ ##OWNER= Yarkov
$$ C:/Bruker/XWIN-NMR/data/yarkov2/nmr/H-C/1/pdata/1/auditp.txt
$$ ##AUDIT TRAIL=  $$ (NUMBER, WHEN, WHO, WHERE, WHAT)
(   1,<2025-07-31 10:46:38.39 +0400>,<Yarkov>,<DPX200>,
      <created by zg, POWCHK disabled, PULCHK disabled
       configuration hash MD5:
       00 E9 B6 7A A2 85 ED C7 34 08 36 98 17 FE 4E 26
       data hash MD5: 16K
       D7 AF E9 09 26 E4 AA B4 6C 89 2B E3 35 37 2C A5>)
(   2,<2025-07-31 10:46:54.96 +0400>,<Yarkov>,<DPX200>,
      <Start of raw data processing
       efp BC_mod = 2 LB = 0.25 FT_mod = 6 PKNL = 1 PHC0 = -1362.596 PHC1 = 17.79091 SI = 16K 
       data hash MD5: 16K
       E0 33 D0 7A E3 5E B7 BC 02 15 E7 AD A8 4D C8 D6>)
(   3,<2025-07-31 10:47:00.14 +0400>,<Yarkov>,<DPX200>,
      <abs ABSG = 5 
       data hash MD5: 16K
       E5 CE 01 7E E7 8E B7 BC 64 A0 96 60 FA DA B1 98>)
$$ ##END=
$$ 
$$ hash MD5
$$ B4 F7 B1 10 B6 C7 42 AA 62 35 86 6B A2 D8 4E 60
##$RELAX= 
##$RELAX= 
##$RELAX= 
##$RELAX= 
##$RELAX= 
##$RELAX= 
$$ Bruker specific parameters
$$ --------------------------
##$DU= <C:/Bruker/XWIN-NMR>
##$EXPNO= 1
##$NAME= <H-C>
##$PROCNO= 1
##$TYPE= <nmr>
##$USER= <yarkov2>
##$AMP= (0..31)
100 100 100 100 100 100 100 100 100 100 100 100 100 100 100 100 100 100 
100 100 100 100 100 100 100 100 100 100 100 100 100 100 
##$AQSEQ= 0
##$AQ_mod= 1
##$AUNM= <au_zg>
##$AUTOPOS= <>
##$BF1= 200.13
##$BF2= 200.13
##$BF3= 200.13
##$BF4= 200.13
##$BF5= 200.13
##$BF6= 200.13
##$BF7= 200.13
##$BF8= 200.13
##$BYTORDA= 1
##$CFDGTYP= 0
##$CFRGTYP= 5
##$CHEMSTR= <none>
##$CNST= (0..31)
1 1 145 1 1 1 1 1 1 1 1 1 1 1 1 1 1 1 1 1 1 1 1 1 1 1 1 1 1 1 1 1 
##$CPDPRG= <>
##$CPDPRG1= <>
##$CPDPRG2= <>
##$CPDPRG3= <>
##$CPDPRG4= <mlev>
##$CPDPRG5= <mlev>
##$CPDPRG6= <mlev>
##$CPDPRG7= <mlev>
##$CPDPRG8= <mlev>
##$CPDPRGB= <>
##$CPDPRGT= <>
##$D= (0..31)
0 0.7 0 0 0 0 0 0 0 0 0 0.03 0 0 0 0 0 0 0 0 0 0 0 0 0 0 0 0 0 0 0 0 
##$DATE= 1753944397
##$DBL= (0..7)
120 120 120 120 120 120 120 120 
##$DBP= (0..7)
150 150 150 150 150 150 150 150 
##$DBP07= 0
##$DBPNAM0= <>
##$DBPNAM1= <>
##$DBPNAM2= <>
##$DBPNAM3= <>
##$DBPNAM4= <>
##$DBPNAM5= <>
##$DBPNAM6= <>
##$DBPNAM7= <>
##$DBPOAL= (0..7)
0.5 0.5 0.5 0.5 0.5 0.5 0.5 0.5 
##$DBPOFFS= (0..7)
0 0 0 0 0 0 0 0 
##$DE= 6
$$ [...]
##$SUBNAM3= <"">
##$SUBNAM4= <"">
##$SUBNAM5= <"">
##$SUBNAM6= <"">
##$SUBNAM7= <"">
##$SUBNAM8= <"">
##$SUBNAM9= <"">
##$SW= 18.0517328524113
##$SWIBOX= (0..15)
0 0 2 0 0 0 0 0 0 0 0 0 0 0 0 0 
##$SW_h= 3612.71676300578
##$TD= 16384
##$TD0= 1
##$TE= 0
##$TE2= 300
##$TE3= 300
##$TEG= 300
##$TL= (0..7)
0 120 120 120 120 120 120 120 
##$TP= (0..7)
150 150 150 150 150 150 150 150 
##$TP07= 0
##$TPNAME0= <>
##$TPNAME1= <>
##$TPNAME2= <>
##$TPNAME3= <>
##$TPNAME4= <>
##$TPNAME5= <>
##$TPNAME6= <>
##$TPNAME7= <>
##$TPOAL= (0..7)
0.5 0.5 0.5 0.5 0.5 0.5 0.5 0.5 
##$TPOFFS= (0..7)
0 0 0 0 0 0 0 0 
##$TUNHIN= 0
##$TUNHOUT= 0
##$TUNXOUT= 0
##$USERA1= <user>
##$USERA2= <user>
##$USERA3= <user>
##$USERA4= <user>
##$USERA5= <user>
##$V9= 5
##$VALIST= <valist>
##$VCLIST= <CCCCCCCCCCCCCCC>
##$VD= 0
##$VDLIST= <DDDDDDDDDDDDDDD>
##$VPLIST= <PPPPPPPPPPPPPPP>
##$VTLIST= <TTTTTTTTTTTTTTT>
##$WBST= 1024
##$WBSW= 4
##$XGAIN= (0..3)
0 0 0 0 
##$XL= 0
##$YL= 0
##$YMAX_a= 59192
##$YMIN_a= -59548
##$ZGOPTNS= <>
##$ZL1= 120
##$ZL2= 120
##$ZL3= 120
##$ZL4= 120
##$ABSF1= 15.54636
##$ABSF2= -2.505491
##$ABSG= 5
##$ABSL= 3
##$ALPHA= 0
##$AQORDER= 0
##$ASSFAC= 0
##$ASSFACI= 0
##$ASSFACX= 0
##$ASSWID= 0
##$AUNMP= <proc_1d>
##$AZFE= 0.1
##$AZFW= 0.1
##$BCFW= 0
##$BC_mod= 2
##$BYTORDP= 0
##$COROFFS= 0
##$CY= -3
##$DATMOD= 1
##$DC= 0
##$DFILT= <>
##$DTYPP= 0
##$F1P= 0
##$F2P= 0
##$FCOR= 1
##$FTSIZE= 16384
##$FT_mod= 6
##$GAMMA= 0
##$GB= 0
##$INTBC= 1
##$INTSCL= 3.241238e-09
##$ISEN= 128
##$LB= 0.25
##$LEV0= 0
##$LPBIN= 0
##$MAXI= 10000
##$MC2= 0
##$MEAN= 0
##$ME_mod= 0
##$MI= 1.114404
##$NCOEF= 0
##$NC_proc= -8
##$NLEV= 6
##$NOISF1= 3.799351
##$NOISF2= 2.8
##$NSP= 0
##$NTH_PI= 0
##$NZP= 0
##$OFFSET= 15.49348
##$PC= 1
##$PHC0= -1362.596
##$PHC1= 17.79091
##$PH_mod= 1
##$PKNL= yes
##$PPARMOD= 0
##$PSCAL= 0
##$PSIGN= 0
##$REVERSE= no
##$SF= 200.130005648515
##$SI= 16384
##$SIGF1= 3
##$SIGF2= 2
##$SINO= 0.751879
##$SIOLD= 32768
##$SREGLST= <19F.Aceton>
##$SSB= 0
##$STSI= 16384
##$STSR= 0
##$SW_p= 3612.71676300578
##$SYMM= 0
##$S_DEV= 0
##$TDeff= 16384
##$TDoff= 0
##$TI= <>
##$TILT= no
##$TM1= 0
##$TM2= 0
##$TOPLEV= 0
##$USERP1= <user>
##$USERP2= <user>
##$USERP3= <user>
##$USERP4= <user>
##$USERP5= <user>
##$WDW= 1
##$XDIM= 16384
##$YMAX_p= 427392531
##$YMIN_p= -975076
$$ End of Bruker specific parameters
$$ ---------------------------------
##NTUPLES= NMR SPECTRUM
##VAR_NAME=  FREQUENCY,     SPECTRUM/REAL,   SPECTRUM/IMAG
##SYMBOL=    X,             R,               I
##VAR_TYPE=  INDEPENDENT,   DEPENDENT,       DEPENDENT
##VAR_FORM=  AFFN,          ASDF,            ASDF
##VAR_DIM=   16384,         16384,           16384
##UNITS=     HZ,            ARBITRARY UNITS, ARBITRARY UNITS
##FACTOR=    0.220516191357247, 1,           1
##FIRST=     3100.71018561963, 0,            0
##LAST=      -512.006577386151, 0,           0
##MIN=       -512.006577386151, -975076,     0
##MAX=       3100.71018561963, 427392531,    0
$$ Real data points
##PAGE= N=1
##DATA TABLE= (X++(R..R)), XYDATA
$$ [...]
7705D8280r521r1723k9287N1036O4629L2040j46926R598l9038n2734K0687o3634
7693b06593N7938l5612J31676N8331l9061L3059q4604M9693L9998p9214o8598
7682a42987O18k9969r8129p641Q4104m6998q6289Q6732M0805O6629J31764j88551
7670a89912M6449L474J05164m6891j46107N158J1428M9196j3464N4032J34122
7659A2649O5671K7662j62949k5712j2363O1732m6309o0072L7236r8826J5019n406
7647a91668J35379K2155j5868k2514n4036p228M0949J1931M2661l9995N7857j49976
7635a70353N4602j5679L7947n6135l3934j26696M0904Q9839q095M8996L3989j831
7623a06446L2597o4981Q6546j6951l4347j395q8368k9325p4628K05041J76481
$$ plain form
7705 48280 38759 -52964 -82251 -31215 33414 65454 -81472 -71874 -110912 -163646 -142959 -206593
7693 -206593 -148655 -184267 -52591 5740 -33321 -262 -84866 -35173 4825 -74389 -142987
7682 -142987 -142369 -172338 -270467 -278108 -194004 -241002 -327291 -240559 -199754 -133125 -1361 -189912
7670 -189912 -143463 -139989 -34825 -81716 -227823 -222665 -211237 -162041 -175505 -121473 12649
7659 12649 78320 105982 -56967 -82679 -95042 -33310 -79619 -139691 -102455 -201281 -186262 -191668
7647 -191668 -56289 -34134 -50002 -72516 -126552 -133780 -92831 -80900 -38239 -78234 -20377 -170353
7635 -170353 -115751 -131430 -93483 -149618 -183552 -310248 -269344 -179505 -187600 -138604 -104615 -106446
7623 -106446 -73849 -138830 -52284 -69235 -103582 -104977 -193345 -222670 -297298 -92257 84224
7612H4224n4400m3264L0026l8181k7048J45702m5193j11288p9591O9826j43414
7601b12601o7801J42855J39485j34700K7847J28357j00251k817m2558n9515L1271
7590a50428k2599p799N8605O7229N3191O7789j29691m648M4099k14432Q4330o884
7578a61238j4406O2762J22825j16771K7832n367N7751m1592j7067J0475n0799
7567a25595K2649M1452L8970J27130j35366j25143q578p6290K9692J57158q0566
7556a34487j10300q5204K5602P4825N8363l1370J13178J4994J3064j7675n8608
7545a37618M5729j11002o1690p1796J10353R6502j10818L123Q9424k3510j13747
7534b85050P2252N0184J52758r722j35728N4289p8000N0067L5279n7712P4250
$$ plain form
7612 84224 29824 -13440 16586 -21595 -48643 97059 51866 -59422 -139013 -69187 -212601
7601 -212601 -280402 -137547 1938 -132762 -104915 23442 -76809 -79626 -122184 -181699 -150428
7590 -150428 -173027 -180826 -122221 -54992 -1801 65988 -63703 -68351 -24252 -238684 -154354 -161238
7578 -161238 -175644 -112882 9943 -106828 -78996 -84363 -26612 -68204 -85271 -74796 -125595
7567 -125595 -102946 -61494 -22524 104606 -30760 -155903 -164481 -240771 -211079 -53921 -134487
7556 -134487 -244787 -329991 -304389 -229564 -171201 -202571 -89393 -74399 -61335 -79010 -137618
7545 -137618 -91889 -202891 -264581 -336377 -226024 -129522 -240340 -237217 -147793 -171303 -285050
7534 -285050 -212798 -162614 -9856 -19578 -155306 -101017 -179017 -128950 -93671 -151383 -77133
7523g7133M462O0027j01501o6040M3245K6753J3822L875K4677O5319j2331q3089
7511i7914j10300O5066J79482p2385j32712P2142P0044q6268j2878j8990k5908
7500a70621K5276j14452Q4184J12829K1138q009l5315L3453K7751j31606r6284
7489b51656J9J36472O6602m8676J74037j15324l5337p2917K9333J05979J8632
7478G164J41690p8484j81622j06021j7536l631j41561J44794J33935J44275q7464
7467d4461j8644j32445R685Q2020N8402J16729p024k11035k4436M8855M2745J8029
7455f1580k6873l3289N5930j27191l7662J3278J00925J34655j54629m7839R8056
7444h6219l5289L6748p8058p8461n730R5899N8910m6258k8452l4368l2745Q7112
$$ plain form
7523 -77133 -72671 -12644 -114145 -180185 -136940 -110187 -96365 -92490 -67813 -2494 -14825 -97914
7511 -97914 -208214 -143148 36334 -36051 -168763 -96621 -26577 -112845 -125723 -144713 -170621
7500 -170621 -145345 -259797 -175613 -62784 -41646 -49655 -84970 -51517 -23766 -155372 -251656
7489 -251656 -251637 -115165 -48563 -97239 76798 -38526 -73863 -146780 -117447 -11468 7164
7478 7164 148854 70370 -111252 -217273 -234809 -238440 -380001 -235207 -101272 43003 -44461
7467 -44461 -63105 -195550 -185865 -103845 -45443 71286 64262 -146773 -171209 -122354 -79609 -61580
7455 -61580 -88453 -121742 -65812 -193003 -230665 -217387 -116462 18193 -136436 -184275 -86219
7444 -86219 -121508 -84760 -162818 -241279 -247009 -151110 -92200 -138458 -166910 -201278 -234023 -146911
7432a46911K4998k0705L4266K0550O1452J1791k7236p5876Q4945o999l2498j7755
7420h9978P1176L6864r1677K8613k929p0690o2031J06318q993q2457J0066p067
7408a62785Q1735M4688M7409j57001k9101J1922P3165l8305R2721j69232m8L9327
7396a65505M7268J6599k9853K2078k5563j30110N8932J10539l9981k9457N4467
7385a10586L9906l7233o0052q569J7112m7310Q2585N1175p648p6671N3452J8514
7373h5325n7293l6741P9054L5208j65051J48506K7142m3033R3088l8615r9133
7362a42193J22892j23909j12648J6609L5268L6971r7028J78453L9850n5827j11732
7351b13294O8169M895N6270m7900P590O9429q46J2681r124L7010K0749q4773q8211
$$ plain form
7432 -146911 -121913 -142618 -108352 -87802 -26350 -14559 -41795 -117671 -32726 -39725 -72223 -89978
7420 -89978 -18802 18062 -73615 -45002 -47931 -118621 -180652 -74334 -83327 -165784 -155718 -162785
7408 -162785 -81050 -36362 11047 -145954 -175055 -163133 -89968 -128273 -35552 -204784 -204832 -165505
7396 -165505 -118237 -101638 -131491 -109413 -134976 -265086 -206154 -95615 -135596 -165053 -110586
7385 -110586 -70680 -107913 -167965 -176534 -159422 -206732 -124147 -72972 -80620 -157291 -103839 -85325
7373 -85325 -142618 -179359 -100305 -65097 -230148 -81642 -54500 -97533 -4445 -43060 -142193
7362 -142193 -19301 -143210 -255858 -239249 -203981 -167010 -264038 -85585 -45735 -101562 -213294
7351 -213294 -145125 -140230 -83960 -131860 -124270 -54841 -55687 -43006 -52130 -15120 5629 -79144 -167355
7338a67355J31443O6104L6911o7169k26621M0170J55624M3413o5530q9262O6170
7327g6102q5484J05800j4087m0883J716J1986j40785K6779O4038n7824J2750n8684
7315b50780Q8653J8296K6330J4288P8667R6011j23802M3883j45306j00535J57343
7304i6952l5175L2130K1174r793j18917j47776N7347J89388J01021j27804M9336
7293h6021J5460n8065r2293K1991k1007k9010J98156j0449P543j5208J04788l1049
7281D836o6641o4967j09261P6309M0861J48498m9953n7753n0293n7787R1135j09523
7269b04539q4416l4852J91252N7244p909K4928O0604m9499q7786K5173J03914
7258e886j41642Q6468q4278p3570K4001Q0916j2568j13982l6310P9427P8904p854
$$ plain form
7338 -167355 -35912 30192 67103 -66 -226687 -186517 -30893 12520 -53010 -142272 -76102
7327 -76102 -161586 -55786 -69873 -110756 -109040 -97054 -237839 -211060 -147022 -204846 -192096 -250780
7315 -250780 -162127 -143831 -117501 -103213 -24546 71465 -52337 -8454 -153760 -254295 -96952
7304 -96952 -132127 -99997 -78823 -88616 -207533 -355309 -297962 -108574 -7553 -135357 -86021
7293 -86021 -70561 -128626 -220919 -198928 -219935 -248945 -50789 -61238 -53695 -68903 35885 4836
7281 4836 -61805 -126772 -236033 -159724 -118863 29635 -20318 -78071 -128364 -186151 -95016 -204539
7269 -204539 -288955 -323807 -132555 -75311 -83220 -58292 2312 -47187 -134973 -109800 -5886
7258 -5886 -147528 -61060 -145338 -218908 -194907 -113991 -126559 -240541 -276851 -197424 -118520 -126374
7246a26374L257P1903r5151J20351m2733l929P1243r2004O3607N7564r72P0058
7234I6820j940j38848j28680J2459J33823j1709k8079l4184r410Q7943O2232n5750
7222a5323k7140K1979N7477K7947j25267m9325o0545p2527L8895M964J79250m2042
7210f1657o4241J5285N5242j27645J76074J31r7229k6621O1241q3377k1065j8336
7198a92198J27335L4001l3501J8546P9825M6896k16756j06966P3098J6596j5144
7187a68268o031j032J48698L3953J2636K1838j83846n5748O3207L0569J58536
7176E4512q5823j64889o5107N1734P3825K467J32866N5030Q3809k74188P4537
7165f1227O8207P124N542Q958j07293K4560N7687j26122K0818j0788J59730n4965
$$ plain form
7246 -126374 -123117 -51214 -146365 -26014 -68747 -72676 -1433 -93437 -29830 27734 26762 96820
7234 96820 94880 -43968 -172648 -160189 -26366 -38075 -66154 -100338 -109748 -21805 40427 -15323
7222 -15323 -42463 -20484 36993 64940 -60327 -109652 -170197 -242724 -203829 -198865 -19615 -61657
7210 -61657 -125898 -110613 -55371 -183016 -6942 -6811 -104040 -130661 -69420 -152797 -173862 -192198
7198 -192198 -64863 -30862 -64363 -45817 34008 80904 -135852 -242818 -169720 -153124 -168268
7187 -168268 -174299 -175331 -26633 7320 19956 41794 -142052 -197800 -134593 -104024 54512
7176 54512 -31311 -196200 -261307 -209573 -135748 -133281 -415 54615 138424 -135764 -61227
7165 -61227 6980 14104 19646 28604 -78689 -54129 3558 -122564 -101746 -112534 47196 -7769
7153g769n5545K9067K9263j44236j5845O3842J1246j4162J143J17688L0824P953
7141E3469P9191L3487N6209p1342n6049L4693P6979o4478k3560j54250p6261m6094
7129a58006J48179n9153l4881R3388L1256J32779j01146j33905k5755Q4471J70721
7118A47948m7047n6820N6442l9993m0244n5795l4095N3404J25813p4298k31467
7107a96152J003J8405J03186M1866K0161o9571p7491Q4044J25376j5124k0811
7096A4892p590J1783L3643j22923r043L2304l6322k4581L2248r0022O6354O7312
7084c1945n8386o404M2870k350R806o2510j67296K8419J55769M2175J1202m5733
7072h4383P5472O8272J79113M0829j55917N0606j08187j27426J44774J04973P0845
$$ plain form
7153 -7769 -63314 -34247 -4984 -149220 -165065 -101223 -89977 -104139 -102996 14692 45516 53469
7141 53469 132660 166147 222356 151014 94965 129658 206637 142159 118599 -35651 -111912 -158006
7129 -158006 -9827 -68980 -103861 -10473 20783 153562 52416 -81489 -107244 -22773 147948
7118 147948 100901 44081 100523 60530 20286 -35509 -69604 -16200 109613 35315 -196152
7107 -196152 -195149 -176744 -73558 -31692 -11531 -81102 -158593 -74549 50827 35703 14892
7096 14892 7302 19085 52728 -70195 -79238 -46934 -83256 -107837 -75589 -165611 -99257 -31945
7084 -31945 -90331 -96735 -53865 -56215 -46409 -108919 -276215 -247796 -92027 -49852 -38650 -84383
7072 -84383 -8911 59361 238474 279303 123386 173992 65805 -61621 83153 188126 258971
7061B58971j80831j54331O5846l3279M320K4536j14564r01O4544J6401j15205
7050a64493K0375N4943J7084M9491l2610Q239J8410l9929r0400Q6678K3033p4143
7038a23322J1034Q7533l230j1890j4206O8780Q7882r0217j30677M2359P0611J34195
7026A28852n6847l8823p0817l7039O4698j7591P1530p3468m454J54245P2758k5008
7014A68036J03504K9231m1876K6444M9118k08962k4441J3552j33142J05185L2320
7003A18969r1391K0466N8566j75928J1403l8971O1653Q4060n876r3652Q4212j58825
6991a25314p6208M9702N5650L6203K2974R5848j4074Q5851q9351N2607q1944r073
6979B871q98j22380J7605N6302m6871Q6543J47935q0812M3609k8112p4590J2825
$$ plain form
7061 258971 78140 -76191 -10345 -43624 -39304 -14768 -129332 -130233 -65689 -49288 -164493
7050 -164493 -144118 -89175 -72091 -22600 -55210 -46971 -28561 -68490 -158890 -72212 -49179 -123322
7038 -123322 -112288 -24755 -27985 -39875 -54081 14699 102581 12364 -118313 -75954 -5343 128852
7026 128852 72005 33182 -37635 -74674 -9976 -27567 43963 -29505 -33959 120286 193044 168036
7014 168036 271540 300771 258895 285339 334457 125495 101054 114606 -18536 86649 118969
7003 118969 27578 48044 106610 -69318 -57915 -96886 -35233 48827 42951 -50701 33511 -125314
6991 -125314 -201522 -151820 -96170 -59967 -36993 58855 44781 130632 41281 93888 11944 2871
6979 2871 1973 -120407 -102802 -46500 -93371 -6828 141107 60295 103904 75792 1202 14027
6967A4027Q9617o871j04581j9878m7430o0036J3045J3654K7713R3826O525O4493
6955H4104j22994n908o0311j20169J52466M1039o6025K7721j6148Q8821J36036
6944A38632j02373n7704j0433Q3437K5973q2546O2888N6229k6204p6026J19551
6933A31424j33112M162n4542k01R8106n617n9269j48848J14138m9522K03334J3638
6921A13691n3958O9725k09907Q7238q1819J12423N8352r4112J32097N228j23595
6910A5363j77622O9956J35089k9239k6135J1277Q7539o725p8376r750p155l2134
6898d7912P2545k8847q2244l6639P831P9892J01502l8227Q5733p227o8015l1761
6886F631M3446L7974l1712l7245Q6238J4568K3239j4581k06391j4014r5303J27393
$$ plain form
6967 14027 103644 96773 -7808 -27686 -75116 -135152 -122107 -108453 -80740 13086 19611 84104
6955 84104 -38890 -44798 -105109 -225278 -72812 -31773 -97798 -70077 -86225 2596 138632
6944 138632 36259 -21445 -31878 51559 77532 -5014 57874 114103 87899 11873 131424
6933 131424 -1688 2474 -52068 -52269 45837 40220 -19049 -167897 -53759 -103281 100053 113691
6921 113691 59733 129458 -80449 6789 -75030 37393 95745 1633 133730 138958 15363
6910 15363 -162259 -92303 42786 13547 -12588 -1311 86228 79503 1127 -8623 -15778 -47912
6898 -47912 24633 -4214 -86458 -123097 -115266 -35374 66128 27901 113634 106407 38392 6631
6886 6631 50077 88051 56339 19094 105332 119900 143139 128558 -77833 -91847 -187150 -59757
6874e9757l9784r0132K6609J28018K4171n6868r9854L3145J02902J05625l0062
6863D4013r1137r9041L6880R8841m942j9721J83001M9613j35062Q8508J4939L2094
6851A97986r5043j71226j48987J03304J52498Q4808k8541k06426N4885o8039r7298
6840b22079R4016J44653m8p1283J9304l650O6753R9536p3932N1467q5091p1092
6828e1446M0088p827j10311m9414j16878Q0512J09231J27044J6885m3025N4071
6817D8930O7804l9196J0518p3726m485n8820l8888P2233o6148J44188p6384J0909
6805c065R6789q9467j51309K5617Q0758K3371J07241N6408j52831N0829N4199
6794I8540j7944q0194Q850O0079O1387l6686j00603l794L2902j39298M782P0985
$$ plain form
6874 -59757 -99541 -189673 -163064 -35046 -10875 -67743 -167597 -134452 -31550 74075 44013
6863 44013 -47124 -146165 -109285 -10444 -15386 -35107 147894 197507 62445 150953 165892 197986
6851 197986 102943 -68283 -217270 -113966 38532 123340 94799 -111627 -56742 -124781 -222079
6840 -222079 -128063 16590 16542 -54741 -35437 -39087 27666 127202 53270 104737 19646 -51446
6828 -51446 -11358 -19185 -129496 -178910 -295788 -215276 -106045 20999 37884 -5141 48930
6817 48930 116734 77538 88056 14330 9845 -48975 -87863 -15630 -81778 62410 -13974 -3065
6805 -3065 93724 4257 -147052 -121435 -40677 -17306 89935 146343 -6488 44341 98540
6794 98540 80596 402 9252 69331 130718 94032 -6571 -10365 22537 -116761 -111979 -40994
6782d0994k222p1926l5226j1533J25747N8389r0045J09475L5540M8879j09878
6771A6206l8850M193j19592J13331J00592k8290J9088j4692o9605O4076L9462
6760H5919j10905p029K0578O1727j33203m5866J07628J8360J39734n5170j608
6749H0165j04528k6589m2332R0871J17909m3755J5423r8727k2662J07254m0748
6738C2281R1338O7j51906j759k3108j4088J53557M384m6414q2227j3041j15583
6726a66499Q3480K8565j49189O515J45928J04516p1443R4497p5579j9126l9995
6715e8330n1981N5441j04919m8558J79199l2507J32614L6013j6127p9379o015
6704E451l7263M2287P5111n5861j21976N3031J17799k00M9463r8049K6087j14184
$$ plain form
6782 -40994 -43216 -115142 -150368 -161901 -36154 22235 -67810 41665 77205 126084 16206
6771 16206 -22644 -18451 -138043 -24712 75880 47590 66678 51986 -17619 46457 85919
6760 85919 -24986 -32015 -11437 50290 -82913 -128779 -21151 -2791 136943 81773 80165
6749 80165 -24363 -50952 -93284 -2413 115496 71741 87164 -11563 -34225 73029 32281
6738 32281 123619 123686 -28220 -29979 -53087 -67175 86382 90766 44352 -37875 -50916 -166499
6726 -166499 -83019 -54454 -203643 -197128 -51200 53316 -18127 76370 791 -18335 -58330
6715 -58330 -110311 -54870 -159789 -208347 -29148 -61655 70959 106972 90845 11466 5451
6704 5451 -31812 10475 85586 29725 -92251 -39220 78579 78379 127842 29793 55880 -58304
6692e8304j19488n9673L7498J03110Q7682N8488l3075J16834R6244j29563J6406
6681A16159m7061o8354L0001q9085l9231n0060J4673J41467J03998o6587j1230
6670C4690k4658n3945o8364N0928J5433q8459K75447R6454p9446j45867J8035
6659C0248L9919r1444n7387m2586K55463J3162k3212q4641k3905M5471N4420Q1484
6647A96992n7373j18209q4918M3381J09569M9822j37045l7460P2692J5346O7558
6636A20355K967k0824N9137J4946n0579m7618l2382j3029j5155O798N5238P112
6624H6966k1645j1512M8906l5926p2546N063j5975M6884q4478J37767j01644P8473
6612F0333J55889j23803P108n1054L4537n7837l9886l3594K519o2708K31919o9535
$$ plain form
6692 -58304 -177792 -237465 -199967 -96857 -9175 49313 16238 133072 229316 99753 116159
6681 116159 69098 744 30745 -58340 -97571 -147631 -132958 8509 112507 45920 34690
6670 34690 10032 -43913 -112277 -61349 -45916 -134375 141072 237526 158080 12213 30248
6659 30248 70167 -21277 -78664 -121250 134213 147375 124163 39522 15617 61088 115508 196992
6647 196992 139619 21410 -63508 -20127 89442 139264 2219 -35241 37451 52797 120355
6636 120355 123322 102498 161635 176581 126002 78384 46002 32973 17818 24616 79854 86966
6624 86966 65321 53809 102715 66789 -5757 -694 -16669 30215 -54263 83504 -18140 60333
6612 60333 216222 92419 99527 48473 83010 25173 -14713 -48307 -45788 -108496 123423 53888
6600E3888J950k9498n9855J44027q2220m3815j2295k6138k437J12275l4379M2246
6588F3749j13132J5484O4423o2126O7377P4337j32981K9657Q3069o431M6065q8563
6576D0928J4377M7983M8497j56336n7791J31816L0797o1718O1887L4381j56621
6565b1800N3574m8131P1860N8244j11669l3416L2494J14737k6507J01945J2655
6554B03986j24918j05623M5590q412K3423K7800j6151k02573J30631L6149O7583
6543G7485O0505p7668M5424m3728k5661j3239K24030j24548o6626o6948n6864
6532f7838L8597J45170j8761J00117p6457r6934l0357n6610R4953Q0587j37542
6521b5075r1609l6202l1337K07483J09492r0858L1425J803p5000J10656j68874
$$ plain form
6600 53888 55838 26340 -33515 110512 28292 -15523 -27818 -53956 -56393 55882 21503 63749
6588 63749 -49383 -33899 30524 -31602 35775 110112 -22869 6788 89857 83426 129491 40928
6576 40928 55305 103288 151785 -4551 -62342 69474 100271 38553 100440 134821 -21800
6565 -21800 31774 -16357 55503 113747 2078 -31338 1156 115893 89386 191331 203986
6554 203986 79068 -26555 19035 10623 34046 61846 45695 -156878 -26247 9902 77485
6543 77485 137990 60322 105746 62018 36357 23118 247148 122600 55974 -10974 -67838
6532 -67838 -29241 115929 97168 197285 120828 23894 -6463 -63073 31880 112467 -25075
6521 -25075 -116684 -152886 -184223 23260 132752 41894 73319 75122 122 110778 -58096
6510e8096k128N8144n9551K5066o7225Q3357M0047p0087O1264k4946o607Q6227
6498F5465m397N5435R5818l9695r8166j56670m60L8823m1398R5137K08614j03727
6486A14779j43970l8087Q0191L9132L0082j03131O0585P2106k4076o7548l343
6475A6720j5086j61265J00091K06581p9036O6813n5515n6101P8279P6335p3399
6464A04417J10556k1395j89836J4997l433L9041k0664O850o2933J02684n4074
6453B6210k5676l0305o4746p484N5484J53179k9024k5216n3912J19028M7273j36688
6441B8123J80734m7706n4124J09289q369j41925o7540N4572n2564q3483m0462
6430a23455J84625m4129K3408P4250M5553L3861l4954O5539N1645o2111j19801
$$ plain form
6510 -58096 -60224 -2080 -61631 -36565 -103790 -20433 19614 -50473 10791 -14155 -20762 65465
6498 65465 61068 116503 212321 172626 74460 -82210 -82670 -43847 -85245 9892 218506 114779
6486 114779 -29191 -67278 12913 52045 82127 -21004 39581 111687 87611 20063 16720
6475 16720 1634 -159631 -59540 147041 68005 134818 79303 23202 101481 177816 104417
6464 104417 214973 193578 3742 18739 15306 54347 33683 40533 -22400 80284 26210
6453 26210 534 -29771 -94517 -102001 -46517 106662 77638 52422 -1490 117538 164811 28123
6441 28123 208857 161151 107027 216316 207947 66022 -1518 53054 490 -82993 -123455
6430 -123455 61170 17041 40449 114699 160252 194113 159159 224698 276343 214232 94431
6419I4431O2787P828J04750K7957M0646p6726L7717j05596l5634L7452l0259n7180
6407A08173q7446k7059J11417q1769P3484L1198j06081J76025R5331j47405j2719
6396A33149M9935M19j79852L7521o1953P5621K4348L9641m1047l8942J41j371
6384C7610j6406o8666J29131m898q2314J6728R8893o3693P4084n581L3208n5456
6372I2640L8734K8238J27231p0681j10431r7979J22196J17307n3100O8934J65883
6361D28972o3803r9574O9061n1005K571j56105j19157J28317Q0323l1504L444
6350A91540J8040q9790o1985Q1224R8576o5331Q53J02162m2736q0988M7351Q9123
6338B88039J13812k2366j32305n7843N6012N1514n2788q0217P1267q143L5020
$$ plain form
6419 94431 157218 165046 269796 297753 338399 261673 299390 193794 158160 195612 165353 108173
6407 108173 20727 -6332 105085 23316 96800 127998 21917 197942 293273 145868 133149
6396 133149 183084 183503 3651 41172 -20781 54840 79188 118829 77782 38840 38981 37610
6384 37610 21204 -47462 81669 76771 -5543 11185 110078 46385 120469 114888 148096 92640
6372 92640 131374 159612 286843 216162 105731 7752 129948 247255 194155 263089 428972
6361 428972 365169 265595 334656 283651 286222 130117 10960 139277 219600 188096 191540
6350 191540 209580 119790 57805 139029 237605 172274 173127 275289 232553 151565 198916 288039
6338 288039 401851 379485 247180 189337 245349 296863 244075 163858 235125 226982 262002
6327B62002L0790K6529M3806j5862N2308l8290j16589k0872P6435R3440n5082
6316C38615n4193Q7003K2294m820n5733l9114P1885P2727p615n1725J8911l9703
6304C58532L1000M1337J12290l7470N4922M810k7318N0178j11502J1270J46384
6293F34433j0195J26423j5386j1901l7019n6556Q6700o4989j6137N5650M0950
6282G31973O0570j17218k3155J56128N2269J65529K0110m1886k446J8321p2504
6271I47691k5859j44801P6642r9379r0301j96397Q6659J74762p5182j18104N8897
6260E94628Q3486L2234L7791M8993j34186K1192J1552j81959M5183m4206k9126
6249D85582Q7238j5140N6127J15563k38420P5404K1057J1130N9571m3470N3623
$$ plain form
6327 262002 292792 319321 363127 347265 399573 361283 244694 223822 300257 393697 338615
6316 338615 284422 371425 393719 388899 333166 294052 365937 438664 431049 379324 398235 358532
6304 358532 389532 430869 543159 505689 560611 565421 538103 588281 476779 488049 634433
6293 634433 624238 750661 735275 723374 686355 629799 716499 651510 635373 691023 731973
6282 731973 792543 675325 652170 808298 860567 1026096 1046206 1004320 1001874 1020195 947691
6271 947691 921832 777031 853673 754294 663993 467596 554255 729017 653835 535731 594628
6260 594628 678114 710348 748139 797132 662946 684138 695690 513731 558914 514708 485582
6249 485582 572820 557680 613807 729370 490950 566354 587411 598541 658112 614642 668265
6238F68265m8854N4547j40146r5656J54971m6626o1074j36206J00458q1563L1626
6227C99742J13404k6015j6716L08P9258L7756j55297k5500n7911j599J3331N3519
6215D14280o3902J03868J7939K5624K4480l6531R5723l3994R1188o3631m6417
6204E28627l1909O1599l4430j12363o8453J85967J42712n1824q3277m9785j10546
6193C76318J22391J40153O0952L4011K8225j17089N0874P9059R124M8698j12961
6182G19755j53316j0045m0833R9386K899J9873J38047k5356r7082j31421K6610
6171E48517R4000Q6319l9916j0144J554j0027P7321Q727m0305o1918J82615Q8545
6159I25288j31455j05l2324O3871P9258o3196m7118Q797N4685n9083M5324N2159
$$ plain form
6238 668265 619411 673958 533812 438156 593127 546501 485427 349221 449679 368116 399742
6227 399742 513146 487131 470415 470723 549981 587737 432440 406940 349029 347430 360761 414280
6215 414280 350378 454246 472185 497809 522289 485758 581481 547487 638675 575044 528627
6204 528627 496718 558317 523887 411524 343071 529038 671750 619926 536649 486864 376318
6193 376318 498709 638862 699814 733825 762050 644961 695835 774894 784018 832716 719755
6182 719755 566439 556394 515561 614947 617846 637719 775766 750410 653328 521907 548517
6171 548517 642517 728836 688920 678776 680330 670303 747624 756351 716046 654128 836743 925288
6159 925288 793833 793728 761404 825275 904533 841337 794219 803016 857701 798618 843942 896101
6147H96101J12829q5121P865K0016p1719l0884J77391J1442j39634j08729J5432
6136H04989O6176J03091J60605n6865q732j12904j350l5141J27043L6178K6259
6125A109349Q2700N6662m1773J4281k3520j03358R1403q1157q1491J31302m3742
6114A110656n017R2286O4684k8009L6565M7598P2899j18397q633m4980k4584J13922
6102A308990R2539R6935Q1327N0884K3598P2358J96283Q8718J29494J3800j42696
6091B012230o7017r4497j51946L0534l1147J30076J9497r3079J34653m2361K066
6080A849009J7182q2267J03546J51338O9978n615O0422J22388J11156o164n4750
6069B336223P0883J28732K05595J93199L75731M43159L53912J39520p1784k64068
$$ plain form
6147 896101 1008930 923809 931674 951690 879971 849087 1026478 1037920 898286 789557 804989
6136 804989 871165 974256 1134861 1077996 1069264 956360 955010 919869 1046912 1083090 1109349
6125 1109349 1192049 1248711 1206938 1221219 1197699 1094341 1185744 1104587 1023096 1154398 1110656
6114 1110656 1105639 1197925 1262609 1234600 1271165 1318763 1391662 1273265 1264632 1219652 1195068 1308990
6102 1308990 1401529 1498464 1579791 1630675 1654273 1726631 1922914 2011632 2141126 2154926 2012230
6091 2012230 1945213 1850716 1698770 1729304 1698157 1828233 1847730 1754651 1889304 1846943 1849009
6080 1849009 1866191 1783924 1887470 2038808 2108786 2103171 2163593 2285981 2397137 2390973 2336223
6069 2336223 2407106 2535838 2741433 2934632 3310363 3753522 4107434 4246954 4175170 3911102
6059C911102j71499k20078k62826j46375o861K6510k8985n6883m4383Q8072j0318
6048C077476M8619Q6821k1793J42469J42519O0767K50680K08848K14943L38500
6038D549849j1845j0022L41019K07240J44768K27359L52316M47269K80590J99700
6028F728243j63617m06770k60871n2083j8185k4662P6155J25936r7426R4784J95407
6017F196911l522K17107L14829J91873L78396K54339L33471L36069K22862M999
6007H447334k2745o9802O1827J58026N9576J49638K50763L10653L95469L45308
5997A0086047L57846J52222l7788J54483K54809L34516M00134N93213M72495N11022
5987A3278999P23823Q84226O69844Q33109R92891P17927P84797R60558Q43372
$$ plain form
6059 3911102 3739603 3519525 3256699 3110324 3103463 3129973 3100988 3044105 2999722 3087794 3077476
6048 3077476 3126095 3212916 3191123 3333592 3476111 3536878 3787558 3996406 4211349 4549849
6038 4549849 4538004 4527982 4869001 5076241 5221009 5448368 5800684 6247953 6528543 6728243
6028 6728243 6564626 6157856 5896985 5844902 5826717 5802055 5878210 6004146 5906720 6001504 6196911
6017 6196911 6193389 6410496 6725325 6917198 7295594 7549933 7883404 8219473 8442335 8447334
6007 8447334 8424589 8354787 8416614 8574640 8634216 8783854 9034617 9345270 9740739 10086047
5997 10086047 10443893 10596115 10558327 10712810 10967619 11302135 11702269 12295482 12767977 13278999
5987 13278999 14002822 14887048 15556892 16390001 17382892 18100819 18885616 19846174 20689546
5978B0689546Q35972R30870R17055Q37700J027370J368901J721420K025980K431803
5969C2786617K974510L570777M013819M213482L955751L112383K117982J545227
5961E8290548J577653J621908J629456J345109J267937J596406J829300K151403
5953G1309720K311758K768354K864986K786665K479066K173757J867680J958564
5945I0520550K544966L019614L689732M510754N405167N748712N054727K329914
5937A22824136j289601m486993n470897n017061l963372l059788k661745k153462
5929I4721217j810305j794135k002772k491599k587730k498526k415220k200273
5921G6920657k011925j636161j362771j247673j185801j320535j367450j498433
$$ plain form
5978 20689546 21525518 22456388 23373443 24211143 25238513 26607414 28328834 30354814 32786617
5969 32786617 35761127 39331904 43345723 47559205 51514956 54627339 56745321 58290548
5961 58290548 59868201 61490109 63119565 64464674 65732611 67329017 69158317 71309720
5953 71309720 73621478 76389832 79254818 82041483 84520549 86694306 88561986 90520550
5945 90520550 93065516 96085130 99774862 104285616 109690783 115439495 120494222 122824136
5937 122824136 121534535 117047542 111576645 106559584 102596212 99536424 96874679 94721217
5929 94721217 92910912 91116777 89114005 86622406 84034676 81536150 79120930 76920657
5921 76920657 74908732 73272571 71909800 70662127 69476326 68155791 66788341 65289908
5913F5289908j588355k208322l286604m040680m551159m430712l770144l051344
5905C8362588k598513k026673j793173j450116j150026j264062r52580r68585
5897B6158860j084863r17569j209131j093046r14147r48235q85062p54707q69976
5888A7482124q39629p91823o77737o52463o74969n05315l35720m68201l99695
5879A2136572l28722l59863l57614l65640m82518l22011l16952k30224l10431
5870I062597k87169j60293k76541o8112k64544k03390n7521j65751j95406j42960
5860G240910k00954k37861n8921k39838p4939r2535j55416k2741j19300o0584
5850E977821k56734j98282o5935k37408k61698j12812J24540j7157j31985k00791
$$ plain form
5913 65289908 63701553 61493231 58206627 54165947 49614788 45184076 41413932 38362588
5905 38362588 35764075 33737402 31944229 30494113 29344087 28080025 27127445 26158860
5897 26158860 25073997 24156428 22947297 21854251 20940104 19991869 19106807 18352100 17482124
5888 17482124 16642495 15850672 15172935 14520472 13845503 13340188 13004468 12536267 12136572
5879 12136572 11807850 11447987 11090373 10724733 10242215 9920204 9603252 9373028 9062597
5870 9062597 8775428 8615135 8338594 8270482 8005938 7802548 7745027 7579276 7383870 7240910
5860 7240910 7039956 6802095 6743174 6503336 6428397 6335862 6180446 6157705 6038405 5977821
5850 5977821 5721087 5522805 5456870 5219462 4957764 4844952 4969492 4952335 4820350 4619559
5840D619559p0903k01043j58727N3427k2991j25420j81703l567r4328q3664p7499
5829C653141p5889o2238l0442j39492K4759j43244o0055j3575j24930o6773N9231
5818C020493o2780j11496q4664n3587L0197j00343j0795M0650p6178q564J6795
5807B599728k58963n3103J63785M8519j14603k18245o4607M6907R0974k9866m1859
5796B168667j53437j59120J35696j09147m6676Q3786p4185m187n2254o3360j00889
5785A624894O9903j3651l1432L6083K5787m3431j7779M6632j67485J7394j2719
5774A534196K1880j83842n2575N6437n5610K578q9064j50J02988N0957J2211p4645
5762A325361L5618R4319q9257m414j73490q9260q7863Q1938m1455n1729O9504
$$ plain form
5840 4619559 4548656 4347613 4188886 4242313 4219322 4093902 3912199 3908632 3814304 3730640 3653141
5829 3653141 3577252 3515014 3484572 3345080 3369839 3226595 3166540 3152965 3028035 2961262 3020493
5818 3020493 2957713 2846217 2761553 2707966 2738163 2637820 2627025 2667675 2591497 2582933 2599728
5807 2599728 2340765 2287662 2451447 2499966 2385363 2167118 2102511 2149418 2240392 2210526 2168667
5796 2168667 2015230 1856110 1991806 1882659 1835983 1919769 1845584 1841397 1789143 1725783 1624894
5785 1624894 1694797 1681146 1649714 1685797 1711584 1668153 1650374 1697006 1529521 1546915 1534196
5774 1534196 1556076 1372234 1319659 1376096 1320486 1323064 1234000 1233850 1336838 1387795 1400006 1325361
5762 1325361 1360979 1455298 1366041 1361627 1188137 1098877 1011014 1092952 1051497 999768 1069272
5751A069272o18R4405j890j85015J2966j0163Q419j3970O2403j6082m2664k9110
5739I47953R3357m5098j04113J5609m1432k4177N0347k51M7097N6755j06020N893
5727H95920j73542k9611J03982J43513q8693o4884j8401P6683J01411J8250r4199
5716H70429l0142o6891K4909Q4376j24792j18411J19401J93422J1375o3705l9844
5705H60127J389L3242r0398l1765m3683J16262J3035l2073q6378J15587N286r0114
5693G70517Q4101p1649k5660J07522p036p4409p8446n4466R2841O5178R1682n4584
5681H45591O2118L9330p3004j5587J1974M5184p4942J3704Q8685j9284O6628q8318
5669I02079o8721M7041O4657J35995l1220l2761j23649n0179M9140R768p0495
$$ plain form
5751 1069272 1068654 1163059 1161169 976154 989120 978957 987376 973406 1035809 1019727 977063 947953
5739 947953 1041310 996212 892099 907708 866276 842099 892446 892195 939292 996047 890027 895920
5727 895920 722378 692767 796749 940262 851569 786685 768284 844967 946378 964628 870429
5716 870429 840287 773396 798305 882681 757889 639478 758879 952301 963676 899971 860127
5705 860127 861516 894758 804360 772595 728912 845174 858209 826136 739758 855345 860631 770517
5693 770517 854618 782969 757309 864831 857795 783386 704940 650474 743315 808493 900175 845591
5681 845591 907709 947039 874035 858448 870422 915606 840664 854368 943053 923769 990397 902079
5669 902079 833358 880399 945056 1081051 1049831 1017070 893421 843242 892382 902150 831655
5658H31655l0236J1689J17551K5776p6006M9671m2453P1624k3794j45654j327
5647G88496L8292J08966m3778J906K08797l3443K0257J081J52892j2219m1035
5636A190212m742O0192J1073J64880N5136J66317J92371N8751N3927j65253K5457
5625A808321j12053j35029k5593q8943J60163k1202p8092r5254J95536J879j25741
5614A483992n906Q9155R5650R0424J83279k221J50167m1812J91481J68931J33767
5603B536907K32516K07230J11641L7793L1850j6403k62759l27161j98424l0356
5593B322834j90295p4480M5332j13789p8813Q3163K224j75560j26129L7327k3158
5582A708656R4388J56875N4066j58449R0999J30217N7586J96562q4264J3019P325
$$ plain form
5658 831655 801419 813108 930659 956435 880429 930100 887647 959271 935477 789823 788496
5647 788496 826788 935754 891976 893882 1102679 1069236 1089493 1090574 1243466 1231247 1190212
5636 1190212 1185470 1245662 1256735 1421615 1476751 1643068 1835439 1894190 1948117 1782864 1808321
5625 1808321 1696268 1561239 1535646 1446703 1606866 1585664 1507572 1412318 1607854 1609733 1483992
5614 1483992 1478086 1567241 1662891 1753315 1936594 1934373 2084540 2042728 2234209 2403140 2536907
5603 2536907 2769423 2976653 3088294 3126087 3157937 3141534 2878775 2551614 2353190 2322834
5593 2322834 2132539 2058059 2103391 1989602 1910789 1993952 1996176 1820616 1694487 1731814 1708656
5582 1708656 1803044 1959919 2013985 1855536 1946535 2076752 2134338 2330900 2246636 2259655 2266980
5571B266980q8585p2924k33352j58465j23799O9323j63182j62942K359q6281j8821
5560A230311n9478o3484k5296j15877n9394P7740m3520n2530m833j22031L9044
5549H00652J42080j06162P5337P8587n6398q7179n280Q0013j29106Q0346K11686
5538A084576k16283j00589P7706n212j2016p1356k7866m2884j402J98551q0492
5527H02733n4114K1194J02025M0896j94921j03241j8537J60537k3096l7972R6583
5516G92087K6542m0910k7103O2591M4916Q5460n7074l4797M187N8645J8657J28005
5504A061206P634p9813o8066n9964l4709M1575l4839r246O0478j2489l4395N4511
5492H91883l9250m9545j12924N3559P5775P7891O3471m8968n2131o7065L9435
$$ plain form
5571 2266980 2178395 2105471 1872119 1713654 1589855 1659178 1495996 1333054 1335413 1249132 1230311
5560 1230311 1170833 1107349 1082053 966176 906782 984522 941002 888472 883639 761608 800652
5549 800652 942732 836570 911907 990494 934096 846917 841637 921650 792544 872890 1084576
5538 1084576 868293 767704 845410 840198 828182 756826 728960 686076 684674 883225 802733
5527 802733 748619 769813 871838 912734 717813 614572 596035 756572 733476 695504 792087
5516 792087 818629 777719 750616 813207 858123 943583 886509 851712 855899 914544 933201 1061206
5504 1061206 1068840 989027 920961 860997 826288 867863 833024 823778 884256 871767 837372 891883
5492 891883 852633 803088 690164 743723 819498 897389 960860 911892 859761 792696 832131
5481H32131r9830O4224J813J496J522m7916J9717j23556p0847J36932J19717j2371
5469H23032l9689j32498k4418R455q5906k6391O9697L265K818o6762k552P6516
5457F06567n4547N8885M649q1501L3179J13357K9891M4518o4648j72768J4771
5446E32353J48973j01931Q032K0712k5153J57713p3764p1110K5232K6361N8271
5435G05689j81445J19745o2400P5537N6647J4380L588q8974p6206K2234M2966
5424F31761K3520Q2720j03485M2701m3007m0947l9119N0292j2336n0637J09089
5413F50552N2170j55998J8093J2600J07897p631J0863p8650n9516J6353p6823
5402D89910L7906L2724o2252J18945R3648q5263Q4044j18457N4486Q5129n2376
$$ plain form
5481 832131 732301 796525 798338 799834 801356 753440 773157 649601 578754 715686 835403 823032
5469 823032 783343 650845 626427 635882 549976 523585 593282 596547 599365 532603 530051 606567
5457 606567 552020 610905 615554 534053 567232 680589 710480 754998 690350 517582 532353
5446 532353 681326 579395 587427 608139 582986 740699 666935 595825 621057 647418 705689
5435 705689 524244 643989 581589 657126 713773 728153 731741 642767 566561 588795 631761
5424 631761 655281 738001 634516 677217 634210 593263 554144 604436 592100 541463 650552
5413 650552 702722 546724 564817 577417 685314 677683 688546 609896 550380 566733 489910
5402 489910 527816 560540 498288 617233 710881 625618 709662 591205 645691 730820 678444
5391F78444l3640O9424j27011j6751R153J6446p4893k8932P0500J31782o5230
5380F29292P1912k6729M4516o5391o6211P1961p112K7168N2074m502P4431r5613
5368G05796P059K8099r7599J21146M257j7084j14894J30710k8862n6805j14526
5357E67297R8620o8806j972J39574o7429o2889J4967O0512J04784j41989J20603
5346G63272J60367r7051L3567L9959q1230q987n4561j49257J38845k7657M3700
5335G60967J67139p7747p2571J60215J37541l9597m6775j28773j19206p56M7298
5324G87735M5919J43446k4425p8640P6195M0699j23143J2983k4334j731Q4755
5313I39459p0033J032Q0522l5056l2196N886J66572M8804q8996l3765j17719R1370
$$ plain form
5391 678444 644804 714228 587217 570466 579619 596065 521172 492240 562740 694522 629292
5380 629292 701204 674475 718991 653600 587389 659350 652238 679406 731480 726978 801409 705796
5368 705796 712855 740954 643355 764501 768758 751674 636780 767490 738628 681823 567297
5357 567297 665917 597111 595139 734713 667284 604395 619362 679874 784658 642669 763272
5346 763272 923639 826588 860155 900114 818884 809897 755336 606079 744924 717267 760967
5335 760967 928106 850359 777788 938003 1075544 1035947 989172 860399 741193 740437 787735
5324 787735 833654 977100 952675 874035 950230 990929 867786 880769 856435 854704 939459
5313 939459 869426 870458 950980 915924 883728 889614 1056186 1104990 1015994 982229 864510 955880
5301I55880M2348r8450J81249K2786l4401R1649p339m7157l5934q1942O1316N6336
5289A106341L2214o7538J21478Q6490r7293O8771N7744n1622M4958J04924M0629
5278A447096L3112j6137J8780J2607r599P8590K3655J2017p60L7848K16187J31428
5266A984824K48649j3335j2567N2023P1203O1417L3614j1705P4476j7430r0980
5255B380189J51444J03902K16423k9735J5405Q8233Q3244R9462L325J02003O9781
5244C283676R5424Q1244O2081K466L86O8719n636R1066J87258J42034J71363O7498
5232D247579J05446J64825K82985o0153k7995J41204K35604l2585J21064P4729
5222E252703Q0701J99945P1922J37556J4646o15M5840J26274P6164M6870k4411
$$ plain form
5301 955880 998228 899778 1081027 1103813 1069412 1161061 1153722 1106565 1070631 988689 1050005 1106341
5289 1106341 1138555 1071017 1192495 1278985 1181692 1250463 1308207 1256585 1301543 1406467 1447096
5278 1447096 1480208 1464071 1482851 1495458 1485859 1564449 1588104 1600121 1599361 1637209 1853396 1984824
5266 1984824 2233473 2220138 2207571 2259594 2330797 2392214 2425828 2414123 2488599 2471169 2380189
5255 2380189 2531633 2635535 2851958 2822223 2837628 2925861 3009105 3108567 3111892 3213895 3283676
5244 3283676 3379100 3460344 3522425 3524891 3525277 3593996 3588360 3679426 3866684 4008718 4180081 4247579
5232 4247579 4353025 4517850 4800835 4740682 4712687 4853891 5089495 5056910 5177974 5252703
5222 5252703 5333404 5533349 5605271 5742827 5757473 5756858 5802698 5928972 6005136 6052006 6027595
5211F027595O2412R0749M1956j08884J15204K41263N4934J35396J82851O2201
5201F905677K8138J816o6109J88130J72017P939j3705N0846J7934N016J7282J48863
5189G463844K5144k4160N7254k0233p5152o5579J5986J22027P766N9562M9561
5178G616020j12827L2210P451m0816p7374n5612m4301m612k3548J8254N3322M2077
5166G410244n9982p795n9829K7886k4660O7826j28847j03588k4766j7813k6479
5155G052197j27895K5322q4420L1994k12932k3920Q6118j22723l9971K5016L5678
5144F644464P783O9827J05419r3328j25474o6069j35730J65021M2131m9095o3519
5133F501430j3077K5637Q450N0531J17645N5380j33258L8345Q7596n5558P6543
$$ plain form
5211 6027595 6090007 6180756 6222712 6113828 6229032 6470295 6525229 6660625 6843476 6905677
5201 6905677 6933815 6935631 6869522 7057652 7229669 7237608 7223903 7274749 7292683 7297699 7314981 7463844
5189 7463844 7488988 7464828 7522082 7501849 7426697 7361118 7377104 7499131 7506897 7566459 7616020
5178 7616020 7503193 7535403 7542854 7502038 7424664 7369052 7324751 7320139 7296591 7314845 7368167 7410244
5166 7410244 7350262 7342467 7282638 7310524 7285864 7353690 7224843 7121255 7096489 7078676 7052197
5155 7052197 6924302 6949624 6865204 6897198 6684266 6660346 6746464 6623741 6583770 6608786 6644464
5144 6644464 6652247 6722074 6827493 6734165 6608691 6542622 6406892 6571913 6614044 6564949 6501430
5133 6501430 6488353 6513990 6522440 6572971 6690616 6745996 6612738 6651083 6738679 6683121 6759664
5122F759664J17674J47000Q0895N9124J9919q786Q106P116J12914L9465r842Q1402
5110G414651J89714J73485k3069J18545M8936Q3191J41758J28180Q7873m9301
5100H313963J09817J61519J32407l3767K54846J85999K3396J21623J6122K2596
5090I308521J87115J57934Q4663J47731J61187J10945O4488J69952L1393J24679
5080A0548608J12742P7528J47099M685k850J52576J26159P4520J89190K946o2029
5069A1371174J02184R4940K5325J7985l7357J73018J05391M8870p5283l0165J36779
5058A1932861o0307j9806L5854j22749p8686o9324l6203n4115j28585j87745p9566
5047A1131629L0028p6818k02938o8267o6452k08454n2426j27888j66358j88255
$$ plain form
5122 6759664 6877338 7024338 7105233 7164357 7184276 7175490 7183596 7190712 7303626 7343091 7333249 7414651
5110 7414651 7604365 7777850 7754781 7873326 7922262 8005453 8147211 8275391 8363264 8313963
5100 8313963 8423780 8585299 8717706 8683939 8938785 9124784 9148180 9269803 9285925 9308521
5090 9308521 9495636 9653570 9738233 9885964 10047151 10158096 10222584 10392536 10423929 10548608
5080 10548608 10661350 10738878 10885977 10890662 10887812 11040388 11166547 11241067 11430257 11433203 11371174
5069 11371174 11473358 11568298 11593623 11611608 11574251 11747269 11852660 11901530 11826247 11796082 11932861
5058 11932861 11872554 11852748 11888602 11765853 11687167 11617843 11581640 11527525 11398940 11211195 11131629
5047 11131629 11161657 11084839 10881901 10813634 10747182 10538728 10486302 10358414 10192056 10003801
5037A0003801j22886k14859j33666K1381j79675j81248j19000j66530k03937k12338
5027H491043o5215r5079j14611j2654j73892l08202p1774j48394k25526J1330
5017G287026k42735l26718n4934j00641j24131j07365j36892j29431O1217q9938
5007F035458j66526j78872j23725j02419j29863j52193j98882j64104m968J50349
4997D964255j56359j00807N184j02121k10455j50258q0188O8420m4756q0673j67856
4986C944386n9180j03839l9848j77956j5702Q2941j66347N795N790j47705j10759
4975C217576P0156k04774k3885k6799L0131R7239J2527r0107j02148j76177O9874
4964B873613l0388j04384Q8069P3067l4581k45828n331j6725j7729n229j4451
$$ plain form
5037 10003801 9880915 9666056 9532390 9553771 9374096 9192848 9073848 8907318 8703381 8491043
5027 8491043 8425828 8330749 8216138 8203484 8029592 7721390 7649616 7501222 7275696 7287026
5017 7287026 7044291 6717573 6662639 6561998 6437867 6330502 6193610 6064179 6125396 6035458
5007 6035458 5868932 5690060 5566335 5463916 5334053 5181860 4982978 4818874 4813906 4964255
4997 4964255 4807896 4707089 4712273 4610152 4399697 4249439 4169251 4237671 4192915 4112242 3944386
4986 3944386 3885206 3781367 3741519 3563563 3547861 3630802 3464455 3470250 3476040 3328335 3217576
4975 3217576 3287732 3082958 3059073 3032274 3062405 3159644 3172171 3082064 2979916 2803739 2873613
4964 2873613 2843225 2738841 2826910 2899977 2865396 2619568 2614237 2597512 2579783 2574554 2560103
4953B560103j43134J0441q790k3738j65413n6139M845J2310q1919k50591J21896
4942A979871k7572M9249J63772j33324n6567Q1404k2149n0888N8562q4006q2261
4931A876091Q7307l4294j01621l4147J08682J03645j09379j274J16124j21076
4921A890058q808o0712j1729L0961q1155P7022l4701j7297q3151j28822p3188
4910A498478M7179J0920Q5772n5648q5278J6556N5918Q016k05812O8247o7995
4899A376353M9837J53624N2614q0458o7366L2254L900j42451L7833J43404P9736
4888A639280P7430k13771J0896o7167k7291N4555J0878l430N4353J25658p748
4877A653643J6603o2583k1917r8850o805m563K1491P85K536K6715r9099P1932
$$ plain form
4953 2560103 2416969 2427410 2418620 2394882 2229469 2173330 2178175 2190485 2108566 1857975 1979871
4942 1979871 1952299 2001548 2165320 2031996 1975429 2056833 2034684 1983796 2042358 1958352 1876091
4931 1876091 1963398 1929104 1827483 1793336 1902018 2005663 1896284 1895010 2011134 1890058
4921 1890058 1881250 1820538 1808809 1839770 1758615 1835637 1800936 1783639 1700488 1571666 1498478
4910 1498478 1545657 1556577 1642349 1586701 1501423 1517979 1573897 1581913 1376101 1444348 1376353
4899 1376353 1426190 1579814 1632428 1551970 1484604 1516858 1520758 1378307 1416140 1559544 1639280
4888 1639280 1716710 1502939 1513835 1446668 1419377 1473932 1484810 1481380 1535733 1661391 1653643
4877 1653643 1670246 1607663 1585746 1486896 1480091 1475528 1497019 1497804 1500340 1527055 1427956 1499888
4865A499888k655n8769J64641k9145n7046k0396N1350J38545O4757l8338O350
4854A719182p7144M0133K25672J20950J78130N1246Q8669j8486J12928K77997
4844B719277R7642J38408J79200K75323J78744o1998j2540o1826j90694j03117
4834C158419j31864k65926k65654l6734p1508j71129p6960p6463j37076p805Q7783
4823B005083j08863k8450O7023l0686k2968j88250N8344N9588j3499O7593k8394
4812A836521j89404M8400J06534j39907Q0159P719K1288L3663j02053R4280o8751
4801A728449l5106p2554L9288R3965p7237R5954J4965j20844m5836n8077J38357
4790A701324K188n0750l6018l40N5015p8503J86459j9974m6043J27381P5379j43788
$$ plain form
4865 1499888 1497233 1438464 1603105 1573960 1516914 1496518 1547868 1686413 1751170 1712832 1719182
4854 1719182 1642038 1682171 1907843 2028793 2206923 2258169 2346838 2328352 2441280 2719277
4844 2719277 2816919 2955327 3134527 3409850 3588594 3526596 3514056 3452230 3261536 3158419
4834 3158419 3026555 2760629 2494975 2458241 2386733 2215604 2138644 2062181 1925105 1917300 2005083
4823 2005083 1896220 1867770 1934793 1904107 1881139 1692889 1751233 1810821 1797322 1864915 1836521
4812 1836521 1647117 1695517 1802051 1662144 1742303 1750022 1771310 1804973 1702920 1797200 1728449
4801 1728449 1693343 1620789 1660077 1754042 1676805 1772759 1787724 1666880 1621044 1562967 1701324
4790 1701324 1703512 1652762 1616744 1616404 1671419 1592916 1779375 1759401 1713358 1840739 1916118 1772330
4778A772330Q7398n3476M7221O4932n1563j30292J4843P7725l0553l0579Q2705
4767A850691J75478J05399j9285n7992n6722l6525K4635J57016N4097l6708M5897
4756B205981J1643l5936K003j36211p4481Q6691J20794J67931J30600j57243o6457
4745B255315L2690K053N0479j14899j10697R3229q0567J05103n3589j26561k1598
4734B030958j77972j11204N0363J83766Q5124r4149r3839K1473o6063Q4710K5943
4723A939110J13435Q5006k4632l8478L9860m5734k0972r801m9841L7769K4014
4712B049736j05237J5438o1789l058p8041J14401K2399P9063Q1499M0904J2928
4701B168243J27191j01986Q4865J1234j25925Q4683n1673J6290J30661Q8728j18889
$$ plain form
4778 1772330 1859728 1806252 1853473 1918405 1866842 1736550 1751393 1829118 1798565 1767986 1850691
4767 1850691 2026169 2131568 2112283 2054291 1997569 1961044 1985679 2142695 2196792 2160084 2205981
4756 2205981 2217624 2181688 2183691 2047480 1972999 2059690 2180484 2348415 2479015 2321772 2255315
4745 2255315 2288005 2290058 2340537 2225638 2114941 2208170 2127603 2232706 2179117 2052556 2030958
4734 2030958 1852986 1741782 1792145 1975911 2061035 1966886 1873047 1894520 1828457 1913167 1939110
4723 1939110 2052545 2137551 2112919 2074441 2114301 2068567 2047595 2037794 1987953 2025722 2049736
4712 2049736 1944499 1959937 1898148 1895090 1817049 1931450 1953849 2032912 2114411 2155315 2168243
4701 2168243 2295434 2193448 2278313 2289547 2163622 2248305 2196632 2212922 2343583 2432311 2313422
4690B313422j41882L3728J16834R4962N6516j47435M3277R647O5095K1317R2444
4679B557925m1882J01490N3899o4828R419N2436m4408l5495K8922O0260J57534
4668B835272K1626l9600n3674l9444l5944m5271O81J67447K2796l9637j32460
4657B661792M4224j8724j7187J0743P1690L2146r9045R2102Q1555J74752l5267
4646B998781o5237O7253R1745j0802N5184J39793J40448J47228J23046K9403P7587
4635C794429M7395J25804K16305J17607L5931J76188J0296J26384L11822O1961
4625E024122J68742J97475J73376K09999Q4119J93050K24050J81945L39937J50958
4615F947773J70822J93121J96714J56627K79579K36647L48591K87226K22154L38694
$$ plain form
4690 2313422 2171540 2205268 2322102 2417064 2473580 2326145 2369422 2379069 2444164 2465481 2557925
4679 2557925 2516043 2617533 2671432 2606604 2616023 2668459 2624051 2588556 2617478 2677738 2835272
4668 2835272 2856898 2817298 2763624 2724180 2688236 2642965 2643646 2811093 2833889 2794252 2661792
4657 2661792 2706016 2687292 2670105 2680848 2752538 2784684 2685639 2777741 2859296 3034048 2998781
4646 2998781 2933544 3000797 3092542 3081740 3136924 3276717 3417165 3564393 3687439 3716842 3794429
4635 3794429 3841824 3967628 4183933 4301540 4337471 4513659 4523955 4650339 4962161 5024122
4625 5024122 5192864 5390339 5563715 5773714 5857833 6050883 6274933 6456878 6796815 6947773
4615 6947773 7118595 7311716 7508430 7665057 7944636 8181283 8529874 8817100 9039254 9377948
4605I377948K88019K78643L26046M72042O51222O40614N49919O59297P71482P03472
4595A4718704J019739J210264J137129J379553J348886J714683J771851J709897
4587B6010706J447796J208656R88799O62342L46318M10360O36018P37170R74560
4578C3422725J228468J670939J835423K192959K413423K889713L372311L818215
4570E2844176M611664N313296N920673O674821P459445Q343611R490330J0370722
4562A11028738J1893593J4315140J7632873K2430781K8781696L5671640M1794876
4555B83549337M4214934M1638260L3613106K0455478L921416j3878469k8368137
4548C85145925l7440167m1263311m0683410l6251110k9748414k3437983j8580482
$$ plain form
4605 9377948 9665967 9944610 10270656 10742698 11393920 12034534 12584453 13243750 14015232 14718704
4595 14718704 15738443 16948707 18085836 19465389 20814275 22528958 24300809 26010706
4587 26010706 27458502 28667158 29655957 30318299 30664617 31074977 31710995 32448165 33422725
4578 33422725 34651193 36322132 38157555 40350514 42763937 45653650 49025961 52844176
4570 52844176 57455840 62769136 68689809 75364630 82824075 91167686 100658016 111028738
4562 111028738 122922331 137237471 154870344 177301125 206082821 241754461 283549337
4555 283549337 327764271 369402531 403015637 423471115 427392531 413514062 385145925
4548 385145925 347705758 306442447 265759037 229507927 199759513 176321530 157741048
4541A57741048j4942288j2269654j0315578q914865p939787p143505o478148n792379
4533H3944844n372822m980240m597550m337196l851075l433939l288023k972534
4525E1111465k815983k626566k191393j991498j908362j685115j606003j617539
4517C4669006j587321j374618j399197j277882j116193j092495j053182r99528
4509B4768590q57328q95414p62013o84222n80422o94636o13894o01970m91268
4500A8587423n46694o37349o56580n19488l11986l93318l50238j85695l31804
4491A4654271l57552k67650k12675j70677k23428n6125o9148j12252j41548j9464
4481A3023752k3004K17014P702J103J14394N6854J71106L34373J44587K66527
$$ plain form
4541 157741048 142798760 130529106 120213528 111298663 103358876 96215371 89737223 83944844
4533 83944844 78572022 73591782 68994232 64657036 60805961 57372022 54083999 51111465
4525 51111465 48295482 45668916 43477523 41486025 39577663 37892548 36286545 34669006
4517 34669006 33081685 31707067 30307870 29029988 27913795 26821300 25768118 24768590
4509 24768590 23911262 23015848 22253835 21569613 20989191 20294555 19680661 19078691 18587423
4500 18587423 18040729 17403380 16746800 16227312 15915326 15522008 15171770 14986075 14654271
4491 14654271 14296719 14029069 13816394 13645717 13422289 13366164 13297016 13184764 13043216 13023752
4481 13023752 13000748 13217762 13225464 13226567 13340961 13397815 13568921 13903294 14047881 14314408
4471A4314408L48636N37149M65309M17411O43415O47582Q66538R54887P95514
4462A9990849Q24104N15724M50592J42321n0298k45209o42293p89491q32677q21385
4452A8542237r64520r79200p68029q32798q06423n87877n54637n90282o36173
4443A1822298l47796m01508n82402l79019l08592n29891l16927j96388k70396
4434H489379l30309l72781j52668p5561m41485q6668j64175p8282j22725j30886
4424F533839j82347j18686k80378m1797k51175m5793j39307j53826Q7721j99044
4414E209207j18817o3642r1950p6949n6998j42421n374j31281j09890j13266k7754
4403D270865j19743j36622l5859m0721j65710j43199J48359M4138j01823n8555
$$ plain form
4471 14314408 14663044 15200193 15665502 16082913 16726328 17373910 18240448 19195335 19990849
4462 19990849 20814953 21330677 21781269 21923590 21873292 21628083 20985790 20196299 19363622 18542237
4452 18542237 17577717 16598517 15830488 14997690 14191267 13603390 13048753 12458471 11822298
4443 11822298 11474502 11072994 10490592 10111573 9802981 9273090 8956163 8759775 8489379
4434 8489379 8159070 7786289 7633621 7558060 7116575 7029907 6865732 6787450 6664725 6533839
4424 6533839 6351492 6232806 5952428 5910631 5659456 5613663 5474356 5320530 5408251 5209207
4414 5209207 5090390 5026748 4934798 4857849 4800851 4658430 4653056 4521775 4411885 4298619 4270865
4403 4270865 4151122 4014500 3978641 3937920 3772210 3629011 3777370 3821508 3719685 3661130
4393C661130j27014K5309k3340j78415j22025n5765l186p4684m2658p2225j5175
4382B971952J09111j13003K4338j90724j35172J7929R7108P2381J786m2972q6505
4371B726229J24083j14911k73753K1994j61789j60697M9755o8766k1664n1600
4361B068881o1709K9752J00674j00765j12631j30978M1111p2008N2243J45778
4351A960348j63627K662o2997Q6338j86509n4438N9387K4745m3172R1092O6237
4340A780066n9097q7188p1791R2530o4788N0464O0413l3588L428o4537J51412
4329A757324o3950l2778o0895J08347k4864j17758p2037J8296L5258J5505M6252
4318A608700r9932o1937j0244J55942q0339J28982j25642N9725k8598p4907N3466
$$ plain form
4393 3661130 3534116 3559425 3536085 3357670 3235645 3179880 3176694 3102010 3059352 2987127 2971952
4382 2971952 3081063 2968060 2992398 2801674 2666502 2684431 2781539 2853920 2855706 2812734 2726229
4371 2726229 2850312 2735401 2461648 2483642 2321853 2161156 2210911 2142145 2120481 2068881
4361 2068881 2007172 2036924 2137598 2036833 1924202 1793224 1834335 1762327 1814570 1960348
4351 1960348 1796721 1799383 1736386 1822724 1636215 1581777 1641164 1665909 1622737 1713829 1780066
4340 1780066 1720969 1633781 1561990 1654520 1589732 1640196 1700609 1667021 1670449 1605912 1757324
4329 1757324 1693374 1660596 1599701 1708048 1683184 1565426 1493389 1511685 1546943 1562448 1608700
4318 1608700 1508768 1446831 1436587 1592529 1512190 1641172 1515530 1575255 1546657 1471750 1525216
4307A525216k6059p2633J42513J29928N8072K8305R9103P3789R3361Q8169j9577
4296B120187m0291j30982q3511j68876o0648J6283J15284q4748k44608j8656N2943
4285A472377R7573P3241M8886j5044P2453k0475j23714O1283k5839o7303O4971
4274A638409R5718K64480N7187j255K44062L6079M9497J03218K22850K22924K61884
4263C195053J94345J83040J28744j50563k03703o5872k69180j64660k11564k42968
4253B392672k7309k07220j49545j85673M0147K7754R3995p8158q9108j31304N3052
4242A739303o639j41452O1983j4309J06398j80791L793J75941L3091m6496K2103
4231A752925l3730M2851M9799N3678j33563n8824k0786K2015k06407J00573J24147
$$ plain form
4307 1525216 1499157 1426524 1569037 1698965 1757037 1785342 1884445 1958234 2051595 2139764 2120187
4296 2120187 2079896 1948914 1865403 1696527 1635879 1652162 1767446 1682698 1438090 1419434 1472377
4285 1472377 1569950 1643191 1692077 1677033 1749486 1729011 1605297 1666580 1640741 1573438 1638409
4274 1638409 1734127 1998607 2055794 2054539 2298601 2334680 2384177 2487395 2710245 2933169 3195053
4263 3195053 3389398 3572438 3701182 3550619 3346916 3281044 3011864 2847204 2635640 2392672
4253 2392672 2365363 2158143 2008598 1822925 1863072 1890826 1984821 1906663 1817555 1686251 1739303
4242 1739303 1732664 1591212 1653195 1638886 1745284 1564493 1568286 1744227 1777318 1730822 1752925
4231 1752925 1719195 1762046 1811845 1865523 1731960 1673136 1652350 1674365 1467958 1568531 1692678
4220A692678J67264J6518j0953P1266q1224Q8653N0535k086J7834Q5815j14292
4209A982008q4328J10289M335L3352N2692K0321O5431n6466k5713J052J10688
4198B213661J70884J32246J5836o0937L4105J78054r2689J33359m6830l1733P5720
4187B721676J58733J41636R2444n4104O3861j27104Q3102M0903q952P1619L4171
4176C217985J43323j6524O114j1592J8522O7838J53607j4910L257P3581O1685
4165C702886J00868J07199r2527M0663O1167R3732L4896Q498Q7381l4055J54662
4154D265370o4953j9548j9550K81876N8802n9302L848J13904K7429r2451O4554
4143D559979o4042N8197J76910K6754j35986M1381o4818O9964r8879L879j131
$$ plain form
4220 1692678 1859942 1876460 1865507 1936773 1855549 1944202 1994737 1992651 2010485 2096300 1982008
4209 1982008 1897680 2007969 2012304 2045656 2098348 2118669 2184100 2127634 2101921 2102973 2213661
4198 2213661 2384545 2516791 2532627 2471690 2505795 2683849 2591160 2724519 2677689 2645956 2721676
4187 2721676 2880409 3022045 3114489 3060385 3124246 2997142 3080244 3121147 3112195 3183814 3217985
4176 3217985 3361308 3344784 3350898 3339306 3357828 3425666 3579273 3564363 3567620 3641201 3702886
4165 3702886 3803754 3910953 3818426 3859089 3920256 4013988 4048884 4057382 4144763 4110708 4265370
4154 4265370 4200417 4180869 4161319 4443195 4501997 4442695 4446543 4560447 4587876 4495425 4559979
4143 4559979 4495937 4554134 4731044 4757798 4621812 4663193 4598375 4668339 4569460 4573339 4572208
4132D572208Q872k4077o3087l41728J9924O3544k4397j1523m206j8609p4507J7095
4120D119509n259m8058j05290q9355j48737j35924j19820r9992j24592o1671J23302
4109C304113o9550j99168j37916n2690p4672J3097L7427o2868J2436r4523p1940
4098B603746m4861J40508M7806j93027j29692M8133q1778j03982j07240J75992
4088B355605k0993q6682l1392M0146q532k43529Q0952N4412J9136k69757m7216
4077A842150J77378L5993r1864M3920O9296j83436N2400q6315l0717J6316N1204
4066A896325p5267K5106M1377p2144j53616L2091K29180M5905o1480q0387L3757
4055A860847p2567k8558P595r780p54j01445J08728M8329j74091n4280r0275k8348
$$ plain form
4132 4572208 4581080 4557003 4493916 4152188 4172112 4235656 4211259 4199736 4195530 4176921 4102414 4119509
4120 4119509 4114250 4066192 3960902 3871547 3722810 3586886 3467066 3367074 3242482 3180811 3304113
4109 3304113 3234563 3035395 2897479 2844789 2770117 2783214 2820641 2757773 2770209 2675686 2603746
4098 2603746 2558885 2699393 2747199 2554172 2424480 2472613 2390835 2286853 2179613 2355605
4088 2355605 2334612 2247930 2216538 2256684 2248152 2004623 2085575 2139987 2159123 1889366 1842150
4077 1842150 2019528 2055521 1963657 2007577 2076873 1893437 1945837 1859522 1828805 1845121 1896325
4066 1896325 1821058 1846164 1887541 1815397 1661781 1693872 1923052 1968957 1907477 1827090 1860847
4055 1860847 1788280 1759722 1767317 1757537 1756783 1655338 1764066 1812395 1638304 1584024 1493749 1465401
4043A465401J72365J67167k4545j09166L3830R7677Q698L5632j81826P4315o4945
4032A674603j13471K12019P1375j58805J96211K6037k32420n9521P0228j25189
4022A561067k4759K9607J64343M9818O7279K1932j44323m4809p4525J12362J25661
4011A843653l78K03801J9677j28737M7216j80515L5296J66307J91958j5496j13551
4000B069231Q9109j6428M3148J07950o4338n9133L6025J43919l1022j3589N8332
3989B363204N2335O7336P2833p7243Q6831M6080O0642j25335R8173r9040J67750
3978B713566Q3452M3874J39841J48155P6931j02748l7950k7981m8233j18652J32198
3967C002453Q7155m7307n7460K14134n9619q4700J87065P6349J66307j6P1184
$$ plain form
4043 1465401 1637766 1804933 1780388 1671222 1705052 1802729 1811427 1847059 1665233 1739548 1674603
4032 1674603 1561132 1773151 1844526 1685721 1881932 1907969 1675549 1616028 1686256 1561067
4022 1561067 1536308 1565915 1730258 1780076 1847355 1869287 1724964 1680155 1605630 1717992 1843653
4011 1843653 1843275 2047076 2066753 1938016 1985232 1804717 1840013 2006320 2198278 2182782 2069231
4000 2069231 2158340 2141912 2185060 2293010 2228672 2169539 2205564 2349483 2318461 2304872 2363204
3989 2363204 2415539 2482875 2555708 2478465 2565296 2611376 2672018 2546683 2644856 2545816 2713566
3978 2713566 2797018 2840892 2980733 3128888 3205819 3103071 3065121 3037140 2988907 2870255 3002453
3967 3002453 3089608 3042301 2984841 3198975 3139356 3054656 3241721 3318070 3484377 3484361 3555545
3956C555545Q8939p8816K46166R3468N5963J02921K52113J28982K14237K68600
3946D928118J4776M8770N3967J88759K80008K4166J09848J74153k7259J1579L5179
3935E842064O8847J16718J59134J83751J68112J51139K60811L57108L99555L50495
3925H057734M71450M20915L60901M53524K34473L84770N3056J52512J00339L8875
3915A0728549K77981K40172M32936L66258L80177N55866O34065M32280P06670
3906A4754954R04274J066914J061686R57077J152253J206193J070949R81447R02101
3897B4057848J265960J442355J771404K206470K641300L148239L506825L854379
3889D3894780L926237L835696K727975J747529J441075J447189J606891J879581
$$ plain form
3956 3555545 3644484 3565668 3811834 3905302 3961265 4064186 4316299 4445281 4659518 4928118
3946 4928118 4942894 4991664 5045631 5234390 5514398 5538564 5648412 5822565 5795306 5806885 5842064
3935 5842064 5910911 6027629 6186763 6370514 6538626 6689765 6950576 7307684 7707239 8057734
3925 8057734 8529184 8950099 9311000 9764524 9998997 10383767 10436823 10589335 10689674 10728549
3915 10728549 11006530 11246702 11679638 12045896 12426073 12981939 13616004 14048284 14754954
3906 14754954 15659228 16726142 17787828 18744905 19897158 21103351 22174300 23155747 24057848
3897 24057848 25323808 26766163 28537567 30744037 33385337 36533576 40040401 43894780
3889 43894780 47821017 51656713 54384688 56132217 57573292 59020481 60627372 62506953
3881F2506953K196275K731743L176143L567843L749719K993523K258513J348385
3873H4529097P01401P27736Q98779J442914K067671K913942L465173M183701N334918
3864A06265332O401451O521194N230183J905416k517799n713191o492298n748594
3856A05851694m569718l643618l091380k339568j592004q82026m88476l79038
3848H8865866l79146j297376k305708l290355l728752l511545l128379k361990
3840F8862615j733118j688867j540218j309474j488228k075257k823072l502500
3832E2701881l907340l842502l434087k864231k319144k005205j888313j406979
3824C1034080j205985j112846r29440j011199j331478j165309j153573j090211
$$ plain form
3881 62506953 64703228 67434971 70611114 74178957 77928676 80922199 83180712 84529097
3873 84529097 85230498 85958234 86857013 88299927 90367598 93281540 96746713 100930414 106265332
3864 106265332 112666783 119187977 124418160 126323576 123805777 118092586 111600288 105851694
3856 105851694 101281976 97638358 94546978 92207410 90615406 89733380 89244904 88865866
3848 88865866 88486720 87189344 84883636 81593281 77864529 74352984 71224605 68862615
3840 68862615 67129497 65440630 63900412 62590938 61102710 59027453 56204381 52701881
3832 52701881 48794541 44952039 41517952 38653721 36334577 34329372 32441059 31034080
3824 31034080 29828095 28715249 27785809 26774610 25443132 24277823 23124250 22034039
3816B2034039r18424r64326p23179o19009o38136m98171n10294n47710n04406
3807A6110384k64244j85885m0235j45583l37574j56695k44533k56553m61033l76088
3797A3641961m11017l63319m22237m34729j88771j73778k24100k88528q7083k41246
3787A0807153k19030l15688j51697k72294k71484k9302n1622k13304j86049k70249
3777H826434k54275j86828k46575j67976j23130j66420q084j97964l10488k53957
3767F910737j6330j65487k06810k5730J967k07518k07352M9029j59634p6673j36410
3756E759789r7313r7487q9883j04811M0765j43118p842j21081r7814r9399j68994
3745D772812j14075j16046m3650j61175r9301q623q7755k22970r9634L1796J13599
$$ plain form
3816 22034039 21115615 20151289 19428110 18809101 18170965 17672794 17162500 16614790 16110384
3807 16110384 15846140 15660255 15620020 15474437 15136863 14980168 14735635 14479082 14018049 13641961
3797 13641961 13230944 12867625 12445388 12010659 11821888 11648110 11424010 11135482 11048399 10807153
3787 10807153 10588123 10272435 10120738 9848444 9576960 9547658 9496036 9282732 9096683 8826434
3777 8826434 8572159 8385331 8138756 7970780 7847650 7681230 7673146 7475182 7164694 6910737
3767 6910737 6894407 6728920 6522110 6496380 6498347 6290829 6083477 6132506 5972872 5896199 5759789
3756 5759789 5662476 5564989 5475106 5370295 5411060 5267942 5260100 5139019 5041205 4941806 4772812
3745 4772812 4658737 4542691 4499041 4337866 4238565 4229942 4142187 3919217 3819583 3851379 3964978
3734C964978O0693j60396j44694o8471n6167K4009N4791R8160j6449j38623j73744
3723C444087n2348j5196n4786L4027j43184j41909n6147J67992p8367l09949M9153
3712B843373l9522r0928l4432r3573K3619J6210n6507l9516N2957M3882K2772
3701B648335k7247n2401q4993j90262q1040p9604M271o597l1073J29746k5942
3690B203193M3699j3470N144j70813J2975J10926r4184j4693P294o5824j42251
3679A881996R7333j40309k2956l3724j18099K1790J39448L4755q5869M7820L9988
3668A862173j08065o5674k2933K6916j28895J7623J2211R124P4804q0068P1080
3657A668296J27857o7174j13491n66L8710N2305j52035O4543J43338j9712j04171
$$ plain form
3734 3964978 4025671 3865275 3720581 3652110 3595943 3619952 3674743 3772903 3756454 3617831 3444087
3723 3444087 3391739 3376543 3321757 3355784 3212600 3070691 3014544 3182536 3104169 2794220 2843373
3712 2843373 2803851 2712923 2678491 2584918 2608537 2624747 2568240 2528724 2581681 2625563 2648335
3701 2648335 2621088 2568687 2483694 2293432 2212392 2132788 2137059 2130462 2099389 2229135 2203193
3690 2203193 2246892 2233422 2238566 2067753 2080728 2191654 2097470 2082777 2090071 2024247 1881996
3679 1881996 1979329 1839020 1816064 1782340 1664241 1686031 1825479 1860234 1774365 1822185 1862173
3668 1862173 1754108 1688434 1665501 1692417 1563522 1581145 1593356 1602480 1677284 1597216 1668296
3657 1668296 1796153 1728979 1615488 1614922 1653632 1705937 1553902 1618445 1761783 1742071 1637900
3646A637900L9586j958j35895P5061M3964J0818N5272J29847l8451q1296O4148
3635A798996R4796M3351J12594P3578p2924l6156K8752R716K09147N2634J16250
3624B430734j2057j92279N6658O3682J00605Q6617P2562P5829N9682K4505K0657
3613B787195J47265J13739o044J05099J20387R3332J36723K03645k5810J76055
3603C851586R9648K72411K00535J37204N6452J11467J05427J98338K66590J78928
3593E478586K82539K74228L12796L77345J53949J29531L65564L76152K00094J24726
3583H075510J06078L03210K74471J39836M0543l8307J43877q7379J14785R9940
3573I172564L7357J26678J07325J14509K17286J77229J98001K22741L70885K95701
$$ plain form
3646 1637900 1677486 1675528 1539633 1614694 1658658 1669476 1724748 1854595 1816144 1734848 1798996
3635 1798996 1893792 1937143 2049737 2123315 2050391 2014235 2042987 2052703 2261850 2314484 2430734
3624 2430734 2418677 2226398 2283056 2346738 2447343 2533960 2606522 2682351 2742033 2766538 2787195
3613 2787195 2934460 3048199 3042155 3147254 3267641 3360973 3497696 3701341 3675531 3851586
3603 3851586 3951234 4223645 4424180 4561384 4617836 4729303 4834730 5033068 5299658 5478586
3593 5478586 5761125 6035353 6348149 6725494 6879443 7008974 7374538 7750690 7950784 8075510
3583 8075510 8181588 8484798 8759269 8899105 8939648 8901341 9045218 8957839 9072624 9172564
3573 9172564 9209921 9336599 9443924 9558433 9775719 9952948 10150949 10373690 10744575 11040276
3563A1040276J97004J69608L34367N88649L59249M64962L38162L54975M21263
3554A4268515L19048K66090J64609J82210J2015j48697q0083k80589l09230j30853
3544A4263035j55800l70095l87519j16503L4993j94254l20250j98838m7081P2944
3534A2580632J25885J46830K77313K12353l67825m75280n52934l28332k85679
3525A1332963j71253k13211K8727j69911j32668k1028k05706j93627r8404l04600
3515I851282k38057j63783k84737k39347k09139p9886j78021l7065o8351j67286
3505H185610m4853P3885K08196L45689N29985O53783K28608k11854r42250q31625
3495H195174o96391p17284m75541l46009j88509k33764j23909r8375j05184j51419
$$ plain form
3563 11040276 11237280 11406888 11741255 12329904 12689153 13154115 13492277 13847252 14268515
3554 14268515 14587563 14853653 15018262 15200472 15212487 15063790 14983707 14703118 14393888 14263035
3544 14263035 14107235 13737140 13349621 13233118 13268111 13073857 12753607 12554769 12507688 12580632
3534 12580632 12706517 12853347 13130660 13343013 12975188 12499908 11946974 11618642 11332963
3525 11332963 11161710 10948499 10977226 10807315 10674647 10653619 10447913 10254286 10155882 9851282
3515 9851282 9613225 9449442 9164705 8925358 8716219 8636333 8458312 8421247 8352896 8185610
3505 8185610 8140757 8214642 8422838 8768527 9298512 9952295 10180903 9969049 9026799 8195174
3495 8195174 7498783 6781499 6305958 5959949 5771440 5537676 5413767 5315392 5210208 5058789
3485E058789p9016j60729j10416j12612j37040p8191J38947o3900p6412J39166
3475D518586J58406O6088q7736m1741K42165L04799Q5706L82133K75234j00873
3465E802767l10938m47132k21080l01513l17086j26325j81548k03244J3511l7580
3455C669832j39818j16809k69295q2808m9055N9653k7324j15950p1012r6606k3645
3444B737163j89128j11328N2686J4365j26624j97622k56p277J34133J5724m5679
3433B276157j79467J3004k17826M1636M4264j32934P837L955L2384m3413K2207
3422A867804L4490j2049j5376N0127j7425K4918J5805r155J5784j48578N3190
3411A859535J39283k8570j3425J10585J6588l8884J32572J30009j5314q902N1078
$$ plain form
3485 5058789 4979773 4819044 4708628 4596016 4458976 4380785 4519732 4455832 4379420 4518586
3475 4518586 4676992 4743080 4655344 4613603 4855768 5160567 5246273 5628406 5903640 5802767
3465 5802767 5491829 5044697 4823617 4522104 4205018 4078693 3897145 3693901 3707412 3669832
3455 3669832 3530014 3413205 3143910 3061102 3012047 3071700 3044376 2928426 2857414 2760808 2737163
3444 2737163 2548035 2436707 2489393 2503758 2377134 2179512 2179256 2171979 2306112 2321836 2276157
3433 2276157 2096690 2109694 1891868 1933504 1977768 1844834 1852671 1856626 1889010 1845597 1867804
3422 1867804 1902294 1890245 1874869 1924996 1907571 1932489 1948294 1939139 1954923 1806345 1859535
3411 1859535 1998818 1970248 1956823 2067408 2083996 2045112 2177684 2307693 2292379 2283477 2334555
3400B334555J9975J98818J04836J9320L5617J20901J60875J25483N985P2120J41098
3389C339583K3748L8406p1070J10840J99899L5143j5729m6270n1650J93279P1665
3378C827844j40315N0028q3977j77720j4246M2858j7195m2512j34470k11005o6016
3367C033274l0341j44307r1100j88342r0973j15809r8726L2651j43578p0079J8762
3356B111432n2877Q215j7772r6466j60703k8621o9269K3240n6413k4049k1280
3345A615437K0179R3160P9058k1527L2526p0211j8544r6789n9311n4388J4238
3334A533828j10450j16117K1372j21595j732j764N2273K3888j32350K5767L3735
3323A206855k2954N2478M7175j66708J6460J44195n1897j7608j5529Q1871j404
$$ plain form
3400 2334555 2354530 2553348 2658184 2677504 2713121 2834022 2994897 3120380 3126365 3198485 3339583
3389 3339583 3363331 3401737 3330667 3441507 3641406 3676549 3660820 3614550 3562900 3756179 3827844
3378 3827844 3687529 3737557 3653580 3475860 3461614 3504472 3487277 3444765 3310295 3099290 3033274
3367 3033274 3002933 2858626 2767526 2579184 2488211 2372402 2273676 2306327 2162749 2092670 2111432
3356 2111432 2058555 2066770 2048998 1952532 1791829 1763208 1693939 1717179 1660766 1636717 1615437
3345 1615437 1635616 1728776 1807834 1786307 1818833 1748622 1730078 1633289 1573978 1519590 1533828
3334 1533828 1423378 1307261 1328633 1207038 1205306 1203542 1255815 1279703 1147353 1173120 1206855
3323 1206855 1183901 1236379 1283554 1116846 1133306 1277501 1225604 1207996 1192467 1274338 1272934
3312A272934j22456K6427P7514J6191p8796J00496K9973j89613N4712n5098J01603
3301A233887N4195n1896r6611k38561k3199Q0137N0125R5133m6449l8584Q1592
3290A099769m7226L5171J6529r333P7973n8340L7728q2240q9515O0506K0369j39417
3278I21974l1614j8595m8172L5506N4157P1636P6228o5925j5936o6998O5864N8259
3266A036384k9703n2576J5485N5635k9976N717m4459J3885j8585n1783K06023
3255A106047o049M7513q496l3587q1305p9764R5500j903j0857J37104K5955j2005
3243A178153j04996O4177J10323m4171L2002P046J02869K05280Q93m8439L0840
3232A533977j1807R0210k559J1916m1389N2956L3908L4236q8395K2851j37519
$$ plain form
3312 1272934 1150478 1176905 1254419 1270610 1191814 1292310 1322283 1132670 1187382 1132284 1233887
3301 1233887 1288082 1236186 1139575 901014 877815 957952 1008077 1103210 1056761 1018177 1099769
3290 1099769 1052543 1087714 1104243 1094910 1172883 1114543 1152271 1070031 980516 1041022 1061391 921974
3278 921974 890360 871765 823593 859099 913256 984892 1061120 995195 979259 912261 978125 1036384
3266 1036384 1006681 954105 969590 1025225 995249 1000966 956507 970392 951807 900024 1106047
3255 1106047 1099998 1147511 1139015 1105428 1024123 944359 1039859 1037956 1027099 1164203 1190158 1178153
3243 1178153 1073157 1137334 1247657 1203486 1235488 1242534 1345403 1550683 1551576 1503137 1533977
3232 1533977 1522170 1612380 1609821 1621737 1580348 1633304 1667212 1701448 1613053 1635904 1498385
3221A498385j10509K9991P2784Q7448J8466j41116N2333j31377p297M6111n9273
3210A355946J13990o5264n0909J09909l1057Q7253l4321j5771R0924p5181j4884
3199A470635J08865J44431n0820K1865K6426j5391M1359N5140j7228R7361r394
3188A873249k46793O9746J49491P5843p0936r0427J6571J18330M9980n5171k0880
3177A869003k9440l126q5371n0227L1498J43633j49181p5944j12621m0239n887
3166A492098j4334P270P8739N1640j04130L5684O8215m3018N0111p085J07096
3155A722286n0029r7724M9451M4829P091r9870j7524O8162J35318r1944l1999
3144A638047P7810M9145m9073q1925J02827l3075L9387M8567J37281r7970q8814
$$ plain form
3221 1498385 1387876 1417867 1490651 1578099 1596565 1455449 1507782 1376405 1369108 1415219 1355946
3210 1355946 1469936 1404672 1353763 1463672 1432615 1519868 1485547 1469776 1560700 1485519 1470635
3199 1470635 1579500 1723931 1673111 1694976 1721402 1706011 1747370 1802510 1785282 1882643 1873249
3188 1873249 1626456 1696202 1845693 1921536 1850600 1760173 1776744 1895074 1945054 1889883 1869003
3177 1869003 1839563 1836437 1751066 1700839 1732337 1875970 1726789 1650845 1538224 1497985 1492098
3166 1492098 1477764 1485034 1563773 1615413 1511283 1546967 1615182 1572164 1622275 1615190 1722286
3155 1722286 1672257 1574533 1623984 1668813 1675904 1576034 1558510 1626672 1761990 1670046 1638047
3144 1638047 1715857 1765002 1715929 1634004 1736831 1703756 1743143 1791710 1928991 1831021 1742207
3133A742207L9148n2132n9600N9848J02373j5518j4553K0481M9564L0605J01008
3122B003431r3487j31099p4151M2332p41l9850r0664M2846j17184j50549P9790
3111A470674l6697M27J04811O192k393p7113j49389k789P9381O1347m5689j76323
3099A232439J31127r6774p757O6311L8062P6105n3278J2794P3077l9644j5576
3088A416886r6250j28632o427M0461M0900q1910p2690J11997m8027j4040j30553
3077A031715j0327P2193n1910q5913r6719O6711j9768m1718o8964j0945R7279
3066H81634J41150M7935L305p8944N9829q0854o8485N6178Q957m3351L8557R121
3054I75032m9067l5701r6981K1213M8071k9672P8307Q957L3665k06656k2755K1326
$$ plain form
3133 1742207 1781355 1729223 1669623 1729471 1831844 1816326 1801773 1822254 1871818 1902423 2003431
3122 2003431 1909944 1778845 1704694 1747026 1746285 1706435 1615771 1658617 1541433 1390884 1470674
3111 1470674 1433977 1434404 1539215 1545407 1543014 1465901 1316512 1313723 1393104 1454451 1408762 1232439
3099 1232439 1363566 1266792 1259035 1325346 1363408 1439513 1386235 1399029 1472106 1432462 1416886
3088 1416886 1320636 1192004 1185577 1226038 1266938 1185028 1112338 1224335 1176308 1162268 1031715
3077 1031715 1021388 1093581 1041671 955758 859039 925750 905982 864264 795300 784355 881634
3066 881634 1022784 1070719 1074024 995080 1054909 974055 905570 961748 970705 927354 965911 975032
3054 975032 925965 890264 793283 814496 862567 832895 911202 920159 953824 747168 724413 745739
3042G45739l0123K7400Q6424m0139p2388q1787J07757O3310o6521j0820k3923
3031G04929O48J12602L8311n2847P5824m2751Q9435j0781o7544P245j556j19006
3019G34509m9789R9742L7015l3095Q0690j6448J439L7535Q4826L6364J8682R1574
3007A123044k7063p6558l2247J4018L7692R0979R6545Q4399k3278P6919L2648
2996A397098N3971L09800q6803M0417J82523j3526J76241J61436J47827K37696
2986B606680J70261J87102J92711K77378L92582J60937K84525L00478M28784K91828
2976E293266K32255L25477J06213O3335K8998k16956k29927l44453l13659l61063
2966D583486k99682j68157l97009p5455k04074j98787k73364j06661j24686k39658
$$ plain form
3042 745739 715616 743016 829440 789301 716913 635126 742883 806193 739672 728852 704929
3031 704929 705577 818179 856490 803643 879467 836716 926151 915370 847826 855071 853515 734509
3019 734509 684720 784462 821477 788382 869072 852624 854063 891598 976424 1012788 1031470 1123044
3007 1123044 1095981 1019423 987176 1001194 1038886 1129865 1226410 1310809 1287531 1364450 1397098
2996 1397098 1451069 1760869 1674066 1714483 1897006 1883480 2059721 2221157 2368984 2606680
2986 2606680 2776941 2964043 3156754 3434132 3826714 3987651 4272176 4572654 5001438 5293266
2976 5293266 5525521 5850998 5957211 6020546 6049544 5832588 5602661 5258208 4944549 4583486
2966 4583486 4283804 4115647 3718638 3643183 3439109 3240322 2966958 2860297 2735611 2495953
2956B495953j20573j56280k03147o8412N0825r2062J3559j01431j51012o1688
2946A605732K0898p8801j59415Q4842q176j37457j25240l8445L0576L1096r6583
2935A129027r5547j33970j4368l9311M2976p1709R2043J1174m8043m7237q7699
2924G37336O5316M7732o7226n9223O4784m5703l7566j07383j2220R77L2586K7847
2912F47257K29215j05821j88345N480j5880R8042P222j40423j3910q9023l6310
2901C97504J0007J29768M8395j60103P8425P4554j58799n4619J71684r827K714
2890E29703K6723k06638R1566J097j29000K4289o134k5534O6821J00556n024j32175
2878C36250k2509J33441N9168m7073p2972r05o6261N483j2124M0670M9729j12640
$$ plain form
2956 2495953 2375380 2219100 2015953 1947541 1998366 1906304 1919863 1818432 1667420 1605732
2946 1605732 1626630 1547829 1388414 1473256 1465080 1327623 1202383 1163938 1194514 1225610 1129027
2935 1129027 1033480 899510 885142 845831 888807 817098 909141 920315 872272 825035 737336
2924 737336 802652 850384 783158 723935 788719 743016 705450 598067 585847 586824 619410 647257
2912 647257 876472 770651 582306 587786 571906 669948 677170 536747 522837 433814 397504
2901 397504 407511 537279 585674 425571 503996 578550 419751 365132 536816 526989 529703
2890 529703 556426 349788 441354 442451 313451 337740 331606 306072 372893 473449 468425 336250
2878 336250 313741 447182 506350 459277 386305 385400 319139 324622 312498 353168 402897 290257
2866B90257m47j70K3009j51782N6658J07469n5676R7969k8339o1201m1462O3287
2854B99572n6332K8930n1441J8016O1672l8526q4021M2454P0125r3082K2505o8804
2842A51068J27497k1301j07351R928P0578k0816k1033n2207J09113J5543N8489
2831C19508o0710j04914q4682p3359P6116n8227K56818k9234p5037p0579O0351
2820A56051N6289k8O4914O850n8944n0886o0893P2742J25290j40052m0117J47965
2808B79181K2386j8052l7423O536p4635p1991n6489k4804R7312P9825j5614Q7801
2796B74033P024j9620k20689Q9430M7432j80891M8345P4455J44321l7673j09380
2785A16787R1438O8100o2463P1561j64569L755M6655J18376j16181j10415L6133
$$ plain form
2866 290257 289810 289640 312649 160867 217525 324994 269318 367287 338948 277747 236285 299572
2854 299572 243240 272170 220729 238745 300417 261891 177870 220324 290449 197367 219872 151068
2842 151068 278565 257264 149913 159841 230419 209603 188570 136363 245476 261019 319508
2831 319508 258798 153884 69202 -4157 71959 13732 270550 241316 166279 95700 156051
2820 156051 212340 212312 277226 284076 225132 174246 113353 186095 311385 171333 131216 279181
2808 279181 301567 283515 246092 252628 177993 106002 49513 24709 122021 201846 186232 274033
2796 274033 281057 261437 40748 130178 177610 -3281 45064 119519 263840 226167 116787
2785 116787 208225 276325 213862 285423 120854 124609 171264 289640 173459 63044 99177
2774I9177J09802q4636N6017j5691q8006J00754J09134R2143m7200k690q6040
2763B42764p0239l9039J62532n2115q4989j03089J12713n749K6425M7563N8134
2752B94911o9743j41682r9155j31753J24678R3509K0580J3590J2486O3717J08907
2741B90045p4649k9048j15525J48900k3183Q8232m2435k1900M6963j38744J6286
2730A44942Q8466N3976r7952l8606N9726l6741n9595Q7361Q6479l9365l0158j3063
2718B05470j98563R9535p9979n681o8621M4399J5414K8327M3936k9167J29678
2707A84748P3137K5160K2770l3713l9303p9060k7616l621M1334P1728j39206j05745
2695i387O5907J12385N7191o5820k0007K04508q3539j9203M2253l7480j00356
$$ plain form
2774 99177 208979 124343 180360 164669 76663 177417 286551 378694 331494 328804 242764
2763 242764 172525 133486 296018 243903 158914 55825 168538 162789 189214 236777 294911
2752 294911 225168 83486 -15669 -147422 -22744 70765 91345 104935 117421 181138 290045
2741 290045 215396 186348 70823 219723 196540 284772 242337 220437 267400 128656 144942
2730 144942 233408 287384 189432 150826 210552 173811 114216 201577 288056 248691 218533 205470
2718 205470 6907 106442 26463 20782 -47839 -3440 11974 40301 84237 55070 184748
2707 184748 257885 283045 305815 272102 232799 153739 126123 122502 163836 235564 96358 -9387
2695 -9387 56520 168905 226096 160276 140269 344777 261238 242035 284288 246808 146452
2684A46452Q7007j45795k480j9455j2419l9297N7718K60091n3789q1378j43064
2673E3591O0829j16430J18796J14095o9467p009l3099Q2310L6735k3418r3340
2662A23593j2912j6815J20927j07671j496J9621r9921L1692j08619M6884K9020
2651B4303K7179O5401j14179o8738L4385N6066l1912n116m2682R2703P8302J4400
2639A30112L4702j50841L8079K2124l6462J9518l1297l455O714K8186j06944M5495
2627d069J91495o427l5842j34666L7172j2999R358o9665N2575N8917l5909q1916
2615c1976M7701r3060P5207K8872k4853k1489p4176Q4515j42183J47200O4244
2604F0002m9579K7267j4937L0430J15074q6031K5867O2809J4882j51301K114M2107
$$ plain form
2684 146452 233459 87664 85184 65729 53310 14013 71731 331822 278033 196655 53591
2673 53591 114420 -2010 116786 230881 161414 154405 121306 203616 240351 216933 123593
2662 123593 110681 93866 214793 107122 105626 125247 25326 57018 -51601 -4717 24303
2651 24303 51482 116883 2704 -66034 -31649 24417 -7495 -12611 -55293 37410 115712 130112
2639 130112 164814 13973 52052 74176 37714 57232 25935 22480 29194 57380 -49564 -4069
2627 -4069 187426 180999 145157 10491 47663 34664 44022 -25643 26932 85849 49940 -31976
2615 -31976 15725 -77335 -2128 26744 1891 -19598 -93774 -9259 -151442 -4242 60002
2604 60002 10423 37690 22753 53183 168257 82226 108093 170902 185784 34483 36597 78704
2592G8704l6608o3476L0573Q8034k8900j13856O9920J26667k1838m1780O1796
2581A49236J7766j33784J4381J9335j8208L4459o6861j8730k3811Q4823l3608
2570B4998r9143J05097N4663J4128k9266J72326j67922q9318p3228R0326R969
2559A2630j13253M810O0175M7067l801Q8561N2765j70310O9172N3040m352k1063
2547G5441m3216k16j13413J32016r0468o0083O4678J62483p5597N6032K2171j29135
2535F93m2004l1306J7862N8646M4318o4995P3068l6277O0385k1884q8068l0480
2523f0042P7705J51218l1710l686j500k1322q9073m1729O0075O7235J23705j17004
2511A13872j38645K06080p569j23492o9508r399N408q0698J57134m9184N9705
$$ plain form
2592 78704 42096 -21380 9193 97227 68327 -45529 24391 151058 129220 87440 149236
2581 149236 167002 33218 47599 66934 48726 83185 16324 -2406 -26217 58606 24998
2570 24998 -74145 30952 85615 99743 70477 242803 74881 -14437 -87665 2661 12630
2559 12630 -100623 -95813 -35638 11429 7628 96189 148954 -21356 47816 100856 96504 75441
2547 75441 32225 32009 -81404 50612 -39856 -99939 -35261 127222 51625 107657 129828 693
2535 693 -41311 -72617 -54755 3891 48209 -16786 56282 20005 80390 58506 -29562 -60042
2523 -60042 17663 168881 137171 133485 131985 110663 21590 -20139 39936 107171 230876 113872
2511 113872 -24773 181307 173738 50246 -19262 -28661 -23253 -103951 53183 3999 63704
2500F3704j8370P6575k1698N4322o3472j41079o5161r8229R5762J08532k5022
2489c4136m4824P0318l0931j3697J38161J04567j66366o8103R3760l8386j69450
2478a59087k8375J45236J27692p9753K7541L3170k9738l9919r8079k1580O4607
2467e8285J95485o1962j66074P6753J10905O7118j20367L4R5618J33178l9454
2456B32949q62j61119M0495m7779L9992k3909R9245o4573n6751N4601j7358m1079
2444E3852m1998l1433P3147K00638K6027j41008n2105j2719q3329k6623R0429
2433E4878m8960m8544j2365p4845j9899m7612J35920K6688m1375J10752r2088
2422e7450o3043Q7540N6277K3792J2297m3316O4663M1971j53982j8867J9014L074
$$ plain form
2500 63704 45334 121909 100211 154533 91061 -50018 -115179 -213408 -117646 -9114 -34136
2489 -34136 -78960 -8642 -39573 -53270 84891 189458 23092 -45011 48749 10363 -159087
2478 -159087 -187462 -42226 85466 5713 33254 66424 36686 -3233 -101312 -122892 -58285
2467 -58285 137200 75238 -90836 -14083 96822 163940 43573 43607 139225 272403 232949
2456 232949 232087 70968 111463 63684 103676 79767 179012 114439 57688 112289 94931 53852
2444 53852 11854 -19579 53568 254206 280233 139225 87120 74401 -8928 -35551 54878
2433 54878 5918 -42626 -54991 -129836 -149735 -197347 -61427 -34739 -76114 34638 -57450
2422 -57450 -120493 -32953 23324 47116 59413 16097 80760 122731 -31251 -50118 -31104 -28030
2410b8030M8402j2709k154O2179O4552P9859j7291N0544j58108N4321j24389O4018
2398H1194K15136p1288j17073M4521Q7925L3270j21246M2377P6594q590O3440
2387C26260J2706m6434j06865j26986O8728L8070Q142q4571J1602J00178J73444
2376C74274L888n7548l37O7223j43014J5960N5347N4240J62099n6888o5329l5866
2364C74049n1111l0721M5848M686N9867M7736R6382k6083j8185J18476J26387
2353G47331J9880j3686l9077L1183M6921L8592J05451m1018K05248O2046J86764
2342A349635J38773J14565K94135J92982J80497L08491K05019J85919L10085L59496
2332C639597K40897L48788N44674P58121J068290J321453J955855K591354L188309
$$ plain form
2410 -28030 20372 7663 5509 67688 132240 212099 194808 245352 87244 141565 17176 81194
2398 81194 296330 225042 107969 152490 240415 273685 152439 194816 271410 262820 326260
2387 326260 338966 292532 185667 58681 127409 165479 173621 89050 100652 200830 374274
2376 374274 378162 320614 320277 387500 244486 260446 315793 370033 532132 475244 409915 374049
2364 374049 322938 292217 338065 342751 402618 450354 546736 520653 502468 620944 747331
2353 747331 767211 753525 714448 745631 792552 831144 936595 895577 1100825 1162871 1349635
2342 1349635 1488408 1602973 1897108 2090090 2270587 2579078 2784097 2970016 3280101 3639597
2332 3639597 3880494 4229282 4773956 5532077 6600367 7921820 9877675 12469029 15657338
2323A5657338K500225M40287k801470l324871k428616j770085j216008q70389
2315F186411o14906n73785n11900l89956j26896l08211j48201o5207k20832l40990
2305B885527k17867j55749j77293j97432q2403k08403q6459j31234o7549j7928
2295A543210j06760O6889j66262q3799j32353j04582l0417k0062n9392J14299
2285A020771o4456r9348n3760N9622o5487r4168O231n8076j02281J64186N2702
2274G65936j35541l2929L2045J7560J736p7950n1690k8709O9858l7971n0648K3030
2262D94727o1540n3676l1958k9222N2175m1977L3758j91275J5871J39842l6469
2251B90256p9534m2607K2157J04533m7507n0234J09699r7277O0601n4262K1291
$$ plain form
2323 15657338 18157563 18597850 15796380 12471509 10042893 8272808 7056800 6186411
2315 6186411 5571505 4997720 4485820 4095864 3968968 3660757 3512556 3447349 3226517 2885527
2305 2885527 2667660 2511911 2334618 2137186 2054783 1846380 1759921 1628687 1561138 1543210
2295 1543210 1436450 1503339 1337077 1253278 1120925 1016343 985926 965864 906472 1020771
2285 1020771 956315 856967 803207 862829 797342 703174 709405 651329 549048 713234 765936
2274 765936 630395 597466 629511 647071 648807 570857 519167 490458 560316 522345 471697 494727
2262 494727 433187 379511 347553 318331 370506 328529 362287 171012 186883 326725 290256
2251 290256 210722 168115 190272 294805 247298 197064 306763 209486 270087 215825 237116
2240B37116j4440l1665k4554L7984K0949J30109j38175l9196k3103O771J09740
2229B71536j28295L4351J12811r7053J21946k7766l7428m8803O6066m5693J1960
2218B33632j07942j47673Q0377Q2717K4614K7191p6279J8160K2489n8889k0043
2207G8354J13670R897k8894O2050j25986k6520L9797j06524J6006l9341r9027
2196a06518M3990Q4026Q0967r964j06935m9645J22626n0917Q2044K9102M6528
2185A65304p8110j9364L873j25126p2112L2834J33407L1824L7394L3814m7562
2174I6176j38689Q3801J3883R072J9775K4669R2939j05619j63416J59355K7902
2163A19848j12428P1006P960J1641N6864L4198k10916K2411p8959L4811O8220
$$ plain form
2240 237116 222676 191011 166457 204441 225390 355499 217324 178128 155025 161796 271536
2229 271536 143241 177592 290403 193350 315296 287530 250102 201299 267365 221672 233632
2218 233632 125690 -21983 58394 141111 165725 192916 116637 134797 157286 98397 78354
2207 78354 192024 201921 173027 235077 109091 82571 122368 15844 31850 -7491 -106518
2196 -106518 -62528 21498 102465 92501 -14434 -64079 58547 7630 89674 118776 165304
2185 165304 87194 67830 71703 -53423 -125535 -92701 40706 72530 109924 143738 96176
2174 96176 -42513 41288 55171 64243 84018 108687 201626 96007 -67409 91946 119848
2163 119848 7420 78426 86386 98027 154891 189089 -21827 584 -78375 -43564 24656
2152B4656k0589q0633M1487J31582N7702J1498o5975L2893N4195k6217m5364l5426
2140G9809k829J8527k9794j72515l9699J95120j9698o7684j2908l3669k8845J27555
2128A3370P0378m7417j39946M3590J2251j0671J12183o0215k2301q3623J589J31021
2116B0209o1834K3544P8759q4712r4531L4989J27248j150j2301K2303j10524j52886
2104b10886J54287Q7334L130j5515k9963j16695m2364J42826J817N0089j10979
2093h6919l0256O9715P9889n3832q3572J88014j2367n957k3795J6462M3145q0751
2081A9776j6561L2700m7993k9806N5013P1171k7187p1730P0298n8615J25265k8111
2069I4220K8525P4389O4675j04001j24231j77015m2699J75066j2887P1747k6702
$$ plain form
2152 24656 4067 -76566 -35079 96503 154205 165703 99728 132621 186816 160599 115235 79809
2140 79809 76980 95507 65713 -106802 -146501 48619 28921 -38763 -51671 -85340 -114185 13370
2128 13370 83748 36331 -103615 -60025 -47774 -58445 53738 -6477 -28778 -112401 -110812 20209
2116 20209 -41625 -18081 60678 -24034 -118565 -83576 43672 42522 30221 52524 -58000 -210886
2104 -210886 -56599 30735 33865 18350 -11613 -128308 -170672 -27846 -26029 24060 -86919
2093 -86919 -117175 -47460 32429 -21403 -104975 83039 70672 64715 40920 57382 100527 19776
2081 19776 3215 35915 -12078 -41884 13129 84300 57113 -14617 55681 -2934 122331 94220
2069 94220 122745 197134 261809 157808 33577 -143438 -186137 -11071 -23958 47789 21087
2058B1087j28099n1760J23351J11160l2863J8615o180j3891P1947o8119j08537
2047f3289N5459L1132n6091J38226J5503q5790n9862m2318J447K8414P9517m5419
2035c071m8534M3296n1778J1472m5212K8456m2965J07717J17785p5078j03710
2024f1622o51M6008J45946j75794R4039k1684j02443P1513l9040R4429o8110J20079
2012A02670o8839o2187O4738l8219n1806o7577J7485m898L2456M855P6030J3189
2000A7897j11092Q2356P5238r5565J1872J2586k9641J8758R5720M9256J9527j30510
1988A6402m7410P1113l8235J00143r6757N8594k0662m2128M0386j72596p7490
1977b08640J17539R149m2420M9095N8035L8533J3577K2399L5500o6825L9791l9872
$$ plain form
2058 21087 -107012 -158772 -35421 75739 42876 61491 55311 41420 113367 45248 -63289
2047 -63289 -7830 23302 -32789 105437 120940 35150 -24712 -67030 -65583 -37169 42348 -3071
2035 -3071 -51605 -8309 -60087 -48615 -93827 -65371 -108336 -619 117166 42088 -61622
2024 -61622 -62273 -16265 129681 -46113 47926 26242 -76201 -4688 -43728 50701 -17409 102670
2012 102670 33831 -28356 36382 -1837 -53643 -121220 -103735 -108633 -76177 -71322 4708 17897
2000 17897 -93195 -10839 64399 -31166 -19294 -6708 -36349 -17591 78129 127385 146912 16402
1988 16402 -31008 40105 1870 102013 5256 63850 43188 1060 41446 -131150 -208640
1977 -208640 -91101 -81952 -124372 -75277 -17242 21291 34868 57267 92767 25942 65733 25861
1965B5861p2690K7499K1467r6K3736j04341n2059K3795Q6017J15754j28434m024
1953c7515L4150j18140N5943q7429J09873q370j7122n1300l3507J10226J68978
1942A25787m490j32213p1025J10142O9012j7972L9360j8425o474J18194N6279
1931B68175k36018j20442O3458l3905M2441P6773j00051l0140o0656K7855k4980
1920a27490J88056q9315l4360J00117p0210M1583Q8731o405n8659k1092J4319
1909B5275n4640P1283j13142q815J52347n5276k485J33428j83896o5663K16317
1898A14733J54582j11376k79309P7171p2825J44173n3471M8997J32154j18733
1888C6096m033q9281K178o4357j6139j009j2182R2777J61022K1017j22155k8104
$$ plain form
1965 25861 -46829 -19330 2137 2041 25777 -78564 -130623 -106828 -20811 94943 -33491 -37515
1953 -37515 -3365 -121505 -65562 -152991 -43118 -51488 -68610 -119910 -153417 -43191 125787
1942 125787 121297 -10916 -81941 28201 97213 79241 118601 100176 93702 211896 268175
1931 268175 32157 -88285 -24827 -58732 -16291 60482 -39569 -69709 -130365 -102510 -127490
1920 -127490 60566 -28749 -63109 37008 -33202 8381 97112 90707 32048 10956 25275
1909 25275 -29365 41918 -71224 -80039 72308 17032 14547 147975 -35921 -101584 114733
1898 114733 269315 157939 -121370 -44199 -117024 27149 -26322 22675 154829 36096
1888 36096 32063 -57218 -55040 -119397 -135536 -136545 -148727 -55950 105072 126089 3934 -24170
1876b4170o2177J01406N0971N2948o8076J9404J5544j2697N8206j03806P2059
1865I9612m7650j12454l6174P7928L0347j5323L9110l903q4631j514j23839k8751
1853b07242j6001j02477J24914J46496k6721K6648j15737q4611J23804O212L1752
1842i2963J463O7705j50181q853J67997P3011J2943n7627m8426m5431p8671k8350
1830a87383R5917M5480k1480L3283m0070J4017O2790k26537P1104J83101Q5146
1819A15368k7987j07161o2002N2310N2029R8595j06001k8243k3001M6055j7613
1808g651k28280J02199Q6537l3703n6850r6825m351R1183J04940m0115Q8229M6237
1796E1550p1486q6975l8984o8469R9381J84507j6607j25581L0500L3418r8155
$$ plain form
1876 -24170 -86347 15059 66030 118978 50902 70306 85850 73153 131359 27553 99612
1865 99612 51962 -60492 -96666 -18738 11609 -3714 35396 31493 -53138 -54652 -178491 -207242
1853 -207242 -223243 -325720 -200806 -54310 -81031 -54383 -170120 -254731 -130927 -124715 -92963
1842 -92963 -91500 -23795 -173976 -182829 -14832 58179 71122 13495 -34931 -80362 -159033 -187383
1830 -187383 -91466 -45986 -67466 -34183 -74253 -60236 2554 -223983 -152879 30222 115368
1819 115368 87381 -19780 -81782 -29472 22557 121152 15151 -13092 -36093 9962 -7651
1808 -7651 -235931 -133732 -47195 -80898 -137748 -234573 -238924 -147741 -42801 -82916 5313 51550
1796 51550 -19936 -106911 -145895 -214364 -114983 69524 52917 -72664 -42164 -8746 -106901
1785a06901M2944r5894P1712J75903j6869m9347M0567n9314j77196j993R8249
1774g8139Q9185N5Q3776o0871l0459J9050k2858J9226r542l0470j7145N6541k5778
1761g429k6957j14896R3246N7583j0559j08341l0597j05138k0876J46707J00219
1750b7038j04744M4070L035L7045M5457N4561l2660m2323N0232m844o0850k4995
1738f3054Q3232K10215m7358j55734p8075j11509j5246J33746L7421J0416l4222
1727c0168O0016n3950P3791J01895j16255j67j1534L551M2254j10411j20419N2915
1715a08482l5890J14820j25854O8221K6943J9825K5832q5347M9506p4754K6133
1704i9047P354p5825j3690p5755R1826Q5863j0073L7772O103p4945J16976L7702
$$ plain form
1785 -106901 -63957 -159851 -88139 87764 70895 21548 62115 2801 -174395 -176388 -78139
1774 -78139 11046 11101 94877 34006 3547 22597 -261 18965 9423 -21047 -38192 18349 -7429
1761 -7429 -34386 -149282 -56036 1547 -9012 -117353 -147950 -253088 -273964 -127257 -27038
1750 -27038 -131782 -87712 -84677 -47632 -2175 52386 19726 -22597 27635 22791 -38059 -63054
1738 -63054 20178 230393 183035 27301 -50774 -162283 -177529 -43783 -6362 4054 -30168
1727 -30168 29848 -24102 49689 151584 35329 35162 23628 27179 69433 -40978 -161397 -108482
1715 -108482 -144372 -29552 -155406 -87185 -60242 -40417 -14585 -99932 -50426 -125180 -99047
1704 -99047 -91693 -167518 -181208 -256963 -165137 -79274 -89347 -51575 -45472 -120417 -3441 34261
1692C4261k1463P2299q0442j0240j11820M2914j37271j1475J48440k0373N5868
1681c9302M52P2761R4059o7725k33P0496l2277l0268P203j05482K5039j76490
1669a81767P1171R6297M12M4674j51199L3135P106J32728j99746m0042N8764n
1657a28472m8946p3241J49528N6824r1754K9790l3679R4521k2125O1538r8296
1646a04312j26021J16329l6664M249J4712R5168n1853n0084j6759l5910Q5490
1635a05655j01792J91616k8697J23620K2857q0080J12778n4018j00276N3533o3818
1624b9932r5940J15193J09977J5615M9878p714j25460j16525J4874Q4152K5953
1613D0071K059J6943L0854k7032k4291q3884r703M6523Q1439p2001M3667j21860
$$ plain form
1692 34261 12798 85097 4655 -5585 -117405 -74491 -211762 -223237 -74797 -95170 -39302
1681 -39302 -38850 33911 127970 60245 60012 130508 98231 67963 75166 -30316 -5277 -181767
1669 -181767 -110596 -14299 -13887 30787 -120412 -87277 -80171 52557 -147189 -187231 -128467 -128472
1657 -128472 -177418 -250659 -101131 -44307 -136061 -106271 -139950 -45429 -67554 -6016 -104312
1646 -104312 -230333 -114004 -150668 -146419 -131707 -36539 -88392 -138476 -155235 -191145 -105655
1635 -105655 -207447 -15831 -44528 79092 101949 21869 134647 80629 -19647 33886 -29932
1624 -29932 -125872 -10679 99298 114913 164791 157077 31617 -84908 -70034 14118 40071
1613 40071 42130 59073 89927 62895 38604 -45280 -54983 -8460 72979 978 44645 -77215
1601g7215k8587J03928J04070o3801l7686j00883q1489Q2759J45481r1439j13822
1590a58684l5928J50426j4318P8793J45587l6033j7686j28943J9594j08992K3823
1579h2361L912N6237j01663J16988m687j480J15859K049J5439j13240k1435m0803
1567e5185j54755M5450K2541O3742J32167r2437j15990O0428r3608l3902J15962
1556a05587l9191N1501P7673m8944l6100J51211k0133N6565j8863o4004R067N7353
1544G0548j85195J7764J9295R2074P898l8663q3725k6898j4090M0024O7416j6582
1532e0134n936J49477m8258j111n783j99748J9462P2914L3069k6968j9078L7145
1520d4949m7617q1798M807J5168L7421K51289o8472j97993J7899J4926J3518L0043
$$ plain form
1601 -77215 -105802 -1874 102196 38395 709 -100174 -181663 -98904 46577 -44862 -158684
1590 -158684 -194612 -44186 -58504 20289 165876 129843 112157 -16786 2808 -106184 -82361
1579 -82361 -78449 -22212 -123875 -6887 -11574 -13054 102805 104854 120293 7053 -14382 -55185
1567 -55185 -209940 -164490 -141949 -78207 53960 -38477 -154467 -94039 -187647 -221549 -105587
1556 -105587 -144778 -93277 -15604 -64548 -100648 50563 30430 86995 68132 4128 13195 70548
1544 70548 -114647 -96883 -77588 14486 22384 -16279 -100004 -126902 -140992 -100968 -33552 -50134
1532 -50134 -56070 93407 45149 44038 38255 -161493 -142031 -69117 -36048 -63016 -82094 -44949
1520 -44949 -92566 -174364 -169557 -154389 -116968 134321 65849 -132144 -114245 -99319 -85801 -55758
1508e5758J14441o6596J24678j0242l1670J0593k7067n5921J16519j09287j21471
1497a11781J7496K02054m371n1697n4101o9573K2592j15645K379J96955r424j04655
1485g9771J17044J5765q291L2827Q0830r6944o8394K0393O1134q403P1773m4884
1473I3079l1076k1622m3024n4790l7558K826o1229l196J19334K1494o8660J27971
1461D3549j27906n389J32520K2640j83944j43032J67017M864K4121n9150j15908
1450b40618P14K2312q542N65R3389J12599m0443J65340Q5615q4665K7769k373
1438A31662j12507n2751j1174k29554J3217Q4078J23723l9653P672N471P1488
1427h328r4067p9955n7346J90698r3513n5168Q6272N0448M2328J8517m2055J04767
$$ plain form
1508 -55758 58683 -7913 116765 106523 74853 85446 58379 2458 118977 9690 -111781
1497 -111781 -94285 107769 103398 51701 -2400 -71973 -49381 -165026 -162647 34308 24884 -79771
1485 -79771 37273 53038 44747 77574 158404 61460 -6934 13459 74593 66190 137963 93079
1473 93079 62003 40381 -2643 -57433 -94991 -92165 -153394 -156590 -37256 -15762 -84422 43549
1461 43549 -84357 -89746 42774 65414 -118530 -261562 -94545 -89681 -65560 -124710 -240618
1450 -240618 -239904 -217592 -226134 -225569 -132180 -19581 -60024 105316 190931 106266 134035 131662
1438 131662 19155 -33596 -44770 -274324 -261107 -177029 -53306 -92959 -85287 -79816 -8328
1427 -8328 -102395 -182350 -239696 -48998 -142511 -197679 -111407 -60959 -18631 -114 -42169 62598
$$ [...]
##END NTUPLES=NMR SPECTRUM
##END=
