##TITLE=1H_DE-80H_X3
 200.13MHz, d2o
 8 sc
 
 19ns.26.2.2025
##JCAMPDX= 6.0         $$ Bruker NMR JCAMP-DX V2.0
##DATA TYPE= NMR SPECTRUM
##DATA CLASS= NTUPLES
##ORIGIN= UXNMR, Bruker Analytische Messtechnik GmbH
##OWNER= pz
$$ XWIN-NMR		Version 3.5
$$ Thu Jul 24 14:43:01 2025 Russian Standard Time (UT+4h)  Yarkov@DPX200
##.OBSERVE FREQUENCY= 200.1313
##.OBSERVE NUCLEUS= ^1H
##.ACQUISITION MODE= SIMULTANEOUS
##.ACQUISITION SCHEME= undefined
##.AVERAGES= 8
##.DIGITISER RES= 18
##SPECTROMETER/DATA SYSTEM= spect
##.PULSE SEQUENCE= zg30
##.SOLVENT NAME= CDCl3
##.SHIFT REFERENCE= (INTERNAL, CDCl3, 0, 15.5177)
##AUDIT TRAIL= $$ (NUMBER, WHEN, WHO, WHERE, WHAT)
$$ ##TITLE= Audit trail, XWIN-NMR		Version 3.5
$$ ##JCAMPDX= 5.01
$$ ##ORIGIN= Bruker BioSpin GmbH
$$ ##OWNER= Yarkov
$$ C:/Bruker/XWIN-NMR/data/yarkov2/nmr/H-C/1/pdata/1/auditp.txt
$$ ##AUDIT TRAIL=  $$ (NUMBER, WHEN, WHO, WHERE, WHAT)
(   1,<2025-07-24 14:41:53.70 +0400>,<Yarkov>,<DPX200>,
      <created by zg, POWCHK disabled, PULCHK disabled
       configuration hash MD5:
       00 E9 B6 7A A2 85 ED C7 34 08 36 98 17 FE 4E 26
       data hash MD5: 16K
       3B D2 3B 42 B9 82 FD D5 0D CA 23 D9 89 C1 EA F8>)
(   2,<2025-07-24 14:42:18.15 +0400>,<Yarkov>,<DPX200>,
      <Start of raw data processing
       efp BC_mod = 2 LB = 0.25 FT_mod = 6 PKNL = 1 PHC0 = -1359.556 PHC1 = 13.59091 SI = 16K 
       data hash MD5: 16K
       5A F4 4E 0C 54 BB A4 31 5D 0A 90 B6 A3 B3 7C 6F>)
(   3,<2025-07-24 14:42:26.48 +0400>,<Yarkov>,<DPX200>,
      <abs ABSG = 5 
       data hash MD5: 16K
       BF B5 DB 05 BF DA F9 6E 7B F8 BB 95 A4 D2 A9 26>)
$$ ##END=
$$ 
$$ hash MD5
$$ 3D 6A 38 34 7B 89 23 4B 1C 67 D4 5C 3F E5 C7 A5
##$RELAX= 
##$RELAX= 
##$RELAX= 
##$RELAX= 
##$RELAX= 
##$RELAX= 
$$ Bruker specific parameters
$$ --------------------------
##$DU= <C:/Bruker/XWIN-NMR>
##$EXPNO= 1
##$NAME= <H-C>
##$PROCNO= 1
##$TYPE= <nmr>
##$USER= <yarkov2>
##$AMP= (0..31)
100 100 100 100 100 100 100 100 100 100 100 100 100 100 100 100 100 100 
100 100 100 100 100 100 100 100 100 100 100 100 100 100 
##$AQSEQ= 0
##$AQ_mod= 1
##$AUNM= <au_zg>
##$AUTOPOS= <>
##$BF1= 200.13
##$BF2= 200.13
##$BF3= 200.13
##$BF4= 200.13
##$BF5= 200.13
##$BF6= 200.13
##$BF7= 200.13
##$BF8= 200.13
##$BYTORDA= 1
##$CFDGTYP= 0
##$CFRGTYP= 5
##$CHEMSTR= <none>
##$CNST= (0..31)
1 1 145 1 1 1 1 1 1 1 1 1 1 1 1 1 1 1 1 1 1 1 1 1 1 1 1 1 1 1 1 1 
##$CPDPRG= <>
##$CPDPRG1= <>
##$CPDPRG2= <>
##$CPDPRG3= <>
##$CPDPRG4= <mlev>
##$CPDPRG5= <mlev>
##$CPDPRG6= <mlev>
##$CPDPRG7= <mlev>
##$CPDPRG8= <mlev>
##$CPDPRGB= <>
##$CPDPRGT= <>
##$D= (0..31)
0 0.7 0 0 0 0 0 0 0 0 0 0.03 0 0 0 0 0 0 0 0 0 0 0 0 0 0 0 0 0 0 0 0 
##$DATE= 1753353713
##$DBL= (0..7)
120 120 120 120 120 120 120 120 
##$DBP= (0..7)
150 150 150 150 150 150 150 150 
##$DBP07= 0
##$DBPNAM0= <>
##$DBPNAM1= <>
##$DBPNAM2= <>
##$DBPNAM3= <>
##$DBPNAM4= <>
##$DBPNAM5= <>
##$DBPNAM6= <>
##$DBPNAM7= <>
##$DBPOAL= (0..7)
0.5 0.5 0.5 0.5 0.5 0.5 0.5 0.5 
##$DBPOFFS= (0..7)
0 0 0 0 0 0 0 0 
##$DE= 6
$$ [...]
##$SUBNAM3= <"">
##$SUBNAM4= <"">
##$SUBNAM5= <"">
##$SUBNAM6= <"">
##$SUBNAM7= <"">
##$SUBNAM8= <"">
##$SUBNAM9= <"">
##$SW= 18.0517328524113
##$SWIBOX= (0..15)
0 0 2 0 0 0 0 0 0 0 0 0 0 0 0 0 
##$SW_h= 3612.71676300578
##$TD= 16384
##$TD0= 1
##$TE= 0
##$TE2= 300
##$TE3= 300
##$TEG= 300
##$TL= (0..7)
0 120 120 120 120 120 120 120 
##$TP= (0..7)
150 150 150 150 150 150 150 150 
##$TP07= 0
##$TPNAME0= <>
##$TPNAME1= <>
##$TPNAME2= <>
##$TPNAME3= <>
##$TPNAME4= <>
##$TPNAME5= <>
##$TPNAME6= <>
##$TPNAME7= <>
##$TPOAL= (0..7)
0.5 0.5 0.5 0.5 0.5 0.5 0.5 0.5 
##$TPOFFS= (0..7)
0 0 0 0 0 0 0 0 
##$TUNHIN= 0
##$TUNHOUT= 0
##$TUNXOUT= 0
##$USERA1= <user>
##$USERA2= <user>
##$USERA3= <user>
##$USERA4= <user>
##$USERA5= <user>
##$V9= 5
##$VALIST= <valist>
##$VCLIST= <CCCCCCCCCCCCCCC>
##$VD= 0
##$VDLIST= <DDDDDDDDDDDDDDD>
##$VPLIST= <PPPPPPPPPPPPPPP>
##$VTLIST= <TTTTTTTTTTTTTTT>
##$WBST= 1024
##$WBSW= 4
##$XGAIN= (0..3)
0 0 0 0 
##$XL= 0
##$YL= 0
##$YMAX_a= 447967
##$YMIN_a= -436668
##$ZGOPTNS= <>
##$ZL1= 120
##$ZL2= 120
##$ZL3= 120
##$ZL4= 120
##$ABSF1= 15.49127
##$ABSF2= -2.560579
##$ABSG= 5
##$ABSL= 3
##$ALPHA= 0
##$AQORDER= 0
##$ASSFAC= 0
##$ASSFACI= 0
##$ASSFACX= 0
##$ASSWID= 0
##$AUNMP= <proc_1d>
##$AZFE= 0.1
##$AZFW= 0.1
##$BCFW= 0
##$BC_mod= 2
##$BYTORDP= 0
##$COROFFS= 0
##$CY= -3
##$DATMOD= 1
##$DC= 0
##$DFILT= <>
##$DTYPP= 0
##$F1P= 0
##$F2P= 0
##$FCOR= 1
##$FTSIZE= 16384
##$FT_mod= 6
##$GAMMA= 0
##$GB= 0
##$INTBC= 1
##$INTSCL= 3.241238e-09
##$ISEN= 128
##$LB= 0.25
##$LEV0= 0
##$LPBIN= 0
##$MAXI= 10000
##$MC2= 0
##$MEAN= 0
##$ME_mod= 0
##$MI= 1.114404
##$NCOEF= 0
##$NC_proc= -5
##$NLEV= 6
##$NOISF1= 3.799351
##$NOISF2= 2.8
##$NSP= 0
##$NTH_PI= 0
##$NZP= 0
##$OFFSET= 15.51772
##$PC= 1
##$PHC0= -1359.556
##$PHC1= 13.59091
##$PH_mod= 1
##$PKNL= yes
##$PPARMOD= 0
##$PSCAL= 0
##$PSIGN= 0
##$REVERSE= no
##$SF= 200.130000798052
##$SI= 16384
##$SIGF1= 3
##$SIGF2= 2
##$SINO= 0.751879
##$SIOLD= 32768
##$SREGLST= <19F.Aceton>
##$SSB= 0
##$STSI= 16384
##$STSR= 0
##$SW_p= 3612.71676300578
##$SYMM= 0
##$S_DEV= 0
##$TDeff= 16384
##$TDoff= 0
##$TI= <>
##$TILT= no
##$TM1= 0
##$TM2= 0
##$TOPLEV= 0
##$USERP1= <user>
##$USERP2= <user>
##$USERP3= <user>
##$USERP4= <user>
##$USERP5= <user>
##$WDW= 1
##$XDIM= 16384
##$YMAX_p= 347152292
##$YMIN_p= -139362
$$ End of Bruker specific parameters
$$ ---------------------------------
##NTUPLES= NMR SPECTRUM
##VAR_NAME=  FREQUENCY,     SPECTRUM/REAL,   SPECTRUM/IMAG
##SYMBOL=    X,             R,               I
##VAR_TYPE=  INDEPENDENT,   DEPENDENT,       DEPENDENT
##VAR_FORM=  AFFN,          ASDF,            ASDF
##VAR_DIM=   16384,         16384,           16384
##UNITS=     HZ,            ARBITRARY UNITS, ARBITRARY UNITS
##FACTOR=    0.220516191357247, 1,           1
##FIRST=     3105.5613605075, 0,             0
##LAST=      -507.155402498282, 0,           0
##MIN=       -507.155402498282, -139362,     0
##MAX=       3105.5613605075, 347152292,     0
$$ Real data points
##PAGE= N=1
##DATA TABLE= (X++(R..R)), XYDATA
$$ [...]
6281B4314k53N774r44j8748r934q112M9029n212j3562j3877N111q82j6170L3093
6267B9627P188k584j0687L155m106o830L5532o399J514P41j7029K4082N481J9042
6253G8727l4151K389J5984k7027j4393N6091Q081n576P826Q579k0395m952M1192
6240A12375J2561k5167m606j3714J0130k3190J5356M7020m336J5125L3916j148
6228A74322q170J4327J7612J8185N917M670L3855L1663O976r223R904J2061L9005
6215C51104J2535N695J0782J5179K0174K5967N1360L8626L5113K8342J4596J7529
6203F27002L4519J2187L4949K8756K4236m828L3188k1564k8501R952k0759J5437
6191G44574J3153K9072L8841l0082K9811k6629M261k1947j4082O1253L4847L226
$$ y = [24314, 24061, 29835, 28891, 10143, 209, -7903, 41126, 35914, 22352, 8475, 13586, 12704, -3466, 29627, 36815, 34231, 23544, 26699, 22593, 15763, 51295, 44896, 46410, 47151, 30122, 54204, 59685, 78727, 44576, 46965, 62949, 35922, 21529, 77620, 85701, 80125, 87951, 96530, 76135, 71183, 112375, 124936, 99769, 95163, 81449, 91579, 68389, 83745, 130765, 126429, 141554, 175470, 174322, 166152, 180479, 198091, 216276, 222193, 226863, 260718, 292381, 299357, 290134, 300038, 312099, 351104, 363639, 369334, 380116, 395295, 415469, 441436, 492796, 531422, 566535, 594877, 609473, 627002, 661521, 673708, 708657, 737413, 761649, 756821, 790009, 768445, 739944, 749896, 729137, 744574, 757727, 786799, 825640, 795558, 825369, 798740, 803001, 781054, 766972, 828225, 863072, 866298]
6179H66298K5218K9174J8542K1595K2189k4067m8969o9231p3622j9699n1341n1441
6167F44646p0680o8055J0272K0872l8436j1599l0739L258l9737P672j2362j2144
6155D02968n500L040O925j3700k593L8312P5148l305L118n0653q7302m3226l1270
6142B91962j2300k6407J5330l4664N746o436R459k8035m3560R601J810J5350k6019
6129A71837l1880j61L8528k9439l9717J151N3792k0562K806l26P732p330L0654
6116A77085K9579J5013K6935l548K0088M5659p295J924R548j4950K5016k4860
6104C00194l4667J8115p448J4024n8914j5803M956L0033R440k070M2231J1691
6092C11782J6918l502J5695N1909K7934J1926l994K5048M4277J0516N7410J5970
$$ y = [866298, 891516, 920690, 939232, 960827, 983016, 958949, 909980, 840749, 767127, 747428, 696087, 644646, 573966, 505911, 516183, 537055, 498619, 487020, 456281, 459539, 419802, 427474, 415112, 402968, 397468, 400508, 407433, 393733, 391140, 429452, 504600, 501295, 504413, 453760, 366458, 323232, 291962, 279662, 253255, 268585, 233921, 239667, 233231, 242690, 214655, 171095, 180696, 182506, 197856, 171837, 139957, 139796, 178324, 148885, 109168, 110319, 164111, 143549, 146355, 146029, 153761, 146431, 177085, 206664, 221677, 248612, 245064, 265152, 310811, 303516, 305440, 314988, 300038, 325054, 300194, 265527, 283642, 276194, 290218, 231304, 215501, 220457, 250490, 259930, 257860, 300091, 311782, 328700, 325198, 340893, 392802, 420736, 432662, 428668, 453716, 497993, 508509, 565919, 581889]
6080E81889k226k1756l5649O148R439k667k5518l169N4135J010K353m6537l5800
6067D81652J8884j5774m7067L0629L1898r932J5787L341k014J4770J4774l2103
6055E04845n3287m92l6208j5895R614M127P622N792k5518M575M5501L4439L0233
6042E15348L5041J1123j6785o8573k9012k5143j5028k272l6640k5201j2208r787
6030C20863m2928r623L8889j5489m2955l7053n416J761l29J4302k421J2320J6462
6017B48383J3936M396m640k7641K2200J0405K4982l1402j3632j9528N856n504
6005B27811j7707o934p382k5994l6069J8994K2234k0208k3486K4025k5208J8878
5993A48954L5391k837n4212j639K8331k1289L907j0248J6660q10P110k1870l1654
$$ y = [581889, 579663, 557907, 522258, 528406, 537845, 535178, 509660, 506491, 560626, 561636, 563989, 517452, 481652, 500536, 484762, 437695, 468324, 500222, 490290, 506077, 509418, 507404, 522174, 536948, 504845, 451558, 451066, 414858, 398963, 408577, 412704, 420326, 426118, 400600, 405175, 450676, 485115, 515348, 550389, 561512, 544727, 476154, 447142, 421999, 406971, 404699, 368059, 342858, 330650, 320863, 277935, 268312, 307201, 291712, 248757, 211704, 206288, 208049, 207720, 222022, 219601, 231921, 248383, 262319, 266715, 262075, 234434, 256634, 267039, 292021, 260619, 246987, 227459, 233315, 227811, 210104, 203170, 195788, 169794, 133725, 152719, 174953, 154745, 131259, 155284, 130076, 148954, 184345, 181508, 127296, 125657, 153988, 132699, 136606, 126358, 143018, 142208, 149318, 127448, 95794]
5980I5794j9603j7144k592j3215R622K0753L1298M424l5917M69J2120M1755j6668
5967A11096p248J926K9669Q19k6547Q423j5930j916q244J5617K1745M356J782
5954A35548K963K696j6537L973J1532l8423Q304l4780J8903N2432L457p2384K0120
5941I7804K3090m011Q44k0367M5480K709j0126j5827j7189J2365q984K091k1719
5928H6160k87J2428l4745J9662K9129L3512l0326n5602K0422l0888J8379O834
5916G4678L517m820K0960j4268r003O0840k6594k464K7300q99J235m0428j0560
5903G9494j7289k7139J3702K1517k6084j0991r268j7175j94N4M5292J2578j1616
5890E2881L911j1382K6568k8447J765J1631k4434J0968M411K5109o984Q428l1320
$$ y = [95794, 76191, 59047, 56455, 43240, 52862, 73615, 104913, 109337, 73420, 73889, 86009, 127764, 111096, 103848, 105774, 135443, 136262, 109715, 118138, 102208, 100292, 92048, 107665, 129410, 133766, 135548, 138511, 141207, 124670, 128643, 140175, 101752, 110056, 75276, 94179, 146611, 150068, 77684, 97804, 120894, 116883, 117727, 97360, 142840, 145549, 135423, 119596, 102407, 114772, 105788, 107879, 86160, 85873, 98301, 63556, 83218, 112347, 145859, 115533, 59931, 80353, 49465, 67844, 74678, 78195, 73375, 94335, 80067, 71064, 131904, 105310, 102846, 130146, 129247, 130482, 90054, 79494, 62205, 35066, 48768, 70285, 44201, 33210, 23942, 6767, 6573, 6627, 51919, 64497, 52881, 56792, 45410, 71978, 43531, 45296, 56927, 32493, 43461, 47872, 72981, 65997, 74425, 43105]
5877D3105k1124j8604j8628j3941M9844L2490j5594l7533j3673R350L3920l7833
5865h221l30K4952n078n706j0478Q760J5406K6099R617k1299l7845J7613K2753
5852C6243k0146j3357j4400K4700N775M221J1229P185m0049L800k166O975R866
5839A9876l4241m211k490q986K5433M7778N356l1834j8249K1227j1688K571n479
5826E063k7436K8533J8724k7081k5167K579O061n123K4307k3081K2806m613p162
5813a1590M2626o148r87o129j1518l9248K2014M4534j9940J5799P828J5794K471
5800E5506k3920m6953L5683n711k0616m0435K6971K5075J5001j5966J93M248j5840
5787f764n028k2575N1853J7403r020m9758L3266k2050q385L1119P577N052j4257
$$ y = [43105, 21981, 3377, -15251, -29192, 20652, 53142, 37548, 15, -13658, -4308, 29612, -8221, -8551, 16401, 11323, 5617, -4861, 3899, 19305, 45404, 55021, 33722, -4123, 13490, 36243, 16097, 2740, -11660, 13040, 18815, 23036, 34265, 41450, 1401, 5201, 3035, 10010, 19876, -14365, -18576, -21066, -30052, -4619, 43159, 48515, 16681, -1568, 19659, 7971, 10542, 5063, -22373, 6160, 24884, -2197, -27364, -24785, -18724, -23847, 460, -22621, 185, -4428, -11590, 31036, 24888, 23901, 17772, 6254, -32994, -10980, 33554, 13614, 29413, 37241, 53035, 55506, 31586, -15367, 20316, 14605, -6011, -46446, -19475, 5600, 20601, 4635, 4828, 9076, -6764, -11792, -34367, 17486, 34889, 25869, -23889, 9377, -12673, -21058, 10061, 17638, 22690, 8433]
5774H433p589Q311o811K1202J7343j9104J674K808n034r757K7771J2714m173m1631
5760F157M516j9425k925m380L779L6684k0979O789K5818k946m4548o526J0756
5747g230M5275j9529j4513N794m97r514M002k109n587J1434j5203l0638K8438
5734i877J1382k2395o138M7117L1066N995k9355l4229L393Q140N690n213j7524
5721a1948j1217K5741J1173L4517o196K6048k2160j4997J4956j1072k5908K8129
5709C7066J0777j8893p550k307J3118k4937Q616M811P832P348j5413K5196K628
5696D8292K5085r617o4580J5617J7949J1319L8762o354K4773p42K1849N4599k4147
5683A52805n4848M669k0582l8803K3746o927j5064L6268O92j7874Q330M1221k1884
$$ y = [8433, 844, 9155, 2344, 23546, 40889, 21785, 23459, 26267, 21233, 11476, 39247, 51961, 47788, 6157, 10673, -8752, -11677, -16057, -12278, 24406, 3427, 10216, 36034, 33088, -11460, -17986, -7230, 38045, 18516, 4003, 9797, 9300, -214, 3788, 1679, -3908, 7526, -7677, -38315, -9877, 1505, -20890, -27028, 20089, 51155, 57150, 27795, -6434, -3041, 5099, 10789, 5576, -11948, -23165, 2576, 13749, 48266, 42070, 68118, 45958, 30961, 45917, 34845, 8937, 37066, 47843, 28950, 21400, 19093, 32211, 7274, 15890, 20701, 28533, 35881, 20468, 45664, 48292, 73377, 63760, -820, 14797, 32746, 44065, 82827, 76473, 101246, 100504, 122353, 176952, 152805, 97957, 102626, 82044, 43241, 66987, 60060, 44996, 81264, 81956, 64082, 72412, 113633, 91749]
5670I1749j2644j8991K6495L2681J6598o561M41J0228j6055K3476k1758L8217
5658A63876J4787M3999P8978k4681N803L0324J13j4967k9791k0876k2675j2371
5646B12519l5673j1272k3675l1498o795j1172L0793J5236J465J575l4463L865
5634A10905J1852L5493o205O824K0004N3655k444k660K4188J7522N499J5757J7083
5621C07473M8144J0433k1675m9722l3492l2306l1234j528o551J1752k7806J4137
5609A87625j5324r592K9345l3044m452K4643j9967l130Q079K2934K5160k8401
5597A83876O954p113O03M5369K3815K8495J4204J2206P239K3065j2874p0469k9312
5584B26058N0804j5377k2414J7596J6860k482J4277m371l3673M0135M18R103P380
$$ y = [91749, 79105, 60114, 86609, 119290, 135888, 129327, 129768, 139996, 123941, 147417, 125659, 163876, 178663, 222662, 301640, 276959, 282762, 313086, 313199, 298232, 268441, 247565, 224890, 212519, 176846, 165574, 141899, 110401, 103606, 92434, 123227, 138463, 139928, 141503, 107040, 110905, 122757, 158250, 152045, 158869, 178873, 232528, 230084, 227424, 251612, 269134, 274633, 290390, 307473, 355617, 366050, 344375, 294653, 261161, 228855, 197621, 196093, 189542, 201294, 173488, 187625, 172301, 162709, 192054, 159010, 154558, 179201, 159234, 156104, 164183, 187117, 212277, 183876, 190830, 183717, 184320, 229689, 253504, 281999, 296203, 308409, 315648, 338713, 325839, 255370, 226058, 276862, 261485, 239071, 256667, 273527, 271045, 285322, 280951, 247278, 287413, 287831, 296934, 304314]
5571C04314M4034L4680j4111m737K9513K6323k3485j6871j7378j0479m3073l9771
5559B68959M6628J0039J1497J4690m393k7037k9020P001K4123M385j0049j525
5547C15298P389M4322l4600J6462L7226K2190l1322m3549o0433m0766Q865m912
5535B36170k7284O79j2333j0070n025L675R921K417j1431j9122J1039K3899K7990
5522B30525J3426P846J8483L5506J576j0724j0520K1452j1884l8012l5525j3169
5510B08980J0795j0972k2978q997J0399K006m607l0345k3010L3310N481j4834
5498A55228J0290j2259K2964N561n278L5296R658l1511K8112M658K976l125k01
5485B22369j1570l1877R943o6855k9597k423P754R454K7120K9937l7905J4766
$$ y = [304314, 348348, 383028, 368917, 364180, 393693, 420016, 396531, 379660, 362282, 351803, 308730, 268959, 315587, 325626, 337123, 351813, 347420, 320383, 291363, 298364, 322487, 326872, 316823, 315298, 322687, 367009, 332409, 348871, 386097, 408287, 376965, 333416, 272983, 232217, 241082, 236170, 208886, 209565, 197232, 187162, 182137, 185812, 195733, 198150, 186719, 167597, 178636, 202535, 230525, 243951, 251797, 270280, 305786, 307362, 296638, 286118, 307570, 295686, 257674, 222149, 208980, 219775, 208803, 185825, 176828, 187227, 189233, 184626, 154281, 131271, 164581, 170062, 155228, 165518, 153259, 176223, 181784, 176506, 211802, 221460, 189949, 218061, 222719, 225695, 222570, 222369, 210799, 178922, 188865, 122010, 92413, 89990, 97744, 107198, 134318, 164255, 126350, 141116]
5473A41116k1747l616j3080l901k792L7053R146o712J2523k8570L5400J2087K8903
5460A95810M057Q654J0044k3101k2048l0348K1864M2169J8592k3791K0356l4163
5448A88095j2473J0323J5310j7574P764J8792j3150M244k9743n221J4119J8913
5436A99399q624K0671J8175k5993J2146K291K6847L5957O305K6692Q156N6060
5424C78082Q083l4143j2349l646L014j2928j738L5552l8707K4648K5212j2944
5412C58136j1899n842K9099J8465m4823k3638n999L0286j8460j3045j3288P624
5400C06616J2005O568L7980k0527k4364M2713R456j2249K2738M5890K7995K4540
5388D79361m4035l0549k6767l4086l137J5301J9298k5282l0551n3228j7447k1443
$$ y = [141116, 119369, 115753, 102673, 98772, 95980, 133033, 142179, 135467, 147990, 119420, 154820, 166907, 195810, 199867, 208521, 218565, 195464, 173416, 143068, 164932, 207101, 225693, 201902, 222258, 188095, 175622, 185945, 201255, 183681, 191445, 210237, 197087, 201331, 171588, 166367, 180486, 199399, 190775, 211446, 229621, 203628, 215774, 218065, 244912, 280869, 287174, 313866, 322022, 378082, 386165, 352022, 339673, 336027, 339041, 326113, 324375, 359927, 321220, 345868, 371080, 358136, 346237, 340395, 369494, 387959, 343136, 319498, 313499, 343785, 325325, 312280, 298992, 306616, 318621, 325189, 363169, 342642, 318278, 360991, 370447, 358198, 380936, 426826, 454821, 479361, 435326, 404777, 378010, 343924, 340787, 356088, 375386, 350104, 319553, 266325, 248878, 227435]
5376B27435l5015M029K1575K5992l6006j2959j4384r288j7170K3183J0878k2656
5364A65614K502J8085M1209k9788J4089O546k615Q973p843m3205l856m6841r015
5351A13855J7680l143j5257j3620K7247l18j0703P095k9919O624j9779k1827p923
5338E0012j4215L8684K357m997Q754j27k7386J2941r668J0028K3283k850K1850
5325A08666l3820m0355j9311J5240J5888J0558P822K5695k6385m1945m252j6161
5313A640L3537J6047j5924l55n47k697J4075L0063j5238k274n863j6172L5577
5300G1869m029m641n991o972Q84J1433J3211k3495q490k159N652k6809J0916K4022
5286E5401n750K0384L444m51j077k6158L2261J1808k3153n6545K1172M750k0857
$$ y = [227435, 192420, 196449, 218024, 244016, 208010, 195051, 180667, 171379, 154209, 177392, 188270, 165614, 168116, 186201, 227410, 197622, 211711, 218257, 215642, 224615, 216772, 173567, 169711, 122870, 113855, 131535, 128392, 113135, 99515, 126762, 126444, 115741, 122836, 92917, 99541, 79762, 57935, 50012, 35797, 74481, 76838, 71841, 80595, 80468, 53082, 66023, 56355, 66383, 89666, 86816, 108666, 74846, 34491, 15180, 30420, 46308, 56866, 64688, 90383, 63998, 22053, 17801, 1640, 35177, 51224, 35300, 34945, 34398, 31701, 45776, 75839, 60601, 58327, 52464, 36292, 71869, 67840, 63199, 57208, 50236, 51120, 62553, 75764, 52269, 43779, 41620, 47272, 20463, 31379, 55401, 49651, 70035, 73479, 73028, 71951, 45793, 78054, 89862, 66709, 10164, 31336, 36086, 15229]
5273A5229K4783J2891k8539Q499p598r926l513L4710l112L029j0852k5683K6047
5260C5965L0146j7911l3683J0614j444j3576M725K46O44M719n400J979J3092M697
5246C4813l3938K1680j5326j0807J0381K7091J9969J5716j5554k6689p477J9769
5234C9628L4483l1922j8498k6079J1056N7991j1804j0815l548j8453j1426M557
5222A5170M603J371K5489k6088o270j9830Q439K1886R537L6730j3090L4130m4747
5209D7330j2432j0301K759J9489l0947O986J2057o00j6774J9412J7973j6462l827
5196C4663l909m854k5412J1535LM8168P924j186m2182K2348p262p481k7494j7294
5182a2433J7954M843n692J8181K105J6537M0135l3921q784J6109J0566l845j1356
$$ y = [15229, 40012, 52903, 24364, 32863, 25265, 15339, 11826, 46536, 43424, 46453, 35601, 9918, 35965, 66111, 48200, 14517, 25131, 23687, 10111, 14836, 15082, 15726, 20445, 15045, 17024, 30116, 34813, 875, 22555, 7229, -3578, 6803, 33894, 53863, 69579, 54025, 27336, 19859, 39628, 74111, 42189, 23691, -2388, 8668, 66659, 54855, 44040, 40492, 22039, 10613, 15170, 19773, 21144, 46633, 20545, 14275, -5555, 2884, 24770, 34307, 71037, 57947, 92077, 47330, 34898, 24597, 27356, 46845, 15898, 22884, 34941, 34341, 17567, 36979, 54952, 38490, 34663, 30754, 25900, 488, 12023, 12026, 60194, 68118, 66932, 24750, 47098, 39836, 32355, 4861, -12433, 5521, 10364, 4672, 22853, 24958, 41495, 81630, 47709, 38925, 55034, 65600, 61755, 50399]
5169E0399k1500j4670K9630J0019k91K3954K062l0627j4204J3060K0972k131M020
5156G0693L9877l6150k7999J9634M2441j7010j4313l6185K1373l5740k5015M3496
5144D5102J8218P42k8557k4842J7528N7680j6450l3987k2296M7239j9011k7810
5132A3556J1974P626K9964J26K150J0578j0806K0296J5031j9656n488R159k2268
5119F2242j8436M3194L2139J1946j8991J9080L4828j2317l2972O994l4466N4299
5107A47540K3992j0779K2390K170R67P4567M4522k7242L4853O0698L0625J2060
5095D16363j7390l7269l2718k9172m1394j0148J1930j2065J3575J335j293P563
5083B69317j5798J2822l024k5021P931K8828q911M5623O046J9399J1582K0905
$$ y = [50399, 28899, 14229, 43859, 53878, 53587, 77541, 79603, 48976, 34772, 47832, 68804, 66673, 70693, 110570, 74420, 46421, 66055, 108496, 91486, 77173, 40988, 62361, 26621, 1606, 45102, 63320, 64062, 35505, 10663, 28191, 85871, 69421, 35434, 13138, 60377, 41366, 13556, 25530, 33156, 63120, 63246, 65396, 75974, 65168, 85464, 100495, 80839, 75351, 84510, 62242, 43806, 87000, 119139, 131085, 112094, 131174, 166002, 153685, 120713, 127707, 93241, 147540, 171532, 160753, 183143, 185313, 186280, 260847, 305369, 278127, 312980, 373678, 404303, 416363, 398973, 361704, 328986, 299814, 258420, 248272, 260202, 248137, 261712, 263047, 261754, 269317, 253519, 266341, 263317, 238296, 246227, 275055, 266144, 311767, 317813, 337212, 348794, 369699]
5071C69699J3987K5497L5196N7606N8960J3533M2976Q5169P1131N8791P7660J63515
5059A073720J42305J58854K60181K92441L03417K71862J67278j07572j24668K7156
5049B464974R7140P5374k3311q4892J5017J14781J63883M3802j98456l35459k97904
5038B034949k35607j60055q5411q389l4658p1219j09065j58592j07903r1471r5065
5027H77514o0039q4591m9705m8401m7228j3185o0067k0763J5178l8273k6563m1040
5015D02837l435M2868m4649k7276k1906j358m895J7493j2905m0967k2126k0577
5003B63104L040m2601j4743L7317R260O97k3838m1895k457o455L9409n094J0278
4990B26022j6107m642J0212Q938J5949o944l2492q864k6709j6868R153n833Q576
$$ y = [369699, 383686, 409183, 444379, 501985, 560945, 574478, 617454, 702623, 773754, 832545, 910205, 1073720, 1216025, 1374879, 1635060, 1927501, 2230918, 2502780, 2670058, 2562486, 2437818, 2464974, 2562114, 2637488, 2614177, 2529285, 2544302, 2659083, 2822966, 2866768, 2668312, 2332853, 2034949, 1799342, 1639287, 1553876, 1545487, 1510829, 1439610, 1330545, 1171953, 1064050, 972579, 877514, 817475, 732884, 683179, 634778, 587550, 574365, 514298, 493535, 508713, 470440, 443877, 402837, 399402, 442270, 397621, 370345, 348439, 347081, 342186, 359679, 346774, 305807, 283681, 263104, 266144, 223543, 208800, 246117, 255377, 256074, 232236, 190341, 187884, 181429, 220838, 215744, 226022, 209915, 205273, 215485, 224423, 240372, 233428, 200936, 192072, 165363, 148495, 157648, 151815, 160391]
4977A60391j266q161k2976J751K5958m161N077Q958J8198m1806j8610m826O3539
4964A82066O595m9606K4521k4748J1783L3354j7251k9127J3034K9739l3902k5630
4952A20828J5354L6147K336K9186J3852k1204M5981P141K257p275R486K6934j0596
4939B70427j0136N306p479K8028O411k1672r598l670n58l913r983K17k3462q304
4925B11614L89J2388J6743m382O724q447j2947k5772L3000m832j4659j5168k5891
4912A68760K4130k5193L3734K1219k4408K055J2715j2816O829R778j4590k2694
4900A79519l646L9105p174K16J9634k4582J056k2528J9989j1892k863M0461j3652
4887B13643j5296R020k726O593j612M685k1109N208j8439J951L2744L0912k1876
$$ y = [160391, 159125, 150964, 127988, 129739, 155697, 151536, 156613, 165571, 183769, 141963, 123353, 118527, 182066, 188661, 139055, 163576, 138828, 150611, 183965, 166714, 137587, 150621, 180360, 146458, 120828, 136182, 172329, 174665, 203851, 217703, 196499, 242480, 249621, 251878, 244603, 254089, 281023, 270427, 260291, 265597, 258118, 286146, 292557, 270885, 261287, 257617, 257059, 253146, 243163, 243380, 219918, 211614, 212003, 224391, 241134, 236752, 243476, 235029, 222082, 196310, 229310, 224478, 209819, 194651, 168760, 192890, 167697, 201431, 222650, 198242, 200297, 213012, 200196, 207025, 216803, 202213, 179519, 175873, 214978, 207804, 208020, 227654, 203072, 204128, 181600, 201589, 189697, 186834, 227295, 213643, 198347, 207367, 204641, 211234, 209622, 214307, 193198, 198406, 179967, 181918, 214662, 245574, 223698]
4874B23698l5229K9730J3945M1328p243k3982p175J0924L7149J3245p50J614O3
4861B97317K172k8898O152J1467o851J032L5840j0226L0362M6060o443k488j6110
4848C59386J997k7032j0221Q297j5264N447K3166k7611K0664l982J0582M4717
4836C90146m0861j3840K5168r214l617J9868L8756J9951J2334R104j8549k3664
4824D05582Q1650K6569j672M3620K3368K3172J243J0253J7350J1383J9672k9390
4812F32800K146q670J4631L5901M5172J2114P485L2625J4223O6997K208J1365
4800H68997L1894L5884J0156O4899J8612M7598O2733N3365K1647L5323N3207Q9897
4788A394212O7741O4090R4229P7837P6514J08140J19316R1901J45688J34620J28345
$$ y = [223698, 188469, 218199, 232144, 273472, 266229, 242247, 235072, 245996, 283145, 296390, 295640, 297254, 297317, 299489, 270591, 276743, 288210, 281359, 282391, 318231, 308005, 338367, 384427, 377984, 375496, 359386, 361383, 334351, 324130, 332427, 317163, 322610, 345776, 318165, 338829, 334847, 345429, 390146, 349285, 335445, 360613, 351399, 347782, 367650, 406406, 426357, 438691, 447795, 429246, 405582, 487232, 513801, 512129, 555749, 579117, 602289, 603532, 613785, 631135, 642518, 662190, 632800, 634946, 626276, 640907, 676808, 721980, 734094, 741579, 774204, 788427, 855424, 857632, 868997, 900891, 936775, 946931, 1011830, 1030442, 1078040, 1140773, 1194138, 1215785, 1251108, 1304315, 1394212, 1461953, 1526043, 1620272, 1698109, 1774623, 1882763, 2002079, 2093980, 2239668, 2374288, 2502633]
4777B502633J25936J37819J75499J76265J60044J79759J77695K39278K55692K68770
4767D399390K64945K27253L44974M09974M97249O40834P51129P65882P06758M52121
4757I460509K12565J04891J30736J73136J77147J27613J03970R6047J86395K95637
4747A1068646K79816K94544L28354L46703L98392N09890M59863M52827M21923
4738A4560958L94862M04250M22579M80614N92318P37698Q47824R16909R13491
4729B0271503Q04411N24672j9387n69529p74526p58057o75118o03879n45308m43115
4719A7211667l40534l20681l69802m74046n54883n57818n47856m51875l72178
4710A3221994k59693k37478k28653k28133j93521m5555Q843K3648k9930j18871
$$ y = [2502633, 2628569, 2766388, 2941887, 3118152, 3278196, 3457955, 3635650, 3874928, 4130620, 4399390, 4664335, 4891588, 5236562, 5646536, 6143785, 6784619, 7535748, 8301630, 9008388, 9460509, 9673074, 9777965, 9908701, 10081837, 10258984, 10386597, 10490567, 10586614, 10773009, 11068646, 11348462, 11643006, 11971360, 12318063, 12716455, 13226345, 13686208, 14139035, 14560958, 14955820, 15360070, 15782649, 16263263, 16855581, 17593279, 18441103, 19358012, 20271503, 21075914, 21600586, 21581199, 21011670, 20237144, 19479087, 18803969, 18200090, 17654782, 17211667, 16871133, 16550452, 16180650, 15706604, 15151721, 14593903, 14046047, 13594172, 13221994, 12962301, 12724823, 12496170, 12268037, 12074516, 12028961, 12037804, 12061452, 12031522, 11912651]
4700A1912651j34898j20617j50536l14000o63890q83120q83908p25880n90175
4691G445627m71689l70986k61630k15700k52056k97707k77821k00171k27878k13082
4681D656907j86029j67585j62289j77657j96714j69643r6650j69374j42208q9105
4671C099653j29356j32839r1498q8830j43662p5747n9553o6149n4702o0536p7102
4660B119679k6377j8712l2488j8664o6269l1434j2258K8699l5813l2792j1148
4649A862423j1426j3487n4117k0464l782m8137l6489k9958m941K7127o2734n6784
4637A547231n7820l7677o7018l5779l5694l5081n2781j7779j7954k2562l6473
4626A130613k7152j6615M183j2101j8660k405M127o44k6332j2962l4504n572K431
$$ y = [11912651, 11777753, 11657136, 11506600, 11192600, 10528710, 9645590, 8761682, 8035802, 7445627, 6973938, 6602952, 6341322, 6125622, 5873566, 5575859, 5298038, 5097867, 4869989, 4656907, 4470878, 4303293, 4141004, 3963347, 3766633, 3596990, 3500340, 3330966, 3188758, 3099653, 2970297, 2837458, 2745960, 2657130, 2513468, 2437721, 2378168, 2312019, 2257317, 2196781, 2119679, 2093302, 2074590, 2042102, 2023438, 1957169, 1925735, 1913477, 1942176, 1906363, 1873571, 1862423, 1850997, 1837510, 1783393, 1762929, 1759147, 1711010, 1674521, 1644563, 1639622, 1666749, 1604015, 1547231, 1489411, 1451734, 1384716, 1348937, 1313243, 1278162, 1225381, 1207602, 1189648, 1167086, 1130613, 1103461, 1086846, 1091029, 1078928, 1060268, 1057863, 1061990, 1061346, 1035014, 1022052, 987548, 981976, 984407]
4613I84407m9309k0659k6104j2062l968p469k2727o5549l4046j8444k7167l0908
4601F65995j9845k6494J615k3520O877k3332k6696k550j6731l531r080K3155l4193
4588E11670o3314O431k431j4131K1673j4468j3425J0691p425k7152J5875k3857
4576D00137J3630J6313l8960j3253M7113l2105Q04m779m9397M037j0259J9305
4564C52586L6577n233n6303p059N2003p413n907j2010j4070K1366k3208j1043
4552C20286j4584L1347j522j2051K5864L0493o950K4122l3138l4470M373K5109
4540C58879Q740O3N068m177m0843R572J6999J0838L030J6102j4421k057O911j6427
4526C58277k8395o79K3770J1215R198j6517j2651N097K205l04m0406J3846k994
$$ y = [984407, 935098, 914439, 888335, 876273, 872305, 864836, 842109, 776560, 742514, 724070, 696903, 665995, 646150, 619656, 621271, 597751, 604628, 581296, 554600, 552050, 535319, 531788, 522708, 545863, 511670, 448356, 454787, 452356, 438225, 459898, 445430, 432005, 442696, 435271, 408119, 423994, 400137, 413767, 430080, 391120, 377867, 424980, 392875, 393679, 388900, 339503, 343540, 333281, 352586, 389163, 383930, 327627, 320568, 372571, 365158, 359251, 347241, 333171, 354537, 331329, 320286, 305702, 337049, 335527, 323476, 349340, 379833, 372883, 397005, 363867, 329397, 333770, 358879, 367619, 367682, 372750, 368573, 327730, 337302, 354301, 365139, 368169, 384271, 369850, 367793, 374704, 358277, 329882, 329203, 352973, 364188, 373386, 356869, 344218, 349315, 351520, 351216, 310810, 324656, 321662]
4513C21662J342K9062k0060l21j6691J2880J0236k3305k046j6355k4607J3073
4501B84870K31j836J0767j3366r178L788J1142r033k430k6590q411k8069J5650
4488B27535J5449l120J1619J4491J363k5946J1728r712r325K0195l4276j5306
4476B04695r474k2070L4698K3421q101j3648K8952k8145K7927o148o778K4120
4464B49449j961k6345j202O778K2722l442n519Q538K748o758J0205K4367l9891
4451B39689k8524M602M8448K7254J2791j5515l2204J937p898L8352K1714l4424
4439B76222j8020J6009O113l8125K2159p36j0323K6950l976L6049k687L557n27
4426C12665K2599l3720j3883J9032J395p970J9071J8943M3285J516j3349j4668
$$ y = [321662, 323004, 352066, 332006, 331685, 314994, 327874, 338110, 314805, 312759, 296404, 271797, 284870, 285101, 283265, 294032, 280666, 271488, 275276, 286418, 277385, 274955, 248365, 239954, 211885, 227535, 242984, 239864, 251483, 265974, 267337, 241391, 253119, 243407, 234082, 254277, 220001, 204695, 195221, 173151, 207849, 231270, 223169, 209521, 238473, 210328, 238255, 232107, 225329, 249449, 247488, 221143, 219941, 226719, 249441, 245999, 240480, 249018, 251766, 245008, 255213, 279580, 239689, 211165, 215767, 264215, 291469, 304260, 288745, 256541, 258478, 250580, 288932, 310646, 276222, 258202, 274211, 280324, 242199, 264358, 263622, 253299, 280249, 276273, 312322, 309635, 313192, 312665, 335264, 301544, 287661, 306693, 308088, 300118, 319189, 338132, 381417, 382933, 369584, 354916]
4414C54916j5621k4345K7046R784j0650J2624j1283l4389k947r600L6516R408
4402C41459j9436K1085j0069K9L2639o773l8805j2121K7547L740k043K2955M396
4389C64603j7229n201j4349l3182J6564K5446K1192k2705K3135j4324L511Q912
4377C56373j2658L986J8838K4756J6148o007L35k3584K219k7556M526K0971o94
4364C77653J0609J6744O156q446K8479M1737K1569L5454J1285J2428k873k7423
4352E23372o3559j3806k1504p746j3696N687N591J1288L9549j5583r578J3844
4340D53859L345k5723r838P843p287L608J2389O96L950J4013k1192P970K8914
4327D72547J8711j3522j9663M183R689J4792j6995j401J0242K3218M8270P569
$$ y = [354916, 339295, 314950, 341996, 351780, 341130, 353754, 342471, 308082, 305135, 295535, 332051, 341459, 322023, 343108, 333039, 333068, 365707, 358934, 320129, 308008, 335555, 339295, 337252, 360207, 364603, 347374, 342173, 327824, 294642, 311206, 336652, 357844, 335139, 358274, 343950, 347461, 356373, 343715, 347701, 366539, 391295, 407443, 401436, 401771, 378187, 380406, 352850, 357376, 378347, 377653, 388262, 405006, 411162, 402716, 431195, 472932, 494501, 529955, 541240, 553668, 550795, 523372, 459813, 446007, 424503, 416757, 403061, 408748, 414339, 425627, 465176, 449593, 440015, 453859, 457204, 431481, 421643, 429486, 422199, 425807, 438196, 438892, 442842, 456855, 435663, 443633, 472547, 491258, 477736, 458073, 462256, 471945, 486737, 469742, 468341, 478583, 501801, 550071, 557640]
4315E57640j5037L6779K4642k8597J4443O301J687K1323R626K9866m480J3037
4303F67230L7933O163K3660J6232K6092O7382N602k7646M3606N6382K9849N6241
4291A008726M6128K5895N1842P4178P7802O9708M5879Q2326J04288J09075O6872
4280A762719R3090Q3082N8373J01563J25411J43352J62176J56117K12689K29218
4270C127790K61444K68655K28330K36421K14718J63959J61629J82620J87974K86525
4260E320065K91786L46604M78695N08743N60833N95687N96165N63620N14916L86066
4250A0163180K78005K03390J34953J87913K00963L08952M59902N77448P18720
4241A3233426P98337Q64806R01772Q20520O49184M67842J86395r9681k63414k99914
$$ y = [557640, 542603, 579382, 604024, 575427, 589870, 596171, 597858, 619181, 628807, 658673, 654193, 667230, 705163, 711326, 734986, 751218, 777310, 844692, 850294, 822648, 866254, 922636, 952485, 1008726, 1054854, 1080749, 1132591, 1206769, 1284571, 1354279, 1400158, 1482484, 1586772, 1695847, 1762719, 1855809, 1938891, 1997264, 2098827, 2224238, 2367590, 2529766, 2685883, 2898572, 3127790, 3389234, 3657889, 3886219, 4122640, 4337358, 4501317, 4662946, 4845566, 5033540, 5320065, 5611851, 5958455, 6437150, 6945893, 7506726, 8102413, 8698578, 9262198, 9777114, 10163180, 10441185, 10644575, 10779528, 10967441, 11168404, 11477356, 11937258, 12514706, 13233426, 14031763, 14896569, 15798341, 16618861, 17268045, 17735887, 17922282, 17822601, 17559187, 17259273]
4231A7259273k29695q0653J10345K47424M60375O00167P10747P67861P16645N09868
4221B1072357J07431l06499o47768q97512r73442q63851o85124m74217k35388
4212A6095987j7837J65076L29281L41058K72680K0608l41517o64778r52312j064634
4202A4183612j036219r40387p95750o17734m01296k91547j52559j19769m1197
4193I787154r8266k17251l96945n40495o28660o43361n49767n23552m46322l47209
4183E395326l15218k25375j57927j47527j17634j31643j76509j99545j91063k16540
4173C516345j82627j92934j96006j03007j25107j77235r0958q4405q1496r4047
4163B188523p3772n6379p2891m1614n3145q1401m3937m0959p9695k9301p5307
$$ y = [17259273, 17029578, 16948925, 17059270, 17306694, 17767069, 18367236, 19077983, 19845844, 20562489, 21072357, 21179788, 20873289, 20225521, 19328009, 18354567, 17490716, 16805592, 16331375, 16095987, 16078150, 16243226, 16572507, 16913565, 17186245, 17206853, 16865336, 16200558, 15248246, 14183612, 13147393, 12207006, 11411256, 10793522, 10392226, 10100679, 9948120, 9828351, 9787154, 9688888, 9471637, 9074692, 8534197, 7905537, 7262176, 6712409, 6188857, 5742535, 5395326, 5080108, 4854733, 4696806, 4549279, 4431645, 4300002, 4123493, 3923948, 3732885, 3516345, 3333718, 3140784, 2944778, 2841771, 2716664, 2539429, 2448471, 2364066, 2282570, 2188523, 2114751, 2058372, 1985481, 1943867, 1890722, 1809321, 1765384, 1724425, 1644730, 1615429, 1540122]
4152A540122m5319j9993j0930l1359j6308k4965n2121k2755k899k4420l1653k6437
4140A230963p534m258o3528J72n917K663l9261q430j3384R754k8248l2742n108
4127A035142k1307K695M150m3140j7826j1286k2723m7519N0186Q146m5519k7392
4115H63607M4j4152j2271P310L2305j4528k2387j529m881P848J4222K960L3J6127
4101H74708l7500J2515P789j4300J0282k0498r040N617j9313k140O5093l089m6373
4088H23751j6936J176L3265M6748O7660j4093j8378P598K6809j1707m346Q003
4076I49550K9370K4985p215L0814O3539K4556K1542J3469J2068J8327L1862J5686
4064A228553l9687p153J0202K7168N2574L0462j166J1468K7379K7080L7709k8074
$$ y = [1540122, 1494803, 1474810, 1463880, 1432521, 1416213, 1391248, 1339127, 1316372, 1313473, 1289053, 1257400, 1230963, 1223429, 1219171, 1155643, 1155815, 1149898, 1152561, 1113300, 1104870, 1091486, 1101240, 1072992, 1040250, 1035142, 1013835, 1016530, 1020680, 977540, 959714, 948428, 925705, 878186, 928372, 936518, 890999, 863607, 863651, 849499, 837228, 844538, 876843, 862315, 839928, 838399, 833518, 841366, 855588, 858548, 858581, 874708, 837208, 849723, 857512, 843212, 853494, 832996, 823956, 829573, 810260, 808120, 873213, 870124, 823751, 806815, 807991, 841256, 888004, 955664, 941571, 923193, 930791, 957600, 945893, 941547, 949550, 978920, 1003905, 996690, 1027504, 1091043, 1115599, 1137141, 1150610, 1162678, 1181005, 1212867, 1228553, 1188866, 1181713, 1191915, 1219083, 1271657, 1302119, 1300953, 1312421, 1339800, 1366880, 1404589, 1376515]
4052A376515k104j4388j3241j3572o78J3364R563K6673N8602K4511J1175K489
4040A478909K6252p0368l6754k4751m9803j7428j1952r982m3102R507L2059L48
4028A282935L8350L1967l5781l4593l3118j2955P721K1131K9851l490k3230R689
4016A278477K2632q401j3714M760j9030p415L059K758R22M6897j5292l1895L036
4003A266794K4024j4991M0710J0088m1988N922J155p276M9686L8166L5052K3555
3991A430897k3488L337J2103R036j6000J4236L1709m3P276K7519J3255k3780M3311
3978A529368J6680L8949j0774J8455J6412K4128O0856N270J0932o025p393j206
3966A695652J5282K0505N8071R105Q203J8453M1689N3227L6482P472K5008L5548
$$ y = [1376515, 1374411, 1360023, 1346782, 1333210, 1332532, 1345896, 1355459, 1382132, 1440734, 1465245, 1476420, 1478909, 1505161, 1434793, 1398039, 1373288, 1323485, 1306057, 1294105, 1284123, 1241021, 1250528, 1282587, 1282935, 1321285, 1353252, 1317471, 1282878, 1249760, 1236805, 1244526, 1265657, 1295508, 1292018, 1268788, 1278477, 1301109, 1292708, 1278994, 1283754, 1264724, 1257309, 1260368, 1263126, 1264048, 1310945, 1295653, 1263758, 1266794, 1290818, 1275827, 1316537, 1326625, 1284637, 1290559, 1291714, 1284438, 1334124, 1372290, 1407342, 1430897, 1407409, 1410746, 1422849, 1431885, 1415885, 1430121, 1461830, 1461787, 1469063, 1496582, 1509837, 1486057, 1529368, 1546048, 1584997, 1574223, 1592678, 1609090, 1633218, 1694074, 1699344, 1710276, 1704251, 1696858, 1695652, 1710934, 1731439, 1789510, 1798615, 1806818, 1825271, 1866960, 1920187, 1956669, 1964141, 1989149, 2024697]
3954B024697J5312R81J168L504K2705o961L1556j4378P919O5871K3900J5919L0453
3941B222646R1564R8786P6290R4027J21747P7650M7563L8604J5784L232j9398
3930B868495j8572M6855Q4299R144L1481J21852J05437Q0954J23662J25545J59163
3919C738315K00874K15857K38102K40898K61689K87435K56033K94699K75016L43167
3909F352085M02541M38617N80617P32607Q08155Q16320P45962N10220J88350l4449
3899A1541025L776L7340P2975J40366K26843L17529M74134O21637O97534O58353
3889A4791512N58488M51642K56625R1919L5999L1314R8986J20032K38207L40586
3879A7015310N34175P30709R29535J090817J198344J217811J113697O32863k03350
$$ y = [2024697, 2040009, 2040990, 2042158, 2045662, 2068367, 2061406, 2092962, 2078584, 2086503, 2152374, 2176274, 2192193, 2222646, 2314210, 2412996, 2489286, 2583313, 2705060, 2782710, 2830273, 2868877, 2884661, 2887893, 2868495, 2849923, 2896778, 2981077, 2990221, 3021702, 3143554, 3248991, 3329945, 3453607, 3579152, 3738315, 3939189, 4155046, 4393148, 4634046, 4895735, 5183170, 5439203, 5733902, 6008918, 6352085, 6754626, 7193243, 7773860, 8506467, 9314622, 10130942, 10876904, 11387124, 11575474, 11541025, 11544801, 11582141, 11655116, 11795482, 12022325, 12339854, 12813988, 13435625, 14133159, 14791512, 15350000, 15801642, 16058267, 16150186, 16186185, 16217499, 16316485, 16436517, 16674724, 17015310, 17549485, 18280194, 19209729, 20300546, 21498890, 22716701, 23830398, 24463261, 24259911]
3870B4259911r99603j490953j497263j224908q92775n89156m59552l35459k09672
3861A6560570j46214n6873n649r207o3309j47129l28769n43588p28059p33609
3851A3798164o78039n05472l70025j72406j33632p2979n3907j7811m6229j28017
3841A1619647l20876n71719p18774p72200o85896n37982m17822l45810k67848
3832F980720k35154k07333k17167k34080k46549k43490k13070j56702j57806r7783
3822D971586p4384r3833j34356m2127o5170m3753l3391k1405o5686k2078K3044
3811D398447l8162k4474o8714o0398o4136q7540q5867q3981o1893m4739o4362
3800C714181j301o2788l1164k186j7446o668m3339n944K3466J1893l2284j2841
$$ y = [24259911, 23260308, 21769355, 20272092, 19047184, 18154409, 17565253, 17105701, 16770242, 16560570, 16414356, 16357483, 16351834, 16342627, 16279318, 16132189, 15803420, 15259832, 14531773, 13798164, 13120125, 12614653, 12244628, 12072222, 11938590, 11865611, 11811704, 11793893, 11747664, 11619647, 11298771, 10727052, 10008278, 9236078, 8550182, 8012200, 7594378, 7248568, 6980720, 6745566, 6538233, 6321066, 6086986, 5840437, 5596947, 5383877, 5227175, 5069369, 4971586, 4897202, 4803369, 4669013, 4626886, 4561716, 4517963, 4484572, 4463167, 4397481, 4375403, 4398447, 4360285, 4335811, 4267097, 4206699, 4142563, 4055023, 3969156, 3885175, 3823282, 3778543, 3714181, 3712880, 3650092, 3618928, 3616742, 3599296, 3592628, 3549289, 3543345, 3566811, 3578704, 3546420, 3533579]
3788C533579J6591L0212K757j3761j207O974j8134j412j4869l997R144M4504O101
3775C596482J324K8542K2773P468L0696J9621L0540M9758N4694M6509K6931R4890
3763D010228O2016L6823R9527Q6576Q5074R6585J00124J33291J06326J43561J45690
3752E105821J50795J86774J98289K15646K24639K14261K49291K64897L10160L39715
3742G460288L47532L64056M40267N06555N84275P13377Q27796R05081R44647J003159
3732A4097033J042869R48215P93657O90850M84419K90286Q7198l3675j58605k91770
3722A7950477k19794j27699o7473N7816J71552K45390K33716J74014N3123j20565
3712A8350557k83352m83782n92959p51395q20817q60349q56263q53460p17255
$$ y = [3533579, 3550170, 3580382, 3583139, 3569378, 3568171, 3575145, 3557011, 3555599, 3540730, 3536733, 3545877, 3590381, 3596482, 3597806, 3626348, 3649121, 3656589, 3687285, 3706906, 3737446, 3787204, 3841898, 3888407, 3915338, 4010228, 4072244, 4109067, 4208594, 4295170, 4380244, 4476829, 4576953, 4710244, 4816570, 4960131, 5105821, 5256616, 5443390, 5641679, 5857325, 6081964, 6296225, 6545516, 6810413, 7120573, 7460288, 7807820, 8171876, 8612143, 9118698, 9702973, 10416350, 11244146, 12149227, 13093874, 14097033, 15139902, 16088117, 16881774, 17572624, 18057043, 18347329, 18434527, 18400852, 18242247, 17950477, 17730683, 17602984, 17535511, 17593327, 17764879, 18010269, 18243985, 18417999, 18471122, 18350557, 18067205, 17583423, 16990464, 16239069, 15418252, 14557903, 13701640, 12848180, 12130925]
3703A2130925o57074n56390n07997m14750l79121l28974k88221k24476j70048
3694H603874j89327j61886j58424j50808r1614j03471j01880o2550r6615n4454
3684G432845l4604n0410j5724J546l6632L407l0065O966L3831J9040J4115K4182
3672G368497l2994j3282j6644J0035o90q046K3921m431j4061L3084P5235K7556
3660G448180N3510K5640N7902N6997L6429O9213J08094O8030M9665Q4766O8770
3649H127196R1599Q8967J35108R0659J34487P9608N7651J48194J29674J00703
3639I183846J35519J50801J51122J13158J56021J72244J69770J32972J98595K11045
3629A0775093J72940J67632J78340K06166K15894K17996K27885K07712K61661
$$ y = [12130925, 11473851, 10917461, 10409464, 9994714, 9615593, 9286619, 8998398, 8773922, 8603874, 8414547, 8252661, 8094237, 7943429, 7851815, 7748344, 7646464, 7583914, 7487299, 7432845, 7398241, 7347831, 7332107, 7333653, 7297021, 7300428, 7270363, 7277329, 7311160, 7330200, 7344315, 7368497, 7335503, 7322221, 7305577, 7315612, 7314922, 7306876, 7330797, 7326366, 7312305, 7345389, 7420624, 7448180, 7501690, 7527330, 7585232, 7642229, 7678658, 7747871, 7855965, 7923995, 7973660, 8058426, 8127196, 8218795, 8307762, 8442870, 8533529, 8668016, 8747624, 8805275, 8953469, 9083143, 9183846, 9319365, 9470166, 9621288, 9734446, 9890467, 10062711, 10232481, 10365453, 10564048, 10775093, 10948033, 11115665, 11294005, 11500171, 11716065, 11934061, 12161946, 12369658, 12631319]
3620A2631319K82362L20394L22911L01964L57038M25920M47366N25726N77607
3611A6192607O00202O43369P70025R05076R60745J090451J195102J461436J665574
3602B5484587J993497K282002K624552K944177L138664L213985L081962K841767
3594D7605193K439596J912807J322184Q27977L24861q2361l19303m43337l02676
3585E3284941R724L15993N28435O38815O67285M86920J22575m00005r09688j418117
3575E3326878j937843k391200k746475k903112k874979k733363k534291k278662
3567C2926953j975599j698876j424079j247065j103199r20194p89374p12362o23402
3558B2432803n43087m93569m03718l25206k62132k30636j32274j06112J3488M8880
$$ y = [12631319, 12913681, 13234075, 13556986, 13858950, 14215988, 14641908, 15089274, 15615000, 16192607, 16792809, 17436178, 18206203, 19111279, 20072024, 21162475, 22357577, 23819013, 25484587, 27478084, 29760086, 32384638, 35328815, 38467479, 41681464, 44763426, 47605193, 50044789, 51957596, 53279780, 54107757, 54432618, 54350257, 54030954, 53587617, 53284941, 53294665, 53610658, 54139093, 54777908, 55445193, 55932113, 56054688, 55654683, 54744995, 53326878, 51389035, 48997835, 46251360, 43348248, 40473269, 37739906, 35205615, 32926953, 30951354, 29252478, 27828399, 26581334, 25478135, 24557941, 23768567, 23056205, 22432803, 21889716, 21396147, 20992429, 20667223, 20405091, 20174455, 20042181, 19936069, 19949557, 19998437]
3548A9998437J10239J95234K53417L34681M09500M47361N77286O56948P97124
3539B3780227R31480J100047J174981J298577J413561J418596J504610J396106
3531C4018185J327857J266242J207818J158869J101838R83916Q29365N83029L53591
3522D2830710J16856m2278j64269l14663m19385n18972o08754o45719p23686q05005
3512C8704835r22635r25977r45422r88683j022751r95398r28223q84055p38366
3503C0353325o63604m92835l41270j79696M1497J79747K85182L66202K82951L61158
3493C0192657O15367R03926J112539J248275J296948J392582J590683J894808
3485D0247785K145459K308712K397349K445845K394648K333676K300344K196842
$$ y = [19998437, 20108676, 20303910, 20557327, 20892008, 21301508, 21748869, 22326155, 22983103, 23780227, 24711707, 25811754, 26986735, 28285312, 29698873, 31117469, 32622079, 34018185, 35346042, 36612284, 37820102, 38978971, 40080809, 41064725, 41894090, 42477119, 42830710, 42947566, 42905288, 42741019, 42426356, 42006971, 41487999, 40879245, 40233526, 39509840, 38704835, 37782200, 36856223, 35910801, 34922118, 33899367, 32903969, 31975746, 31091691, 30353325, 29689721, 29196886, 28855616, 28675920, 28717417, 28897164, 29182346, 29548548, 29831499, 30192657, 30808024, 31711950, 32824489, 34072764, 35369712, 36762294, 38352977, 40247785, 42393244, 44701956, 47099305, 49545150, 51939798, 54273474, 56573818, 58770660]
3477E8770660K168524K208567K387367K746683L212027L813336M481046N233277
3469H5021487N871808O301039O430415O181899N692425M897296L817096K416476
3461A26629941Q88946o21970j847462k573533k904867k825001k330381j690023
3453A12725650j033488n11920k93633l05051m41864p75039j365730k122040k997478
3444A02879407l957043m674363n198122n392788n433771n271066m961384m559417
3436F3431453m070542l587125l057729k562426k141375j736378j405638j085668
3428D3784572p70196n32542l03610J2837K56781N50669Q98181J253105J736315
3419D6886112K160639K674397L215459L613099L906424L919089L759745L467544
$$ y = [58770660, 60939184, 63147751, 65535118, 68281801, 71493828, 75307164, 79788210, 85021487, 90893295, 97194334, 103624749, 109806648, 115499073, 120396369, 124213465, 126629941, 127518887, 126896917, 125049455, 122475922, 119571055, 116746054, 114415673, 112725650, 111692162, 111180242, 110886609, 110581558, 110139694, 109364655, 107998925, 105876885, 102879407, 98922364, 94248001, 89049879, 83657091, 78223320, 72952254, 67990870, 63431453, 59360911, 55773786, 52716057, 50153631, 48012256, 46275878, 44870240, 43784572, 43014376, 42481834, 42178224, 42191061, 42447842, 42998511, 43896692, 45149797, 46886112, 49046751, 51721148, 54936607, 58549706, 62456130, 66375219, 70134964, 73602508]
3411G3602508L181810K941688K720002K335485J849836J266439N73411k9183n82984
3402H7859012r09871j116578j189724j217429j189569j073636q98767q01028p70318
3393G8692092q00110r53071j202420j543527j908130k338995k711544l070556
3385F4163739l344823l516797l544325l491223l274967l043861k848104k559940
3377C8539699k321948k155025j904919j664825j479057j298747j195734j084449
3369B5434995r76193q71693p01733o33254n90369n14030l83212l06087j97845
3360B0260579j37664l7281J15858J88125K29630J42014P8765r1320k00213k53233
3350B0295260j71788j07604O065J22177J65036K12118K53048K57039L50605K88791
$$ y = [73602508, 76784318, 79726006, 82446008, 84781493, 86631329, 87897768, 88471179, 88441996, 87859012, 86949141, 85832563, 84642839, 83425410, 82235841, 81162205, 80263438, 79462410, 78692092, 77891982, 76938911, 75736491, 74192964, 72284834, 69945839, 67234295, 64163739, 60818916, 57302119, 53757794, 50266571, 46991604, 43947743, 41099639, 38539699, 36217751, 34062726, 32157807, 30492982, 29013925, 27715178, 26519444, 25434995, 24458802, 23587109, 22885376, 22252122, 21661753, 21147723, 20764511, 20458424, 20260579, 20122915, 20085634, 20201492, 20389617, 20619247, 20761261, 20840026, 20748706, 20548493, 20295260, 20123472, 20015868, 20021933, 20144110, 20309146, 20521264, 20774312, 21031351, 21381956, 21670747]
3340B1670747K81640K16959R083j84996l26411l83757l53016l59195l24702k05967
3330B0040385j52434r8855l5856k6427n8468m0077n6220M190Q6277K78719M71847
3319B0413081O54443Q42897R53273J105667J148434J253781J298895J390575J514783
3310C0575829J610829J663251J707157J749616J784013J830227J939258K159911
3302D5020091K373212K487409K419316K291130K084697J835135J801619J821883
3294F2134492J798761J556887J101167M31067k85346q17532j264773j647748k021458
3285F0985517k420472k842720l191850l429828l479835l444605l346952l163034
3277C5666221k920712k654406k364956k090664j844067j617025j412658j244634
$$ y = [21670747, 21952387, 22169346, 22178429, 21993433, 21667022, 21283265, 20930249, 20571054, 20246352, 20040385, 19887951, 19789096, 19753240, 19726813, 19668345, 19628268, 19572048, 19576238, 19662515, 19941234, 20413081, 21067524, 21910421, 22863694, 23969361, 25117795, 26371576, 27670471, 29061046, 30575829, 32186658, 33849909, 35557066, 37306682, 39090695, 40920922, 42860180, 45020091, 47393303, 49880712, 52300028, 54591158, 56675855, 58510990, 60312609, 62134492, 63933253, 65490140, 66591307, 67022374, 66737028, 65919496, 64654723, 63006975, 60985517, 58565045, 55722325, 52530475, 49100647, 45620812, 42176207, 38829255, 35666221, 32745509, 30091103, 27726147, 25635483, 23791416, 22174391, 20761733, 19517099]
3269A9517099j107548j014991q89560q01479p12044o45666n69632n49528n15421
3260A2711230m91865m72250m21551l73945l29525k75852k40706k40669k30714
3251I634153j91339k10467j67835j31101j05044j07340j12033j14076j00141q0597
3241H314180o2833n3678q8867o4164o0803m6160o9554j6805l840m9890j4945o9504
3229G713137p8030j21471j39018j51446j57455j85788j87727j62950j91537k00755
3219F136960j80186j66394j50005j26607r6910r3263j00174p0721j07120r4893
3209D950687n4248o8251m3670l1235M412j7701k4548j8201l2233k2185k1891k8237
3197D592699k968M358k4332m7346o6004m4315l9955m9470l3221l5675q772q372
$$ y = [19517099, 18409551, 17394560, 16505000, 15703521, 14991477, 14345811, 13776179, 13226651, 12711230, 12219365, 11747115, 11325564, 10951619, 10622094, 10346242, 10105536, 9864867, 9634153, 9442814, 9232347, 9064512, 8933411, 8828367, 8721027, 8608994, 8494918, 8394777, 8314180, 8251347, 8197669, 8108802, 8044638, 7983835, 7937675, 7868121, 7851316, 7847476, 7797586, 7782641, 7713137, 7635107, 7513636, 7374618, 7223172, 7065717, 6879929, 6692202, 6529252, 6337715, 6136960, 5956774, 5790380, 5640375, 5513768, 5416858, 5323595, 5223421, 5152700, 5045580, 4950687, 4896439, 4828188, 4784518, 4753283, 4757695, 4739994, 4715446, 4697245, 4665012, 4642827, 4620936, 4592699, 4589731, 4594089, 4569757, 4522411, 4456407, 4412092, 4372137, 4322667, 4289446, 4253771, 4244999, 4236627]
3185D236627o039L2333J2872K5067L296L3622N0318L0099O054l1771N1149j0068
3173D433559m0828k6369o3052p6283m9590l216l328l6080k9485k8519r471L0715
3161D098053K470R596j1512j5093q314r265j9412K2851r468K9393P579K7110O2076
3148D186064N4728J0788K0063P5637L3354K475K8670O6685M2443K4345N0593N4433
3136D650278P6312J09961R5562J29960J03763J06429J55107J18912J90349J32607
3126E869240J57481J56876J23126J04699J29992J44421J60898J30146J56554J44702
3116G278135J53792J83280J88128K29089K27896K80574L18225L13612L04001K74234
3106I750966K69314L24508L56765M04124M38947M54022M57651M45272N01855O19413
$$ y = [4236627, 4230588, 4262921, 4275793, 4300860, 4304156, 4337778, 4388096, 4418195, 4424249, 4392478, 4443627, 4433559, 4392731, 4366362, 4303310, 4227027, 4177437, 4174221, 4170893, 4134813, 4105328, 4076809, 4067338, 4098053, 4100523, 4110119, 4098607, 4083514, 4075200, 4065935, 4046523, 4069374, 4059906, 4089299, 4096878, 4123988, 4186064, 4240792, 4251580, 4271643, 4347280, 4380634, 4383109, 4411779, 4478464, 4520907, 4545252, 4595845, 4650278, 4726590, 4836551, 4932113, 5062073, 5165836, 5272265, 5427372, 5546284, 5736633, 5869240, 6026721, 6183597, 6306723, 6411422, 6541414, 6685835, 6846733, 6976879, 7133433, 7278135, 7431927, 7615207, 7803335, 8032424, 8260320, 8540894, 8859119, 9172731, 9476732, 9750966, 10020280, 10344788, 10701553, 11105677, 11544624, 11998646, 12456297, 12901569, 13403424, 14022837]
3096A4022837O83715P71010Q69203R08273J003926J099885J154840J317113J401107
3087B3231909J573173J727721J856511K053600K334017K629349L002014L384356
3079D1792650L840114M335489M943148N559147O221011O899893P823363R174371
3071I0589186J0886107J2924229J5198085J7829413K0780318K3536464K4525235
3064B16269037K3082455K0996527K1819465K5741660K5748718J3494430j0876140
3057C36276152l5292527m5841366m2060426l3037356k4635265j8304278j3889126
3050A23215808j1063575r446572q464618p705544o983644o262892n561022m865767
3042F2862174m264907l701124l364616l175094k996778k791446k584768k320469
$$ y = [14022837, 14706552, 15477562, 16346765, 17255038, 18258964, 19358849, 20513689, 21830802, 23231909, 24805082, 26532803, 28389314, 30442914, 32776931, 35406280, 38408294, 41792650, 45632764, 49968253, 54911401, 60470548, 66691559, 73591452, 81414815, 90589186, 101475293, 114399522, 129597607, 147427020, 168207338, 191743802, 216269037, 239351492, 260348019, 282167484, 307909144, 333657862, 347152292, 336276152, 300983625, 255142259, 213081833, 180044477, 155409212, 137104934, 123215808, 112152233, 102705661, 94241043, 86535499, 79551855, 73288963, 67727941, 62862174, 58597267, 54896143, 51531527, 48356433, 45359655, 42568209, 39983441, 37662972]
3034C7662972k088812j888088j708601j492730j348402j251892j173327j067127
3026B5643993j011649r88904r45924r24583q97931q86396q82491p83731p24465
3017A7597919p54708o97825n79890n32317n02252m43660l94308m12500m07363
3008A2873096l97714l38931l01929k94530k86661l22484l16282k94960k87235
2999A0032370k59160k55660k66284k08884k71803k25575k03092j34321j65790
2990H041801j26412j54338q3802j45874j88101j23610j86305j39567j60309j40023
2980F593460j16474j15553j19489j21052r0521j22371o8634r9818r4570j23366
2970E521612p3630m0178o7052n6255p0991q0744r8564n6591n2885m4595p4408
$$ y = [37662972, 35574160, 33686072, 31977471, 30484741, 29136339, 27884447, 26711120, 25643993, 24632344, 23643440, 22697516, 21772933, 20875002, 19988606, 19106115, 18322384, 17597919, 16843211, 16145386, 15565496, 15033179, 14530927, 14087267, 13692959, 13280459, 12873096, 12475382, 12136451, 11834522, 11539992, 11253331, 10930847, 10614565, 10319605, 10032370, 9773210, 9517550, 9251266, 9042382, 8770579, 8545004, 8341912, 8207591, 8041801, 7915389, 7761051, 7677249, 7531375, 7343274, 7219664, 7033359, 6893792, 6733483, 6593460, 6476986, 6361433, 6241944, 6120892, 6030371, 5908000, 5839366, 5739548, 5644978, 5521612, 5447982, 5407804, 5340752, 5284497, 5213506, 5132762, 5034198, 4977607, 4924722, 4880127, 4805719]
2959D805719j07431q0063l6549p2332n3833n3748o3547j09447q1083p0381m6100
2948D031205l6415q2976q4666q2466p8030n2592k8575o6694m5766o8491m5890
2937C358644j5004j7982k0810k2590l6201o5609p7595q8145m0302n5558n2741
2926B866107p4501p2286o8946l8407m2160n5448j4921j1260m0547j6834o647q409
2914B415741Q825j0763l5958j3665l2181m7168l0963l2223l1687q2239n9842Q371
2902B056248m3373k9455J4579l3641o5051l9925o646J4825j7992j6848j2096l0860
2890A789765L1977K768k3816l0676j7789p436m805m3840k6737j0024R382m4324
2878A624445r316L5269K4604r396J5261M8060j992j5144n2555o9143m7065o215
$$ y = [4805719, 4698288, 4618225, 4581676, 4509344, 4455511, 4401763, 4338216, 4228769, 4147686, 4077305, 4031205, 3994790, 3911814, 3827148, 3744682, 3666652, 3614060, 3585485, 3518791, 3473025, 3404534, 3358644, 3343640, 3325658, 3304848, 3282258, 3246057, 3180448, 3102853, 3014708, 2974406, 2918848, 2866107, 2791606, 2719320, 2650374, 2611967, 2569807, 2514359, 2499438, 2488178, 2447631, 2430797, 2424150, 2415741, 2424566, 2413803, 2377845, 2364180, 2331999, 2284831, 2253868, 2221645, 2189958, 2107719, 2047877, 2056248, 2012875, 1983420, 1997999, 1964358, 1899307, 1859382, 1852736, 1867561, 1849569, 1832721, 1820625, 1789765, 1821742, 1824510, 1800694, 1770018, 1752229, 1744793, 1739988, 1696148, 1669411, 1659387, 1668769, 1624445, 1615129, 1650398, 1675002, 1665606, 1680867, 1728927, 1726935, 1711791, 1659236, 1590093, 1543028, 1536813]
2866A536813l0825k0075j5943k5846l3730k7758m8336n4261l7905j9601k0232
2855A202301K2734M009k6986j0906J9722O416j1550p369L3244P393j6788k2566
2843A199654l475k2070J9262J5584l8854j5935j748k0537J7419k8519k6416j6708
2831A077657k9517J6009Q559q122k8475J4372k3129R274P734R212M3931q589m031
2818A084885K9592k4097m5792R705M910J823J1197P224K5180k6001N131L678N4289
2805A141724n3195j0859L2093j4263o411q118L4443L6662P701J4476L2725J3593
2793A220571M4647L8507N0493L5288L1188O3324N4193P8651P0900N7932R7335
2782A843029J48977J14351Q1743O4908J19011J44823R0845p1021j86129j98264
$$ y = [1536813, 1505988, 1485913, 1469970, 1444124, 1410394, 1382636, 1334300, 1280039, 1242134, 1222533, 1202301, 1225035, 1229044, 1202058, 1191152, 1210874, 1217290, 1205740, 1198371, 1231615, 1239008, 1222220, 1199654, 1196179, 1174109, 1193371, 1208955, 1170101, 1154166, 1152418, 1131881, 1149300, 1120781, 1094365, 1077657, 1048140, 1064149, 1072708, 1064586, 1036111, 1050483, 1027354, 1036628, 1044362, 1053574, 1097505, 1088916, 1084885, 1114477, 1090380, 1044588, 1054293, 1059203, 1061026, 1072223, 1079447, 1104627, 1078626, 1083757, 1087435, 1141724, 1088529, 1077670, 1109763, 1095500, 1089089, 1080971, 1115414, 1152076, 1159777, 1174253, 1206978, 1220571, 1265218, 1303725, 1354218, 1389506, 1420694, 1484018, 1538211, 1616862, 1687762, 1745694, 1843029, 1992006, 2106357, 2188100, 2253008, 2372019, 2516842, 2607687, 2536666, 2350537, 2152273]
2772B152273k45589j80444j60491r4812q9305o7999p8177o5899j3745k6949k4454
2761A104409j2349p6070l2859K3617q6734j6918r179m6815L985l2324l514J6720
2749H31969m5932N348L4122p769m92n7724k3328k945m292J3029j9167j8385K1854
2736G26288J1370j0698j3082Q78l774n219j2982O381n638N906j8702j9208J0774
2723F72294j1275j5812J6911J3526l2456L534j2302j005J3355J4196o861j0623
2711F43482k4694n822J0437Q12k6816j8402L390j6807J6156l0722O907J0100q239
2698E59782m0453J9887K7221m3315m213K4470j9587l5286J8724j1626k2712j0352
2686D62540L613P653j8940j8688M700J3425J628J3030J823J7274R916j067j2726
$$ y = [2152273, 1906684, 1726240, 1565749, 1470937, 1381632, 1313633, 1235456, 1169557, 1155812, 1128863, 1104409, 1092060, 1015990, 983131, 1006748, 920014, 903096, 893917, 847102, 851087, 818763, 815249, 831969, 786037, 791385, 825507, 817738, 817246, 759522, 736194, 733249, 728957, 741986, 722819, 704434, 726288, 737658, 726960, 713878, 714756, 710982, 705763, 692781, 699162, 693524, 699430, 680728, 661520, 672294, 661019, 645207, 662118, 675644, 643188, 646722, 634420, 633415, 646770, 660966, 654105, 643482, 618788, 612966, 623403, 624215, 597399, 578997, 582387, 565580, 581736, 551014, 557921, 568021, 559782, 519329, 539216, 566437, 523122, 518909, 543379, 523792, 488506, 507230, 495604, 472892, 462540, 466153, 473806, 454866, 436178, 440878, 454303, 455931, 468961, 470784, 488058, 497974, 496907, 484181]
2673D84181k9394J1106k1875q788l565k196q515M431J9045L7956k1987k8537L3794
2660D65656j6351o118M314N66m233q255N416J9007J2816o2524j953L429Q898J028
2646D21696j1208k6974j7658M424J7313j1729k7738J681J9777k5543k2292J7245
2634C38994n045K4662j4537k0329p894P523n679J6067j3817j4423M0700K2702
2622C68924P991j0418j3521l3399j3128k3054L931k681J2363J4135j5584m323
2610B91236R927L7081j8555p560K401k0112K7582J5357K3059n7826Q496K4767
2598C35853L203j680j0825l7705J0156R300m5544L4520j6717q077j2178L875L2975
2585B97156O695l4154M7596P124l0997O050K4351j843j2879k2327j3896J3929
$$ y = [484181, 454787, 465893, 444018, 435230, 431665, 429469, 420954, 425385, 444430, 482386, 460399, 431862, 465656, 449305, 443187, 447501, 448067, 443834, 435579, 440995, 460002, 472818, 410294, 408341, 411770, 420668, 421696, 410488, 383514, 365856, 370280, 387593, 375864, 348126, 349807, 369584, 344041, 321749, 338994, 333949, 358611, 344074, 323745, 315851, 323374, 317695, 333762, 319945, 305522, 346222, 368924, 376915, 366497, 352976, 319577, 306449, 283395, 287326, 284645, 297008, 311143, 295559, 291236, 301163, 338244, 319689, 312129, 314530, 294418, 322000, 337357, 360416, 302590, 311086, 335853, 339056, 337376, 326551, 288846, 299002, 308302, 262758, 297278, 280561, 272484, 260306, 264181, 297156, 303851, 269697, 317293, 324417, 293420, 299470, 323821, 321978, 309099, 286772, 272876, 286805]
2573B86805P781M224L5517l723j5184q199J2028l9906j552J7320J8995j0343l1089
2560B72674R663o564q496O010j6267P88J4778k1769k0106J3059Q372R385n841
2547B55686Q436r532K6278K7302l6288K9881j0734j4821J0867l2532N146O1265
2535C20954k9551k9909n50K0213Q610j0161K050l883L971l5991L0612O731k0828
2522B62268k3261L2589M2085j5040m6613k2401k772k852K237k503K6348j7022
2510B33063j5282J391l3324j4687K8458J1742K1085k3741J6282M697r651r85o314
2497B12734o015j2544R09J2412N225K2362j4357q849j1255j2672K8668k3034K904
2484A96488N7471p188j0661l0162L3582K6169j6441Q86k5897J0611Q309m0264
$$ y = [286805, 294586, 298810, 334327, 330604, 315420, 307221, 319249, 279343, 277791, 295111, 314106, 303763, 272674, 282337, 275773, 267277, 273287, 257020, 257808, 272586, 250817, 230711, 243770, 252142, 261527, 255686, 264122, 254590, 280868, 308170, 271882, 301763, 291029, 276208, 287075, 254543, 259689, 320954, 291403, 261494, 260944, 281157, 289767, 279606, 281656, 277773, 281744, 245753, 276365, 283096, 262268, 239007, 271596, 313681, 298641, 252028, 229627, 226855, 224003, 226240, 223737, 250085, 233063, 217781, 219172, 185848, 171161, 199619, 211361, 232446, 208705, 224987, 229684, 220033, 219048, 212734, 206719, 194175, 195084, 207496, 212721, 235083, 220726, 211877, 200622, 187950, 216618, 193584, 196488, 253959, 246771, 236110, 205948, 239530, 265699, 249258, 250144, 224247, 234858, 243167, 202903]
2472B02903j1391r537L8900J6884k4120j4284p35J9520J2836k9688j8340N221
2460A88169L2515Q507P269k9717L990M952l3541J3422j3711J1557M2213l1054
2448B04571J5147k0783l1307K1506j584k7253K0857k0631l6221L3138j9187L0803
2436A69056Q655R657n4941j3377K9561K7676j1044J1375L3711j1028j3395P99
2424A86705j1806j2428R518Q891K686O540p599j1712J0523p323O700o760o621
2411A67314J3722m924J3079j738o099J5711L9270m1758m2324J366L444K1681K7975
2398B06719j2014j2264L939j55j9800N311J89j5834K8837R772l2683j5062K8346
2385A75301j1752J4325q420j7977J9413j5382M4816r795L230r49Q554k65M67K2863
$$ y = [202903, 191512, 181975, 220875, 237759, 213639, 199355, 198620, 218140, 230976, 201288, 182948, 188169, 220684, 229191, 236460, 206743, 210733, 215685, 182144, 195566, 181855, 193412, 235625, 204571, 219718, 198935, 167628, 189134, 187550, 160297, 181154, 160523, 124302, 157440, 138253, 169056, 177711, 187368, 132427, 119050, 148611, 176287, 165243, 176618, 210329, 199301, 185906, 186705, 174899, 162471, 171989, 180880, 183566, 190106, 182507, 170795, 181318, 173995, 180695, 173935, 167314, 181036, 176112, 189191, 187453, 181354, 197065, 236335, 194577, 152253, 153619, 157063, 178744, 206719, 194705, 182441, 186380, 186225, 166425, 171736, 171925, 156091, 184928, 194700, 162017, 146955, 175301, 163549, 177874, 169454, 151477, 170890, 155508, 200324, 190529, 193759, 192810, 201364, 201099, 201566, 224429]
2371B24429k9954l3943j788m210K6389R278K0901l2740J7793L6587k1102J6113
2359B27753P663M426k5449j1750J5386m0307J8017M7285k2446M307K5153k4644
2347B25394k1624M3424K024J4215q062j2312N867k4960R603R802l5583P488L5517
2334B50793K3200O353J7485J1211K7760k7720K5918l34K0206L6886L8210K0644
2322D50612K38j5948L3317P4107O0966M4301P3449M8570N5706L4673N8888P0652
2310I89531M6177Q5355J22786J85729K35491L39125M04669M68262N65602O84191
2300D126918M96888q8723p75096q06132n84751l69255k46332k42270j34538j48550
2290A228159p4403p7810o2911m4764o3825j2279k7275q7725n1622k6708m8784
$$ y = [224429, 194475, 160532, 158744, 154534, 180923, 190201, 211102, 178362, 196155, 232742, 211640, 227753, 235416, 239842, 214393, 202643, 218029, 177722, 195739, 243024, 220578, 224885, 250038, 225394, 203770, 247194, 249218, 263433, 255371, 243059, 248926, 223966, 233569, 243371, 207788, 215276, 250793, 273993, 280346, 297831, 309042, 336802, 309082, 335000, 334666, 354872, 391758, 429968, 450612, 450850, 434902, 468219, 542326, 603292, 647593, 721042, 769612, 825318, 859991, 918879, 989531, 1035708, 1121063, 1243849, 1429578, 1665069, 2004194, 2408863, 2877125, 3442727, 4126918, 4623806, 4535083, 3759987, 2953855, 2369104, 1999849, 1753517, 1511247, 1376709, 1228159, 1153756, 1075946, 1013035, 968271, 904446, 892167, 864892, 777167, 725545, 698837, 650053]
2279F50053n5223k9067m2008m8342k8934M222r647k5549l7631m1535J7779J2135
2267C66253j0492o432K4079l0553k7865K4480j2520k1098j709k9509p902Q852
2255B75584Q778P373J8151o881l9969m708J5762M423n0582J0689J9805k1260j1993
2242B25172q354J0915n716j7252l369k3950j2223J9403M6980k9641j982K2823
2230B22806n8680j936j3735J1895R922L2653J5284k5071n8427l073R280J1246
2218A52164N245P692J616l894M852M3143j4985j3126L7761l7763m0898k043l015
2205A36749J1521M6125j4292m840l2608k7923N640L132J7538k5534L2870n948
2193A42430l2453J8218O712J9380J2982k5025k3366j3847J0136L2627j3907r226
$$ y = [650053, 594830, 565763, 523755, 475413, 446479, 450701, 441054, 415505, 377874, 336339, 354118, 366253, 355761, 349329, 373408, 342855, 314990, 339470, 326950, 305852, 304143, 274634, 266732, 275584, 284362, 291735, 309886, 303005, 263036, 258328, 274090, 278513, 227931, 238620, 258425, 237165, 225172, 216818, 227733, 222017, 204765, 201396, 177446, 165223, 184626, 231606, 201965, 199983, 222806, 164126, 162190, 148455, 160350, 170272, 202925, 218209, 193138, 134711, 131638, 140918, 152164, 157409, 165101, 166717, 162823, 167675, 210818, 195833, 182707, 220468, 182705, 141807, 139764, 136749, 148270, 194395, 180103, 175263, 142655, 114732, 120372, 123504, 141042, 115508, 148378, 142430, 109977, 128195, 134907, 154287, 167269, 142244, 118878, 105031, 115167, 147794, 133887, 124661]
2181A24661q15n311O225K5919k5292k7733J1010K4649k4190K832j3471M905j012
2168A02377p150J2860j0865J494M439K9397j2051j5374K921K1248J833l4332p605
2155H9192Q775J3197J4963j7569k841p856J0978j5958J1254M21o077J8984k7749
2142H9714q40M7064k6020j7834k8515L0774J4580k8921J5629J5211n165n4875
2130E0802M2692J1175L806l6005j53J8711O695R304q28k5293R531M6904k4454
2117A12887j7086O628j3939l9150N027J7061k4378J8814j4651J2418L3745R148
2105A06524j9040k602O716m3841K354O499J4047q44K1826P742K1690J9540j2282
2092A28329k6743M16K3593j4838J860q340N593j2308J28k7832j2334K2088K2064
$$ y = [124661, 123846, 118535, 124760, 150679, 125387, 97654, 108664, 133313, 109123, 111955, 98484, 103389, 102377, 95227, 108087, 97222, 98716, 103155, 132552, 120501, 105127, 108048, 129296, 131129, 96797, 89192, 97967, 111164, 126127, 108558, 105717, 97861, 108839, 92881, 104135, 104556, 98479, 117463, 89714, 88874, 135938, 109918, 92084, 63569, 94343, 108923, 80002, 95631, 110842, 105677, 50802, 93494, 104669, 108475, 72470, 72317, 91028, 97723, 107027, 106199, 80906, 90437, 137341, 112887, 95801, 102429, 88490, 49340, 54367, 71428, 47050, 65864, 51213, 63631, 97376, 106524, 87484, 84882, 91598, 47757, 50111, 56610, 70657, 69813, 91639, 99381, 121071, 140611, 128329, 101586, 102002, 125595, 110757, 112617, 104277, 109870, 97562, 97690, 69858, 57524, 79612, 101676]
2079A01676j6109J3538L9579m407l2395k2631M768P149R992o434j2425j2239l6437
2066C3625l015q416L5584L4525j7042J6336j7491R259k398L295J0844k0334k9357
2053D5415r182m671K3541M856K3644j0234k2783K9768K8425j8981l7950N670l6392
2040B1126P743M1522j812L3799j1667P299k3528k372j9210J9420M0741k8148l5959
2027D8954r430L5832k295J2957J8765P006l6634l377M331l8117N930J7844J4530
2014G6296K0997k4935l4088L1966K7199j0742J5881j4220k2824O642K6615j4580
2002H4207n4768K602J7476P535L4445m9843K3332K0339K324r508k9765j1663J1692
1989D8405R646M1588k287j4168L393P6n604n542J6644q642j0971j9720j8764q291
$$ y = [101676, 85567, 99105, 138684, 134277, 101882, 79251, 84019, 91168, 101160, 94726, 82301, 70062, 33625, 30610, 22194, 57778, 92303, 75261, 91597, 74106, 83365, 80967, 84262, 95106, 74772, 45415, 36233, 31562, 55103, 59959, 83603, 73369, 50586, 80354, 108779, 89798, 51848, 57518, 21126, 28869, 70391, 68579, 102378, 90711, 98010, 74482, 72110, 52900, 72320, 113061, 84913, 48954, 39524, 75356, 73061, 86018, 104783, 111789, 75155, 71778, 76109, 37992, 43922, 61766, 76296, 97293, 72358, 38270, 70236, 97435, 86693, 102574, 88354, 65530, 72172, 98787, 84207, 29439, 32041, 49517, 57052, 91497, 41654, 64986, 85325, 87649, 78141, 48376, 36713, 48405, 58051, 99639, 97352, 83184, 86577, 86653, 81049, 75507, 92151, 83509, 72538, 52818, 34054, 25763]
1975B5763j1101J2782J7070j2674J2522j7325J6610l470k6623K3162k7946j0829
1963b059K2603K5246M026l0934L3768K4155j9990k5915L1709R251K8434K1342
1951A21636j1621j8256l2326j1261J9183k2455O589J6774J9143N034l3313l7912
1939B1215K3543j6849J6399k1153j9684J9568J0523p795L6406L1119n555l8393
1927D9344j1484j8433L3314O745n6037L2381J1660j8846q734J3978J3366O628
1915E3882K9288K6362l4838l3549J1486M301M452n591k8618j6916k0227M5389
1903C5421J1560p834J4293O46J4125K9814o4092N364k620r628J8783J2467k5956
1890C2343K6430J42k6589q286J6732J2184J5275l8467k1992L2336l091O723J1499
$$ y = [25763, 14662, 27444, 44514, 31840, 44362, 27037, 43647, 40177, 13554, 36716, 8770, -2059, 20544, 45790, 49816, 18882, 52650, 76805, 56815, 30900, 62609, 71860, 100294, 121636, 110015, 91759, 59433, 48172, 67355, 44900, 51489, 68263, 87406, 92440, 59127, 21215, 44758, 27909, 44308, 23155, 3471, 23039, 33562, 25767, 62173, 93292, 87737, 49344, 37860, 19427, 52741, 59486, 3449, 35830, 47490, 28644, 19910, 33888, 47254, 53882, 83170, 109532, 74694, 41145, 52631, 56932, 61384, 55793, 27175, 10259, -9968, 35421, 46981, 39147, 53440, 54086, 68211, 98025, 33933, 39297, 36677, 27049, 45832, 58299, 32343, 58773, 58915, 32326, 24040, 40772, 52956, 68231, 29764, 7772, 40108, 37017, 43740, 55239]
1877E5239m9j1541o937L7125j7343k1629J2520m267k0565J3633p03j0312O945
1864C2116K0350K3432j5766J2748m866j1941j0480j6060J4827Q66k3864j329j8519
1851A514J1928q55M035M8333q490N35j3561O983K6932l4216j3598M1186q203j7212
1837D5311j6347k4550J2711o59l12J4597J9420J0083k389j0996K417m192J9568
1824F4662j8001l4153J9704r357J762K2243N334K2902l4786q854J2229j9205J0292
1811C4772j0234Q5J9221j9281K939J162P649j7041j1001K1202k4721k0810K6681
1798A0623k5570p744j6046K8649O2336r003o048j002q794q056j0914K6054q917
1785B5568K8159Q999l1426J4659J9401k106j4588j0706n792J2492M907j0454j7600
$$ y = [55239, 55190, 43649, 36712, 73837, 56494, 34865, 47385, 43118, 22553, 36186, 35483, 25171, 32116, 52466, 75898, 60132, 72880, 68014, 56073, 45593, 29533, 44360, 45226, 21362, 20033, 1514, 13442, 12587, 16622, 64955, 56465, 57000, 43439, 50422, 77354, 43138, 29540, 70726, 62523, 45311, 28964, 4414, 17125, 16466, 16154, 30751, 50171, 60254, 57865, 46869, 49286, 45094, 64662, 46661, 12508, 32212, 22855, 24617, 46860, 52194, 75096, 40310, 31456, 43685, 24480, 34772, 24538, 24623, 43844, 24563, 27502, 28664, 36313, 19272, 8271, 29473, 4752, -16058, 10623, -14947, -22691, -38737, -10088, 52248, 43245, 37197, 36195, 27401, 19345, 8431, 34485, 25568, 53727, 62726, 31300, 45959, 65360, 63254, 48666, 37960, 32168, 44660, 49567, 39113, 21513]
1772B1513J6455o0J780q438Q97P924j6977M5534k7626m277j5803J3325l1751L8430
1758D0926K2387j7380j8764p659K8485j3709K1366j797R373j9133l0937j6178
1746c020J7545J226J442k1069J1632L4604k363L206k941q058q100j3901Q556j6713
1732B046o073M3546K6157k4576m3990J5846K1880j8683L1497j7520l085q886K3233
1719D1392k5746K5950L691l4747K5439J7190m0227q677J3368j820l046J4639J3838
1706D1244r611J8966J722j6957L2383l2476r774P343j4306l281q410J937K0419
1693B9199k5752m677K3953r961J5916j7253j8162M2454O539J0057l939k1277M533
1680C1630j0915J2514K3295j7473l8038K3030J531j7718k4398K1109J020j5624
$$ y = [21513, 37968, 37908, 39688, 31250, 32147, 40071, 23094, 68628, 41002, 36725, 20922, 34247, 2496, 40926, 63313, 45933, 27169, 19510, 47995, 34286, 55652, 53855, 63228, 44095, 13158, -3020, 14525, 15751, 17193, -3876, 7756, 42360, 39997, 43203, 40262, 32204, 24104, 10203, 18759, 2046, -4027, 39519, 65676, 41100, -2890, 12956, 34836, 16153, 47650, 30130, 27045, 18159, 41392, 15646, 41596, 45287, 10540, 35979, 53169, 12942, 4265, 17633, 15813, 12767, 27406, 41244, 31633, 50599, 52321, 35364, 67747, 35271, 25497, 32840, 18534, 15253, 6843, 8780, 29199, 3447, -1230, 22723, 12762, 28678, 11425, -6737, 35717, 42256, 52313, 48374, 27097, 31630, 20715, 33229, 56524, 39051, 1013, 24043, 25574, 7856, -16542, 4567, 5587, -10037]
1668a0037J7196K9520j6207L3155J2337j1891q648L159m1237k3702N1055p244
1656B7456j6445r528l2336L3854R383K0824L4710j4978l5816j046l1238M5595
1644C0435q870M550j1882m385n565J4926L2098j2217K9252j1997l1833m1351K4890
1631H051P624J85j591j3440n509J5976L8060j615m0938J9006n150J4133R26k7995
1617G723j0060Q118q016Q943J8463j4423m841k399J7284P115l7704J5779K3795
1604B9777J0624L717J0714k0284m195L5j7623L4674K4265l2492j8130k3479J7870
1591A5473P173p704J406p426k6995L481N642J6999q200N544P995r672j7209K105
1577a1388K7000l961M706n673K0174J51k9719P472k0907j9183K4856j2487j0898
$$ y = [-10037, 7159, 36679, 20472, 53627, 65964, 54073, 45425, 48584, 7347, -16355, 34700, 27456, 11011, 1483, -30853, 3001, 12384, 33208, 67918, 52940, 17124, 16078, -15160, 30435, 21565, 26115, 14233, 9848, 4283, 19209, 51307, 39090, 68342, 56345, 24512, -16839, 8051, 15675, 15860, 14269, 829, -4680, 11296, 49356, 47741, 6803, 25809, 20659, 34792, 35718, 7723, -2337, 5781, -2235, 6708, 25171, 10748, 5907, 3508, 20792, 27907, -9797, 5982, 29777, 40401, 44118, 54832, 34548, 30353, 30388, 12765, 47439, 71704, 39212, 21082, -2397, 15473, 22646, 14942, 16348, 8922, -18073, -14592, -8950, 8049, -151, 5393, 13388, 3716, -13493, -11388, 15612, 11651, 16357, 10684, 30858, 31009, 1290, 8762, -12145, -31328, -6472, -18959, -29857]
1564b9857J2857K4858j1690K2687O839K1835l2012j0121J5952k397K1060j3350
1552B6661J0489J6182j2618p086l9507k7118M557L9108l141k1258J9646L2126
1540C8041J4963k4885O168J6942m367j1985J751q954m2279Q901K1307m9048q731
1527d2176K4300K3271J8373K1586O809l1031N869k1857K4840r423l4992K1212
1515F781k488j6107O261L2692k0972Q85J5281k5135J7478l845K5068m6617J8379
1502G661K9713j8728j9760j5942L1100O083k265j9100j6371K854J2676M801J7782
1489B0504J5359m773m4009p36N765K3017m439j3556K0503K5724j9659K2660k1750
1476B4610j5531l688o697o43j9162j6287L7775J3733J1341n650j9948K904L4494
$$ y = [-29857, -17000, 7858, -3832, 18855, 25694, 47529, 15517, 5396, 21348, 18951, 40011, 26661, 37150, 53332, 40714, 33628, -5879, -32997, -28440, 10668, 7527, -13731, 5915, 38041, 53004, 28119, 34287, 51229, 46862, 34877, 36628, 27674, -14605, -5704, 15603, -33445, -42176, -17876, 5395, 23768, 45354, 52163, 21132, 27001, 5144, 29984, 20561, -14431, 6781, 4293, -11814, -5553, 27139, 6167, 7052, 22333, -2802, 14676, 10831, 35899, -10718, 7661, 37374, 18646, -1114, -17056, 14044, 20127, 17862, -1238, -17609, -14755, -2079, 2722, 20504, 35863, 31090, -12919, -13655, -7890, 15127, 10688, -2868, 17635, 43359, 23700, 46360, 24610, 9079, 5391, -1306, -1949, -21111, -37398, 377, 14110, 25451, 19801, -147, 2757, 37251]
1463C7251j104l9325k174K469m475J9173J9551j961J4100q927j4084k139K1834
1450D0189l3816J5369k085j3829L5304j2584Q658J8315M960m2101r02K4323k361
1437C9440j6125k4764j5781L565k474J1022L6246N279j228l9748O281j3252L0038
1424A8499m109k8106J2314J2541J2895j3725N626O368M579n150j3944r109J0910
1411I589J8571j6887k6728q910K1492r241n404J2704j0762q302j2754J4142N4868
1398C2378j5143k0177L1771j1162l6792J8958L0702j282m465M708k1596p49N12
1385G663j7309k053K7475l831r328M1509n6252j9050j225K0598K6773l9585R434
1372a5181K3768N435j9298k8480K6831j2507o436Q420M8729K4925j1137L943m1652
$$ y = [37251, 36147, -3178, -5352, -2883, -7358, 11815, 31366, 29405, 43505, 34578, 20494, 18355, 40189, 6373, 21742, 19657, 5828, 41132, 28548, 37206, 55521, 60481, 18380, 17478, 41801, 39440, 23315, -1449, -17230, -13665, -16139, -5117, 31129, 36408, 35180, -4568, 1713, -11539, 18499, 14390, -13716, -1402, 11139, 24034, 10309, 15935, 22303, 26882, 21732, 7788, -1321, 9589, 28160, 11273, -15455, -24365, -2873, -12114, -17518, -4814, -15576, -23878, -36632, -22490, 32378, 17235, -2942, 28829, 17667, -19125, -167, 30535, 29253, 24788, 29496, 7900, 7151, 7663, -9646, -11699, 15776, 11945, 2617, 44126, -12126, -31176, -32401, -11803, 14970, -24615, -15181, 8587, 14022, -5276, -33756, -6925, -19432, -25868, -17448, 31281, 56206, 45069, 49012, 7360]
1359G360m8146N2765j653m4178J5772L597k944N3582j756l0338k1845K9117m888
1346F445k4979n620l335l9l0507M3947J82M649l1543K2982L9344m524J95k180
1332A5017M645mm1784Q027k4973J8468J6975Q681j559j8100N771J6145k386q148
1318c225J2143j4443k492R124L4876j9762j9794L4612j6852k7125J3328M4550
1306D4940j1398q990m4856n556K6748J7487p917J4852j4245l3483K1457Q867J0305
1293A8211j1628J9791J5409j4623k6484q749J9212J4471j697k2306k5707J6122
1281g978j5598K2236J3696R973l8900P831q916r280J9771K8135P74j5589J2024
1268A8179L009n650q153k8430K3363K1418R472k7313j986n309j5499j9964k960
$$ y = [7360, -40786, 11979, 10326, -33852, -18080, -14483, -17427, 36155, 34399, 4061, -17784, 11333, 6445, -18534, -24154, -27489, -27528, -58035, -14088, -13906, -9257, -40800, -17818, 21526, 17002, 17197, 15017, 19662, 19658, -22126, -14099, -39072, -20604, -3629, 5052, 3493, -14607, -8836, 7309, 4923, -3225, 8918, -5525, -8017, 1107, 35983, 16221, -3573, 31039, 14187, -12938, 390, 44940, 33542, 24552, -20304, -25860, 888, 18375, 10458, 25310, 11065, -22418, -961, 7906, 18211, 6583, 26374, 41783, 27160, 676, -8073, 11139, 25610, 23913, 1607, -24100, -7978, -23576, -1340, 12356, 22329, -16571, -8740, -17656, -26936, -7165, 20970, 21744, 6155, 18179, 21188, 15538, 7385, -21045, 2318, 23736, 33208, 5895, 3909, -1400, -16899, -36863, -39823]
1255c9823J4499J5825J8276k715n710o514j0981k4932J1337J8793q759K506N0148
1242C1950J705M120r250J1013j2845j6349J4606l5894J6948L0288j596l2245R848
1229A2299m783j1306p926J8559K0828j0337M5258k6899l6280k8501L1284J4051
1217A6247k3159Q022K0811N236k3513j8938N5000j3708n3202J2039J1034Q93j6805
1204b0043L5749P668j3563p46j7595j569k7392P225k706J5776K8847r746j3026
1191a1121K5405J2688J318j3800Q29M411k0885p25j7534K8546K313O70K3656m514
1177C1257q981k3389r440m614n263K019J0930n284L2151J7757j073J2600o784
1164D1886n893l9663J7004J2092j3025l7379j7681L7635r748L9267k763o81J0117
$$ y = [-39823, -25324, -9499, 8777, 6062, 352, -6162, -17143, -42075, -30738, -11945, -20704, -18198, 31950, 33655, 37775, 28525, 39538, 26693, 10344, 24950, -10944, 6004, 36292, 34696, 2451, 12299, 7516, -3790, -11716, 6843, 27671, 17334, 62592, 35693, -587, -29088, 2196, 16247, -6912, 1110, 21921, 27157, 3644, -15294, 39706, 25998, -27204, -15165, -4131, -3238, -20043, 15706, 23374, 9811, 9065, -8530, -10099, -37491, -30266, -32972, -17196, 11651, 1905, -11121, 14284, 26972, 28290, 14490, 15319, 19730, -1155, -1880, -19414, 9132, 11445, 12115, 35771, 31257, 22276, -1113, -10553, -15167, -20430, -18411, -7481, -12765, 19386, 37143, 36070, 48670, 41886, 35993, -3670, 13334, 25426, 12401, -24978, -42659, -5024, -14772, 24495, 21732, 21051, 31168]
1151C1168J946M387k9883k6501O551j3527J3648p501q864L3270J2144L426p8K4929
1137D5115q381k9981j8564N72L6286n251k782l8518k1865k636J0862M7641l146
1124I352j2796L837R69P485m136j4498M506k0553q589P964L2226J6010k2212j8171
1110a8606J287R185j0254j2554M5108M442k3369m851J479j9814j9480K2000O4065
1097C8638p047j6822j6762q867j4046J8242L4161j4811l5096j1599j2278J3440
1085c2847j7856J4321K1234Q003J012j0772k3629r314J3336N205K9948L6637Q773
1072D4051k6753o9420q216L6429J3970j0993o0663J8899P2593k0278J8571P212
1060A5402l1062J2146o539K0148R361j8036m6467j67K9669N679L842l2881J0966
$$ y = [31168, 33114, 37501, 7618, -18883, -12332, -25859, -12211, -19712, -28576, 4694, 16838, 20264, 20186, 45115, 36734, 6753, -11811, -11239, 25047, 19796, 17014, -21504, -43369, -46005, -35143, 12498, 9352, -3444, 393, 1362, 8847, 4711, -9787, -5281, -25834, -34423, -26459, 5767, 21777, -435, -18606, -17319, -8134, -18388, -30942, 14166, 18608, -4761, -9612, -8133, -27947, -47427, -25427, 38638, 31591, 14769, -1993, -10860, -24906, -6664, 27497, 12686, -22410, -34009, -46287, -32847, -50703, -36382, -15148, -7145, -6133, -16905, -40534, -49848, -36512, -31307, -1359, 35278, 44051, 17298, -52122, -60338, -23909, -9939, -20932, -81595, -62696, 9897, -10381, 8190, 15402, -15660, -3514, -10053, 10095, 19456, 1420, -45047, -45214, -15545, -9866, -6024, -38905, -27939]
1047b7939K4901K0096j4428O276m54k5808k75J5845J0754l1016L2811r597K110
1034C276k030j7947j207Q839j9483q932J9601J2141j9947N432j0649j6665J2949
1021c4622M017O232P628r524J1521J3830j0154k5772K0102J78Q437j5573j0386
1008c4086m713J3577K9174j3908j6042j700K0414N390K212j0989k6001J1649K1890
995c133r495j7819j790j593J4350J0123m3236J5674L6360J2876q079q415j6132
982b0309J840M5174j1060L695J873j1626N500j2134k4679J5334j5589j4856L6698
969a39L2914k2116j4705k7365K6894P806J4282K4835k3588j3834K5233K401p981
956B4637l4548j4913L1302J139k3286q733K4460M980K798j2937j0537M3573l801
$$ y = [-27939, -3038, 17058, 2630, 8906, 8452, -17356, -17631, -1786, 8968, -22048, 10763, 1166, 3276, 1246, -16701, -17908, -9069, -28552, -37484, -17883, -5742, -25689, -20257, -30906, -47571, -34622, -30605, -24373, -16745, -26269, -14748, -918, -11072, -36844, -16742, -16564, -8127, -23700, -34086, -38799, -25222, 3952, -9956, -25998, -27698, -7284, -1894, 318, -10671, -36672, -25023, -3133, -12628, -30447, -32237, -33830, -19480, -9357, -52593, -36919, -559, 12317, 4238, -4177, -20309, -18469, 26705, 15645, 19340, 21213, 9587, 15087, 2953, -21726, -6392, -21981, -36837, -139, 32775, 10659, -4046, -31411, -4517, 3289, 17571, 42406, 18818, 4984, 30217, 32618, 24637, -9911, -24824, 6478, 7617, -15669, -24402, 58, 5038, 7836, -5101, -15638, 27935, 24134]
943B4134m1822M8357M712k1968j5682J5905j0628K370J7095K93j3844j3702K968
930a812K349k3241m544k3956L5237R108K1387j2190l6955J0156j8004J7602Q629
917a6234j4992K9131J737k3763J7845j5622k5626J3072K205K8342j2096P680l993
904a2314K3115p072J7611M69r113k2676J6026p083j675K0541j4359k415P837o974
890A918k0523j5459J7658K0287j6957q969o390N0604k0229J0579K032j6746j7
877b212P563O641j8617L19p366m992J7173r114M878k1588j2314L2697j3119n982
863b6033J9293l755J2439q524K1465L108L331l9963O678L88j2615J0911L9384
850B6107m759l284n465j4516o770k1152L2207j88n512k5432Q497j212q997m232
$$ y = [24134, -17688, 30669, 35381, 13413, -2269, 13636, 3008, 5378, 22473, 22766, 8922, -4780, -1812, 537, -22704, -27248, -51204, -15967, -6859, 14528, 2338, -34617, -24461, -42465, -24863, -16234, -31226, -2095, -358, -24121, -6276, -21898, -47524, -34452, -32247, -3905, -16001, -8321, -12314, 10801, 3729, 21340, 21809, 12696, -9980, 6046, -1037, -2712, 17829, 3470, 1055, 8892, 1918, -18605, -34064, -16406, 3881, -13076, -22045, -28435, 22169, 1940, 12519, 14551, -2195, -2212, 5351, 11992, -6625, -6306, -13672, -18664, -1491, -10605, -5727, -27315, -39629, -6932, -20051, -26033, -6740, -10495, 1944, -6580, 14885, 17993, 21324, -18639, -11961, -11573, -24188, -13277, 26107, 21348, 18064, 12599, -1917, -8687, -29839, 2368, 2180, -3332, -28764, -20267, -21479, -30476, -34708]
836c4708L1677K5380n673j5939J0811j6978m855l1985P946K8305k9103m633K261
823c7494L5302p862L399j4609j1687j7704Q991J2876J3243J4589J377k335r057
810a0971K5815L498m1463m580M6984L806m3325K5243Q950j9227k472N662o079
797h159N577K2753J8952l4048J279k6365K1005L0189J2481j5699O092l988o0651
784c0582M4784m148R2j2314J7661o888q430K2288R830o8k7265M399l47j1043j8076
769b0107K4573K5461k8276n2731l508N4147l296j3667K2413J1109j9018j4028
757a6928K246p81K8309J0570J5162j1960P02J8576k9136m219k197K0835m2577
744a1398J438O667m304K5152k0355p676J3794J9033n0381k0679J4510J4109J1343
$$ y = [-34708, -3031, 22349, 16676, 737, 11548, -5430, -10285, -42270, -34324, -6019, -35122, -39755, -37494, -2192, -10054, -6655, -21264, -32951, -50655, -41664, -28788, -15545, -956, 421, -1914, -10971, 14844, 18342, -23121, -27701, 19283, 23089, -20236, 5007, 13957, -5270, -7742, -2080, -8159, -2582, 20171, 39123, 5075, 6354, -20011, 994, 31183, 43664, 27965, 34057, 30069, -30582, 14202, 10054, 10146, -2168, 15493, 8605, 175, 22463, 32293, 32225, 4960, 9359, 9012, -2031, -20107, 4466, 29927, 1651, -51080, -54588, -441, -3737, -17404, 5009, 16118, -2900, -16928, -14682, -15463, 12846, 23416, 38578, 26618, 27320, 45896, 16760, 12541, 10344, 31179, -11398, -9960, -3293, -7597, 17555, -2800, -10476, 3318, 22351, -28030, -48709, -34199, -20090, -8747]
731h747n631L8148j980j7035j6391k3431L2990j4570J0601J4510q495k1036j1475
718c2542j8390Q36L4696J7894L0102m3662K1303J9354o241j3568k1640L947k1278
705b9189m0083K3892R892J1054J304j5680J6489J8823j0730J2126L3879p35k8418
692B624K6295Q29l2555J5941m706l3584K4475k0342j6924n413M268Q907K0807
679i378j445j603n344m960k539K1801L6592k6013q21J8917j5906J8124K5232j8104
665C4553j7178j3385j2182k0180n433K5507j1270k4935O148J0824J3715q906L1417
652H695k2675p730K9471k4731j3968n287J730j1438k1422M6854Q127j8881q805
639d0060L6765K9702j3409l0196J0871j6604K565M1648K3404l8822j2514j3760
$$ y = [-8747, -14378, 23770, 21790, 4755, -11636, -35067, -2077, -16647, -6046, 8464, -31, -21067, -32542, -50932, -50096, -15400, 2494, 32596, -11066, 10237, 29591, 23350, 9782, -11858, -7911, -29189, -69272, -45380, -35488, -24434, -23130, -38810, -22321, -3498, -14228, -2102, 31777, 31042, 2624, 28919, 29748, -2807, 13134, 8428, -25156, -681, -21023, -37947, -43360, -39092, -30185, -9378, -10823, -12426, -17770, -22730, -25269, -3468, 33124, 7111, 6290, 25207, 9301, 27425, 52657, 34553, 17375, 3990, -8192, -28372, -33805, -8298, -19568, -44503, -38355, -27531, -13816, -22722, 8695, -13980, -21710, 7761, -16970, -30938, -36225, -34495, -45933, -67355, -20501, -12374, -31255, -40060, -3295, 26407, 12998, -17198, -6327, -22931, -20366, 21282, 44686, 5864, -6650, -20410]
627b0410j3196M956J4962K6054j1484Q678p738k1143j9899j7979J2797m919L4219
614a5102J1094L66j5731j3596J0875J3052J3851l0914J6818K2248j9352l4929
602d1320J5648j1513j3452K2798M694K2757m576k8926p464K9815N232M780K96
589a231n531L220j2522K2646R664l2678L516K145o76k6633K9463Q038j0101m9037
575e9717k1784l41J7618M9081K7984j1895j9826j6558J2043L1027J753m6546r089
562d6250M4108Q360Q028j0518r043J6772L9766l4896l240p403J1231J4043j3771
549A7187l5941J1141J0815j1436M3426j2130k9047J9750j9708M613j6879L956
537a4253j4636M348j388j4116J8905q35l6125J2519r898L0347N448R698k2650
$$ y = [-20410, -33606, -28650, -13688, 12366, 882, 9560, 1822, -19321, -39220, -57199, -44402, -49321, -15102, -4008, -3642, -19373, -32969, -22094, -9042, 4809, -26105, -9287, 12961, -6391, -41320, -25672, -37185, -50637, -27839, -23145, -388, -4964, -33890, -41354, -11539, -6307, -1527, -1231, -6762, -3542, -16064, 6582, 16246, -16432, -12916, -10771, -11447, -38080, -8617, -579, -10680, -59717, -81501, -81842, -64224, -15143, 12841, 946, -18880, -35438, -23395, 7632, 9385, -37161, -46250, -2142, 6218, 14246, 3728, -5315, 11457, 51223, 16327, 13087, 5684, 16915, 30958, 17187, -18754, -7613, 3202, -8234, 35192, 23062, -5985, 13765, -5943, -1330, -18209, -14253, -28889, -24541, -25929, -40045, -21140, -21975, -58100, -45581, -55479, -25132, -19684, -9986, -32636]
524c2636k292R754k1108J7281j0113K7042J3004J3723j0579J600j2284j1142L82
511a7368Q813M040o576O843r165o599k721j8852K2021j8121l231K3826J9591q877
497f376O083n633k4804K937K7885j579N097j9850J0977K7263n620n574j6917J8066
483A1955j2215J1678j2648k1672p656K1406j554J8509m4335j0974r551J5226M8043
470F212J4854k4352j8056k730r792M805J900J1635J4614N384r198k7763L3943
457A456K4212j4938j3393m6502K1966J5114K2456L383k839K8369J882l6307N098
444I957m6140j2K1562L66j1863m260q186L827J8783K0128k5586l8243M2332J8162
430H27m75J5044l3377k6725N899Q023L0917n19k1698l5678J8032M3374j124K0433
$$ y = [-32636, -34928, -25174, -46282, -29001, -39114, -12072, 932, 14655, 4076, 5676, -6608, -17750, -17368, -8555, -4515, -11091, -4248, -13413, -20012, -22733, -41585, -19564, -37685, -40916, -17090, 2501, -6376, -293, -5926, -30730, -27793, 92, -1487, 3610, -16240, -5263, 22000, 16380, 10806, -6111, 11955, -260, 11418, -1230, -22902, -30558, -9152, -10706, 7803, -36532, -47506, -57057, -41831, 6212, 21066, -3286, -21342, -24072, -33864, -29059, -27159, -15524, -910, 4474, -4724, -32487, 1456, 25668, 10730, -2663, -49165, -27199, -12085, 10371, 13754, 10915, 39284, 41166, 4859, 9957, -36183, -36195, -14633, -14267, -26130, -30390, -38576, -34749, -15966, 4162, -21424, -59667, -17335, 827, 352, 15396, -17981, -44706, -38807, -30784, 133, -386, -22084, -57762, -39730, 3644, 2520, 22953]
416B2953P068l8712j8715L9560P676O706L579j812l4897m335l563p386J9115r941
402a2704m786L0012k9347k9747k748J92J2241K5762k9058J5418L2533l4718k4587
389e1537P45M4854J8656j4424k7982J8612l0853n303Q956j468n316K9538j2114
376b7636K1541j183k2650J0148q830l6254L973K4997L61R593J8729M494j9122
363b1839J1124J0219l4565j3552J4699j7709P172j8811L1239m442J4092j3212
351c5585j4715K0543K1053J3437r900M412O887m0768Q254J0980L423J7224l645
338A600J6640k3777P500K1452k177l2981n62m493J3272L075Q279O976m7708j2443
324d5347J1405P407J854j5730k1169p231L2704j0808j9049P846N154K5796j2911
$$ y = [22953, 30021, -8691, -27406, 12154, 19830, 26536, 30115, 28303, -6594, -10929, -14492, -21878, -2763, -12704, -17490, 12522, -16825, -46572, -49320, -49128, -36887, -11125, -40183, -24765, 7768, -26950, -51537, -50792, -5938, 12718, -1706, -29688, -11076, -41929, -47232, -38276, -39744, -45060, -15522, -27636, -6095, -7278, -29928, -19780, -28610, -64864, -60891, -35894, -35533, -25940, -7211, -2717, -21839, -10715, -496, -35061, -48613, -33914, -51623, -44451, -63262, -32023, -36465, -22373, -35585, -50300, -29757, -8704, 4733, -5167, -755, 6132, -34636, -26382, -15402, -11979, 5245, 1600, 18240, -5537, 1963, 23415, 21238, -11743, -12305, -16798, -3526, -451, 7828, 14804, -32904, -45347, -33942, -26535, -24681, -40411, -61580, -68811, -36107, -46915, -65964, -58118, -52964, -27168, -40079]
311d0079j0469N32N825K4346K6268K3573k1289l2492J1929r314l505j8755o789
298e0219k4117J9718L8078j1427L5586j7649r045p081R340j7642J7895j5475q340
285d0378J3880J0134K7625J0281m3887J49J5483j1239L156r664J2050n163O19
272a6954J1251l230k5264j953L539J7058r635p588P703m918m239p709K389K711
258c6839M1322O400j2010k0627n898r302J3821k1450l7828L6156O771J126k3237
245f1595P550P824K2074J5512Q867k2194k1058J7301M952p757k0560K5029K6675
232B620j9304l6980k6022K7763J5735L9037Q901J0174j6293k6139Q070j0808J1250
219a1996J4226k437P0j8166k3783k353o918M2504j149L850n330k231k0941J1642
$$ y = [-40079, -50548, -50016, -44191, -19845, 6423, 29996, 8707, -23785, -11856, -21170, -24675, -43430, -50219, -74336, -54618, -16540, -27967, 7619, -10030, -19075, -26156, -16816, -34458, -16563, -32038, -40378, -26498, -16364, 11261, 21542, -22345, -22196, -6713, -17952, -14796, -24460, -12410, -17573, -16954, -5703, -8933, -34197, -36150, -32611, -15553, -25188, -32776, -25073, -29991, -34230, -41939, -39550, -36839, 4483, 10883, -1127, -21754, -27652, -36954, -23133, -44583, -82411, -46255, -39484, -38358, -61595, -54045, -46221, -24147, -8635, 232, -21962, -43020, -25719, -20767, -28524, -49084, -24055, 2620, -16684, -53664, -79686, -51923, -36188, 2849, 11750, 21924, 5631, -20508, -12438, -23246, -11996, 2230, -207, -137, -18303, -42086, -44439, -51357, -8853, -10002, -6152, -11482, -13713, -34654, -23012]
205b3012k024k4656j5064L1923O724l8730J7181J5403R920r859L8006k1928p445
192b3561n66k7075R53j115m454N464K0228Q813n580k1921l1647R714J9427K1436
178b9884O877J177j2905j5280P897M791K654L2483K975j8502o034K548l4647P83
164e5067L3185j2379k3013K0471J9711K083l029p697J1443L2754j6530l8687Q97
151c5858k689L913L461O172N119p895J0658j179M973l9124l0614K7760K7298p74
137b8779l869J8110J6790l568M19K8282k2340l4577k1863k8768J1905k334L549
124f7043Q040J3620K4460O761m34K77J7381j5301k14l316j6114L960J939k6656
110e2640L9132q155k453J604l117j543l39j398M843k5541k045J2868P995j1223
$$ y = [-23012, -25036, -49692, -64756, -32833, -26109, -64839, -47658, -32255, -22335, -32194, 5812, -16116, -23561, -24127, -51202, -50249, -51364, -55818, -50354, -30126, -21313, -26893, -48814, -80461, -70747, -51320, -29884, -23007, -21830, -34735, -50015, -42118, -37327, -34673, -2190, 785, -17717, -23751, -21203, -55850, -55067, -21882, -34261, -57274, -36803, -17092, -15009, -18038, -25735, -14292, 18462, 1932, -36755, -35858, -38547, -34634, -31173, -25001, -19882, -27777, -17119, -18298, -13325, -52449, -83063, -55303, -28005, -28779, -32648, -14538, 2252, -1316, -897, 27385, 5045, -29532, -51395, -80163, -68258, -70592, -67043, -59003, -45383, -20923, -14162, -14596, -14319, 3062, -12239, -12453, -15769, -31883, -27923, -25984, -52640, -13508, -21663, -24116, -22512, -25629, -27172, -27511, -28909, -24066, -49607, -51652, -38784, -30789, -42012]
96d2012J2231m998j3388Q266p423K4491k0022k426K0146Q551J0636n36r164j0079
82b5727k754p415J3425o378J7618o868j1896k139k7318R581J3456q613j8986J9519
68d4495N609N000K993K834J1534q835j371q58l673P480N568j5068N543N016j3625
53c6348l34J0080j8358J3297J3793Rj1964j8951R287l745L2599q965j8142J150
39c6592O450K8562J291l8075J057j0410j5242j7021M0130K3967j6643k820L0294
26e052j7516j5538L726n201k0622j3177L875K4976J6952R42m830l65O265J0895
12a4670k6608P161J8009k8722J8121j8657J558K353N061J0408M355J3114
0h517
$$ y = [-42012, -29781, -34779, -48167, -39901, -47324, -22833, -42855, -45281, -25135, -16584, -5948, -6484, -15648, -25727, -28481, -35896, -22471, -28849, -11231, -18099, -29995, -32134, -59452, -49871, -36415, -45028, -64014, -44495, -38886, -33886, -30893, -28059, -16525, -25360, -26731, -27589, -31262, -23782, -18214, -33282, -27739, -22723, -36348, -36682, -26602, -44960, -31663, -17870, -17861, -29825, -48776, -39489, -43234, -10635, -19600, -37742, -36592, -30142, -1580, -289, -38364, -37307, -47717, -62959, -79980, -39850, -15883, -32526, -35346, -5052, -22568, -38106, -34380, -39581, -60203, -73380, -69505, -44529, -27577, -26635, -31465, -31830, -25565, -14670, -41278, -34117, -16108, -44830, -26709, -45366, -43808, -41455, -36394, -25986, -21631, -8517]
$$ Imaginary data points
##PAGE= N=2
##DATA TABLE= (X++(I..I)), XYDATA
16383a013070K4989K0748K7735j1508K6721p098l114J9859J2932L3295O562J2192
16371h49757J9835L3764J452j3879J381L9011L1780j080j8757K6662J7712n745
16359g17621O846K3024L2437J2666O919r130P674M2831L2146j4876N991R3N591
16346e65409Q264J2128L2915J7447j2902J4356J7675K2547K190J1831p688j009
16334d47655Q919K7785P566J3346L5559J937J4519J9279O855M228P520O323J5511
16321b78308j7823Q023K5538J6568O858J4080L6509k060K151J7785q240K2606
16309a56313r679J1541J6656k557K8674K770J5983R129K2361P389Q986K3457J3493
16296h110n065J1181K9650p620K557J7869q627j0895M0759J7849k196L591k073
$$ y = [-1013070, -988081, -967333, -939598, -951106, -924385, -931483, -934597, -914738, -901806, -868511, -861949, -849757, -829922, -796158, -794706, -808585, -807204, -768193, -736413, -737493, -756250, -729588, -711876, -717621, -710775, -687751, -655314, -642648, -635729, -644859, -637185, -594354, -562208, -577084, -571093, -571000, -565409, -557145, -545017, -512102, -494655, -507557, -493201, -475526, -452979, -450789, -438958, -446646, -447655, -438736, -410951, -403385, -390039, -354480, -352543, -338024, -318745, -311890, -307662, -300142, -293819, -278308, -296131, -288108, -262570, -246002, -239144, -225064, -188555, -190615, -188464, -170679, -178919, -156313, -165992, -154451, -137795, -140352, -111678, -108908, -92925, -83796, -61435, -54046, -45060, -21603, -8110, -13175, -1994, 27656, 20036, 22593, 40462, 31835, 20940, 61699, 79548, 77352, 80943, 78870]
16283G8870K6777M5099n991K3253j6204m014j8705K0570q644R741n768K9430K1332
16270A95746L992K2404m559L0584K9859K888j9377r938n445K7379l563J1908J2538
16257B94416m29M4753J3755j0188p136j186J6870J5878K622m983j789J5416L632
16244C81631J8114j1613K1469K102r948K6809j4979K4083k71J2578J6495J5615
16232D82085l0437R043j0279N4051p472J949K0870j0958J2404k2680N812K8911
16220E33299m906n210K4749L1298R236j5116Q739K660k3868M8631k504k2914R750
16207E93844J3721L2572R447r24r156j3054n929J6448O41j4256o755K8842L4147
16194F79588M01j8412L109J5933J1670k5957J6693M536j0407K1392l5701K245
$$ y = [78870, 105647, 150746, 144755, 168008, 151804, 147790, 129085, 149655, 141011, 150752, 144984, 174414, 195746, 199738, 222142, 217583, 248167, 278026, 280914, 261537, 251599, 246154, 273533, 269970, 281878, 294416, 293987, 338740, 352495, 342307, 335171, 333985, 350855, 366733, 369355, 364372, 362583, 377999, 381631, 399745, 388132, 409601, 411703, 401755, 428564, 413585, 437668, 437397, 449975, 466470, 482085, 451648, 460691, 450412, 504463, 496991, 498940, 519810, 508852, 521256, 498576, 504388, 533299, 528393, 523183, 547932, 579230, 588466, 573350, 582089, 584749, 560881, 609512, 607008, 584094, 593844, 607565, 640137, 649584, 648660, 639504, 626450, 620521, 636969, 637610, 623354, 616599, 645441, 679588, 679989, 661577, 664686, 680619, 692289, 666332, 683025, 687561, 677154, 698546, 662845, 665090]
16182F65090M7171P825J6186J4725j3770p740p816N549J8707L6824l759l1833
16170G47159J6494N620j6147K2511k4137k4763J6851O133q965K1674J1034r143
16158G64321Q298J6109o62j9539K5771R675j3866J0342k6107R098q896M433P921
16145G86898k7051J4171K6079J9394k4200K4098l652n976m9498L9676N176m439
16133H00676l3Q636Q686J511J7388j5403l577j0975J6105l785k4192K0184K3665
16120H38886k57P381N281j4427j8186k2140R428K0291N46j6232N0545k5829j8809
16107H16478K6744j3194J2815j544K2402K7695k996k18M320l5758l3123Q260j866
16094H30015N84K5085j815k5563J8174m163j7948L8098P800q329M670M4933p318
$$ y = [665090, 712261, 720086, 736272, 750997, 737227, 729487, 721671, 727220, 745927, 782751, 778992, 747159, 763653, 769273, 753126, 775637, 751500, 726737, 743588, 749721, 740756, 762430, 773464, 764321, 772619, 788728, 788066, 768527, 794298, 803973, 790107, 800449, 774342, 783440, 774544, 778977, 786898, 759847, 774018, 800097, 819491, 795291, 819389, 815737, 809761, 760263, 799939, 805115, 800676, 800643, 809279, 817965, 819476, 836864, 821461, 817884, 806909, 823014, 819229, 795037, 815221, 838886, 838629, 846010, 851291, 836864, 818678, 796538, 805966, 826257, 826803, 810571, 861116, 835287, 816478, 843222, 830028, 842843, 841299, 863701, 891396, 888400, 888182, 892502, 856744, 823621, 831881, 830015, 830599, 855684, 853869, 828306, 846480, 842317, 824369, 862467, 870267, 861938, 866608, 911541, 904223]
16081I04223R427j8282k173P989k2189k4077L635J0359K0735J9386k3305k5130
16069H60598J8110M340j730J3528k1044j5337N190j7919N174J1283K7417Q613
16057H98223j9909N769K591k5031P584J4025j3341q816l4365J0565P523k4404
16045H20414K7516M0721J648N138J3082l6j1833p086m2951Q31J2674N616P124
16032H72858J6191J0971K1739m411j6372j8712k1963M490M731j2222R075J4388
16020H80763J5444K97l6348K8399K6904p173o021R551j2384j6607j7112n543M0619
16007I00789J9385O434l3467j9745k657m582M2584R377k5749J960M3440j6104
15995I21665l5007l3766J7666J6531L9634j2402j5160q553L864p761k905J0326
$$ y = [904223, 913650, 895368, 893195, 901184, 878995, 854918, 858553, 868912, 889647, 909033, 885728, 860598, 878708, 883048, 881318, 894846, 873802, 858465, 863655, 845736, 850910, 862193, 889610, 898223, 878314, 884083, 886674, 861643, 869227, 883252, 869911, 861095, 826730, 837295, 844818, 820414, 847930, 888651, 890299, 895437, 908519, 908483, 896650, 889564, 846613, 847444, 860118, 865734, 872858, 889049, 900020, 921759, 917348, 900976, 882264, 860301, 864791, 869522, 857300, 866375, 880763, 896207, 896504, 860156, 888555, 915459, 908286, 902265, 911816, 899432, 882825, 865713, 860170, 900789, 920174, 926608, 893141, 873396, 870739, 866157, 908741, 918118, 892369, 894329, 937769, 921665, 886658, 852892, 870558, 887089, 926723, 914321, 899161, 890608, 894472, 886711, 883806, 894132]
15983H94132M574k7744L0442K3026l4075j3897R158K848k7414N765J207K7957
15971H95979P130Q773j1879R471J4216j9413j2362J2271J2294k0837O291K1327
15959I23261k1859k0959K273n112L0378J7624k0711J4471J2771k343j5927p767
15947I06100M734j3532L17K2244l527j7237Q897p998Q115J8611k6996J9942l071
15934I16599J2394r023o302J0380j6207k4952K9751q425j2547K7127K5954j0488
15922I34261o484r827j015L066q02M10q583j6520l3881j132K9656j9343J608M0068
15908I11482J5136k4940j7524L0768p408Q711N482l4362K5012K069k283Q806k3256
15895H97693k4149J6941O635K327J0428K168n8297P645K4128J3944L892k538l617
$$ y = [894132, 898706, 870962, 901404, 924430, 890355, 876458, 885616, 888464, 861050, 866815, 868022, 895979, 903109, 911882, 900003, 909474, 923690, 904277, 891915, 904186, 916480, 895643, 901934, 923261, 901402, 880443, 882716, 877604, 907982, 925606, 904895, 919366, 932137, 929794, 913867, 906100, 910834, 897302, 897619, 919863, 916336, 899099, 907996, 899998, 908113, 926724, 899728, 919670, 916599, 928993, 919970, 913668, 924048, 907841, 882889, 912640, 904215, 891668, 918795, 944749, 934261, 927777, 917950, 916935, 920001, 919199, 919609, 911026, 894506, 860625, 859493, 889149, 869806, 871414, 911482, 926618, 901678, 884154, 914922, 907514, 916225, 921707, 887345, 912357, 914426, 912143, 920949, 897693, 873544, 890485, 897120, 899447, 909875, 912043, 853746, 861391, 885519, 899463, 903355, 900817, 897200]
15882H97200j7698K6183j4515j094J8559P115j2155j7825J6608O1480j4993k9500
$$ y = [897200, 879502, 905685, 891170, 890076, 908635, 915750, 903595, 885770, 902378, 963858, 948865, 919365]
$$ [...]
##END NTUPLES=NMR SPECTRUM
##END=
