##TITLE=1H_DE-80H_X3
 200.13MHz, d2o
 8 sc
 
 19ns.26.2.2025
##JCAMPDX= 6.0         $$ Bruker NMR JCAMP-DX V2.0
##DATA TYPE= NMR SPECTRUM
##DATA CLASS= NTUPLES
##ORIGIN= UXNMR, Bruker Analytische Messtechnik GmbH
##OWNER= pz
$$ XWIN-NMR		Version 3.5
$$ Thu Jul 24 14:27:56 2025 Russian Standard Time (UT+4h)  Yarkov@DPX200
##.OBSERVE FREQUENCY= 200.1313
##.OBSERVE NUCLEUS= ^1H
##.ACQUISITION MODE= SIMULTANEOUS
##.ACQUISITION SCHEME= undefined
##.AVERAGES= 8
##.DIGITISER RES= 18
##SPECTROMETER/DATA SYSTEM= spect
##.PULSE SEQUENCE= zg30
##.SOLVENT NAME= CDCl3
##.SHIFT REFERENCE= (INTERNAL, CDCl3, 0, 15.5442)
##AUDIT TRAIL= $$ (NUMBER, WHEN, WHO, WHERE, WHAT)
$$ ##TITLE= Audit trail, XWIN-NMR		Version 3.5
$$ ##JCAMPDX= 5.01
$$ ##ORIGIN= Bruker BioSpin GmbH
$$ ##OWNER= Yarkov
$$ C:/Bruker/XWIN-NMR/data/yarkov2/nmr/H-C/1/pdata/1/auditp.txt
$$ ##AUDIT TRAIL=  $$ (NUMBER, WHEN, WHO, WHERE, WHAT)
(   1,<2025-07-24 14:26:59.39 +0400>,<Yarkov>,<DPX200>,
      <created by zg, POWCHK disabled, PULCHK disabled
       configuration hash MD5:
       00 E9 B6 7A A2 85 ED C7 34 08 36 98 17 FE 4E 26
       data hash MD5: 16K
       A5 A6 80 3B CF 1B 28 22 1D 59 3D 96 C9 F9 4A A2>)
(   2,<2025-07-24 14:27:06.84 +0400>,<Yarkov>,<DPX200>,
      <Start of raw data processing
       efp BC_mod = 2 LB = 0.25 FT_mod = 6 PKNL = 1 PHC0 = -1360.623 PHC1 = 9.99091 SI = 16K 
       data hash MD5: 16K
       27 4B 1D 9A E7 16 73 55 69 A6 79 17 17 37 35 38>)
(   3,<2025-07-24 14:27:21.98 +0400>,<Yarkov>,<DPX200>,
      <pk PHC0 = 1.06687 PHC1 = 3.6 
       data hash MD5: 16K
       0F EF 71 E0 95 2F 63 D6 B8 27 3D DB 44 CF E2 DD>)
(   4,<2025-07-24 14:27:25.18 +0400>,<Yarkov>,<DPX200>,
      <abs ABSG = 5 
       data hash MD5: 16K
       72 AB CE 14 63 14 39 AF 2D C6 21 82 C3 B6 8D CA>)
$$ ##END=
$$ 
$$ hash MD5
$$ 8B E3 F2 D9 F7 43 48 81 C6 22 BB C3 48 9A 8C 12
##$RELAX= 
##$RELAX= 
##$RELAX= 
##$RELAX= 
##$RELAX= 
##$RELAX= 
$$ Bruker specific parameters
$$ --------------------------
##$DU= <C:/Bruker/XWIN-NMR>
##$EXPNO= 1
##$NAME= <H-C>
##$PROCNO= 1
##$TYPE= <nmr>
##$USER= <yarkov2>
##$AMP= (0..31)
100 100 100 100 100 100 100 100 100 100 100 100 100 100 100 100 100 100 
100 100 100 100 100 100 100 100 100 100 100 100 100 100 
##$AQSEQ= 0
##$AQ_mod= 1
##$AUNM= <au_zg>
##$AUTOPOS= <>
##$BF1= 200.13
##$BF2= 200.13
##$BF3= 200.13
##$BF4= 200.13
##$BF5= 200.13
##$BF6= 200.13
##$BF7= 200.13
##$BF8= 200.13
##$BYTORDA= 1
##$CFDGTYP= 0
##$CFRGTYP= 5
##$CHEMSTR= <none>
##$CNST= (0..31)
1 1 145 1 1 1 1 1 1 1 1 1 1 1 1 1 1 1 1 1 1 1 1 1 1 1 1 1 1 1 1 1 
##$CPDPRG= <>
##$CPDPRG1= <>
##$CPDPRG2= <>
##$CPDPRG3= <>
##$CPDPRG4= <mlev>
##$CPDPRG5= <mlev>
##$CPDPRG6= <mlev>
##$CPDPRG7= <mlev>
##$CPDPRG8= <mlev>
##$CPDPRGB= <>
##$CPDPRGT= <>
##$D= (0..31)
0 0.7 0 0 0 0 0 0 0 0 0 0.03 0 0 0 0 0 0 0 0 0 0 0 0 0 0 0 0 0 0 0 0 
##$DATE= 1753352818
##$DBL= (0..7)
120 120 120 120 120 120 120 120 
##$DBP= (0..7)
150 150 150 150 150 150 150 150 
##$DBP07= 0
##$DBPNAM0= <>
##$DBPNAM1= <>
##$DBPNAM2= <>
$$ [...]
##$SUBNAM3= <"">
##$SUBNAM4= <"">
##$SUBNAM5= <"">
##$SUBNAM6= <"">
##$SUBNAM7= <"">
##$SUBNAM8= <"">
##$SUBNAM9= <"">
##$SW= 18.0517328524113
##$SWIBOX= (0..15)
0 0 2 0 0 0 0 0 0 0 0 0 0 0 0 0 
##$SW_h= 3612.71676300578
##$TD= 16384
##$TD0= 1
##$TE= 0
##$TE2= 300
##$TE3= 300
##$TEG= 300
##$TL= (0..7)
0 120 120 120 120 120 120 120 
##$TP= (0..7)
150 150 150 150 150 150 150 150 
##$TP07= 0
##$TPNAME0= <>
##$TPNAME1= <>
##$TPNAME2= <>
##$TPNAME3= <>
##$TPNAME4= <>
##$TPNAME5= <>
##$TPNAME6= <>
##$TPNAME7= <>
##$TPOAL= (0..7)
0.5 0.5 0.5 0.5 0.5 0.5 0.5 0.5 
##$TPOFFS= (0..7)
0 0 0 0 0 0 0 0 
##$TUNHIN= 0
##$TUNHOUT= 0
##$TUNXOUT= 0
##$USERA1= <user>
##$USERA2= <user>
##$USERA3= <user>
##$USERA4= <user>
##$USERA5= <user>
##$V9= 5
##$VALIST= <valist>
##$VCLIST= <CCCCCCCCCCCCCCC>
##$VD= 0
##$VDLIST= <DDDDDDDDDDDDDDD>
##$VPLIST= <PPPPPPPPPPPPPPP>
##$VTLIST= <TTTTTTTTTTTTTTT>
##$WBST= 1024
##$WBSW= 4
##$XGAIN= (0..3)
0 0 0 0 
##$XL= 0
##$YL= 0
##$YMAX_a= 803840
##$YMIN_a= -793656
##$ZGOPTNS= <>
##$ZL1= 120
##$ZL2= 120
##$ZL3= 120
##$ZL4= 120
##$ABSF1= 15.53094
##$ABSF2= -2.520909
##$ABSG= 5
##$ABSL= 3
##$ALPHA= 0
##$AQORDER= 0
##$ASSFAC= 0
##$ASSFACI= 0
##$ASSFACX= 0
##$ASSWID= 0
##$AUNMP= <proc_1d>
##$AZFE= 0.1
##$AZFW= 0.1
##$BCFW= 0
##$BC_mod= 2
##$BYTORDP= 0
##$COROFFS= 0
##$CY= -3
##$DATMOD= 1
##$DC= 0
##$DFILT= <>
##$DTYPP= 0
##$F1P= 0
##$F2P= 0
##$FCOR= 1
##$FTSIZE= 16384
##$FT_mod= 6
##$GAMMA= 0
##$GB= 0
##$INTBC= 1
##$INTSCL= 3.241238e-09
##$ISEN= 128
##$LB= 0.25
##$LEV0= 0
##$LPBIN= 0
##$MAXI= 10000
##$MC2= 0
##$MEAN= 0
##$ME_mod= 0
##$MI= 1.114404
##$NCOEF= 0
##$NC_proc= -5
##$NLEV= 6
##$NOISF1= 3.799351
##$NOISF2= 2.8
##$NSP= 0
##$NTH_PI= 0
##$NZP= 0
##$OFFSET= 15.54416
##$PC= 1
##$PHC0= -1359.556
##$PHC1= 13.59091
##$PH_mod= 1
##$PKNL= yes
##$PPARMOD= 0
##$PSCAL= 0
##$PSIGN= 0
##$REVERSE= no
##$SF= 200.129995506324
##$SI= 16384
##$SIGF1= 3
##$SIGF2= 2
##$SINO= 0.751879
##$SIOLD= 32768
##$SREGLST= <19F.Aceton>
##$SSB= 0
##$STSI= 16384
##$STSR= 0
##$SW_p= 3612.71676300578
##$SYMM= 0
##$S_DEV= 0
##$TDeff= 16384
##$TDoff= 0
##$TI= <>
##$TILT= no
##$TM1= 0
##$TM2= 0
##$TOPLEV= 0
##$USERP1= <user>
##$USERP2= <user>
##$USERP3= <user>
##$USERP4= <user>
##$USERP5= <user>
##$WDW= 1
##$XDIM= 16384
##$YMAX_p= 477555695
##$YMIN_p= -590159
$$ End of Bruker specific parameters
$$ ---------------------------------
##NTUPLES= NMR SPECTRUM
##VAR_NAME=  FREQUENCY,     SPECTRUM/REAL,   SPECTRUM/IMAG
##SYMBOL=    X,             R,               I
##VAR_TYPE=  INDEPENDENT,   DEPENDENT,       DEPENDENT
##VAR_FORM=  AFFN,          ASDF,            ASDF
##VAR_DIM=   16384,         16384,           16384
##UNITS=     HZ,            ARBITRARY UNITS, ARBITRARY UNITS
##FACTOR=    0.220516191357247, 1,           1
##FIRST=     3110.85264877942, 0,            0
##LAST=      -501.864114226361, 0,           0
##MIN=       -501.864114226361, -590159,     0
##MAX=       3110.85264877942, 477555695,    0
$$ Real data points
##PAGE= N=1
##DATA TABLE= (X++(R..R)), XYDATA
$$ [...]
$$ plain form
6071 1284209 1287446 1333175 1365645 1454490 1525506 1640836 1736627 1831882 1949306 2061505 2195619
6060 2195619 2364360 2496959 2577432 2641057 2628892 2613223 2497658 2406769 2362585 2331630 2366877
6049 2366877 2416843 2465274 2483765 2486756 2480974 2439156 2383384 2347823 2331701 2313722 2347771 2391997
6037 2391997 2417731 2471329 2504064 2514145 2497134 2446862 2363066 2300025 2180270 2096459 2033705
6026 2033705 2007141 2003984 1978911 1961289 2006377 2093561 2190050 2272929 2396460 2473723 2448430
6015 2448430 2366762 2210233 2094401 1942474 1801175 1696745 1603116 1551599 1524712 1478602
6005 1478602 1445953 1404177 1339269 1297352 1235089 1187442 1172856 1163305 1085647 1043815 1070552 1097291
5993 1097291 1134578 1153318 1175019 1236709 1289558 1327519 1358637 1329036 1277996 1199406 1108967
$$ packed form
6071A284209L237M5729L2470Q8845P1016J15330R5791R5255J17424J12199J34114
6060B195619J68741J32599Q0473O3625j2165j5669j15565r0889m4184l0955L5247
6049B366877M9966M8431J8491K991n782m1818n5772l5561j6122j7979L4049M4226
6037B391997K5734N3598L2735J0081j7011n0272q3796o3041j19755q3811o2754
6026B033705k6564l157k5073j7622M5088Q7184R6489Q2879J23531P7263k5293
6015B448430q1668j56529j15832j51927j41299j04430r3629n1517k6887m6110
6005A478602l2649m1776o4908m1917o2263m7647j4586r551p7658m1832K6737K6739
5993A097291L7287J8740K1701O1690N2849L7961L1118k9601n1040p8590r0439
$$ plain form
5982 1108967 1041147 967880 893985 846307 814117 758798 734629 712084 665740 634412 648615
5971 648615 670119 600934 614100 597624 570831 572070 571193 583395 562216 550721 537600 545598
5959 545598 537274 505243 499670 485388 490590 479296 453466 505981 479047 471985 487770 475545
5947 475545 464868 417825 438821 496739 510095 506722 493414 490181 498451 509289 509568 510238 536400
5934 536400 539531 562434 573791 566292 569252 559587 538819 530062 561084 543739 512345 499913 515267
5921 515267 510359 508014 498259 512140 523714 497615 498230 462606 478878 520881 531080 483466 481228
5908 481228 524814 536607 531092 505077 516305 523922 518212 524179 539851 516782 522121 510965 508387
5895 508387 506907 532865 527713 484004 457531 412756 389847 396442 390466 396345 389129 409164 418414
$$ packed form
5982A108967o7820p3267p3895m7678l2190n5319k4169k2545m6344l1328J4203
5971F48615K1504o9185J3166j6476k6793J239q77J2202k1179j1495j3121P998
5959E45598q324l2031n573j4282N202j1294k5830N2515k6934p062J5785j2225
5947D75545j0677m7043K0996N7918J3356l373j3308l233Q270J0838K79O70K6162
5934E36400L131K2903J1357p499K960r665k0768q757L1022j7345l1394j2432J5354
5921E15267m908k345r755J3881J1574k6099O15l5624J6272M2003J0199m7614k238
5908D81228M3586J1793n515k6015J1228P617n710N967J5672k3069N339j1156k578
5895E08387j480K5958n152m3709k6473m4775k2909O595n976N879p216K0035R250
$$ plain form
5882 418414 389911 329547 353055 359170 368156 322996 343705 355875 312183 362623 325487 300804
5870 300804 308349 339575 318155 318635 295694 300330 315869 343466 296427 295766 309280 274305 278175
5857 278175 275379 240889 230993 246024 269011 247561 223964 203881 225162 256768 249235 217058
5845 217058 176750 169330 194905 233202 227673 177157 192325 201794 177673 191938 212021 171143
5833 171143 162822 183464 175135 142673 136554 176032 177536 185415 184773 169015 177436 192931 176662
5820 176662 165763 175176 180737 171249 154956 153929 148086 172780 199798 208819 212278 213796 209209
5807 209209 186989 188770 192308 191956 163382 171249 163306 169737 171266 150199 131095 155127 169401
5794 169401 186923 167662 160266 164399 163670 176183 168835 160061 162600 192332 208658 185200 152704
$$ packed form
5882D18414k8503o0364K3508O115Q986m5160K0709J2170m3692N0440l7136k4683
5870C00804P545L1226k1420M80k2941M636J5539K7597m7039o61J3514l4975L870
5857B78175k796l4490r896J5031K2987k1450k3597k0083K1281L1606p533l2177
5845B17058m0308p420K5575L8297n529n0516J5168R469k4121J4265K0083m0878
5833A71143q321K0642q329l2462o119L9478J504P879o42j5758Q421J5495j6269
5820A76662j0899R413N561r488j6293j027n843K4694K7018R021L459J518m587
5807B09209k2220J781L538l52k8574P867p943O431J529k1067j9104K4032J4274
5794A69401J7522j9261p396M133p29J2513p348q774K539K9732J6326k3458l2496
$$ plain form
5781 152704 123045 145497 161626 170382 173198 161001 177694 134107 109743 132868 143479 161104
5769 161104 171378 142053 137945 180354 172553 148048 152722 117582 132542 137319 140861 133187 151519
5756 151519 174906 189492 162202 173495 183421 169324 165873 132166 155882 179794 178331 159125
5744 159125 136898 144525 161601 142850 120531 124146 131642 105573 120577 155472 135853 121861
5732 121861 137795 143197 123664 155689 188724 165547 170128 154539 166200 185497 129800 132505
5720 132505 164023 171705 188717 188706 171345 159862 192187 192072 163834 139053 161059 133673 143284
5707 143284 167729 168155 190986 214241 212409 202349 222275 186576 151964 185559 181032 197162
5695 197162 219274 210636 192153 161290 167354 174688 150836 153040 172276 181735 141100 149931 201547
$$ packed form
5781A52704k9659K2452J6129Q756K816j2197J6693m3587k4364K3125J0611J7625
5769A61104J0274k9325m108M2409p801k4505M674l5140J4960M777L542p674J8332
5756A51519K3387J4586k7290J1293R926j4097l451l3707K3716K3912j463j9206
5744A59125k2227P627J7076j8751k2319L615P496k6069J5004L4895j9619j3992
5732A21861J5934N402j9533L2025L3035k3177M581j5589J1661J9297n5697K705
5720A32505L1518P682J7012j1j7361j1483L2325j15k8238k4781K2006k7386R611
5707A43284K4445M26K2831K3255j832j0060J9926l5699l4612L3595m527J6130
5695A97162K2112q638j8483l0863O064P334k3852K204J9236R459m0635Q831N1616
$$ plain form
5682 201547 204295 170002 193031 203560 189549 205543 202698 202365 223517 241676 238645 260006 250008
5669 250008 238113 253690 309378 282814 313309 325651 313686 325787 337630 352906 376406 411862
5657 411862 446063 476918 505196 557167 605254 654402 732081 827419 975156 1046802 1085298
5646 1085298 1068759 951899 857050 765070 686157 648083 647627 637499 609135 608519 634688 653135
5634 653135 635021 643484 669333 698402 723042 748210 816012 857566 928119 958953 1016810 1127081
5622 1127081 1223309 1361025 1515849 1760901 2072706 2391236 2660715 2755431 2630892 2285969
5612 2285969 2014848 1762211 1577345 1412153 1291777 1215021 1133210 1096083 1051262 1065691
5602 1065691 1059597 1037627 1020262 1022845 1065092 1064204 1099942 1154427 1218967 1277880 1331565 1428369
$$ packed form
5682B01547K748l4293K3029J0529j4011J5994k845l33K1152J8159l031K1361r998
5669B50008j1895J5577N5688k6564L0495J2342j1965J2101J1843J5276K3500L5456
5657D11862L4201L0855K8278N1971M8087M9148P7679R5338J47737P1646L8496
5646A085298j6539j16860r4849r1980p8913l8074m56j0128k8364o16K6169J8447
5634F53135j8114Q463K5849K9069K4640K5168O7802M1554P0553L0834N7857J10271
5622A127081R6228J37716J54824K45052L11805L18530K69479R4716j24539l44923
5612B285969k71121k52637j84866j65192j20376p6756q1811l7127m4821J4429
5602A065691o094k1970j7365K583M2247q88L5738N4485O4540N8913N3685R6804
$$ plain form
5590 1428369 1537533 1688399 1864706 2096169 2395848 2745613 2985896 3021714 2838928 2494913
5580 2494913 2188923 1955159 1739442 1651144 1542691 1434827 1389657 1318532 1269377 1253825
5570 1253825 1267164 1262687 1280755 1312803 1294632 1299902 1245791 1301198 1326267 1323994 1350975 1423039
5558 1423039 1480542 1550896 1615927 1716217 1868356 1998421 2119503 2112923 2049769 1945779 1859552
5547 1859552 1786840 1759959 1750683 1744537 1754672 1753848 1732221 1748030 1743404 1655998 1561340 1493405
5535 1493405 1457676 1486981 1487606 1458103 1427040 1420684 1421074 1410121 1406911 1446299 1446368 1444291 1488818
5522 1488818 1488104 1502827 1551419 1553238 1541161 1536133 1517797 1469302 1412348 1353761 1299088 1247854
5510 1247854 1134942 1083853 1058558 1014095 962416 932792 925338 932820 964852 984113 989697 991309
$$ packed form
5590A428369J09164J50866J76307K31463K99679L49765K40283L5818j82786l44015
5580B494913l05990k33764k15717q8298j08453j07864m5170p1125m9155j5552
5570A253825J3339m477J8068L2048j8171N270n4111N5407K5069k273K6981P2064
5558A423039N7503P0354O5031J00290J52139J30065J21082o580o3154j03990q6227
5547A859552p2712k6881r276o146J0135q24k1627J5809m626q7406r4658o7935
5535A493405l5729K9305O25k9503l1063o356L90j0953l210L9388O9k077M4527
5522A488818p14J4723M8592J819j2077n028j8336m8495n6954n8587n4673n1234
5510A247854j12912n1089k5295m4463n1679k9624p454P482L2032J9261N584J612
$$ plain form
5498 991309 1020500 1039628 1104164 1161489 1222683 1265045 1284436 1294364 1277954 1256845 1154220 1078590
5486 1078590 1003503 938676 907472 863341 828234 788707 759293 738604 749937 748406 744536 726115
5474 726115 705902 715049 739784 780920 797604 835777 859651 885709 913827 944426 952281 974915
5462 974915 1001701 925410 867879 838194 760832 693250 674282 660647 673999 658609 626617 626948
5450 626948 609666 570191 599016 581831 576683 584158 614047 597116 607223 655070 688750 717500
5438 717500 737963 732444 792531 856580 844333 864370 883788 876667 858996 866233 837457 790738
5426 790738 790890 784937 773171 786187 813417 784347 821713 856696 834890 894988 942977 984880
5414 984880 991402 1034527 1097343 1110050 1117073 1105942 1140713 1192700 1240985 1325544 1324214 1354841
$$ packed form
5498I91309K9191J9128O4536N7325O1194M2362J9391R928j6410k1109j02625p5630
5486A078590p5087o4827l1204m4131l5107l9527k9414k0689J1333j531l870j8421
5474G26115k0213R147K4735M1136J6684L8173K3874K6058K8118L0599P855K2634
5462I74915K6786p6291n7531k9685p7362o7582j8968j3635J3352j5390l1992L31
5450F26948j7282l9475K8825j7185n148P475K9889j6931J0107M7847L3680K8750
5438G17500K0463n519O0087O4049j2247K0037J9418p121j7671P237k8776m6719
5426G90738J52n953j1766J3016K7230k9070L7366L4983k1806O0098M7989M1903
5414I84880O522M3125O2816J2707P023j1131L4771N1987M8285Q4559j330L0627
$$ plain form
5402 1354841 1405708 1468205 1423928 1388881 1397601 1403933 1442872 1478164 1481643 1520631 1525841 1525955 1514075
5389 1514075 1566859 1629127 1664062 1734694 1757817 1723962 1675415 1652199 1615660 1590158 1566572
5378 1566572 1572763 1607734 1617327 1593526 1596813 1564289 1543074 1574658 1578587 1617273 1675442 1699250
5366 1699250 1734650 1767871 1781869 1739798 1680186 1594024 1522245 1499044 1418383 1322642 1272695
5355 1272695 1185877 1135283 1083210 1041253 1013822 938234 913850 900796 890535 874127 863263
5344 863263 867749 877822 839500 847362 877543 918848 965299 980822 976694 972815 946536 874756
5332 874756 805142 777994 742848 654296 622630 582081 575143 559443 535945 531225 528910 523621
5320 523621 466038 437756 427589 421736 439492 425669 431407 410421 400838 383367 376307 349547
$$ packed form
5402A354841N0867O2497m4277l5047Q720O332L8939L5292L479L8988N210J14j1880
5389A514075N2784O2268L4935P0632K3123l3855m8547k3216l6539k5502k3586
5378A566572O191L4971R593k3801L287l2524k1215L1584L929L8686N8169K3808
5366A699250L5400L3221J3998m2071n9612q6162p1779k3201q0661r5741m9947
5355A272695q6818n0594n2073m1957k7431p5588k4384j3054j0261j6408j0864
5344H63263M486J0073l8322P862L0181M1305M6451J5523m128l879k6279p1780
5332H74756o9614k7148l5146q8552l1666m0549o938j5700k3498m720k315n289
5320E23621n7583k8282j0167n853J7756j3823N738k0986r583j7471p060k6760
$$ plain form
5308 349547 349664 374860 388178 378965 389202 424767 416645 425563 378750 347080 396204 408213 369163
5295 369163 361801 359751 360531 338218 321894 318203 302075 315672 315846 282147 301589 260677 255090
5282 255090 312165 304119 291185 321041 329942 351132 324518 278648 299148 334441 336392 325610
5270 325610 332089 312258 334119 338979 314759 268082 256463 262897 284059 324527 312229 283102
5258 283102 289725 292540 265385 269208 267379 277941 283323 266307 251690 258265 289404 290336 282265
5245 282265 278205 299875 301947 297447 267179 270668 261757 257919 264698 261134 226623 258910 254374
5232 254374 258116 275526 266450 284349 276786 269200 275084 296485 301656 322612 265606 235308 262779
5219 262779 269291 282158 281347 277943 272752 295754 278483 251833 282671 276497 280625 300296 295777
$$ packed form
5308C49547J17K5196J3318r213J0237L5565q122Q918m6813l1670M9124J2009l9050
5295C69163p362k050P80k2313j6324l691j6128J3597J74l3699J9442m0912n587
5282B55090N7075q046j2934K9856Q901K1190k6614m5870K0500L5293J951j0782
5270C25610O479j9831K1861M860k4220m6677j1619O434K1162M0468j2298k9127
5258B83102O623K815k7155L823j829J0562N382j7016j4617O575L1139R32q071
5245B82265m060K1670K072m500l0268L489q911l838O779l564l4511L2287m536
5232B54374L742J7410r076J7899p563p586N884K1401N171K0956n7006l0298K7471
5219B62779O512J2867q11l404n191K3002j7271k6650L0838o174M128J9671m519
$$ plain form
5206 295777 300282 283083 277320 285138 243254 245403 259062 248155 259351 259416 236646 274384 229487
5193 229487 227266 254821 247746 262502 243143 242341 255665 270981 266561 281653 314924 275219 254530
5180 254530 241214 252307 244186 234714 314325 306817 271950 309401 296603 268850 288503 276644
5168 276644 264879 288806 280660 264440 256245 237788 267697 273723 246555 297042 288828 228141
5156 228141 255678 238648 239301 276971 284509 276625 293483 270669 285193 257668 279358 284633 281852
5143 281852 291210 270126 234882 251366 238554 219548 215073 252901 296690 249407 262907 266784
5131 266784 276610 290672 299220 278343 299660 323096 335665 309614 300901 279482 296165 293759
5119 293759 308636 287877 307784 309984 315577 324048 326352 334443 361761 335651 340538 367533 393527
$$ packed form
5206B95777M505j7199n763P818m1884K149J3659j0907J1196O5k2770L7738m4897
5193B29487k221K7555p075J4756j9359q02J3324J5316m420J5092L3271l9705k0689
5180B54530j3316J1093q121r472P9611p508l4867L7451j2798k7753J9653j1859
5168B76644j1765K3927q146j6220q195j8457K9909O026k7168N0487q214o0687
5156B28141K7537j7030O53L7670P538p884J6858k2814J4524k7525K1690N275k781
5143B81852R358k1084l5244J6484j2812j9006m475L7828M3789m7283J3500L877
5131B66784R826J4062Q548k0877K1317K3436J2569k6051q713k1419J6683k406
5119B93759J4877k0759J9907K200N593Q471K304Q091K7318k6110M887K6995K5994
$$ plain form
5106 393527 353314 311173 329431 323306 321532 367144 399641 406771 413616 450686 470239 495884
5094 495884 486424 462975 458698 442291 475489 488155 529284 547090 562637 557965 561130 592612
5082 592612 621883 676135 741492 788692 796466 847740 948797 1052127 1190884 1279372 1360777
5071 1360777 1298039 1173480 1073830 966215 966934 950668 887166 852654 811409 822997 863902
5060 863902 856159 852769 871461 864782 905722 902150 934047 936635 974660 991431 1012697 1063258 1158864
5047 1158864 1185820 1222224 1304802 1373224 1464489 1562105 1621754 1726160 1826129 1930083 2118296
5036 2118296 2295926 2472273 2695045 2904023 3196402 3560215 3923616 4339224 4845448 5422728
5026 5422728 6098110 6885918 7550127 7976131 8221423 8462448 8970243 9623090 9989761 9797626
$$ packed form
5106C93527m0213m2141J8258o125j774M5612L2497P130O845L7070J9553K5645
5094D95884r460k3449m277j6407L3198J2666M1129J7806J5547m672L165L1482
5082E92612K9271N4252O5357M7200P774N1274J01057J03330J38757Q8488Q1405
5071A360777o2738j24559r9650j07615P19j6266o3502l4512m1245J1588M0905
5060H63902p743l390J8692o679M0940l572L1897K588L8025J6771K1266N0561R5606
5047A158864K6956L6404Q2578O8422R1265R7616N9649J04406R9969J03954J88213
5036B118296J77630J76347K22772K08978K92379L63813L63401M15608N06224N77280
5026E422728O75382P87808O64209M26004K45292K41025N07795O52847L66671j92135
$$ plain form
5016 9797626 9032449 8008551 7081164 6434946 6004743 5705692 5535845 5326697 5046905
5007 5046905 4680625 4205885 3789079 3396790 3116592 2919058 2695864 2505661 2365354 2216945
4997 2216945 2112032 2002160 1879858 1779891 1736316 1642992 1586443 1527927 1469835 1411351 1369893
4986 1369893 1338264 1312326 1256466 1213084 1190680 1131781 1089147 1032655 990634 953500 938748
4975 938748 901166 852290 883351 877661 831816 836975 817270 802921 788586 764716 759574 755758
4963 755758 755096 770251 767188 767392 725059 736240 733101 710342 733677 714499 691483 727585 755346
4950 755346 710869 690086 700659 716354 716893 691513 756653 751221 730352 758023 745149 752870
4938 752870 727404 766198 787244 778615 785044 790553 783453 774844 801708 795469 783290 822350 816719
$$ packed form
5016I797626p65177j023898r27387o46218m30203k99051j69847k09148k79792
5007E046905l66280m74740m16806l92289k80198j97534k23194j90203j40307j48409
4997B216945j04913j09872j22302r9967m3575r3324n6549n8516n8092n8484m1458
4986A369893l1629k5938n5860m3382k2404n8899m2634n6492m2021l7134j4752
4975I38748l7582m8876L1061n690m5845N159j9705j4349j4335k3870n142l816
4963G55758o62J5155l063K04m2333J1181l139k2759K3335j9178k3016L6102K7761
4950G55346m4477k0783J0573J5695N39k5380O5140n432k0869K7671j2874P721
4938G52870k5466L8794K1046q629O429N509p100q609K6864o239j2179L9060n631
$$ plain form
4925 816719 857213 861052 905742 938138 956486 990651 1005992 1017434 1064420 1142184 1147494 1183310
4913 1183310 1184416 1148119 1171693 1203115 1179951 1139580 1168138 1176428 1113375 1082514 1096021 1060868
4901 1060868 1018749 1011290 979317 949419 936644 923321 888664 888733 916734 887293 858881 827892
4889 827892 832989 835590 883173 894074 866302 851646 807090 801417 802797 806200 822220 807129 809189
4876 809189 843609 829927 800917 768788 782227 839329 795000 768680 814339 799636 761361 782502
4864 782502 796798 768682 750989 747786 792200 787317 821265 843079 814118 795335 805799 831364
4852 831364 828445 831903 827367 821311 848743 869409 858302 874281 865787 855926 861996 875075 883229
4839 883229 837370 847264 854072 900021 880908 867003 867316 906502 916854 919089 934457 957439 944392
$$ packed form
4925H16719M0494L839M4690L2396J8348L4165J5341J1442M6986P7764N310L5816
4913A183310J106l6297K3574L1422k3164m0371K8558Q290o3053l0861J3507l5153
4901A060868m2119p459l1973k9898j2775j3323l4657O9K8001k9441k8412l0989
4889H27892N097K601M7583J0901k7772j4656m4556n673J380L403J6020j5091K060
4876H09189L4420j3682k9010l2129J3439N7102m4329k6320M5659j4703l8275K1141
4864G82502J4296k8116j7693l203M4414m883L3948K1814k8961j8783J0464K5565
4852H31364k919L458m536o056K7432K0666j1107J5979q494r861O070J3079Q154
4839H83229m5859R894O808M5949j9113j3905L13L9186J0352K235J5368K2982j3047
$$ plain form
4826 944392 970908 1016826 1024253 1024459 1041765 1120946 1172258 1157718 1170345 1166293 1166910 1159558 1127966
4813 1127966 1142370 1146889 1151431 1181273 1201394 1234192 1255587 1286487 1351285 1388620 1404913 1436090
4801 1436090 1475594 1531739 1588169 1638091 1660645 1680760 1749444 1813038 1850850 1891189 1937716
4790 1937716 1927024 1946039 1994503 2077002 2127952 2186034 2267719 2323560 2362187 2412659 2476896
4779 2476896 2542884 2606563 2652571 2715277 2827724 2970887 3103379 3197030 3326530 3468506
4769 3468506 3647738 3843478 4024547 4208497 4413868 4638100 4829588 5027603 5320914 5638329
4759 5638329 5941992 6272257 6627499 6980855 7363102 7741176 8134658 8598266 9083020 9640087
4749 9640087 10215962 10858371 11481681 12127555 12873126 13662602 14621212 15819420 17229382
$$ packed form
4826I44392K6516M5918P427K06J7306P9181N1312j4540J2627m052O17p352l1592
4813A127966J4404M519M542K9842K0121L2798K1395L0900O4798L7335J6293L1177
4801A436090L9504N6145N6430M9922K2554K0115O8684O3594L7812M0339M6527
4790A937716j0692J9015M8464Q2499N0950N8082Q1685N5841L8627N0472O4237
4779B476896O5988O3679M6008O2706J12447J43163J32492R3651J29500J41976
4769C468506J79232J95740J81069J83950K05371K24232J91488J98015K93311L17415
4759E638329L03663L30265L55242L53356L82247L78074L93482M63608M84754N57067
4749I640087N75875O42409O23310O45874P45571P89476R58610J198208J409962
$$ plain form
4740 17229382 18804479 20401605 21764980 22775199 23461232 23955907 24390558 24864665 25288498
4731 25288498 25626577 25896661 26261179 26776588 27399865 28067126 28808618 29586041 30468054
4722 30468054 31482410 32612787 33771398 34882044 35885250 36803811 37735021 38838797
4714 38838797 40045051 41399192 42957135 44689686 46566932 48421827 50000787 50874996
4706 50874996 50749397 49789917 48466053 46978330 45578348 44303988 43085037 41987774
4698 41987774 41059664 40208585 39268729 38171869 36929815 35672459 34477080 33469963 32608160
4689 32608160 31925956 31323416 30742920 30193522 29753766 29503057 29400502 29296587 29084988
4680 29084988 28809177 28502939 28191278 27652480 26671737 25263718 23512649 21683975 20080539
$$ packed form
4740A7229382J575097J597126J363375J010219O86033M94675M34651M74107M23833
4731B5288498L38079K70084L64518N15409O23277O67261P41492P77423Q82013
4722C0468054J014356J130377J158611J110646J003206R18561R31210J103776
4714C8838797J206254J354141J557943J732551J877246J854895J578960Q74209
4706E0874996j25599r59480j323864j487723j399982j274360j218951j097263
4698D1987774r28110q51079r39856j096860j242054j257356j195379j007117q61803
4689C2608160o82204o02540n80496n49398m39756k50709j02555j03915k11599
4680B9084988k75811l06238l11661n38798r80743j408019j751069j828674j603436
$$ plain form
4671 20080539 18770964 17723120 16809253 16070748 15406635 14744552 14097595 13528811 12989369
4662 12989369 12527864 12081926 11629691 11197945 10751655 10332180 9915203 9553438 9190105
4653 9190105 8809764 8498145 8204416 7947875 7694389 7450195 7196969 6962000 6737510 6509764
4643 6509764 6327991 6186648 6003684 5854857 5741219 5677963 5637716 5575682 5528598 5503458
4633 5503458 5461921 5453164 5470151 5508996 5510451 5488627 5473483 5423557 5325257 5233338 5175184 5140277
4621 5140277 5065234 4995285 4924029 4848606 4747189 4626616 4514784 4386099 4276326 4156781
4611 4156781 4003259 3897738 3813644 3692101 3617785 3556904 3471271 3445216 3391328 3347206 3312325
4600 3312325 3263923 3268398 3280839 3301576 3347899 3345248 3322502 3247033 3209403 3149266 3061525 2968262
$$ packed form
4671B0080539j309575j047844r13867p38505o64113o62083o46957n68784n39442
4662A2989369m61505m45938m52235m31746m46290m19475m16977l61765l63333
4653I190105l80341l11619k93729k56541k53486k44194k53226k34969k24490k27746
4643F509764j81773j41343j82964j48827j13638o3256m0247o2034m7084k5140
4633E503458m1537q757J6987L8845J455k1824j5144m9926r8300r1919n8154l4907
4621E140277p5043o9949p1256p5423j01417j20573j11832j28685j09773j19545
4611D156781j53522j05521q4094j21543p4316o0881q5633k6055n3888m4122l4881
4600C312325m8402M475J2441K0737M6323k651k2746p5469l7630o0137q7741r3263
$$ plain form
4588 2968262 2922289 2869189 2758946 2690695 2642999 2561106 2460717 2388876 2303358 2233248 2171223
4577 2171223 2096463 1997762 1980428 1915910 1890993 1825664 1757979 1710559 1692091 1643137 1617209
4566 1617209 1594037 1569616 1529445 1500557 1486383 1486912 1440732 1399930 1368472 1366485 1332115 1310937
4554 1310937 1292909 1272532 1207808 1194079 1194370 1155277 1164720 1153732 1167957 1182954 1133200 1112836
4542 1112836 1095998 1082038 1111850 1107779 1057285 1047428 1034143 1019162 1043436 1027579 1024618 1012838
4530 1012838 1025416 1011429 1005387 969322 974730 951142 931707 951841 970394 922050 901338 936300
4518 936300 902781 924857 922750 954787 945196 919200 927868 913228 916457 915715 901224 889332 915299
4505 915299 937799 964130 923541 894242 872601 865367 855104 854066 862190 861672 856000 855945 882456
$$ packed form
4588B968262m5973n3100j10243o8251m7696q1893j00389p1841q5518p0110o2025
4577B171223p4760r8701j7334o4518k4917o5329o7685m7420j8468m8954k5928
4566A617209k3172k4421m0171k8888j4174N29m6180m0802l1458j987l4370k1178
4554A310937j8028k0377o4724j3729K91l9093R443j0988J4225J4997m9754k0364
4542A112836j6838j3960K9812m071n0494r857j3285j4981K4274j5857k961j1780
4530A012838J2578j3987o042l6065N408k3588j9435K0134J8553m8344k0712L4962
4518I36300l3519K2076k107L2037r591k5996Q668j4640L229p42j4491j1892K5967
4505I15299K2500K6331m0589k9299k1641p234j0263j038Q124n18n672n5K6511
$$ plain form
4492 882456 872292 838182 800890 808187 832603 852816 834988 807230 795196 784031 786832 787593
4480 787593 780311 758689 767234 768019 771251 754466 720676 725018 724953 738053 721819 710609 727888
4467 727888 746059 746768 724214 740203 729360 726891 696539 726921 716210 671306 687720 690530
4455 690530 704951 711664 695674 734513 751255 742938 716311 686443 701874 693863 690698 701252
4443 701252 707996 711319 733238 749030 773889 769842 812248 801613 759682 790525 783788 772891
4431 772891 754747 759566 810528 832280 805667 810412 832114 822275 807525 810932 819106 850447 876903
4418 876903 888561 856926 856017 880955 909118 912476 872534 886207 893280 931580 950125 937726
4406 937726 952102 954715 948664 989370 1012632 989165 1005520 1014863 1008765 998500 1002126 1018455 1019976
$$ packed form
4492H82456j0164l4110l7292P297K4416K0213j7828k7758j2034j1165K801P61
4480G87593p282k1622Q545P85L232j6785l3790M342o5J3100j6234j1210J7279
4467G27888J8171P09k2554J5989j0843k469l0352L0382j0711m4904J6414K810
4455F90530J4421O713j5990L8839J6742q317k6627k9868J5431q011l165J0554
4443G01252O744L323K1919J5792K4859m047M2406j0635m1931L0843o737j0897
4431G72891j8144M819N0962K1752k6613M745K1702r839j4750L407Q174L1341K6456
4418H76903J1658l1635r09K4938K8163L358l9942J3673P073L8300J8545j2399
4406I37726J4376K613o051M0706K3262k3467J6355R343o098j0265L626J6329J521
$$ plain form
4393 1019976 1039446 1045981 1014496 1010566 996607 973002 977429 978461 979458 991975 1010301 973504 962146
4380 962146 977319 978078 996514 994951 973294 957180 955773 969671 984178 976778 946463 925810 969300
4367 969300 1000504 966651 941833 941941 928421 941186 971119 952925 927916 922300 887835 896958
4355 896958 915497 903140 927821 920260 934083 938493 937760 961721 923554 891763 921282 937464
4343 937464 920291 938474 976118 966901 1000491 993620 1003994 1000834 1047362 1077586 1064698 1096590
4331 1096590 1121249 1152557 1167732 1170679 1154828 1116029 1096441 1084728 1071476 1089754 1100295 1096728
4319 1096728 1062936 1067289 1083552 1061868 1084271 1085891 1106696 1141985 1125890 1123033 1112557 1143727
4307 1143727 1152145 1149791 1174973 1188868 1186113 1220984 1218142 1197899 1188105 1233122 1263110 1288272
$$ packed form
4393A019976J9470O535l1485l930j3959k3605M427J032R97J2517J8326l6797j1358
4380I62146J5173P59J8436j563k1657j6114j407J3898J4507p400l0315k0653M3490
4367I69300L1204l3853k4818J08j3520J2765K9933j8194k5009n616l4465R123
4355H96958J8539j2357K4681p561J3823M410p33K3961l8167l1791K9519J6182
4343I37464j7173J8183L7644r217L3590o871J0374l160M6528L0224j2888L1892
4331A096590K4659L1308J5175K947j5851l8799j9588j1713j3252J8278J0541l567
4319A096728l3792M353J6263k1684K2403J620K0805L5289j6095k857j0476L1170
4307A143727Q418k354K5182J3895k755L4871k842k0243r794M5017K9988K5162
$$ plain form
4295 1288272 1292445 1298522 1356698 1369006 1390202 1368099 1422715 1451312 1447219 1514543 1568691 1620223
4283 1620223 1672461 1676818 1693615 1740551 1792365 1856100 1879821 1937640 2017057 2053922 2136393 2239741
4271 2239741 2322267 2418352 2481310 2582787 2699974 2801778 2965495 3107122 3253352 3424863
4261 3424863 3588419 3783729 3998500 4220822 4422350 4654954 4927281 5217473 5547305 5968083
4251 5968083 6496614 7057558 7551361 7922419 8244581 8546407 8827578 9148582 9458148 9717052
4241 9717052 10000508 10286083 10641825 11102399 11677582 12347057 13054159 13905134 14856297 15767363
4231 15767363 16635096 17469382 18188771 18759439 19169332 19512353 19804316 20181853 20625765
4222 20625765 21195575 21948805 22846430 23845423 24975174 26108626 27133381 28084462 28839462
$$ packed form
4295A288272M173O077N8176J2308K1196k2103N4616K8597m093O7324N4148N1532
4283A620223N2238M357J6797M6936N1814O3735K3721N7819P9417L6865Q2471J03348
4271B239741Q2526R6085O2958J01477J17187J01804J63717J41627J46230J71511
4261C424863J63556J95310K14771K22322K01528K32604K72327K90192L29832M20778
4251E968083N28531N60944M93803L71058L22162L01826K81171L21004L09566K58904
4241I717052K83456K85575L55742M60574N75183O69475P07102Q50975R51163R11066
4231A5767363Q67733Q34286P19389N70668M09893L43021K91963L77537M43912
4222B0625765N69810P53230Q97625R98993J129751J133452J024755R51081P55000
$$ plain form
4213 28839462 29350406 29560312 29501215 29266562 28994904 28779564 28668096 28763343 28995582 29442315
4203 29442315 30002496 30674374 31356902 31946183 32372444 32449475 32179823 31488267 30470626
4194 30470626 29290925 28134938 27145393 26337732 25760948 25429990 25297665 25325167 25441588
4185 25441588 25543825 25438667 25106719 24396085 23344895 22084648 20758502 19445092 18279584
4176 18279584 17299132 16491437 15830882 15405422 15099132 14851357 14605237 14285545 13809130
4167 13809130 13188184 12449666 11651692 10877719 10133045 9492190 8946995 8451860 8064306
4158 8064306 7753580 7491852 7252619 7029329 6810046 6497134 6252730 5981428 5704893 5506841
4148 5506841 5282880 5059130 4856486 4654637 4473429 4354788 4161948 4033666 3960091 3844940
$$ packed form
4213B8839462N10944K09906n9097k34653k71658k15340j11468R5247K32239M46733
4203B9442315N60181O71878O82528N89281M26261P7031k69652o91556j017641
4194C0470626j179701j155987r89545q07661n76784l30958j32325K7502J16421
4185B5441588J02237j05158l31948p10634j051190j260247j326146j313410j165508
4176A8279584r80452q07695o60555m25460l06290k47775k46120l19692m76415
4167A3809130o20946p38518p97974p73973p44674o40855n45195m95135l87554
4158H064306l10726k61728k39233k23290k19283l12912k44404k71302k76535j98052
4148E506841k23961k23750k02644k01849j81208j18641j92840j28282p3575j15151
$$ plain form
4138 3844940 3775592 3668642 3553962 3432214 3339751 3328196 3249620 3143079 3100203 3058208 3015286
4127 3015286 2927001 2872563 2831938 2813201 2787816 2754712 2698304 2683971 2611029 2584900 2553121
4116 2553121 2526119 2509869 2527813 2513500 2448727 2428521 2432565 2408350 2359310 2338009 2301798 2280419
4104 2280419 2248641 2224766 2181112 2159355 2188415 2200170 2155165 2134554 2133425 2130384 2106042 2100576
4092 2100576 2096969 2107357 2110508 2077143 2039361 2052480 2040069 2025876 2018906 2047304 2072165 2078444
4080 2078444 2089968 2094831 2095094 2113627 2137645 2099480 2096528 2108091 2122595 2119028 2121891 2137286 2124813
4067 2124813 2150123 2187819 2250109 2297621 2312111 2349316 2418285 2474998 2494194 2561067 2579739
4056 2579739 2568275 2537188 2538224 2565738 2623438 2711318 2781688 2843513 2904511 2942448 2979225 3039662
$$ packed form
4138C844940o9348j06950j14680j21748r2463j1555p8576j06541m2876m1995m2922
4127C015286q8285n4438m0625j8737k5385l3104n6408j4333p2942k6129l1779
4116B553121k7002j6250J7944j4313o4773k0206M044k4215m9040k1301l6211k1379
4104B280419l1778k3875m3654k1757K9060J1755m5005k0611j129l041k4342n466
4092B100576l607J0388L151l3365l7782J3119j2411j4193o970K8398K4861O279
4080B078444J1524M863K63J8533K4018l8165k952J1563J4504l567K863J5395j2473
4067B124813K5310L7696O2290M7512J4490L7205O8969N6713J9196O6873J8672
4056B579739j1464l1087J036K7514N7700Q7880P0370O1825O0998L7937L6777O0437
$$ plain form
4044 3039662 3071802 3065284 3050123 3075868 3123784 3154276 3170962 3217646 3253876 3315832 3412187 3504330
4032 3504330 3601680 3691299 3701336 3671269 3594157 3516758 3438264 3388528 3362494 3349146 3358844 3366064
4020 3366064 3361307 3393375 3443853 3432289 3445924 3397407 3345972 3319139 3244793 3216164 3208432 3204718
4008 3204718 3226713 3198143 3200132 3217571 3221695 3224047 3200306 3177962 3186457 3201868 3206786 3175662
3996 3175662 3208953 3244041 3232208 3244403 3311986 3328856 3314885 3341161 3363006 3376686 3402164
3985 3402164 3455902 3507516 3551709 3575939 3646253 3687739 3718927 3733570 3775321 3809953 3891271
3974 3891271 3952871 3965632 4015271 4061795 4132981 4241632 4343671 4385693 4429336 4507793 4552502
3963 4552502 4593908 4662989 4722021 4751422 4791271 4812774 4846751 4891533 4931146 4969047 4982584
$$ packed form
4044C039662L2140o518j5161K5745M7916L0492J6686M6684L6230O1956R6355R2143
4032C504330R7350Q9619J0037l0067p7112p7399p8494m9736k6034j3348R698P220
4020C366064m757L2068N0478j1564J3635m8517n1435k6833p4346k8629p732l714
4008C204718K1995k8570J989J7439M124K352k3741k2344Q495J5411M918l1124
3996C175662L3291L5088j1833J2195O7583J6870j3971K6276K1845J3680K5478
3985C402164N3738N1614M4193K4230P0314M1486L1188J4643M1751L4632Q1318
3974C891271O1600J2761M9639M6524P1186J08651J02039M2022M3643P8457M4709
3963D552502M1406O9081N9032K9401L9849K1503L3977M4782L9613L7901J3537
$$ plain form
3952 4982584 5038367 5078343 5150833 5221219 5272979 5303992 5288033 5322665 5321564 5369501 5427433 5477092
3940 5477092 5543558 5634809 5679367 5732713 5787470 5816634 5882215 5932321 5967760 6019669 6002244
3929 6002244 6045524 6048225 6018410 6005953 5979291 6052130 6108636 6155657 6256427 6374121 6505908
3918 6505908 6641552 6836378 7060236 7293958 7472505 7594444 7739632 7805906 7849102 7861515
3908 7861515 7882628 7893334 8003845 8155466 8312726 8465732 8692585 8939221 9278415 9605408
3898 9605408 9975470 10375174 10838397 11351865 11951496 12605126 13303522 14020741 14744473 15485496
3888 15485496 16225584 17069383 18062178 19241023 20725505 22357559 24103197 25809581 27232116
3879 27232116 28216150 28691464 28927846 29078817 29320853 29706812 30165448 30758641 31641632
$$ packed form
3952D982584N5783L9976P2490P0386N1760L1013j5959L4632j101M7937N7932M9659
3940E477092O6466R1251M4558N3346N4757K9164O5581N0106L5439N1909j7425
3929F002244M3280K701k9815j2457k6662P2839N6506M7021J00770J17694J31787
3918F505908J35644J94826K23858K33722J78547J21939J45188O6274M3196J2413
3908G861515K1113J0706J10511J51621J57260J53006K26853K46636L39194L26993
3898I605408L70062L99704M63223N13468N99631O53630O98396P17219P23732P41023
3888A5485496P40088Q43799R92795J178845J484482J632054J745638J706384J422535
3879B7232116R84034M75314K36382J50971K42036L85959M58636N93193Q82991
$$ plain form
3870 31641632 32796157 34151927 35574223 36972946 38141740 39013412 39580187 39964388 40267536
3861 40267536 40509769 40770753 41161171 41806158 42762983 43977671 45592951 47551424 49879653
3852 49879653 52447170 54919301 56744831 57359823 56444037 54212583 51372399 48633356
3844 48633356 46331354 44528299 43158805 42090340 41262890 40667924 40301780 40103090 40016717
3835 40016717 39883531 39623797 39077393 38153032 36806975 35264785 33759270 32411185 31303105
3826 31303105 30546128 30033547 29640299 29353076 29159020 29013630 28758542 28290469 27357468
3817 27357468 26027668 24446221 22887892 21488141 20265897 19285510 18493962 17822798 17209570
3808 17209570 16638903 16076594 15475434 14902285 14417095 14042111 13715760 13435866 13179814
$$ packed form
3870C1641632J154525J355770J422296J398723J168794Q71672N66775L84201L03148
3861D0267536K42233K60984L90418O44987R56825J214688J615280J958473K328229
3852D9879653K567517K472131J825530O14992r15786k231454k840184k739043
3844D8633356k302002j803055j369494j068465q27450n94966l66144j98690q6373
3835D0016717j33186k59734n46404r24361j346057j542190j505515j348085j108080
3826C1303105p56977n12581l93248k87223j94056j45390k55088m68073r33001
3817B7357468j329800j581447j558329j399751j222244r80387p91548o71164o13228
3808A7209570n70667n62309o01160n73149m85190l74984l26351k79894k56052
$$ plain form
3799 13179814 12925744 12717533 12507342 12308458 12171977 12031222 11917719 11824699 11753482 11691732
3789 11691732 11594525 11527710 11460036 11342117 11188868 10980671 10786984 10585177 10378656 10219770
3779 10219770 10049237 9925978 9848208 9825507 9749707 9665570 9657458 9670293 9644018 9638309 9591103
3768 9591103 9546342 9562092 9616497 9643546 9652046 9671731 9663355 9677800 9712313 9751573 9751099 9762802
3756 9762802 9796594 9811077 9835206 9904581 9975415 10026039 10084610 10198995 10289080 10413114 10544193
3745 10544193 10629038 10715663 10882200 11043277 11202031 11367944 11549709 11787721 11997728 12245968
3735 12245968 12513254 12805890 13136936 13509925 13877727 14293453 14710412 15142965 15611604
3726 15611604 16146159 16774117 17454070 18186507 18960929 19838079 20841477 21882628 23047776
$$ packed form
3799A3179814k54070k08211k10191j98884j36481j40755j13503r3020p1217o1750
3789A1691732r7207o6815o7674j17919j53249k08197j93687k01807k06521j58886
3779A0219770j70533j23259p7770k2701p5800q4137q112J2835k6275n709m7206
3768I591103m4761J5750N4405K7049Q500J9685q376J4445L4513L9260m74J1703
3756I762802L3792J4483K4129O9375P0834N0624N8571J14385R0085J24034J31079
3745A0544193Q4845Q6625J66537J61077J58754J65913J81765K38012K10007K48240
3735A2245968K67286K92636L31046L72989L67802M15726M16959M32553M68639
3726A5611604N34555O27958O79953P32437P74422Q77150J003398J041151J165148
$$ plain form
3717 23047776 24367574 25893885 27592746 29500793 31640784 33840943 36046253 38270734
3709 38270734 40341366 42105808 43554777 44604758 45211437 45512569 45476820 45173542 44817437
3700 44817437 44476908 44249717 44187476 44386022 44715613 45034932 45337825 45491144 45362578 44900002
3690 44900002 44141181 43019515 41524235 39860430 38037111 36132611 34313830 32549949
3682 32549949 30884692 29397588 28082890 26953126 25923446 25054498 24289492 23589981 23000412
3673 23000412 22511888 22068361 21665288 21289740 20974996 20703674 20449581 20221897 20025483
3664 20025483 19905159 19795301 19705422 19599912 19552945 19535036 19504727 19504141 19489771 19539354 19557477
3653 19557477 19584467 19619402 19620097 19647356 19666433 19670105 19674055 19628536 19627349 19677168 19727142 19767414
$$ packed form
3717B3047776J319798J526311J698861J908047K139991K200159K205310K224481
3709C8270734K070632J764442J448969J049981O06679L01132l5749l03278l56105
3700D4817437l40529k27191o2241J98546L29591L19319L02893J53319j28566m62576
3690D4900002p58821j121666j495280j663805j823319j904500j818781j763881
3682C2549949j665257j487104j314698j129764j029680q68948p65006o99511n89569
3673B3000412m88524m43527m03073l75548l14744k71322k54093k27684j96414
3664B0025483j20324j09858q9879j05510m6967j7909l0309n86j4370M9583J8123
3653A9557477K6990L4935O95K7259J9077L672L950m5519j187M9819M9974M0272
$$ plain form
3641 19767414 19792662 19846087 19907571 19983491 20012263 20072855 20118537 20197952 20276315 20357857 20439243
3630 20439243 20560911 20677687 20846820 20984754 21154325 21326873 21497040 21699454 21847256
3621 21847256 21968732 22109161 22290733 22494312 22684878 22882194 23078553 23286932 23533936
3612 23533936 23809048 24040684 24257946 24509538 24724525 24952622 25169046 25373177 25543055
3603 25543055 25764759 25924182 26131945 26343556 26559177 26771490 27061892 27331759 27677223
3594 27677223 28070804 28412412 28827124 29298722 29842742 30431473 31073067 31859234 32754766
3585 32754766 33757956 34880773 36179759 37655924 39408043 41441659 43792293 46583151
3577 46583151 49739038 53192159 56859151 60633237 64243779 67564890 70450260 72821772
$$ packed form
3641A9767414K5248N3425O1484P5920K8772O0592M5682P9415P8363Q1542Q1386
3630B0439243J21668J16776J69133J37934J69571J72548J70167K02414J47802
3621B1847256J21476J40429J81572K03579J90566J97316J96359K08379K47004
3612B3533936K75112K31636K17262K51592K14987K28097K16424K04131J69878
3603B5543055K21704J59423K07763K11611K15621K12313K90402K69867L45464
3594B7677223L93581L41608M14712M71598N44020N88731O41594P86167Q95532
3585C2754766J003190J122817J298986J476165J752119K033616K350634K790858
3577D6583151L155887L453121L666992L774086L610542L321111K885370K371512
$$ plain form
3569 72821772 74631340 75753522 76315526 76401794 76223868 75929494 75729422 75689703 75867141
3560 75867141 76235403 76669884 77055169 77185692 76917325 76113063 74797463 72879539 70398593
3551 70398593 67433628 64077493 60560026 57006746 53605007 50409156 47460778 44893628
3543 44893628 42647788 40744797 39084325 37690843 36447693 35417972 34527555 33795766
3535 33795766 33214472 32724165 32354102 32132083 32012601 32033140 32203690 32453723 32879868 33456957
3525 33456957 34149459 34955718 35973198 37215218 38617620 40288605 42142675 44277421
3517 44277421 46696538 49395780 52310604 55464466 58796578 62142410 65423184 68575232
3509 68575232 71587706 74460431 77187593 79771967 82103336 84044620 85594093 86698081
$$ packed form
3569G2821772J809568J122182N62004Q6268j77926k94374k00072l9719J77438
3560G5867141L68262M34481L85285J30523k68367q04262j315600j917924k480946
3551G0398593k964965l356135l517467l553280l401739l195851k948378k567150
3543D4893628k245840j902991j660472j393482j243150j029721q90417p31789
3535C3795766n81294m90307l70063k22019j19482K0539J70550K50033M26145N77089
3525C3456957O92502Q06259J017480J242020J402402J670985J854070K134746
3517D4277421K419117K699242K914824L153862L332112L345832L280774L152048
3509F8575232L012474K872725K727162K584374K331369J941284J549473J103988
$$ plain form
3501 86698081 87401556 87713610 87646710 87254725 86583967 85621901 84471509 83089524 81526725
3492 81526725 79847829 77977940 75923330 73790680 71596018 69370426 67203055 65125312
3484 65125312 63174110 61354541 59778922 58472280 57412725 56693997 56376427 56474745 56983454
3475 56983454 58033739 59474726 61163391 62807899 64270196 65761650 67700970 70310287
3467 70310287 73555807 77049335 80497882 83815542 87184379 90787417 94703130 98854327
3459 98854327 103005668 107068335 110989905 114742837 118311582 121762911 125240466 128939106
3451 128939106 133040198 137718366 143139634 149381439 156447386 164309023 172610668 180734441
3443 180734441 188073193 194135087 198856649 202217724 204098456 204238326 202389757 198769984
$$ packed form
3501H6698081P03475L12054o6900l91985o70758r62066j150392j381985j562799
3492H1526725j678896j869889k054610k132650k194662k225592k167371k077743
3484F5125312j951202j819569j575619j306642j059555p18728l17570R8318N08709
3475E6983454J050285J440987J688665J644508J462297J491454J939320K609317
3467G0310287L245520L493528L448547L317660L368837L603038L915713M151197
3459I8854327M151341M062667L921570L752932L568745L451329L477555L698640
3451A28939106M101092M678168N421268O241805P065947P861637Q301645Q123773
3443A80734441P338752O061894M721562L361075J880732J39870j848569l619773
$$ plain form
3435 198769984 193744933 188151959 182775108 177990285 173994083 170763183 168151854 166032128
3427 166032128 164108109 162190337 160009521 157369923 153995135 149768221 144635524 138762684
3419 138762684 132350428 125627060 118926178 112433157 106312057 100693419 95576308 91040839
3411 91040839 86891349 83030938 79624207 76755641 74357482 72475341 71027811 69919774
3403 69919774 69279010 69049118 69191574 69738152 70734602 72227696 74273996 76900246 80121995
3394 80121995 83900494 88139308 92552907 96940031 101123939 105022102 108678954 112182831
3386 112182831 115402848 118232891 120516304 122203135 123232885 123663313 123433448 122481080
3378 122481080 120858907 118845604 116839574 114963533 113323761 111870686 110472295 109013760
$$ packed form
3435A98769984n025051n592974n376851m784823l996202l230900k611329k119726
3427A66032128j924019j917772k180816k639598l374788m226914n132697n872840
3419A38762684o412256o723368o700882o493021o121100n618638n117111m535469
3411I1040839m149490l860411l406731k868566k398159j882141j447530j108037
3403F9919774o40764k29892J42456N46578R96450J493094K046300K626250L221749
3394H0121995L778499M238814M413599M387124M183908L898163L656852L503877
3386A12182831L220017K830043K283413J686831J029750M30428k29865r52368
3378A22481080j622173k013303k006030j876041j639772j453075j398391j458535
$$ plain form
3370 109013760 107467497 105760536 103771096 101398810 98629470 95479425 91908101 87979240
3362 87979240 83767020 79386362 74959781 70698628 66599443 62760190 59232648 55983899
3354 55983899 53080628 50526691 48338504 46451932 44885417 43639511 42520910 41405833
3346 41405833 40206914 38987074 37856224 36804745 35914242 35159566 34567758 34100471 33800799
3337 33800799 33681540 33745817 34030174 34492040 35134140 35833231 36466645 36881801 37052331 36876213
3327 36876213 36433293 35931392 35460361 35120386 35008127 35013138 35123189 35334510 35572283 35870736
3317 35870736 36158933 36347401 36422428 36380169 36181733 35939009 35696963 35514076 35469833 35579409
3307 35579409 35850252 36329909 37026234 37856409 38726795 39520532 40189623 40701110 41126216
$$ packed form
3370A09013760j546263j706961j989440k372286k769340l150045l571324l928861
3362H7979240m212220m380658m426581m261153m099185l839253l527542l248749
3354E5983899k903271k553937k188187j886572j566515j245906j118601j115077
3346D1405833j198919j219840j130850j051479q90503p54676n91808m67287k99672
3337C3800799j19259O4277K84357M61866O42100O99091O33414M15156J70530j76118
3327C6876213m42920n01901m71031l39975j12259N011J10051K11321K37773K98453
3317C5870736K88197J88468P5027m2259j98436k42724k42046j82887m4243J09576
3307C5579409K70843M79657O96325Q30175Q70386P93737O69091N11487M25106
$$ plain form
3298 41126216 41643279 42377871 43520610 45035961 46824063 48838903 51089058 53436084
3290 53436084 55923452 58566785 61318818 64154604 66947752 69619431 72120132 74500694
3282 74500694 76890481 79259595 81679401 84229925 86692935 88959166 90940280 92596017
3274 92596017 93995765 95198449 96381254 97420188 98151436 98429150 97996223 96839747 95104004
3265 95104004 92910472 90292371 87163441 83630908 79684209 75346148 70801571 66187836
3257 66187836 61615181 57220130 53049582 49155833 45522419 42180916 39201785 36570088
3249 36570088 34245687 32189223 30352987 28660524 27210562 25937762 24740858 23623277
3241 23623277 22647512 21734041 20896476 20146840 19439950 18811697 18248303 17756897 17299977
$$ packed form
3298D1126216N17063P34592J142739J515351J788102K014840K250155K347026
3290E3436084K487368K643333K752033K835786K793148K671679K500701K380562
3282G4500694K389787K369114K419806K550524K463010K266231J981114J655737
3274I2596017J399748J202684J182805J038934P31248K77714m32927j156476j735743
3265I5104004k193532k618101l128930l532533l946699m338061m544577m613735
3257F6187836m572655m395051m170548l893749l633414l341503k979131k631697
3249C6570088k324401k056464j836236j692463j449962j272800j196904j117581
3241B3623277r75765r13471q37565p49636p06890o28253n63394m91406m56920
$$ plain form
3232 17299977 16891560 16582869 16317939 16081843 15822890 15614254 15439245 15269382 15118811
3223 15118811 14990524 14835097 14654162 14457817 14248769 14067252 13869058 13640866 13466158
3214 13466158 13299875 13118453 12964747 12786438 12643958 12509647 12330987 12192459 11996758
3205 11996758 11759262 11487475 11236172 10984265 10717968 10420024 10109554 9815546 9542541
3196 9542541 9285904 9023309 8819150 8651463 8488616 8325646 8160386 7989356 7860163 7757210
3186 7757210 7653303 7579684 7547336 7467234 7380465 7263340 7159067 7103530 7040102 6983030 6925661
3175 6925661 6882654 6816375 6711960 6623505 6574236 6585937 6531981 6485192 6494648 6517343 6486949
3164 6486949 6455885 6414634 6389956 6409289 6427528 6448407 6491066 6543638 6528636 6538024 6570287 6638705
$$ packed form
3232A7299977m08417l08691k64930k36096k58953k08636j75009j69863j50571
3223A5118811j28287j55427j80935j96345k09048j81517j98194k28192j74708
3214A3466158j66283j81422j53706j78309j42480j34311j78660j38528j95701
3205A1996758k37496k71787k51303k51907k66297k97944l10470k94008k73005
3196I542541k56637k62595k04159j67687j62847j62970j65260j71030j29193j02953
3186G757210j03907p3619l2348q0102q6769j17125j04273n5537o3428n7072n7369
3175F925661m3007o6279j04415q8455m9269J1701n3956m6789R456K2695l0394
3164F486949l1064m1251k4678J9333J8239K0879M2659N2572j5002R388L2263O8418
$$ plain form
3152 6638705 6713512 6730660 6758558 6763354 6760593 6748826 6738919 6712008 6655646 6602601 6526447 6464793
3140 6464793 6465036 6440299 6412678 6413907 6481623 6550366 6640925 6729206 6766873 6825532 6820031 6862424
3128 6862424 6920752 7025913 7065495 7085537 7116345 7203597 7306086 7390249 7484076 7603588 7744186
3117 7744186 7901696 7978318 8097097 8218345 8363553 8515879 8637977 8795535 8969617 9164938
3107 9164938 9399105 9610117 9807455 10024223 10240464 10501528 10776573 11111242 11460006 11813593
3097 11813593 12137664 12468573 12817862 13186327 13527847 13899994 14309609 14769588 15274756
3088 15274756 15854617 16419232 17020078 17666948 18359948 19164406 19992326 20805139 21608797
3079 21608797 22477728 23410162 24327836 25247756 26227494 27313972 28507315 29822256 31246644
$$ packed form
3152F638705P4807J7148K7898M796k761j1767r907k6911n6362n3045p6154o1654
3140F464793K43k4737k7621J229O7716O8743R0559Q8281L7667N8659n501M2393
3128F862424N8328J05161L9582K0042L0808Q7252J02489Q4163R3827J19512J40598
3117G744186J57510P6622J18779J21248J45208J52326J22098J57558J74082J95321
3107I164938K34167K11012J97338K16768K16241K61064K75045L34669L48764L53587
3097A1813593L24071L30909L49289L68465L41520L72147M09615M59979N05168
3088A5274756N79861N64615O00846O46870O93000Q04458Q27920Q12813Q03658
3079B1608797Q68931R32434R17674R19920R79738J086478J193343J314941J424388
$$ plain form
3070 31246644 32811545 34530272 36470143 38660804 41098237 43841521 46879568 50208677
3062 50208677 53927407 58042567 62666628 67887716 73740012 80301657 87692173 95936533
3054 95936533 105151694 115363339 126791553 139706168 154412227 171377929 191172196
3047 191172196 214299872 241301440 272348595 306455909 340481234 370048387 392557178
3040 392557178 409578678 426611403 447322173 467823026 477555695 466892226 434177302
3033 434177302 387782500 339452658 296489456 261049880 232162400 208322636 188505463
3026 188505463 171916767 157637215 144950244 133560574 123417977 114471992 106563806
3019 106563806 99421591 92855168 86875969 81518289 76691726 72290342 68268300 64627595
$$ packed form
3070C1246644J564901J718727J939871K190661K437433K743284L038047L329109
3062E0208677L718730M115160M624061N221088N852296O561645P390516Q244360
3054I5936533R215161J0211645J1428214J2914615J4706059J6965702J9794267
3047A91172196K3127676K7001568L1047155L4107314L4025325K9567153K2508791
3040C92557178J7021500J7032725K0710770K0500853R732669j0663469l2714924
3033D34177302m6394802m8329842m2963202l5439576k8887480k3839764j9817173
3026A88505463j6588696j4279552j2686971j1389670j0142597q945985p908186
3019A06563806p142215o566423n979199n357680m826563m401384m022042l640705
$$ plain form
3011 64627595 61306356 58233925 55347195 52652226 50141876 47790515 45612815 43598903
3003 43598903 41668110 39769419 37973839 36193901 34616260 33122773 31708357 30372532
2995 30372532 29169413 28015784 27011889 26081531 25278197 24523304 23840841 23209845 22549922
2986 22549922 21934449 21316899 20692943 20089607 19522073 18987074 18469430 18015239 17601707
2977 17601707 17193263 16801740 16420745 16048990 15688307 15314472 14920860 14595516 14260846
2968 14260846 13930968 13608095 13273551 12928136 12654579 12374552 12072789 11775288 11554704
2959 11554704 11322001 11101460 10866425 10673279 10511942 10325764 10139845 9998949 9883910
2950 9883910 9782240 9604188 9418518 9292906 9175036 9083963 8976674 8867222 8783058 8703605
$$ packed form
3011F4627595l321239l072431k886730k694969k510350k351361k177700k013912
3003D3598903j930793j898691j795580j779938j577641j493487j414416j335825
2995C0372532j203119j153629j003895r30358q03334p54893o82463o30996o59923
2986B2549922o15473o17550o23956o03336n67534n34999n17644m54191m13532
2977A7601707m08444l91523l80995l71755l60683l73835l93612l25344l34670
2968A4260846l29878l22873l34544l45415k73557k80027l01763k97501k20584
2959A1554704k32703k20541k35035j93146j61337j86178j85919j40896j15039
2950I883910j01670j78052j85670j25612j17870r1073j07289j09452q4164p9453
$$ plain form
2940 8703605 8620112 8539995 8410521 8336410 8230990 8086739 8025312 7913949 7743809 7584262
2930 7584262 7446499 7322432 7224641 7101499 6996541 6913699 6841938 6748913 6696784 6664770 6625153
2919 6625153 6625001 6591587 6528734 6434983 6347425 6233152 6112534 6033660 5975541 5869055 5754949
2908 5754949 5667596 5555058 5464643 5389105 5272338 5209304 5092524 5000802 4934637 4816552 4706701
2897 4706701 4564210 4448368 4311077 4236101 4161789 4093597 3988919 3933757 3812735 3712064
2887 3712064 3674228 3634413 3602939 3490956 3453422 3427871 3325737 3226111 3171589 3127474 3089187
2876 3089187 3023433 2960525 2866830 2796849 2734023 2677968 2619104 2563577 2514160 2478195 2447772
2865 2447772 2412512 2358208 2315539 2282273 2229228 2147245 2119922 2074756 2008342 1970727 1951150
$$ packed form
2940H703605q3493q0117j29474p4111j05420j44251o1427j11363j70140j59547
2930G584262j37763j24067r7791j23142j04958q2842p1761r3025n2129l2014l9617
2919F625153j52l3414o2853r3751q7558j14273j20618p8874n8119j06486j14106
2908E754949q7353j12538r0415p5538j16767o3034j16780r1722o6165j18085j09851
2897D706701j42491j15842j37291p4976p4312o8192j04678n5162j21022j00671
2887C712064l7836l9815l1474j11983l7534k5551j02134r9626n4522m4115l8287
2876C089187o5754o2908r3695o9981o2826n6055n8864n5527m9417l5965l0423
2865B447772l5260n4304m2669l3266n3045q1983k7323m5166o6414l7615j9577
$$ plain form
2854 1951150 1910307 1862202 1849567 1828392 1837140 1837806 1845809 1842096 1845036 1885912 1897326 1886293 1868262
2841 1868262 1824843 1803956 1821497 1813057 1796651 1788651 1779011 1779575 1759799 1736558 1687613 1701601
2829 1701601 1681390 1653311 1660216 1660632 1627390 1614797 1616088 1599390 1590460 1550979 1547523 1538284 1530130
2816 1530130 1504096 1526598 1514808 1485773 1489522 1505077 1500636 1480068 1461146 1448378 1439632 1461384
2804 1461384 1429800 1385528 1361267 1318646 1325206 1291579 1304648 1274884 1291195 1280698 1262529 1322650
2792 1322650 1351359 1381408 1381399 1378862 1365735 1372847 1400436 1398060 1376646 1382045 1414142 1453757 1430081
2779 1430081 1452209 1488469 1504455 1510238 1539877 1595334 1635853 1675001 1731139 1755586 1790631 1827656
2767 1827656 1867811 1954648 2066703 2242803 2393502 2488178 2661894 2848827 2971810 3073018
$$ packed form
2854A951150m0843m8105j2635k1175Q748O66Q003l713K940M0876J1414j1033j8031
2841A868262m3419k0887J7541q440j6406q000r640N64j9776k3241m8945J3988
2829A701601k0211k8079O905M16l3242j2593J291j6698q930l9481l456r239q154
2816A530130k6034K2502j1790k9035L749J5555m441k0568j8922j2768q746K1752
2804A461384l1584m4272k4261m2621O560l3627J3069k9764J6311j0497j8169O0121
2792A322650K8709L0049rk537j3127P112K7589k376k1414N399L2097L9615k3676
2779A430081K2128L6260J5986N783K9639N5457M0519L9148N6138K4447L5045L7025
2767A827656M0155Q6837J12055J76100J50699R4676J73716J86933J22983J01208
$$ plain form
2757 3073018 3174090 3277720 3395630 3501117 3516184 3454242 3331277 3109846 2815047 2587743
2747 2587743 2328021 2137904 2019405 1906378 1803862 1737962 1684048 1614423 1528980 1514174
2737 1514174 1463145 1397595 1354845 1279354 1250713 1254335 1270038 1215064 1195186 1175253 1137144 1124978
2725 1124978 1068190 1033219 1039345 1022318 1021036 1013845 988254 965312 948910 907452 902353 907880
2713 907880 857113 809763 829897 838811 787527 793979 805274 786574 764852 739785 734949 773331
2701 773331 755930 747666 744222 759579 755150 767443 768471 721390 710482 730976 714630 655501
2689 655501 662648 672409 670747 653935 655403 662714 648699 612822 592982 620477 644263 622224 585215
2676 585215 583213 591046 600384 596539 581339 594179 584438 569812 544738 548902 568974 585735 598331
$$ packed form
2757C073018J01072J03630J17910J05487J5067o1942j22965k21431k94799k27304
2747B587743k59722j90117j18499j13027j02516o5900n3914o9625q5443j4806
2737A514174n1029o5550m2750p5491k8641L622J5703n4974j9878j9933l8109j2166
2725A124978n6788l4971O126j7027j282p191k5591k2942j6402m1458n099N527
2713I07880n0767m7350K0134Q914n1284O452J1295j8700k1722k5067m836L8382
2701G73331j7401q264l444J5357m429J2293J028m7081j0908K0494j6346n9129
2689F55501P147R761j662j6812J468P311j4015l5877j9840K7495K3786k2039l7009
2676E85215k002P833R338l845j5200J2840r741j4626k5074M164K0072J6761J2596
$$ plain form
2663 598331 610647 593688 576251 580836 580676 584573 577188 599935 630989 633790 602421 586684 614393
2650 614393 591464 573155 541251 526937 505676 504137 528795 535120 510574 477748 490176 487470
2638 487470 503938 498674 483953 509538 485466 488894 443082 412827 421065 444351 465962 430970
2626 430970 401974 391665 418787 406394 371509 349052 358594 374179 386920 369230 357067 363117
2614 363117 362125 372955 357388 355423 354715 349973 387537 361748 365996 343197 339842 374970 387741
2601 387741 348194 342305 323304 345057 366900 377941 373417 344302 374252 355292 376936 332329
2589 332329 335275 311043 310067 321427 292163 298421 311448 287662 261325 272383 272849 300223 280118
2576 280118 293471 277403 284169 287083 294327 312898 293812 281585 282589 288912 271708 238951 241193
$$ packed form
2663E98331J2316j6959j7437M585j60L897p385K2747L1054K801l1369j5737K7709
2650F14393k2929j8309l1904j4314k1261j539K4658O325k4546l2826J2428k706
2638D87470J6468n264j4721K5585k4072L428m5812l0255Q238K3286K1611l4992
2626D30970k8996j0309K7122j2393l4885k2457R542J5585J2741j7690j2163O050
2614C63117r92J0830j5567j965p08m742L7564k5789M248k2799l355L5128J2771
2601C87741l9547n889j9001K1753K1843J1041m524k9115K9950j8960K1644m4607
2589C32329K946k4232r76J1360k9264O258J3027k3786k6337J1058M66K7374k0105
2576B80118J3353j6068O766K914P244J8571j9086j2227J004O323j7204l2757K242
$$ plain form
2563 241193 307786 307872 293623 286487 285890 275863 255622 266359 229517 269241 277362 296991 298937
2550 298937 293436 327256 325083 282676 242711 250283 252759 258855 266818 274554 302115 319175 270567
2537 270567 284243 268549 220984 238942 268705 231309 233969 228713 246585 285103 278451 222606
2525 222606 195843 217508 240606 236107 208827 227373 258781 276243 261153 250917 205429 198763
2513 198763 230478 280122 277397 251060 244052 234749 254958 239971 220148 269975 272198 239738
2501 239738 238215 216523 207210 190976 202036 200783 199842 212782 241053 245999 194087 179716 201173
2488 201173 208805 198790 211942 188855 173790 191375 158094 162861 151658 129404 156048 146459
2476 146459 152819 179617 174335 130886 132090 165038 169175 154391 106491 85280 91840 144320 148053
$$ packed form
2563B41193O6593Q6j4249p136n97j0027k0241J0737l6842L9724Q121J9629J946
2550B98937n501L3820k173m2407l9965P572K476O096P963P736K7561J7060m8608
2537B70567J3676j5694m7565J7958K9763l7396K660n256J7872L8518o652n5845
2525B22606k6763K1665K3098m499k7280J8546L1408J7462j5090j0236m5488o666
2513A98763L1715M9644k725k6337p008r303K0209j4987j9823M9827K223l2460
2501B39738j523k1692r313j6234J1060j253r41J2940K8271M946n1912j4371K1457
2488B01173P632j0015J3152k3087j5065J7585l3281M767j1203k2254K6644r589
2476A46459O360K6798n282m3449J204L2948M137j4784m7900k1211O560N2480L733
$$ plain form
2463 148053 160343 181739 177889 145529 125601 130924 168940 173751 180443 151279 157003 145724 123400
2450 123400 136670 124091 151265 166814 151978 158294 168380 181637 185571 175598 184813 169856
2438 169856 150232 164668 187656 145372 154932 189504 174281 136483 149704 199013 200012 182911
2426 182911 168186 174414 168196 126700 148898 149148 156160 160456 164269 165765 193175 173150 153134
2413 153134 155639 133257 108015 137695 144635 118132 141052 159825 158218 177879 178386 172602 162014
2400 162014 191362 168828 159151 145095 128773 136929 168079 177888 156703 162711 191941 177923
2388 177923 159462 152282 154230 153255 137096 105834 124988 141246 91456 131633 148178 142767 154518
2375 154518 165127 155143 165608 172072 167059 140931 145323 138645 149234 126691 134224 158306 169727
$$ packed form
2463A48053J2290K1396l850l2360j9928N323L8016M811O692k9164N724j1279k2324
2450A23400J3270j2579K7174J5549j4836O316J0086J3257L934r973R215j4957
2438A69856j9624J4436K2988m2284R560L4572j5223l7798J3221M9309R99j7101
2426A82911j4725O228o218m1496K2198K50P012M296L813J496K7410k0025k0016
2413A53134K505k2382k5242K9680O940k6503K2920J8773j607J9661N07n784j0588
2400A62014K9348k2534r677j4056j6322Q156L1150R809k1185O008K9230j4018
2388A77923j8461p180J948r75j6159l1262J9154J6258m9790M0177J6545n411J1751
2375A54518J0609r984J0465O464n013k6128M392o678J0589k2543P533K4082J1421
$$ plain form
2362 169727 147004 138792 155458 157503 120245 74573 94582 95185 115259 122511 115741 95339 82446
2349 82446 109324 104739 98726 96167 148065 156445 127606 107658 109556 114537 112170 120748 120945 111378
2335 111378 126808 148488 178514 161251 175827 187708 169416 176583 133945 119020 168162 199362
2323 199362 184287 177919 181514 163700 155897 170257 160532 211676 205508 211598 244921 247727 222311
2310 222311 203773 217826 226709 251990 286650 278254 262465 308703 355903 377703 366353 388308
2298 388308 438858 468441 487498 549887 578996 619695 689575 698931 704143 793596 877611 971784
2286 971784 1043314 1163583 1298048 1480036 1703274 1990029 2338188 2779343 3296980 3641655
2276 3641655 3696898 3330148 2813722 2335104 1960914 1700294 1503571 1345195 1198855 1055787
$$ packed form
2362A69727k2723q212J6666K045l7258m5672K0009O03K0074P252o770k0402j2893
2349H2446K6878m585o013k559N1898Q380k8839j9948J898M981k367Q578J97r567
2335A11378J5430K1680L0026j7263J4576J1881j8292P167m2638j4925M9142L1200
2323A99362j5075o368L595j7814p803J4360r725N1144o168O090L3323K806k5416
2310B22311j8538J4053Q883K5281L4660q396j5789M6238M7200K1800j1350K1955
2298C88308N0550K9583J9057O2389K9109M0699O9880R356N212Q9453Q4015R4173
2286I71784P1530J20269J34465J81988K23238K86755L48159M41155N17637L44675
2276C641655N5243l66750n16426m78618l74190k60620j96723j58376j46340j43068
$$ plain form
2266 1055787 990999 938307 875001 841619 788319 753761 701483 624927 579046 566470 548546
2255 548546 534282 483117 426847 429666 391530 350054 323041 337680 327898 324551 296266 327482
2243 327482 305769 317108 349038 302460 249714 238664 223423 230008 219684 200799 199188 200724
2231 200724 185108 189415 191788 186277 196713 163701 159164 143110 143874 148774 167228 143602 123896
2218 123896 141601 166463 146499 162433 152549 148987 178580 165080 126783 125369 159524 137645
2206 137645 130558 142229 141881 137805 72155 98448 131857 114341 118454 131395 136960 125424 111884
2193 111884 123387 96387 83941 84294 102522 109675 91272 115913 106457 108692 105652 97151 83753
2180 83753 69982 102927 124822 115713 109174 142196 117436 125027 110232 96494 88165 71427 105834
$$ packed form
2266A055787o4788n2692o3306l3382n3300l4558n2278p6556m5881j2576j7924
2255E48546j4264n1165n6270K819l8136m1476k7013J4639r782l347k8285L1216
2243C27482k1713J1339L1930m6578n2746j1050j5241O585j0324j8885j611J536
2231B00724j5616M307K373n511J0436l3012m537j6054P64M900J8454k3626j9706
2218A23896J7705K4862j9964J5934r884l562K9593j3500l8297j414L4155k1879
2206A37645p087J1671l48m076o5650K6293L3409j7516M113J2941N565j1536j3540
2193A11884J1503k7000j2446L53J8228P153j8403K4641r456K235l040q501j3398
2180H3753j3771L2945K1895r109o539L3022k4760P591j4795j3738q329j6738L4407
$$ plain form
2167 105834 97343 86514 74859 61646 65233 71479 76168 106915 91526 84866 66372 73087 87196
2154 87196 79406 71854 104204 95809 66420 57729 95526 109020 73795 62121 39486 40616 57570
2141 57570 70672 74093 87188 86654 69286 84238 52240 31198 58846 114581 89624 59690
2129 59690 46550 55636 82131 79299 72183 74312 87470 69417 56527 25383 33388 72925 68656
2116 68656 42875 27021 39546 61896 57521 49938 8951 24836 35223 23235 21483 45795
2104 45795 32404 45024 71417 60109 60287 56614 3208 -1315 15726 43368 57668 39558 15106
2091 15106 42594 47023 31566 27205 29604 53374 50094 51588 61734 50647 33895 27633 16096
2078 16096 37576 78520 62243 47229 53656 63730 34795 38670 48168 53498 85112 71780 68999
$$ packed form
2167A05834q491j0829j1655j3213L587O246M689L0747j5389o660j8494O715J4109
2154H7196p790p552L2350q395k9389q691L7797J3494l5225j1674k2635J130J6954
2141E7570J3102L421J3095n34j7368J4952l1998k1042K7648N5735k4957k9934
2129E9690j3140R086K6495k832p116K129J3158j8053j2890l1144Q005L9537m269
2116F8656k5781j5854J2525K2350m375p583m0987J5885J0387j1988j752K4312
2104D5795j3391J2620K6393j1308J78l673n3406m523J7041K7642J4300j8110k4452
2091A5106K7488M429j5457m361K399K3770l280J494J0146j1087j6752o262j1537
2078A6096K1480M0944j6277j5014O427J0074k8935L875R498N330L1614j3332k781
$$ plain form
2065 68999 66066 50010 25642 36631 64926 62866 58504 55363 49771 40770 17444 -2442 -17349
2052 -17349 6440 21628 37554 17297 47888 40685 28001 35762 72549 54031 41882 70000
2040 70000 51243 24154 42046 18474 -5854 -4827 -3021 29353 22577 9464 28214 51079
2028 51079 27673 26354 60740 67181 27061 26096 46654 5441 6659 17507 38907 45465 16346
2015 16346 -11925 5270 45407 40837 41144 48003 60367 38984 38490 74655 45586 7884 21768
2002 21768 71414 70088 68119 46538 15727 25989 7312 -3102 9323 26105 34382 25823 32363
1989 32363 10163 49583 88438 77342 34503 28944 37923 37769 70523 42929 31433 8255 -1356
1976 -1356 -24105 21039 45742 46720 39496 33727 17668 -11306 -36211 -49998 -17331 13419 -29064
$$ packed form
2065F8999k933j6056k4368J0989K8295k060m362l141n592r001k3326j9886j4907
2052a7349K3789J5188J5926k0257L0591p203j2684P761L6787j8518j2149K8118
2040G0000j8757k7089J7892k3572k4328J027J806L2374o776j3113J8750K2865
2028E1079k3406j319L4386O441m0120r65K0558m1213J218J0848K1400O558k9119
2015A6346k8271J7195M0137m570L07O859J2364k1383m94L6165k9069l7702J3884
2002B1768M9646j326j969k1581l0811J0262j8677j0414J2425J6782Q277q559O540
1989C2363k2200L9420L8855j1096m2839n559Q979j54L2754k7594j1496k3178r611
1976a356k2749M5144K4703R78p224n769j6059k8974k4905j3787L2667L0750m2483
$$ plain form
1963 -29064 10165 42660 29631 11371 45554 37308 2339 5843 38041 54986 36702 30845
1951 30845 84922 56203 47070 38130 87 14320 22429 3407 20303 83140 57683 38194
1939 38194 23648 29998 14660 25803 8614 2784 -9568 6367 53107 84476 57699 57471 36525
1926 36525 7000 14255 6112 3293 7248 6108 6163 -7295 -14759 9189 23240 45606 46210 37013
1912 37013 24058 27271 46320 90662 77434 55023 24125 11544 30427 31161 21494 36852 31348
1899 31348 2629 1879 -29358 1865 12330 50768 35512 39170 40771 21084 5570 9992 -18507
1886 -18507 -7986 19584 16115 47814 19851 4903 28571 5482 11962 31520 43184 24397
1874 24397 34313 41833 -3596 9274 47818 41335 38419 5847 -15164 6270 5892 34906 18573
$$ packed form
1963b9064L9229L2495j3029j8260L4183q246l4969L504L2198J6945j8284n857
1951C0845N4077k8719r133q940l8043J4233Q109j9022J6896O2837k5457j9489
1939C8194j4546O350j5338J1143j7189n830j2352J5935M6740L1369k6777k28k0946
1926C6525k9525P255q143k819L955j140N5j3458p464K3948J4051K2366O04r197
1912C7013j2955L213J9049M4342j3228k2411l0898j2581J8883P34r667J5358n504
1899C1348k8719p50l1237L1223J0465L8438j5256L658J601j9687j5514M422k8499
1886a8507J0521K7570l469L1699k7963j4948K3668k3089O480J9558J1664j8787
1874B4397R916P520m5429J2870L8544o483k916l2572k1011K1434l78K9014j6333
$$ plain form
1861 18573 16983 -14784 -5954 16430 -20735 -27635 -7772 21350 54920 48171 22966 -17259 2521
1848 2521 25394 15974 13521 10952 3249 24044 55321 88911 49837 25066 6622 48581 61121
1835 61121 65488 53322 37840 38886 48013 87687 77824 39911 47629 45558 43860 60445 15359
1822 15359 30294 32805 34495 31213 36170 47529 16861 7586 11854 -2058 -1180 11628 12920 1603
1808 1603 12600 17867 18553 24546 3617 -12319 -27724 11704 28124 455 14358 6618 31484
1795 31484 -3635 -15633 14041 18275 -18270 -6758 -15571 7283 22449 1191 -2785 1163 -5987
1782 -5987 -23445 14392 13912 2207 4966 34614 12598 21077 36815 53000 52558 29730 20406
1769 20406 57146 31581 -17119 -10773 -1740 6007 23244 17364 -10033 3467 3301 9564 25
$$ packed form
1861A8573j590l1767Q830K2384l7165o900J9863K9122L3570o749k5205m0225J9780
1848B521K2873r420k453k569p703K0795L1277L3590l9074k4771j8444M1959J2540
1835F1121M367j2166j5482J046R127L9674r863l7913P718k071j698J6585m5086
1822A5359J4935K511J690l282M957J1359l0668r275M268j3912Q78J2808J292j1317
1808A603J0997N267O86N993k0929j5936j5405L9428J6420k7669J3903p740K4866
1795C1484l5119j1998K9674M234l6545J1512q813K2854J5166k1258l976L948p150
1782e987j7458L7837m80j1705K759K9648k2016Q479J5738J6185m42k2828r324
1769B0406L6740k5565m8700O346R033P747J7237n880k7397J3500j66O263r539
$$ plain form
1756 25 2420 -13682 -9076 -3570 -1632 -1487 25201 40153 28054 -18124 -1956 21454 16878 13473
1742 13473 3901 -4642 -6568 11141 17186 29673 25650 -421 -1651 8499 12662 23861 5970
1729 5970 -4851 29120 27419 26903 21870 -22977 2951 9295 46690 35006 9387 12599 27752
1716 27752 24999 -13572 16863 58855 55523 21254 31611 72378 37103 -5724 -34377 -29230
1704 -29230 -17783 6400 26717 -4681 -21431 -40959 -13717 -15508 18601 30120 39658 45364
1692 45364 -8260 -19241 -4905 12381 12744 -11330 -19991 25650 -669 -30654 -25237 -13427 -33284
1679 -33284 -34176 -26810 3229 -2062 -23550 -7841 -37701 -10584 9991 -2933 -14057 -4247 -5185
1666 -5185 9285 2290 21478 22191 12716 10931 -968 -17759 -11278 5663 5713 5786 40551 90182
$$ packed form
1756B5K395j6102M606N506J938J45K6688J4952j2099m6178J6168K3410m576l405
1742A3473r572q543j926J7709O045J2487m023k6071j230J0150M163J1199j7891
1729E970j0821L3971j701n16n033m4847K5928O344L7395j1684k5619L212J5153
1716B7752k753l8571L0435M1992l332l4269J0357M0767l5275m2827k8653N147
1704b9230J1447K4183K0317l1398j6750j9528K7242j791L4109J1519R538N706
1692D5364n3624j0981J4336J7286L63k4074q661M5641k6319k9985N417J1810j9857
1679c3284q92P366L0039n291k1488J5709k9860K7117K0575j2924j1124R810r38
1666e185J4470o995J9188P13r475j785j1899j6791O481J6941N0P3L4765M9631
$$ plain form
1652 90182 55364 31463 32487 31458 2996 3245 18212 23296 12934 -18867 -5484 16700 9219
1639 9219 15918 24104 36169 -2214 -30383 -20067 21672 21201 11267 7455 18500 16112 6007
1626 6007 -11297 -20900 -24634 10961 -1674 3977 6306 -13440 -28828 12253 19268 15437 27095
1613 27095 -22732 -18564 14861 15938 24859 24655 34394 25316 -328 -7528 -2216 3792 -10782 -30990
1599 -30990 -44896 -5934 -4950 21593 12270 -19869 -3286 51155 54413 40526 30647 32158 17008
1586 17008 7765 5979 18104 -2662 14496 7407 15670 2977 14972 7965 -19028 -17562 -18274
1573 -18274 -11435 -11382 -22875 -2060 13908 -21897 -40556 -41104 -29644 -35442 -5880 6536 -8464
1560 -8464 31295 39506 18764 6661 5740 52418 17651 10570 18185 -7739 -12443 -14837 -9700 -8162
$$ packed form
1652I0182l4818k3901J024j029k8462K49J4967N084j0362l1801J3383K2184p481
1639I219O699Q186J2065l8383k8169J0316M1739m71r934l812J1045k388j0105
1626F007j7304r603l734L5595j2635N651K329j9746j5388M1081P015l831J1658
1613B7095m9827M168L3425J077Q921k04R739r078k5644p200N312O008j4574k0208
1599c0990j3906L8962R84K6543r323l2139J6583N4441L258j3887r879J511j5150
1586A7008r243j786J2125k0766J7158p089Q263j2693J1995p007k6993J466p12
1573a8274O839N3j1493K0815J5968l5805j8659n48J1460n798K9562J2416j5000
1560h464L9759Q211k0742j2103r21M6678l4767p081P615k5924m704k394N137J538
$$ plain form
1546 -8162 24506 8323 17141 14839 23454 14262 -8871 3652 11939 -23871 -39913 -15845 -24951
1533 -24951 8826 13004 2822 26834 5669 -5638 11780 8557 -16637 -2624 5147 -3911 -37967
1520 -37967 -26984 -1757 -7342 18478 25060 8971 17446 52055 24735 -4985 -6734 -1152 -3736
1507 -3736 -5591 -27669 -32826 8000 3654 1050 12991 -30934 -1107 19868 -9256 -8679 -32067
1494 -32067 -40762 2628 46589 45308 26215 25071 23675 24393 17287 -662 -12772 -15860 -39700
1481 -39700 -23418 -5103 -5261 -18321 7966 8168 19191 10005 -2748 -14926 -17035 3100 19122
1468 19122 14143 10387 1232 -8691 3107 34733 6232 -50876 -13542 4829 11777 31917 9870
1455 9870 3397 -14772 -10616 139 1185 7307 336 -23077 -12746 -17397 -19660 -1673 -1750 -2420
$$ packed form
1546h162L2668j6183Q818k302Q615r192k3133J2523Q287l5810j6042K4068r106
1533b4951L3777M178j0182K4012k1165j1307J7418l223k5194J4013P771r058l4056
1520c7967J0983K5227n585K5820O582j6089Q475L4609k7320k9720j749N582k584
1507c736j855k2078n157M0826m346k604J1941m3925K9827K0975k9124N77k3388
1494c2067q695M3390M3961j281j9093j144j396P18p106j7949j2110l088k3840
1481c9700J6282J8315j58j3060K6287K02J1023r186j2753j2178k109K0135J6022
1468A9122m979l756r155r923J1798L1626k8501n7108L7334J8371O948K0140k2047
1455I870o473j8169M156J0755J046O122o971k3413J0331m651k263J7987p7o70
$$ plain form
1441 -2420 13999 -14038 -16953 -7353 -3960 3242 -3412 -23434 -13551 11736 -2473 10030 11209
1428 11209 30325 29016 55934 77615 63633 44487 27273 27387 24389 2689 6156 -71 -21375
1415 -21375 5422 39120 9588 -17454 -22076 -16556 -20895 -22088 -29348 -15167 -16599 -18366 -14772
1402 -14772 2666 -29445 -37395 -14220 -10876 -10994 11953 15473 3972 1732 -22698 -28936 -26295
1389 -26295 -1432 -8272 -8563 -9660 -17713 -29191 3269 -19324 -43941 -11358 -10588 -20300 -14306 11446
1375 11446 14931 29028 18366 -3952 3133 29976 38368 26688 -7234 19127 35497 20000
1363 20000 -5245 14769 30987 23239 -6065 18767 13300 -10364 44174 35529 20206 -450
1351 -450 10714 -9510 -21356 -20908 11876 17454 18179 9962 -33553 -14886 -15150 -6148 8746 39489
$$ packed form
1441b420J6419k8037k915R600L393P202o654k0022R883K5287j4209J2503J179
1428A1209J9116j309K6918K1681j3982j9146j7214J14k998k1700L467o227k1304
1415b1375K6797L3698k9532k7042m622N520m339j193p260J4181j432j767L594
1402a4772J7438l2111p950K3175L344j18K2947L520j1501k240k4430o238K641
1389b6295K4863o840k91j097q053j1478L2460k2593k4617L2583P70r712N994K5752
1375A1446L485J4097j0662k2318P085K6843Q392j1680l3922K6361J6370j5497
1363B0000k5245K0014J6218p748k9304K4832n467k3664N4538q645j5323k0656
1351d50J1164k0224j1846M48L2784N578P25q217m3515J8667k64R002J4894L0743
$$ plain form
1337 39489 34639 47058 24550 20816 -5095 -15980 8047 12579 -21953 -3859 554 -2063 -26806
1324 -26806 -22915 -10864 22461 17357 -8089 -35266 13222 23973 34708 39771 10963 11824 6189
1311 6189 29021 7750 27273 3188 -14588 18297 17423 -29193 -34202 -28671 17444 32276 25691
1298 25691 -39835 -47469 -32775 2279 19963 28836 -23361 -8656 5093 15013 -25813 -42442
1286 -42442 -4183 -7818 -3457 36256 -6457 4003 6618 -4156 -4661 4077 18929 11276 572
1273 572 -26968 -5201 2835 -23335 -11476 6576 25949 16208 -11110 -615 -1711 3262 25418
1260 25418 11856 20111 4957 -12567 -11693 -4256 10659 16463 40287 16345 -7654 -25430 4766
1247 4766 305 -8256 -16177 -1899 19969 12990 34881 25766 18340 19366 -5698 12544 24888
$$ packed form
1337C9489m850J2419k2508l734k5911j0885K4027M532l4532J8094M413k617k4743
1324b6806L891J2051L3325n104k5446k7177M8488J0751J0735N063k8808Q61n635
1311F189K2832k1271J9523k4085j7776L2885q74m6616n009N531M6115J4832o585
1298B5691o5526p634J4694L5054J7684Q873n2197J4705J3749R920m0826j6629
1286d2442L8259l635M361L9713m2713J0460K615j0774n05Q738J4852p653j0704
1273E72k7540K1767Q036k6170J1859J8052J9373r741k7318J0495j096M973K2156
1260B5418j3562Q255j5154j7524Q74P437J4915N804K3824k3942k3999j7776L0196
1247D766m461q561p921J4278K1868o979K1891r115p426J026k5064J8242J2344
$$ plain form
1234 24888 11604 -35848 -48081 -30148 -796 13315 3622 7934 29651 10075 8089 21034
1222 21034 -20764 -8946 -202 -10338 -14159 -4632 10874 22303 3374 19964 28461 1435 2206
1209 2206 -13703 -24635 -42955 -22074 31079 17670 8065 -6004 -22163 22634 6927 -10673
1197 -10673 -7608 -2873 -34656 -11657 -21438 -41643 -25165 -17803 5628 -6542 -26784 -697 -24938
1184 -24938 -30175 -13623 10384 25182 36907 -17525 -37716 -11391 -9818 -2286 14090 36829
1172 36829 -17716 15214 5818 7525 18412 14138 1600 -15157 7417 -27840 -6750 -2452 -31301
1159 -31301 -59981 -32139 -20030 -22812 1465 -1217 -25681 -20371 -26211 -10055 -12677 9299 32465
1146 32465 33106 14830 -16377 -33745 -10895 -1892 7865 9652 -9231 15712 23454 23907 -30229
$$ packed form
1234B4888j3284m7452j2233J7933K9352J4111r693M312K1717j9576j986J2945
1222B1034m1798J1818Q744j0136l821R527J5506J1429j8929J6590Q497k7026P71
1209B206j5909j0932j8320K0881N3153j3409r605j4069j6159M4797j5707j7600
1197a0673L065M735l1783K2999r781k0205J6478P362K3431j2170k0242K6087k4241
1184b4938n237J6552K4007J4798J1725n4432k0191K6325J573P532J6376K2739
1172C6829n4545L2930r396J707J0887m274j2538j6757K2574l5257K1090M298k8849
1159c1301k8680K7842J2109k782K4277k682k4464N310n840J6156k622K1976K3166
1146C2465O41j8276l1207j7368K2850R003R757J787j8883K4943P742M53n4136
$$ plain form
1133 -30229 -48209 6209 4840 -3071 -13285 -27435 -69954 -34432 -7426 993 29570 12582
1121 12582 -3324 -2476 -13920 -47324 -29459 -9864 -9141 -27861 8902 1802 -397 9131 28138
1108 28138 -1259 4569 22667 -5830 -10440 -21415 -25106 -1483 30311 12139 9607 39784 47361
1095 47361 28044 -2983 7714 -12080 14981 19442 2842 76541 73347 27596 24254 -22250
1083 -22250 -10949 -50921 -41855 21293 48442 36228 44211 15129 -335 -199 15346 16334 -5244
1070 -5244 9912 2371 12528 14603 5493 3851 -2085 -1151 -33050 -12408 -12281 -21584 -25198 6498
1056 6498 27125 -19979 -15190 5560 268 29889 25444 -581 -8512 2375 16673 -11283 -33821
1043 -33821 -30665 -40516 -65095 -56151 -43603 -54276 -32724 -23505 -18575 -6747 -54974 -38425 -9059
$$ packed form
1133c0229j7980N4418j369p911j0214j4150m2519L5522K7006Q419K8577j6988
1121A2582j5906Q48j1444l3404J7865J9595P23j8720L6763p100k199R528J9007
1108B8138k9397N828J8098k8497m610j0975l691K3623L1794j8172k532L0177P577
1095D7361j9317l1027J0697j9794K7061M461j6600P3699l194m5751l342m6504
1083b2250J1301l9972R066O3148K7149j2214P983k9082j5464J36J5545R88k1578
1070e244J5156p541J0157K075r110j642n936R34l1899K0642J27r303l614L1696
1056F498K0627m7104M789K0750n292K9621m445k6025p931J0887J4298k7956k2538
1043c3821L156r851k4579Q944J2548j0673K1552R219M930J1828m8227J6549K9366
$$ plain form
1030 -9059 -2244 -20750 -37917 -37837 -6880 7787 3305 -25998 -43861 -26618 -6614 -8218 -6550
1017 -6550 4235 3563 -17835 -55144 -36259 -3402 -19272 -1276 39562 30504 -7655 -15741 -20515
1004 -20515 -22168 -29201 -11255 -9525 -14327 -15335 5981 -14213 -7134 16075 12737 -37440 -37177 -28473
990 -28473 -35837 -51877 -11529 -7876 5583 -54174 -42382 5893 19225 37586 30328 1544 5542
977 5542 -457 -7865 22090 7619 -15511 3459 34606 21227 21912 7109 -13306 -37506 -25459
964 -25459 -30118 -24113 -29177 -18157 -38097 -15901 -11558 -13177 15273 22444 -6469 -2644 -641 -10993
950 -10993 -6833 3581 15895 30561 43967 33905 14843 -2610 -16672 -17800 -18793 -16755 5130
937 5130 -18932 -53964 -55018 -1216 12069 -25158 -20844 -25562 -11814 -28819 -24483 -25549 -10394
$$ packed form
1030i059O815j8506j7167Q0L0957J4667m482k9303j7863J7243K0004j604J668
1017f550J0785o72k1398l7309J8885L2857j5870J7996M0838r058l8159q086m774
1004b0515j653p033J7946J730m802j008K1316k0194P079K3209l338n0177K63Q704
990b8473p364j6040M0348L653J3459n9757J1792M8275J3332J8361p258k8784L998
977E542n999p408K9955j4471k3130J8970L1147j3379O85j4803k0415k4200J2047
964b5459m659O005n064J1020j9940K2196M343j619K8450P171k8913L825K003j0352
950a0993M160J0414J2314J4666J3406j0062j9062j7453j4062j128r93K038K1885
937E130k4062l5032j054N3802J3285l7227M314m718J3748j7005M336j066J5155
$$ plain form
924 -10394 5630 6951 1229 -4641 1947 36261 -5597 -34593 21575 9096 1725 -4193 -16717
911 -16717 -8500 17325 20782 -5149 19732 1604 -39766 -43436 -17694 -6341 -21432 -42768 -7713
898 -7713 19232 17392 33734 46470 25385 -7301 -15877 -34877 -19951 -1872 -6973 -3690 -12187
885 -12187 -25675 -10101 10927 34609 -3220 -25794 -68877 -65347 -48233 -23044 -6119 -16969
873 -16969 2536 -3538 6332 -7717 -23529 2609 -3834 -15806 9316 -3177 -15865 -27293 -13332
860 -13332 36757 17687 -20523 -1520 4164 -10995 -25469 -50167 -26710 -29132 -27292 -96 3649
847 3649 33244 7481 -15034 12506 9322 -25498 -10821 2532 -3295 -11935 -9910 -39166 -14284
834 -14284 -6222 -4742 23972 32086 31352 -2986 -25293 3664 14743 -8191 38 -17356 -4233
$$ packed form
924a0394J6024J321n722n870O588L4314m1858k8996N6168j2479p371n918j2524
911a6717Q217K5825L457k5931K4881j8128m1370l670K5742J1353j5091k1336L5055
898g713K6945j840J6342J2736k1085l2686q576j9000J4926J8079n101L283q497
885a2187j3488J5574K1028K3682l7829k2574m3083L530J7114K5189J6925j0850
873a6969J9505o074R870j4049j5812K6138o443j1972K5122j2493j2688j1428J3961
860a3332N0089j9070l8210J9003N684j5159j4474k4698K3457k422J840K7196L745
847C649K9595k5763k2515K7540l184l4820J4677J3353n827q640K025k9256K4882
834a4284Q062J480K8714Q114p34l4338k2307K8957J1079k2934Q229j7394J3123
$$ plain form
821 -4233 -11653 1657 6316 -12627 -20523 -21156 -30649 -22496 -22572 3757 -20355 -20923 5024 3595 27814
806 27814 8123 19500 -9464 -38419 -23126 -17897 9959 4468 -24567 -13108 -25184 -8601
794 -8601 -28214 -2515 13557 8649 -8766 -12897 -2325 983 -24855 -19087 -11966 -19621 24842
781 24842 19289 33880 52188 34397 -5084 -24648 13747 19368 4545 14746 -5813 568 -64759
768 -64759 -63183 -40789 -32182 -9847 -9062 -22900 -24830 -32178 -13231 13410 8078 -7397 -26103
755 -26103 -12736 8605 -7967 -875 -35372 -15145 12934 25912 10940 -11956 8488 13129
743 13129 5358 2444 10918 8287 -6845 9008 12754 -16528 -16407 -26672 22171 29658 -7465 -24038
729 -24038 -9061 -30980 -66837 -15877 13337 -1563 22796 26605 9720 25762 13984 -6372
$$ packed form
821d233p420J3310M659j8943p896o33r493Q153p6K6329k4112n68K5947j429K4219
806B7814j9691J1377k8964k8955J5293N229K7856n491k9035J1459j2076J6583
794h601j9613K5699J6072m908j7415m131J0572L308k5838N768P121p655M4463
781B4842n553J4591J8308j7791l9481j9564L8395N621j4823J0201k0559O381o5327
768f4759J576K2394Q607K2335P85j3838j930p348J8947K6641n332j5475j8706
755b6103J3367K1341j6572P092l4497K0227K8079J2978j4972k2896K0444M641
743A3129p771k914Q474k631j5132J5853L746k9282J21j0265M8843P487l7123j6573
729b4038J4977k1919l5857N0960K9214j4900K4359L809j6885J6042j1778k0356
$$ plain form
717 -6372 -10468 -12094 9098 8277 24501 5153 655 12686 28525 4737 7513 -2420 -12493 -5031
703 -5031 3720 9158 9571 4394 23710 39660 37582 41350 17495 37885 33079 33575 18972 22434
689 22434 32948 32787 -1818 3293 -17191 -34145 -11870 -16394 -11694 -19075 -1721 -2610 -9068 7327
675 7327 1701 -14358 -14798 2299 -6246 -4626 9376 21698 -6063 347 11573 -14755 -34646
662 -34646 -36964 -37913 -51509 -55312 -57285 -6347 -12528 -20051 -25836 -16244 -17341 -12240 14082 37613
648 37613 -8051 -16123 14050 12896 -704 -2757 18192 2577 28413 12469 -26326 -14047 15013
635 15013 24423 16442 40242 28588 31364 36773 20135 36030 37035 22069 4634 13354 34194
622 34194 26796 14607 -1301 -10661 7961 15150 7472 4538 -16200 -12982 -16104 -9499 -14474 23272
$$ packed form
717f372m096j626K1192q21J6224j9348m498J2031J5839k3788K776r933j0073P462
703e031Q751N438M13n177J9316J5950k078L768k3855K0390m806M96j4603L462
689B2434J0514j61l4605N111k0484j6954K2275m524M700p381J7354q89o458J6395
675G327n626j6059m40J7097q545J620J4002J2322k7761O410J1226k6328j9891
662c4646k318r49j3596l803j973N0938o181p523n785R592j097N101K6322K3531
648C7613m5664q072L0173j154j3600k053K0949j5615K5836j5944l8795J2279K9060
635A5013R410p981K3800j1654K776N409j6638J5895J005j4966j7435Q720K0840
622C4194p398j2189j5908r360J8622P189p678k934k0738L218l122O605m975L7746
$$ plain form
608 23272 -24364 -56002 -21226 -17659 7833 34252 32423 786 -19887 -5293 8044 19388
596 19388 5644 10217 11545 7268 31384 -20670 -32109 -7941 -14436 -32764 -43023 -42995 -29381
583 -29381 2239 21378 -5605 2113 -9766 -11023 -40842 -31598 -796 -29789 -28314 -30468 -10362
570 -10362 127 -10879 16294 -4616 -9892 -10537 23877 1094 8142 -1248 -24203 -57695 -55447
557 -55447 -23644 -11459 6737 244 -18743 -1430 5681 10561 30213 3090 -24310 -36062 -18492
544 -18492 -12311 586 -764 33656 33178 -19060 -21483 -26502 -42221 -25038 13536 33870 14147
531 14147 -13471 -15538 -6450 -17362 7433 -25292 -16846 6887 -1825 -11702 -33508 -37823 -29039
518 -29039 -48903 -7722 -2849 20923 17548 3454 25237 -32025 -43017 -43928 18 25196 25945
$$ packed form
608B3272m7636l1638L4776L567K5492K6419j829l1637k0673J4594J3337J1344
596A9388j3744M573J328m277K4116n2054j1439K4168o495j8328j0259K8J3614
583b9381L1620J9139k6983P718j1879j257k9819R244L0802k8993J475k154K0106
570a0362J0489j1006K7173k0910n276o45L4414k2783P048r390k2955l3492K248
557e5447L1803J2185J8196o493j8987J7313P111M880J9652k7123k7400j1752J7570
544a8492O181J2897j350L4420m78n2238k423n019j5719J7183L8574K0334j9723
531A4147k7618k067R088j0912K4795l2725Q446K3733q712r877k1806m315Q784
518b9039j9864M1181M873K3772l375j4094K1783n7262j0992r11M3946K5178P49
$$ plain form
505 25945 24793 32095 41140 23173 17983 3926 -7553 11847 -18163 3623 2216 32360 27190
492 27190 -592 -16543 -28862 -19380 7137 -9756 -2079 27702 -2688 3340 -20745 -23821 -59352
479 -59352 -29327 -2705 9429 861 -21495 -18061 5412 -2760 17939 4657 -18002 -5674 -21685
466 -21685 -31086 7069 29638 38778 58940 13804 -11510 -24131 -22647 -11844 6498 13982 3281
453 3281 -15040 -16368 -26787 -19995 -20300 -28062 -8119 -16921 -15343 -20479 -13651 -28266 -22841 -19203
439 -19203 -15331 12839 15752 1962 -7429 -17515 -10125 591 4159 25875 18164 5693 29737
426 29737 13399 -1385 8359 -10720 -48379 -35747 -21246 -39865 -16207 3928 -13322 -24894
414 -24894 -2021 -5328 -18534 2675 -5074 3940 22452 9122 -18965 9445 12558 9312 -11876
$$ packed form
505B5945j152P302R045j7967n190j4057j1479J9400l0010K1786j407L0144n170
492B7190k7782j5951j2319R482K6517j6893P677K9781l0390O028k4085l076l5531
479e9352L0025K6622J2134q568k2356L434K3473q172K0699j3282k2659J2328j6011
466b1685r401L8155K2569R140K0162m5136k5314j2621J484J0803J8342P484j0701
453C281j8321j328j0419O792l05p762J9943q802J578n136O828j4615N425L638
439a9203L872K8170K913j3790r391j0086P390J0716L568K1716p711j2471K4044
426B9737j6338j4784R744j9079l7659J2632J4501j8619K3658K0135j7250j1572
414b4894K2873l307j3206K1209p749R014J8512j3330k8087K8410L113l246k1188
$$ plain form
401 -11876 -17525 -4445 -6196 -18262 -12380 -9907 -13756 10539 -19581 10197 3424 23555 -9075
388 -9075 -12492 10096 7746 18753 5659 -4683 21389 -2110 -18832 -14116 -16506 -770 -11860
375 -11860 -22440 -24010 -35430 -27105 -12930 -10215 -28519 -30331 9990 32748 18342 -20920 3078
362 3078 -4372 2682 5745 -7810 -21035 15364 -6062 -13463 17843 -2881 14090 38224 27043
349 27043 -1268 -13607 22791 27421 -6708 11495 28004 2434 -10580 10201 6770 23636
337 23636 21373 25347 17216 33493 -2873 5869 36837 33884 7009 -874 10470 6001 26357
324 26357 10497 2539 21245 1762 2996 6207 13435 30136 -10274 -22390 19617 15177 -30534
311 -30534 -47791 -6008 2733 7228 -11748 -22245 -24920 -31737 -8842 -52008 -33548 -42685 -34105
$$ packed form
401a1876n649J3080j751j2066N882K473l849K4295l0120K9778o773K0131l2630
388i075l417K2588k350J1007j3094j0342K6072k3499j6722M716k390J5736j1090
375a1860j0580j570j1420Q325J4175K715j8304j812M0321K2758j4406l9262K3998
362C078p450P054L063j3555j3225L6399k1426p401L1306k0724J6971K4134j1181
349B7043k8311j2339L6398M630l4129J8203J6509k5570j3014K0781l431J6866
337B3636k263L974q131J6277l6366Q742L0968k953k6875p883J1344m469K0356
324B6357j5860p958J8706j9483J234L211P228J6701m0410j2116M2007m440m5711
311c0534j7257M1783Q741M495j8976j0497k675o817K2895m3166J8460r137Q580
$$ plain form
298 -34105 -35770 -29283 -35008 -51832 -38575 -18188 -4369 581 52459 23704 -17897 -38824 -26727
285 -26727 -27404 -33504 -48580 -8479 41937 9108 -3073 -18545 -12457 38140 55675 37384 29786
272 29786 -6408 9580 38927 19845 -38932 -27347 -19811 -15026 -26821 -35360 -10752 -2823 2271
259 2271 10613 11367 23765 -40229 -22498 26042 -32861 -25172 -11223 -17183 587 1927 -16593
246 -16593 -1910 14449 10888 -18196 -30206 -13165 6702 14514 8594 13765 43364 25679 5426
233 5426 33044 -9046 -21850 -18641 30974 55329 13375 27305 17378 1308 2093 -21334 -29468
220 -29468 -51074 -37141 24238 27160 -1096 -29628 -9911 -5949 -11942 -23726 -31428 27388 24278
207 24278 -14620 12519 28715 31206 6121 -103 2237 19606 -6116 -6890 10133 30109 826
$$ packed form
298c4105j665O487n725j6824J3257K0387J3819M950N1878k8755m1601k0927J2097
285b6727o77o100j5076M0101N0416l2829j2181j5472O088N0597J7535j8291p598
272B9786l6194J5988K9347j9082n8777J1585P536M785j1795q539K4608P929N094
259B271Q342P54J2398o3994J7731M8540n8903P689J3949n960J7770J340j8520
246a6593J4683J6359l561k9084j2010J7041J9867P812n920N171K9599j7685k0253
233E426K7618m2090j2804L209M9615K4355m1954J3930r927j6070P85k3427q134
220b9468k1606J3933O1379K922k8256k8532J9717L962n993j1784p702N8816l110
207B4278l8898K7139J6196K491k5085o224K340J7369k5722p74J7023J9976k9283
$$ plain form
194 826 -17815 3428 24322 666 -48492 -30492 -19811 -31302 -24128 -2036 -15293 28462 22309
181 22309 -808 -13961 760 -19207 -39668 -13968 -13036 13460 3346 19411 10647 -6413 -5447
168 -5447 6839 8647 -10617 -685 12001 -17041 -14859 7687 45153 28828 21187 12182 -13290
155 -13290 26340 13047 2499 -10565 -2940 -20067 5218 40129 -10235 -9694 -16092 -33049 -41643
142 -41643 -23573 16060 49522 48894 12613 -36097 -28816 -33901 -56765 -22439 -9461 -14125 -15543
129 -15543 3266 -1259 -7665 -12456 -13045 -14857 -6879 -12402 -26806 -25614 -47977 -42125 -22054 -41886
115 -41886 -33850 -20101 7098 14494 3037 23407 23933 42895 25371 -1287 2954 -32881 -20198
102 -20198 20760 25480 21960 -9446 -13020 19178 28777 43470 25427 17277 4746 -6048 -3590
$$ packed form
194H26j8641K1243K0894k3656m9158J8000J0681j1491P174K2092j3257M3755o153
181B2309k3117j3153J4721j9967k0461K5700R32K6496j0114J6065q764j7060R66
168e447J2286J808j9264R932J2686k9042K182K2546L7466j6325p641r005k5472
155a3290L9630j3293j0548j3064P625j7127K5285L4911n0364N41o398j6957q594
142d1643J8070L9633L3462o28l6281m8710P281n085k2864L4326J2978m664j418
129a5543J8809m525o406m791n89j812P978n523j4404J192k2363N852K0071j9832
115d1886Q036J3749K7199P396j1457K0370N26J8962j7524k6658M241l5835J2683
102b0198M0958M720l520l1406l574L2198R599J4693j8043q150j2531j0794K458
$$ plain form
89 -3590 7099 21040 16436 16445 -6057 -1889 17509 -6683 -18472 -28679 -15763 -11410 -13888 -5525
75 -5525 9321 24293 -5340 -34903 -22312 -13769 -15379 -22923 -968 12788 1676 -16285 -17103
62 -17103 -12035 -28398 -20511 -25794 -24654 1894 9368 6125 15043 17846 9147 -11981 -34987 -42231
48 -42231 -40265 -22276 -8918 -36109 -44229 -16198 -889 -995 8778 7549 -5394 10064 11152 3131
34 3131 -852 -12202 12267 4773 -6539 822 16583 -7574 9829 17602 2485 3657 3378 -3082
20 -3082 -26907 6120 30487 23601 3804 -5353 9674 -5022 -75 9804 -3429 -15889 -18621
7 -18621 -9983 -1817 -27208 -35192 -15699 -2543 2159
0 2159
$$ packed form
89c590J0689J3941m604Rk2502M168J9398k4192j1789j0207J2916M353k478Q363
75e525J4846J4972k9633k9563J2591Q543j610p544K1955J3756j1112j7961q18
62a7103N068j6363P887n283J140K6548P474l243Q918K803q699k1128k3006p244
48d2231J966J7989J3358k7191q120K8031J5309j06R773j229j2943J5458J088q021
34C131l983j1350K4469p494j1312P361J5761k4157J7403P773j5117J172k79o460
20c082k3825L3027K4367o886j9797r157J5027j4696M947R879j3233j2460k732
7a8621Q638Q166k5391p984J9493J3156M702
0B159
$$ Imaginary data points
##PAGE= N=2
##DATA TABLE= (X++(I..I)), XYDATA
$$ plain form
16383 -1739871 -1697651 -1695734 -1679563 -1648482 -1655265 -1622882 -1592613 -1547581 -1546130 -1532039 -1514150 -1498801
16371 -1498801 -1474281 -1444348 -1425670 -1398079 -1394598 -1400364 -1393961 -1350782 -1319153 -1275864 -1235696 -1226944
16359 -1226944 -1220643 -1225194 -1201940 -1186032 -1178746 -1126754 -1074737 -1071479 -1049678 -1032435 -1034226 -1013518
16347 -1013518 -978428 -972249 -960038 -926557 -935607 -897447 -873079 -827672 -817088 -812508 -797342 -773599
16335 -773599 -758825 -744729 -735505 -712523 -676091 -654541 -647644 -645158 -623789 -603333 -584532 -544816
16323 -544816 -519975 -513785 -486341 -466702 -455239 -439884 -384876 -346510 -334376 -340580 -332034 -313914
16311 -313914 -280202 -257209 -268031 -257147 -228637 -195567 -190267 -197310 -176364 -127558 -106778 -92638
16299 -92638 -92184 -83521 -46816 -29301 -2997 -41137 -2815 9298 42544 85997 88344 90623 102002
$$ packed form
16383a739871M2220J917J6171L1081o783L2383L0269M5032J451J4091J7889J5349
16371a498801K4520K9933J8678K7591L481n766O403M3179L1629M3289M0168Q752
16359a226944O301m551K3254J5908P286N1992N2017L258K1801J7243j791K0708
16347a013518L5090O179J2211L3481r050L8160K4368M5407J0584M580J5166K3743
16335g73599J4774J4096R224K2982L6432K1550O897K486K1369K0456J8801L9716
16323e44816K4841O190K7444J9639J1463J5355N5008L8366J2134o204Q546J8120
16311c13914L3712K2993j0822J0884K8510L3070N300p043K0946M8806K0780J4140
16299i2638M54Q663L6705J7515K6304l8140L8322J2113L3246M3453K347K279J1379
$$ plain form
16286 102002 77180 87020 102169 141837 159101 174103 218600 221927 216184 205160 215408 243598
16274 243598 251331 250453 290739 318584 356496 372277 366509 357555 365022 400782 406536 411712 452667
16261 452667 443222 439489 472204 491493 495293 499131 497307 548407 572173 578937 595881 613664 629960
16248 629960 615131 630766 622891 651034 646998 662113 670529 696452 707114 724572 740075 745238
16236 745238 742264 772831 793017 780837 793814 822202 820913 813838 802161 834415 882420 881840
16224 881840 882241 878672 894546 919829 936734 919811 931527 926463 956699 936641 951231 963307
16212 963307 989348 1027712 1030339 1040672 1030394 1027973 1057394 1075233 1065541 1082808 1082533 1093794
16200 1093794 1119208 1120604 1119490 1089894 1099746 1132469 1131715 1162772 1172132 1140948 1153978 1126003
$$ packed form
16286A02002k4822R840J5149L9668J7264J5002M4497L327n743j1024J0248K8190
16274B43598P733q78M0286K7845L7912J5781n768q954P467L5760N754N176M0955
16261D52667r445l733L2715J9289L800L838j824N1100K3766O764J6944J7783J6296
16248F29960j4829J5635p875K8143m036J5115Q416K5923J0662J7458J5503N163
16236G45238k974L0567K0186j2180J2977K8388j289p075j1677L2254M8005n80
16224H81840M01l569J5874K5283J6905j6923J1716n064L0236k0058J4590J2076
16212I63307K6041L8364K627J0333j0278k421K9421J7839r692J7267k75J1261
16200A093794K5414J396j114k9596R852L2723p54L1057R360l1184J3030k7975
$$ plain form
16188 1126003 1165480 1172590 1173360 1216795 1197592 1206956 1208423 1209910 1257618 1237183 1228819 1223825 1217589
16175 1217589 1207081 1210087 1219143 1250598 1261144 1237948 1204205 1244666 1302061 1289646 1277522 1267358
16163 1267358 1264878 1284676 1284628 1280210 1281510 1300262 1319665 1342923 1332265 1309248 1318262 1360903 1374674
16150 1374674 1371001 1351237 1331153 1340075 1346741 1354146 1342862 1343012 1323901 1350450 1386868 1421487
16138 1421487 1421072 1433393 1431380 1412478 1396092 1388094 1367853 1376356 1373833 1375969 1394918 1421455 1422714
16125 1422714 1456616 1443251 1424280 1439296 1441758 1457155 1486399 1490900 1479398 1492331 1486586 1497182
16113 1497182 1513169 1505357 1466722 1436471 1421183 1444803 1491201 1488524 1473502 1475698 1479767 1477911
16101 1477911 1477133 1446658 1467544 1480941 1490322 1466113 1447747 1437796 1446484 1443136 1462241 1481601
$$ packed form
16188A126003L9477P110P70M3435j9203R364J467J487M7708k0435q364m994o236
16175A217589j0508L006R056L1455J0546k3196l3743M0461N7395j2415j2124j0164
16163A267358k480J9798m8m418J300J8752J9403K3258j0658k3017R014M2641J3771
16150A374674l673j9764k0084Q922O666P405j1284J50j9111K6549L6418L4619
16138A421487m15J2321k013j8902j6386p998k0241Q503k523K136J8949K6537J259
16125A422714L3902j3365j8971J5016K462J5397K9244M501j1502J2933n745J0596
16113A497182J5987p812l8635l0251j5288K3620M6398k677j5022K196M069j856
16101A477911p78l0475K0886J3397R381k4209j8366r951Q688l348J9105J9360
$$ plain form
16089 1481601 1484269 1519385 1503464 1515199 1521457 1523592 1543466 1556101 1547221 1517025 1508060 1511021
16077 1511021 1502374 1501648 1489792 1484196 1476859 1469303 1475311 1489829 1495307 1515594 1536117 1537179 1540422
16064 1540422 1553276 1556122 1556198 1515277 1505757 1513379 1533268 1555041 1527712 1524950 1516236 1553311 1550514
16051 1550514 1555468 1544121 1544441 1524718 1493588 1514965 1546455 1526251 1514517 1525005 1529532 1538622
16039 1538622 1556701 1567539 1568705 1562653 1533465 1549267 1551959 1555372 1550774 1547763 1547957 1562208 1553485
16026 1553485 1535810 1508005 1516519 1519663 1496671 1489216 1529836 1504650 1511778 1528677 1546463 1531465
16014 1531465 1541097 1535848 1535355 1534737 1545223 1525063 1526254 1543622 1556304 1538093 1515278 1507558 1484884
16001 1484884 1490231 1554720 1556719 1559573 1570740 1552469 1555011 1503868 1500303 1510528 1544057 1503412
$$ packed form
16089A481601K668L5116j5921J1735O258K135J9874J2635q880l0196q965K961
16077A511021q647p26j1856n596p337p556O008J4518N478K0287K0523J062L243
16064A540422J2854K846P6m0921r520P622J9889K1773k7329k762q714L7075k797
16051A550514M954j1347L20j9723l1130K1377L1490k0204j1734J0488M527R090
16039A538622J8079J0838J166o052k9188J5802K692L413m598l011J94J4251q723
16026A553485j7675k7805Q514L144k2992p455M0620k5186P128J6899J7786j4998
16014A531465R632n249m93o18J0486k0160J191J7368J2682j8211k2815p720k2674
16001A484884N347O4489J999K854J1167j8271K542n1143l565J0225L3529m0645
$$ plain form
15989 1503412 1513055 1528817 1533410 1563597 1559687 1514572 1511422 1515493 1558890 1563078 1574059 1567900 1558950
15976 1558950 1565044 1565419 1544389 1524904 1524997 1527358 1552444 1558716 1548089 1566787 1591831 1582739 1524251
15963 1524251 1544282 1559560 1549138 1570816 1603821 1581911 1557342 1589041 1541290 1539004 1532806 1523841
15951 1523841 1524380 1526384 1521685 1553365 1578926 1562902 1579267 1592281 1566912 1573461 1575624 1562117
15939 1562117 1535193 1543640 1525911 1532719 1564074 1568123 1532575 1522400 1538507 1559042 1582721 1582385
15927 1582385 1587935 1603087 1595384 1560386 1542310 1541417 1567697 1553740 1537638 1517633 1553303 1534250
15915 1534250 1528653 1528430 1522216 1528242 1525256 1564552 1546545 1548228 1546050 1562711 1557358 1544940 1524813
15902 1524813 1514842 1542021 1505273 1514352 1537482 1573822 1561331 1557698 1574778 1584786 1574370 1548428
$$ packed form
15989A503412R643J5762M593L0187l910m5115l150M071M3397M188J0981o159q950
15976A558950O094L75k1030j9485R3K361K5086O272j0627J8698K5044r092n8488
15963A524251K0031J5278j0422K1678L3005k1910k4569L1699m7751k286o198q965
15951A523841N39K004m699L1680K5561j6024J6365J3014k5369O549K163j3507
15939A562117k6924Q447j7729O808L1355M049l5548j0175J6107K0535K3679l36
15927A582385N550J5152p703l4998j8076q93K6280j3957j6102k0005L5670j9053
15915A534250n597k23o214O026k986L9296j8007J683k178J6661n353j2418k0127
15902A524813r971K7179l6748R079K3130L6340j2491l633J7080J0008j0416k5942
$$ [...]
##END NTUPLES=NMR SPECTRUM
##END=
