##TITLE=1H_DE-80H_X3
 200.13MHz, d2o
 8 sc
 
 19ns.26.2.2025
##JCAMPDX= 6.0         $$ Bruker NMR JCAMP-DX V2.0
##DATA TYPE= NMR SPECTRUM
##DATA CLASS= NTUPLES
##ORIGIN= UXNMR, Bruker Analytische Messtechnik GmbH
##OWNER= pz
$$ XWIN-NMR		Version 3.5
$$ Fri Jul 25 14:14:47 2025 Russian Standard Time (UT+4h)  Yarkov@DPX200
##.OBSERVE FREQUENCY= 200.1313
##.OBSERVE NUCLEUS= ^1H
##.ACQUISITION MODE= SIMULTANEOUS
##.ACQUISITION SCHEME= undefined
##.AVERAGES= 8
##.DIGITISER RES= 18
##SPECTROMETER/DATA SYSTEM= spect
##.PULSE SEQUENCE= zg30
##.SOLVENT NAME= CDCl3
##.SHIFT REFERENCE= (INTERNAL, CDCl3, 0, 15.5408)
##AUDIT TRAIL= $$ (NUMBER, WHEN, WHO, WHERE, WHAT)
$$ ##TITLE= Audit trail, XWIN-NMR		Version 3.5
$$ ##JCAMPDX= 5.01
$$ ##ORIGIN= Bruker BioSpin GmbH
$$ ##OWNER= Yarkov
$$ C:/Bruker/XWIN-NMR/data/yarkov2/nmr/H-C/1/pdata/1/auditp.txt
$$ ##AUDIT TRAIL=  $$ (NUMBER, WHEN, WHO, WHERE, WHAT)
(   1,<2025-07-25 14:14:08.46 +0400>,<Yarkov>,<DPX200>,
      <created by zg, POWCHK disabled, PULCHK disabled
       configuration hash MD5:
       00 E9 B6 7A A2 85 ED C7 34 08 36 98 17 FE 4E 26
       data hash MD5: 16K
       94 99 10 6D 3D A0 E2 F1 05 00 B0 33 EA EA D0 0F>)
(   2,<2025-07-25 14:14:14.18 +0400>,<Yarkov>,<DPX200>,
      <Start of raw data processing
       efp BC_mod = 2 LB = 0.25 FT_mod = 6 PKNL = 1 PHC0 = -1358.956 PHC1 = 13.59091 SI = 16K 
       data hash MD5: 16K
       0F DB E8 88 DA B2 B7 A1 E9 D7 4A 02 8D 99 13 A5>)
$$ ##END=
$$ 
$$ hash MD5
$$ EA A7 0F ED 0A FD 3C 85 63 40 1F E7 BB 64 D3 38
##$RELAX= 
##$RELAX= 
##$RELAX= 
##$RELAX= 
##$RELAX= 
##$RELAX= 
$$ Bruker specific parameters
$$ --------------------------
##$DU= <C:/Bruker/XWIN-NMR>
##$EXPNO= 1
##$NAME= <H-C>
##$PROCNO= 1
##$TYPE= <nmr>
##$USER= <yarkov2>
##$AMP= (0..31)
100 100 100 100 100 100 100 100 100 100 100 100 100 100 100 100 100 100 
100 100 100 100 100 100 100 100 100 100 100 100 100 100 
##$AQSEQ= 0
##$AQ_mod= 1
##$AUNM= <au_zg>
##$AUTOPOS= <>
##$BF1= 200.13
##$BF2= 200.13
##$BF3= 200.13
##$BF4= 200.13
##$BF5= 200.13
##$BF6= 200.13
##$BF7= 200.13
##$BF8= 200.13
##$BYTORDA= 1
##$CFDGTYP= 0
##$CFRGTYP= 5
##$CHEMSTR= <none>
##$CNST= (0..31)
1 1 145 1 1 1 1 1 1 1 1 1 1 1 1 1 1 1 1 1 1 1 1 1 1 1 1 1 1 1 1 1 
##$CPDPRG= <>
##$CPDPRG1= <>
##$CPDPRG2= <>
##$CPDPRG3= <>
##$CPDPRG4= <mlev>
##$CPDPRG5= <mlev>
##$CPDPRG6= <mlev>
##$CPDPRG7= <mlev>
##$CPDPRG8= <mlev>
##$CPDPRGB= <>
##$CPDPRGT= <>
##$D= (0..31)
0 0.7 0 0 0 0 0 0 0 0 0 0.03 0 0 0 0 0 0 0 0 0 0 0 0 0 0 0 0 0 0 0 0 
##$DATE= 1753438447
##$DBL= (0..7)
120 120 120 120 120 120 120 120 
##$DBP= (0..7)
150 150 150 150 150 150 150 150 
##$DBP07= 0
##$DBPNAM0= <>
##$DBPNAM1= <>
##$DBPNAM2= <>
##$DBPNAM3= <>
##$DBPNAM4= <>
##$DBPNAM5= <>
##$DBPNAM6= <>
##$DBPNAM7= <>
##$DBPOAL= (0..7)
0.5 0.5 0.5 0.5 0.5 0.5 0.5 0.5 
##$DBPOFFS= (0..7)
0 0 0 0 0 0 0 0 
##$DE= 6
##$DECBNUC= <off>
##$DECIM= 32
##$DECNUC= <off>
##$DECSTAT= 4
##$DIGMOD= 1
##$DIGTYP= 9
##$DL= (0..7)
0 120 120 120 120 120 120 120 
##$DP= (0..7)
$$ [...]
##$SUBNAM2= <"">
##$SUBNAM3= <"">
##$SUBNAM4= <"">
##$SUBNAM5= <"">
##$SUBNAM6= <"">
##$SUBNAM7= <"">
##$SUBNAM8= <"">
##$SUBNAM9= <"">
##$SW= 18.0517328524113
##$SWIBOX= (0..15)
0 0 2 0 0 0 0 0 0 0 0 0 0 0 0 0 
##$SW_h= 3612.71676300578
##$TD= 16384
##$TD0= 1
##$TE= 0
##$TE2= 300
##$TE3= 300
##$TEG= 300
##$TL= (0..7)
0 120 120 120 120 120 120 120 
##$TP= (0..7)
150 150 150 150 150 150 150 150 
##$TP07= 0
##$TPNAME0= <>
##$TPNAME1= <>
##$TPNAME2= <>
##$TPNAME3= <>
##$TPNAME4= <>
##$TPNAME5= <>
##$TPNAME6= <>
##$TPNAME7= <>
##$TPOAL= (0..7)
0.5 0.5 0.5 0.5 0.5 0.5 0.5 0.5 
##$TPOFFS= (0..7)
0 0 0 0 0 0 0 0 
##$TUNHIN= 0
##$TUNHOUT= 0
##$TUNXOUT= 0
##$USERA1= <user>
##$USERA2= <user>
##$USERA3= <user>
##$USERA4= <user>
##$USERA5= <user>
##$V9= 5
##$VALIST= <valist>
##$VCLIST= <CCCCCCCCCCCCCCC>
##$VD= 0
##$VDLIST= <DDDDDDDDDDDDDDD>
##$VPLIST= <PPPPPPPPPPPPPPP>
##$VTLIST= <TTTTTTTTTTTTTTT>
##$WBST= 1024
##$WBSW= 4
##$XGAIN= (0..3)
0 0 0 0 
##$XL= 0
##$YL= 0
##$YMAX_a= 311936
##$YMIN_a= -330060
##$ZGOPTNS= <>
##$ZL1= 120
##$ZL2= 120
##$ZL3= 120
##$ZL4= 120
##$ABSF1= 0
##$ABSF2= 0
##$ABSG= 0
##$ABSL= 0
##$ALPHA= 0
##$AQORDER= 0
##$ASSFAC= 0
##$ASSFACI= 0
##$ASSFACX= 0
##$ASSWID= 0
##$AUNMP= <proc_1d>
##$AZFE= 0.1
##$AZFW= 0.1
##$BCFW= 0
##$BC_mod= 2
##$BYTORDP= 0
##$COROFFS= 0
##$CY= -3
##$DATMOD= 1
##$DC= 0
##$DFILT= <>
##$DTYPP= 0
##$F1P= 0
##$F2P= 0
##$FCOR= 1
##$FTSIZE= 16384
##$FT_mod= 6
##$GAMMA= 0
##$GB= 0
##$INTBC= 1
##$INTSCL= 3.241238e-09
##$ISEN= 128
##$LB= 0.25
##$LEV0= 0
##$LPBIN= 0
##$MAXI= 10000
##$MC2= 0
##$MEAN= 0
##$ME_mod= 0
##$MI= 1.114404
##$NCOEF= 0
##$NC_proc= -7
##$NLEV= 6
##$NOISF1= 3.799351
##$NOISF2= 2.8
##$NSP= 0
##$NTH_PI= 0
##$NZP= 0
##$OFFSET= 15.54085
##$PC= 1
##$PHC0= -1358.956
##$PHC1= 13.59091
##$PH_mod= 1
##$PKNL= yes
##$PPARMOD= 0
##$PSCAL= 0
##$PSIGN= 0
##$REVERSE= no
##$SF= 200.129996166564
##$SI= 16384
##$SIGF1= 3
##$SIGF2= 2
##$SINO= 0.751879
##$SIOLD= 32768
##$SREGLST= <19F.Aceton>
##$SSB= 0
##$STSI= 16384
##$STSR= 0
##$SW_p= 3612.71676300578
##$SYMM= 0
##$S_DEV= 0
##$TDeff= 16384
##$TDoff= 0
##$TI= <>
##$TILT= no
##$TM1= 0
##$TM2= 0
##$TOPLEV= 0
##$USERP1= <user>
##$USERP2= <user>
##$USERP3= <user>
##$USERP4= <user>
##$USERP5= <user>
##$WDW= 1
##$XDIM= 16384
##$YMAX_p= 357940933
##$YMIN_p= -1323929
$$ End of Bruker specific parameters
$$ ---------------------------------
##NTUPLES= NMR SPECTRUM
##VAR_NAME=  FREQUENCY,     SPECTRUM/REAL,   SPECTRUM/IMAG
##SYMBOL=    X,             R,               I
##VAR_TYPE=  INDEPENDENT,   DEPENDENT,       DEPENDENT
##VAR_FORM=  AFFN,          ASDF,            ASDF
##VAR_DIM=   16384,         16384,           16384
##UNITS=     HZ,            ARBITRARY UNITS, ARBITRARY UNITS
##FACTOR=    0.220516191357247, 1,           1
##FIRST=     3110.19018801807, 0,            0
##LAST=      -502.526574987707, 0,           0
##MIN=       -502.526574987707, -1323929,    0
##MAX=       3110.19018801807, 357940933,    0
$$ Real data points
##PAGE= N=1
##DATA TABLE= (X++(R..R)), XYDATA
$$ [...]
8168 227227 182001 232186 78986 102448 254335 237101 212626 162590 214978 278001 335362
8157 335362 301097 278197 251281 347757 210141 150116 30206 -1982 107331 43454 77124
8146 77124 89701 124196 256229 309991 255491 224298 215844 316940 308561 165661 133172 182066
8134 182066 126325 221266 290658 232136 217106 228740 125002 177566 250736 192456 112618
8123 112618 160918 252352 224147 215008 143158 132758 154625 195730 209889 174527 205419 130291
8111 130291 9490 780 251127 253681 163290 207338 237808 199306 120932 192436 257528 188177
8099 188177 170088 171956 167184 238052 294689 310922 215424 270325 320623 178596 199407 160029
8087 160029 140168 79914 156180 187967 244874 243877 199642 154626 178300 253639 181422 286711
8075 286711 275004 217259 194250 249149 234569 176382 178012 148876 196493 213732 313523 313254
8063 313254 215717 148617 76541 236441 256732 220621 261701 413578 406948 228858 326303
8052 326303 262463 223701 302080 331708 252539 205416 331740 320037 285589 191366 175210
8041 175210 148461 29671 141805 253070 374762 331189 243219 240337 170217 328597 362639
8030 362639 308222 261794 140185 154527 398278 471743 398419 342035 252045 172341 220373
8019 220373 237575 241399 163673 93619 115490 196906 205600 253587 355107 281935 239749 284178
8007 284178 250425 273589 289958 268834 232846 268981 186143 258908 341634 279468 260391 320540
7995 320540 386167 294704 326725 364819 236497 41322 89493 296494 308568 303724 450412
7984 450412 343947 248756 334418 243914 296735 313565 182091 156446 168770 185624 253657
7973 253657 262181 364348 371486 248288 301695 302740 211092 222840 285971 188233 82942 107968
7961 107968 240533 103283 200762 195549 212865 186379 215452 363010 318672 338970 319869
7950 319869 338045 264033 114858 158833 213221 218584 384901 404569 328593 237894 393950
7939 393950 367713 344055 311699 262790 339198 266379 329572 401933 300077 254465 247944 242476
7927 242476 243088 188799 284834 221482 179073 275830 317127 403546 406284 259523 252657 296912
7915 296912 223958 65009 132267 293171 293035 101899 145523 257743 228113 300743 247414
7904 247414 274309 375346 222869 209673 96830 92020 202194 148426 196536 255384 340635
7893 340635 255803 210294 226146 277801 211276 223214 299087 367179 309922 249001 201890 202639
7881 202639 200537 85438 165320 173075 316569 376776 386775 420049 515682 525157 373979 324541
7869 324541 279977 395838 346360 407060 373898 290528 240717 305310 266702 256979 302705 288892
7857 288892 335531 376657 286242 217729 243280 233109 338835 66967 -49915 177170 348184
7846 348184 191080 162150 223253 331649 382679 411498 322700 250684 179675 293609 494955
7835 494955 412738 320407 228273 131492 79292 118888 97412 168904 241859 92275 82970 297593
7823 297593 433363 399679 474205 344997 231394 311636 263076 247929 244139 219567 213207
7812 213207 205032 203169 253373 234465 111292 151803 200757 225023 205729 167447 -93602 175615
7800 175615 582195 348380 264675 100273 211012 265275 297920 258669 237913 183358 189144
7789 189144 343071 355479 338454 282663 249078 171661 242712 392513 440998 536906 414735
7778 414735 326272 348602 162732 180614 189403 133634 216069 198587 212612 118822 93162 82589
7766 82589 146567 120337 109740 218569 236833 348354 406899 223614 297922 313985 306607
7755 306607 277368 277841 399842 448980 370579 233015 321114 274235 170017 216286 225465 217887
7743 217887 349535 332569 330497 338743 232083 204902 200998 305383 322985 346425 315663 272706
7731 272706 341448 263268 270652 307092 215763 308531 384558 300465 168997 290209 351723
7720 351723 443114 464865 271458 260336 313924 199831 192578 318020 299537 314126 207888
7709 207888 249000 255408 320591 265170 256098 179255 305570 348107 286816 317941 255904 332493
7697 332493 375166 181276 152878 252218 368942 407303 264309 161174 88665 160287 193289
7686 193289 231045 265990 259095 303494 325676 327175 282699 385221 327322 308745 185704 206173
7674 206173 227344 179881 96844 34920 110218 196153 373150 338837 381909 302649 198959
7663 198959 194501 166279 109567 151095 108436 121176 146224 292046 234969 54547 99604
7652 99604 278262 282841 223489 217294 215562 151547 140184 185676 178603 370688 383526 349080
7640 349080 282172 219580 307693 321742 227990 246470 269149 254339 129241 288578 344950
7629 344950 417640 406457 267841 170053 194271 147040 125687 206444 189707 204720 266400
7618 266400 315390 201795 131375 127147 252646 392232 373049 182480 154598 178564 291315
7607 291315 232353 198350 186255 147345 275710 465447 491158 242556 130945 343718 340617
7596 340617 283271 282944 262135 239863 176690 219743 309253 288532 330532 301074 177503 138561
7584 138561 221399 191770 61027 108057 173311 166742 240922 343830 204567 3232 -16618
7573 -16618 116679 225864 237141 187619 349346 323152 312018 403085 310643 270773 213042
7562 213042 202531 86309 64790 25763 157320 213270 246624 359308 258160 277370 268752
7551 268752 171015 140866 76336 204229 136570 208823 272929 272763 255804 283128 202652 56105
7539 56105 116790 173053 237973 236082 199049 233389 303313 185364 117321 235683 254805 313258
7527 313258 397113 241381 286380 270402 343994 367301 291194 360813 259264 210132 282228
7516 282228 212267 188913 400062 329134 231464 458413 356753 368162 305631 361482 347278
7505 347278 350234 366802 323712 204183 146177 123380 188667 231731 232811 393001 368373 301013
7493 301013 246191 211613 211103 340389 174139 75142 298063 376387 238176 320372 368107
7482 368107 274371 321278 222635 131630 186233 244446 375482 356512 393102 410228 464913
7471 464913 566737 489086 513487 349839 266373 314985 404122 359177 312368 346663 306705
7460 306705 140856 181184 198947 223643 264108 292594 367634 277335 292174 208571 223654
7449 223654 93457 117225 259145 253468 236315 245938 296095 324239 332050 239906 295966 278452
7437 278452 363496 470642 359549 267105 217842 282328 413931 432942 461762 431413 374860
7426 374860 345043 421445 240574 240600 366764 310365 350117 423085 302275 266863 318134 271987
7414 271987 305805 427369 344449 302903 408753 256939 349536 240881 240361 81123 174555
7403 174555 272150 166005 226792 147904 71527 155191 128111 295189 256866 260183 368632
7392 368632 407037 394567 277807 308013 394459 299121 193626 247974 344910 367123 404898
7381 404898 301315 335145 432014 374986 410562 419722 245628 273843 417956 406980 390612
7370 390612 317618 351335 218195 248535 266750 258230 197266 382727 291226 201674 278350
7359 278350 304059 354448 346371 320866 199340 156037 168616 214305 279263 266780 302933 239399
7347 239399 331859 270751 316112 293441 417944 350712 278698 188026 86977 237389 201230
7336 201230 254633 271958 234030 239144 311118 250024 383922 355148 220064 249266 399963
7325 399963 423580 385337 253671 346682 374241 344513 331467 393827 404308 257218 473333
7314 473333 604301 351252 290061 272345 286650 262039 139416 282403 308169 278809 245626
7303 245626 161697 246838 324753 381274 260035 258526 266096 227556 137953 196618 315164 381283
7291 381283 250345 271300 231965 277540 341098 333011 435034 336108 308102 334662 339564 224811
7279 224811 342960 334208 311149 338779 366447 313742 356577 228717 315705 387490 310934
7268 310934 300676 364640 286890 171422 228324 227858 325077 410759 242083 186754 212159 234279
7256 234279 258646 244539 132594 260694 404153 296632 287582 323107 413052 325961 246175
7245 246175 216068 192514 239858 223775 299406 314620 200129 314777 385419 298274 234476
7234 234476 259563 110815 164103 367519 230389 271682 239340 339072 429806 348608 358953
7223 358953 337177 372713 431764 382812 356155 490144 401536 258672 248268 354497 302140
7212 302140 254198 363071 413109 285978 364164 438579 416898 319537 318455 334375 337186 309902
7200 309902 228616 258605 304419 401557 283131 269028 278382 317756 468165 382670 280505
7189 280505 183400 177158 208723 264082 188578 127975 168172 219869 252239 335295 307762 338434
7177 338434 418228 444121 337442 265194 118941 174977 306216 302815 320291 391525 486336
7166 486336 351696 277406 273254 282068 315980 316032 266894 254570 252911 258411 223949 303818 270452
7153 270452 381481 438229 401797 372592 455544 487133 325502 381671 465722 386120 345420
7142 345420 338945 404554 263557 264820 279016 409008 385291 359364 343469 268028 353086 379265
7130 379265 383550 503561 428891 259216 310081 347529 426975 330075 454180 386384 295237
7119 295237 373576 304383 332239 334371 464641 373992 370221 394209 323456 399385 391926 339844
7107 339844 551263 615992 491823 425731 316368 338021 411548 471250 399491 312157 261856
7096 261856 277153 272615 269411 211539 257392 196530 194872 267613 313125 338814 261525 209563
7084 209563 296988 312890 410926 265999 371383 396319 284274 446082 338804 338801 538787
7073 538787 412555 403296 410291 310264 429954 309082 195134 251171 329764 282815 346085
7062 346085 356678 387744 496681 542033 556757 248595 300599 257370 201058 235295 249936
7051 249936 233554 136380 156928 146598 282311 329463 294005 309107 314501 239814 357728
7040 357728 363218 316621 116178 200921 263963 352216 395676 301959 380855 331359 201727
7029 201727 244372 192181 247176 272908 236546 307018 444245 418901 279330 356176 462824
7018 462824 540420 480777 479727 460948 431798 369268 441658 414782 285757 297540 322420 266051
7006 266051 174409 149020 319419 375571 414925 475103 457712 506699 525990 450777 485809
6995 485809 575725 536218 468158 497838 520133 536268 467647 622340 756459 794982 867517
6984 867517 791845 733472 574234 615398 576327 511406 481725 333703 338519 443736 444668 340693
6972 340693 347869 457140 530332 551202 505696 392006 298752 209155 139988 384833 387021
6961 387021 413415 378823 434002 466821 358051 383262 302932 314838 470082 616023 588179
6950 588179 570300 481958 406589 420206 527161 461962 433469 417579 464966 563700 612489
6939 612489 543464 595917 552598 533622 599991 583902 527315 464236 434460 361296 357645 391933
6927 391933 381696 356478 421331 397594 426455 386363 320347 408711 432373 480449 434843 407859
6915 407859 529728 479403 436419 459842 530350 574317 572118 573781 590426 605862 546856 567078
6903 567078 632533 550267 575234 565495 533171 552465 510076 510613 665609 607769 485128 453797
6891 453797 415570 498118 499064 551580 493861 574129 653954 663163 754958 718562 621732 781471
6879 781471 768985 687795 741351 716464 715672 640473 735907 596132 599165 567630 468833 471174
6867 471174 416284 545799 536518 664681 688848 562533 507691 557070 520450 478287 593796
6856 593796 472439 489495 509438 523626 662068 677761 594207 360090 401954 528193 603067
6845 603067 604141 585951 483279 470101 606532 649262 556589 513581 483676 423995 498398
6834 498398 466068 548410 515364 531355 456893 593830 483008 421628 391022 409166 500293
6823 500293 488634 531065 455075 484742 669677 630684 547564 506724 561756 473415 355161
6812 355161 383393 426414 443744 401650 478704 419837 469555 332131 380210 499773 611165
6801 611165 427955 469693 540000 569435 546449 444999 474856 576042 529147 577616 682496
6790 682496 663335 711113 578939 590803 497706 531420 657597 634741 611672 633101 678924
6779 678924 711090 703756 704968 780414 818815 865178 938161 789331 729622 721374 709121 736626
6767 736626 785557 882385 915665 1069073 1159843 1256910 1173519 1055106 1119502 988095 930656
6756 930656 1111338 1036109 979736 1093338 1102668 1213839 1282898 1301721 1433034 1402338 1361620
6745 1361620 1259546 1231489 1295389 1497369 1469018 1634469 1614295 1516864 1671737 1703566 1805046
6734 1805046 1787455 1810305 1940140 1863096 1764595 1901372 1983108 1970200 1862991 1898062 1974152
6723 1974152 2003566 1983303 2051059 2094909 2259979 2328826 2189009 2106980 2090533 2132924 2138224
6712 2138224 2190708 2173671 2153368 2256428 2420283 2479936 2465956 2602843 2555375 2491539 2400527
6701 2400527 2423945 2529889 2447028 2399644 2451822 2485311 2696722 2727243 2625012 2663111 2803963
6690 2803963 2827299 2767265 2716406 2548214 2458855 2453970 2395711 2285512 2197790 2426886 2365665
6679 2365665 2369799 2410617 2361815 2328042 2190716 2204634 2199074 2158643 2149771 2022136 1984532 2052450
6667 2052450 1967183 2140598 2135336 2174815 2162442 2081469 2089295 2023778 1898589 1836562 1803974
6656 1803974 1683301 1651068 1634702 1611735 1471268 1561511 1525791 1456987 1464188 1504084 1331136
6645 1331136 1317673 1492595 1496134 1491376 1560273 1537440 1378274 1412820 1392434 1330021 1321488 1458263
6633 1458263 1337845 1253758 1113335 1110638 1173029 1241515 1214814 976185 1009534 1070110 982210
6622 982210 965412 1016945 938788 899838 856390 960349 878278 716909 810370 745850 768265
6611 768265 743915 752492 686290 733668 799859 703480 779828 809237 654169 742838 824096 699903
6599 699903 605448 633921 624258 565676 599332 556621 520444 417422 572081 613518 568155
6588 568155 691920 575997 640881 751800 715743 572505 543839 666945 714204 588942
6578 588942 621145 605056 479216 398742 387504 440671 509529 540414 531852 546968 458172 303764
6566 303764 506817 514531 537546 485936 464713 626814 600329 493912 433365 643593 668072
6555 668072 668804 536953 363272 384886 389275 465003 588375 483222 470021 476893 406361 544004
6543 544004 544835 426456 426665 421045 463666 490290 541680 547499 536206 427836 406243 473965
6531 473965 590662 506880 396262 534470 479863 539723 537507 518157 620616 573061 570202
6520 570202 459286 429008 477223 574033 622738 604974 554479 496259 403532 581631 630202
6509 630202 467693 317751 417474 554302 563165 514323 617008 546523 404523 539299 704508
6498 704508 700301 622916 589524 549704 549589 613103 716253 673488 592169 498340 527608 559914
6486 559914 451322 451498 518354 547903 644405 620344 699883 691695 654133 551051 569930 523087
6474 523087 341630 498784 644837 630253 571360 612360 645389 632575 619067 600703 594962
6463 594962 615989 564366 513682 473336 499000 561574 633410 657062 543296 452363 469836
6452 469836 466545 588054 599096 595573 524962 411422 501083 504806 405003 501648 666349 661320
6440 661320 630053 620647 611062 579552 539510 662835 722851 782566 743807 579468 566320 581375
6428 581375 748162 720055 615029 589863 665931 576531 662053 558913 576876 676083 610064
6417 610064 603656 581125 592062 775726 634292 597199 711078 631340 632443 754134 781877
6406 781877 711698 568890 471800 411651 546458 741182 851510 762938 620628 636523 828286
6395 828286 919805 803628 776204 765679 809881 759147 755312 853669 848251 773761 706649 610051
6383 610051 630983 585334 631378 769418 717708 560265 637833 554021 652468 623502 561576
6372 561576 734585 832096 726357 730285 533119 431386 578750 716052 674696 519725
6362 519725 533537 632463 618308 598451 721323 705772 581972 678753 724430 426048 379974
6351 379974 414064 592128 633030 619357 615978 631773 556265 689485 722173 704003 708195 627938
6339 627938 753180 797796 823316 835201 729477 701367 710361 716692 567396 580411 618678
6328 618678 545426 705852 645341 546508 532087 592033 720837 760033 651491 691219 723450
6317 723450 643705 548984 607544 583243 577034 531278 605209 566640 706664 706183 727795 730573
6305 730573 554676 616315 578746 610892 773348 733750 701667 671571 700055 768526 743000
6294 743000 739696 715239 767446 777112 886544 773168 772879 880690 778631 656869 585997
6283 585997 671405 639025 672663 661847 584257 539731 492339 414535 559830 644700 596763
6272 596763 717182 688454 615258 690070 650767 618833 785362 626021 615370 701085 779917
6261 779917 758714 603326 665785 730480 646082 693820 565031 597042 671330 729205 650235
6250 650235 764032 972209 949188 875140 793170 761046 773606 755574 870495 897743 899871
6239 899871 1020346 1024034 932945 924983 978882 866015 806742 787165 796449 773980 823115 921008
6227 921008 982077 943412 950089 897248 913403 851585 866115 980855 1055706 1133829 1057527 1078714
6215 1078714 1250982 1065524 988942 1001696 977244 1029945 1166040 1247792 1227169 1205663 1151381
6204 1151381 1207432 1407553 1482074 1390142 1492730 1583853 1569573 1622033 1780531 1800976 1751476
6193 1751476 1808821 2003832 2221312 2182514 2140988 2308818 2290873 2288588 2301595 2347521 2227888
6182 2227888 2384034 2392809 2402841 2474499 2530729 2509641 2611773 2707904 2618611 2531745 2589730
6171 2589730 2756755 2683250 2823848 2832429 2959106 3027539 2908141 2906085 3097925 3148008 3107992
6160 3107992 3256050 3198899 2986335 2754320 2686841 2676420 2539571 2384945 2376645 2220379
6150 2220379 2216855 2225256 2046502 2079447 1966321 1977187 1935963 1940829 1937511 1909379 1974060 2025676
6138 2025676 2055055 2069610 2147383 2123856 2076512 2054668 1991719 2048468 1968133 2062636 2012167
6127 2012167 1955689 1849749 1747928 1823637 1790909 1755584 1657346 1562695 1603140 1486737 1521099
6116 1521099 1591375 1552923 1622283 1577911 1450385 1472769 1604628 1585386 1555921 1595859 1600363
6105 1600363 1595366 1662458 1744410 1752101 1907618 1965896 1996708 1996131 2127912 2236526 2265796 2372046
6093 2372046 2362521 2472486 2597779 2592108 2672943 2905720 2946688 2930030 3040017 3088339 3087251
6082 3087251 3284892 3490142 3480258 3540639 3617048 3747073 3831262 3964771 4115858 4411265
6072 4411265 4639226 4661237 4911416 5062802 5314916 5518225 5612015 5583799 5588698 5676991 5776085
6061 5776085 5718405 5684332 5772574 5827228 5814913 5888912 5879677 5775878 5825041 5863669 5743084
6050 5743084 5825505 5903400 6042587 6156447 6297837 6347274 6549259 6717040 7014350 7190223
6040 7190223 7282446 7263448 7185965 7092510 6985808 6771844 6306773 6071708 5836845 5626361
6030 5626361 5543963 5403073 5239051 4972983 4815091 4751401 4604750 4475129 4364936 4244044
6020 4244044 4108530 4203544 4292467 4291633 4302985 4334681 4254968 4230244 4382956 4384006 4285545 4130991
6008 4130991 3983714 3812645 3605114 3582781 3469578 3283115 3026735 2901885 2935831 2909425
5998 2909425 2729461 2543381 2474064 2514129 2342180 2225876 2185536 2153579 2099236 2171931 2130374
5987 2130374 1988124 1910778 1939791 1836983 1829213 1787378 1783049 1921349 1912011 1771677 1743718
5976 1743718 1662946 1694790 1566724 1636741 1679156 1501110 1490488 1455502 1711350 1726379 1731512
5965 1731512 1664427 1687695 1669484 1573372 1577562 1472286 1458639 1562138 1684660 1611928 1597924
5954 1597924 1573497 1559714 1472811 1365207 1434044 1512433 1572006 1646572 1639893 1571592 1723843
5943 1723843 1662050 1631659 1810455 1786839 1708617 1756633 1769104 1686713 1576330 1559974 1605938
5932 1605938 1652817 1685029 1772203 1975546 1841963 1803956 1646293 1544007 1685838 1723704
5922 1723704 1831767 1842959 1921807 1864826 1894136 1929816 1964457 1879907 1862836 1764616 1849313
5911 1849313 1884450 1916593 1860398 1848943 1954426 1822438 1730190 1756037 1689530 1511752 1528681
5900 1528681 1494670 1607253 1647832 1599349 1595684 1594965 1665062 1682369 1623103 1586729 1533223 1534455
5888 1534455 1559019 1599269 1581320 1576424 1503363 1452791 1426479 1357347 1396195 1516716 1335229
5877 1335229 1241018 1272292 1310989 1516243 1448838 1258392 1153077 1280518 1295233 1358329 1492772
5866 1492772 1268229 1219794 1308817 1345764 1360617 1302909 1349010 1323856 1188761 1190259 1259483
5855 1259483 1335465 1332141 1220460 1202564 1211776 1245816 1270854 1160962 1212835 1211001 1221453 1240753
5843 1240753 1348187 1285763 1245365 1255075 1071656 1111521 1205092 1180384 1059649 1040930 1083632
5832 1083632 1201247 1146555 1208829 1280519 1166250 1189555 1276025 1312761 1244275 1210152 1244297
5821 1244297 1311661 1177755 1182564 1261308 1186961 1254638 1336992 1353378 1286327 1249566 1246126 1473115
5809 1473115 1477120 1348068 1229189 1369764 1497371 1444326 1482825 1448269 1560039 1646068 1505751
5798 1505751 1421251 1369919 1454837 1445132 1357813 1496095 1309245 1338132 1447034 1394440 1333404
5787 1333404 1348393 1415376 1279476 1468215 1357039 1228285 1233611 1265828 1184035 1204796 1058781
5776 1058781 1074032 1210921 1156509 1062194 1144668 1407381 1559786 1536161 1421853 1285260
5766 1285260 1350312 1427428 1280727 1277391 1302542 1237226 1326865 1472122 1527068 1550907 1468939
5755 1468939 1435750 1365687 1434942 1444164 1404104 1461990 1466700 1340857 1402013 1403396 1455640 1363918
5743 1363918 1415353 1455339 1592199 1632413 1432245 1287919 1528000 1515725 1543138 1560181 1654624
5732 1654624 1502172 1420596 1536623 1481968 1439747 1445036 1582148 1669210 1722575 1750616 1740022
5721 1740022 1649500 1582347 1639213 1495181 1489651 1535400 1409694 1516816 1679500 1697424 1623425
5710 1623425 1599362 1667462 1635892 1638919 1734352 1700789 1660776 1730985 1695003 1734283 1747651 1763078
5698 1763078 1735514 1753313 1726915 1746928 1676279 1694607 1889563 1854781 1787853 1882855 1949405
5687 1949405 1879572 1907295 1885490 1997242 1945612 1968303 1923270 2008758 1915804 2013395 1961396
5676 1961396 2088931 2082926 2099969 2227678 2150987 2110879 2152853 2113155 2066827 2175518 2146433
5665 2146433 2157311 2211038 2209397 2151386 2107989 2115931 2113258 2326315 2217382 2168064 2315456
5654 2315456 2421217 2445835 2501803 2581826 2517024 2472388 2531794 2506349 2475633 2497354 2543597
5643 2543597 2535161 2642657 2718877 2674917 2553250 2684734 2830587 2818718 2894461 2837138 2748756
5632 2748756 2825088 2821765 2723714 2685583 2715925 2886674 2935536 2902371 2962902 2978644 3015515
5621 3015515 3179582 3255422 3280173 3383842 3279696 3337303 3421535 3365862 3361621 3266455 3326612
5610 3326612 3523478 3572756 3662115 3565723 3572262 3790290 3812218 3882055 3913049 4007426 4024368
5599 4024368 4177769 4210935 4305133 4280873 4493798 4541646 4442632 4463989 4732465 4935901 4907354
5588 4907354 4970443 5041146 5159278 5447333 5503246 5624436 5681432 5884346 6076397 6324412
5578 6324412 6432269 6586742 6686307 6765445 6874368 7098046 7389002 7585542 7685217 7734971
5568 7734971 7966526 8159572 8340288 8669183 8935555 9209253 9329821 9571006 9947234 10318426
5558 10318426 10847343 11056973 11361277 11682327 11920612 12168228 12506843 12809208 13050480
5549 13050480 13376912 13714635 13996599 14274782 14509866 14837639 15256040 15659890 16044469
5540 16044469 16323953 16741076 17021872 17309930 17864549 18355674 18780294 19123247 19588120
5531 19588120 20012025 20368837 20686095 21025030 21267430 21520857 21742517 22145198 22445192
5522 22445192 22776190 23150211 23615029 23896107 24298790 24756823 24969577 25538197 25834353
5513 25834353 26100021 26402933 26590573 26943859 27309265 27579010 27964888 28418845 28721929
5504 28721929 29022843 29334057 29796705 30058593 30168837 30519172 30727868 30706596 31003941 31153884
5494 31153884 31318610 31434347 31564666 31555514 31791871 31865654 31794408 31982594 32103085 32176510
5484 32176510 32241134 32298510 32225030 32242528 32430829 32447877 32332719 32422864 32458040 32308892 32307316
5473 32307316 32186430 32031151 31924305 31768175 31538818 31368230 31172040 31070974 30914344
5464 30914344 30686197 30485055 30185499 29938358 29648606 29465863 29141276 28975567 28824957
5455 28824957 28480194 28101541 27770558 27532798 27161006 26650925 26577919 26263271 25855989 25582289
5445 25582289 25240536 24989574 24747708 24309985 23904269 23498480 23129620 22900545 22541364
5436 22541364 22238521 21875620 21534454 21165761 20793869 20371435 19934725 19668807 19379436
5427 19379436 19137390 18897949 18578324 18197125 17951193 17864531 17697505 17413663 17087852 16798824
5417 16798824 16589654 16266894 16075945 15702083 15405485 15103016 14786658 14557970 14261933
5408 14261933 13833752 13401903 13102357 12856719 12455949 12215294 11909901 11659538 11501727
5399 11501727 11264480 11018306 10943635 10869780 10737510 10666753 10739557 10638010 10386117 10217312
5389 10217312 9731030 9554450 9464319 9275256 9061099 8775066 8642330 8306108 8106809 7872961
5379 7872961 7637273 7635074 7508358 7331557 7060799 6851544 7015256 6954456 6651882 6533846
5369 6533846 6311934 6363081 6316183 6187977 6075256 5885805 5715151 5650790 5543512 5428507
5359 5428507 5162395 4910018 4888144 4923908 4737641 4750218 4645453 4505274 4488263 4479422 4404618
5348 4404618 4362377 4352091 4249529 4111855 4003229 4098689 3940771 3836691 3710567 3675917
5338 3675917 3806929 3814152 3715668 3545371 3584239 3638324 3688326 3632956 3491127 3510850 3436402
5327 3436402 3429785 3361697 3311353 3288533 3209302 3275472 3131842 3031244 3180366 3228815 3168289
5316 3168289 3276389 3297156 3230284 3031756 3048247 3071864 3009344 3006756 3001299 2899846 2959706
5305 2959706 2950354 2912752 3040152 3074539 3165226 3105999 3154750 3012598 2917386 2981308 2823590
5294 2823590 2719820 2763764 2796522 2811367 2784243 2694174 2678484 2697210 2790776 2726327 2776679
5283 2776679 2668319 2837667 2898141 2815103 2710985 2652624 2676258 2636763 2661772 2533224 2619827
5272 2619827 2745914 2747706 2715138 2768483 2773223 2826981 2728037 2615715 2633127 2596076 2646407
5261 2646407 2828414 2812381 2831340 2734534 2723011 2729188 2643563 2610714 2788504 2809377 2651404
5250 2651404 2566048 2711323 2734259 2672646 2660085 2717709 2809361 2839633 2775951 2833628 2894113
5239 2894113 2856588 2829016 2938673 2898221 2884101 2882190 2899151 2993919 2959033 2891563 2922620
5228 2922620 2914646 2943718 2978498 3009096 2991811 2930308 2784061 2917247 3170113 3117223 3123299
5217 3123299 3113615 3193395 3169261 3178443 3259345 3075926 3054788 3202911 3226416 3306900 3359315
5206 3359315 3314159 3312279 3310769 3354595 3493824 3499623 3497155 3551032 3575684 3505009 3652556 3553658
5194 3553658 3710039 3815606 3866418 3939758 3980667 3982157 3937459 3965028 3919867 3940759 4037000
5183 4037000 4169732 4326401 4418460 4359323 4209673 4342863 4546445 4526790 4553390 4570812
5173 4570812 4550449 4519055 4560401 4628755 4791190 4853570 5014904 5100450 5157503 5206740 5266378
5162 5266378 5301552 5402007 5435302 5596766 5707751 5775103 5915410 5978623 6013975 6064257 6180053
5151 6180053 6325286 6493538 6557779 6790540 6960188 7064042 7118036 7173988 7320405 7542368
5141 7542368 7600844 7787443 7964737 7999084 8289289 8499826 8615798 8729328 8839636 9060819
5131 9060819 9190784 9463252 9614138 9951008 10169479 10384188 10434293 10664184 10924309 11115495
5121 11115495 11308922 11612541 11764866 11915175 12142593 12244056 12601017 12916398 13158039
5112 13158039 13549493 13765571 14021631 14358071 14650618 14847327 15081962 15485978 15742915
5103 15742915 16084159 16388293 16805118 17008395 17306105 17645198 17964932 18477518 18967250
5094 18967250 19206149 19583721 20163503 20717012 21024664 21260088 21331651 21545677 21600710 21563483
5084 21563483 21764762 21897013 22120089 22375392 22601797 22894529 23027590 23304644 23584218
5075 23584218 23610240 23870629 24097120 24177057 24267840 24444275 24722037 25038267 25240569 25380544
5065 25380544 25560408 25679103 25957051 26143848 26301346 26421104 26806842 27014315 27188796
5056 27188796 27305735 27633675 27746426 27795225 28060035 28359019 28743973 29061149 29329734 29574110
5046 29574110 30006007 30580151 30942312 31284884 31541296 31752792 31813821 31908873 32254757 32363777
5036 32363777 32768219 32836496 32689101 32177463 31382497 30573996 29950473 29499307 29172313 28943967
5026 28943967 28628982 28291066 28021038 27575553 27095905 26657252 26331479 26039188 25494933
5017 25494933 25138512 24756056 24450546 24114702 23904819 23622243 23274961 23092901 22922867
5008 22922867 22587213 22210157 22018425 21674522 21427710 21167244 20910620 20638963 20460857
4999 20460857 20236985 20098191 19818565 19482104 19184391 19019326 18748730 18578637 18331686
4990 18331686 18033602 17875838 17659046 17490743 17131483 17016941 16789153 16598991 16436662
4981 16436662 16174548 16051183 15837955 15653919 15416909 15210870 14974309 14807467 14470380
4972 14470380 14136710 14060575 13930250 13640160 13507750 13370176 13294284 13060755 12821748 12779178
4962 12779178 12484018 12388818 12372012 12246808 12045122 11896024 11773098 11582968 11420328 11404867
4952 11404867 11355317 11152044 10894808 10804658 10816782 10728086 10753404 10653296 10525833 10597711
4942 10597711 10408681 10280896 10268710 10280387 10187687 10108230 10055630 9881785 9857369 9991407
4932 9991407 9971431 10035259 9967375 9856142 9886907 9829247 9902134 9935475 9768337 9681725 9607596
4921 9607596 9487573 9256307 9096333 9109373 8920089 8796083 8731001 8515451 8276068 8164932
4911 8164932 8066657 7980580 7896496 7893280 7760637 7437602 7299198 7273878 7101241 7040792 6948293
4900 6948293 6767989 6700050 6669807 6608384 6649606 6509567 6357965 6353265 6272174 6195446 6128521
4889 6128521 6033807 5972239 5805915 5771602 5777203 5600228 5624163 5472537 5479396 5480539 5406810
4878 5406810 5410902 5299854 5209593 5070688 4981340 4970624 5020069 5091655 5049967 5022951 5027330
4867 5027330 4975232 4941868 4997329 4999065 5028580 5009586 5009322 5184739 5158370 5182325 5120218 5112130
4855 5112130 5179266 5063606 5177313 5272130 5276385 5290594 5430842 5601130 5710699 5741976 5976673
4844 5976673 6229834 6485048 6614759 6898156 7188404 7617099 8075403 8454946 9003859 9702423
4834 9702423 10291788 10894784 11790845 12614279 13504410 14475604 15353967 15981410 16531138 16534486
4824 16534486 16052747 15225669 14316544 13229161 12247609 11283137 10411112 9725386 9103429
4815 9103429 8534456 7988541 7561907 7192139 6888340 6701017 6261081 5981935 5813221 5563135
4805 5563135 5301070 5028512 4964214 4789825 4670206 4662736 4435672 4378485 4290111 4108104
4795 4108104 3961060 3963641 3846733 3604075 3638366 3668368 3670986 3539967 3512303 3431299 3326926
4784 3326926 3147502 3091542 3177860 3225498 3090347 3063089 3056906 2961474 2820524 2825034 2840230
4773 2840230 2947147 2905958 2950279 2949820 2881935 2736560 2595106 2696896 2695365 2694238 2783768
4762 2783768 2757204 2653715 2682245 2664274 2629694 2466384 2467445 2665527 2596022 2549973 2503889
4751 2503889 2475958 2559376 2485050 2479656 2471116 2428922 2405125 2399294 2370928 2394377 2350234 2541328
4739 2541328 2696006 2640744 2594321 2528849 2419533 2494955 2540508 2466980 2494396 2472747 2450416
4728 2450416 2475905 2605651 2628657 2652402 2610516 2497552 2505908 2487376 2434846 2349410 2421647
4717 2421647 2528104 2616221 2623127 2657817 2605804 2474093 2488314 2499273 2559722 2614916 2530922
4706 2530922 2488941 2513070 2568530 2484034 2555411 2584940 2541248 2508119 2466133 2578813 2537360
4695 2537360 2598983 2655160 2679828 2770652 2710169 2732353 2727753 2817353 2945382 2813137 2824713
4684 2824713 2772801 2725518 2702132 2744811 2693686 2683284 2786107 2778882 2776585 2847332 2890775 2799837
4672 2799837 2797601 2784122 2818967 2890431 2871510 2923941 2841060 2833091 2846652 2804620 2888091 2890569
4660 2890569 2836797 2875101 2937512 2809600 2902831 2914300 2994209 3049129 3018494 3032338 2927856
4649 2927856 2965986 2968282 3062465 3048405 3058265 3091271 3208434 3233308 3277862 3337176 3249065 3433753
4637 3433753 3360605 3251734 3311263 3372367 3355189 3286650 3353352 3363597 3273719 3417886 3540991
4626 3540991 3523683 3509248 3583441 3377610 3270584 3342668 3412368 3476572 3593241 3593532 3669308
4615 3669308 3810003 3722620 3700641 3699259 3838764 3885559 3900168 3776147 3708922 3852995 3906644
4604 3906644 3929178 3981293 3984620 3987331 4020351 4130743 4144503 4086550 4222720 4390640 4356557
4593 4356557 4408909 4443569 4372397 4377288 4413442 4510181 4552045 4716625 4870627 4753245 4776645
4582 4776645 4862175 4952784 4912975 4981236 5110192 5085294 5105218 5310970 5318451 5380289 5327790
4571 5327790 5282201 5360859 5518569 5571179 5691915 5751690 5717087 5851130 5975187 5973157 6106256
4560 6106256 6170932 6200727 6278883 6383611 6535094 6559877 6651297 6762514 6816997 7011184 7119493
4549 7119493 7249954 7392106 7422626 7645725 7739471 7858488 8004119 8177882 8365197 8490110
4539 8490110 8695746 8720248 8695957 9000550 9145124 9394608 9701713 9799358 9998325 10241853
4529 10241853 10392638 10530890 10664404 11016813 11191585 11490257 11743487 11932454 12200036
4520 12200036 12429538 12702713 12847856 13132489 13468673 13775768 14061195 14249651 14591386
4511 14591386 14847480 15171538 15308549 15555211 15870845 16107506 16474847 16745516 16948123
4502 16948123 17224182 17577025 17816385 18022963 18246820 18496817 18739944 19000926 19154914
4493 19154914 19166884 19284359 19425672 19577565 19655887 19616999 19617345 19532136 19465345 19469136 19422512
4482 19422512 19374052 19205342 19145329 18986049 18769573 18638438 18470804 18253633 17943488 17849508
4472 17849508 17696598 17439235 17179957 16871477 16712072 16415241 16310910 16171230 15881510
4463 15881510 15660606 15305501 15087567 14937765 14824938 14687450 14520372 14351756 14182397
4454 14182397 13886374 13707938 13456860 13252964 13095904 12864492 12853316 12843151 12564014 12425731
4444 12425731 12345495 12408025 12257704 12077681 12094903 12077006 11988767 11914925 11855739 11768219 11847964
4433 11847964 11627834 11622375 11747663 11686719 11634207 11686039 11702377 11630405 11686551 11916951 12021842
4422 12021842 12111288 12262358 12447952 12485965 12629285 12792954 12966799 13130367 13364536 13690951
4412 13690951 13947003 14231052 14443311 14722881 15048148 15365353 15665657 16142238 16576082
4403 16576082 17010502 17499359 18110682 18659085 19169850 19691944 20405827 21075054 21634171
4394 21634171 22327626 22980668 23678616 24408949 25175025 25974256 26865078 27542349 28237662
4385 28237662 29321108 30140825 30975983 31679717 32499359 33384620 34269020 35051461 35901132
4376 35901132 36663528 37259862 37917278 38638319 39309367 39757111 40194811 40615954 41131722
4367 41131722 41479027 41717292 42074439 42372106 42584658 42682034 42644005 42658037 42814601 42923186
4357 42923186 42905851 42896608 42613972 42487225 42442602 42336541 42062742 41725058 41427398 41239036
4347 41239036 41013254 40733373 40696376 40687140 40492485 40182288 40205006 40081132 39946870 39988642
4337 39988642 40019252 39919911 39845966 39870507 39779545 39761452 39943620 39993660 40084414 40468857 40689823
4326 40689823 40862213 41052586 41248532 41532790 41826470 42170255 42472096 42914138 43262641
4317 43262641 43712043 44207355 44620075 44912289 45248275 45876111 46180892 46548214 46926066
4308 46926066 47419944 47825397 48180835 48529807 48856425 49229806 49594997 49785726 50068968
4299 50068968 50508296 50695922 50953057 51269980 51516765 51596051 51600536 51850986 51977256 52080003
4289 52080003 52079817 51997863 51885830 51852486 51762154 51541844 51411954 51233696 50901907 50659525
4279 50659525 50325947 49967076 49498933 48940955 48443811 47967806 47390537 46662817 46247050
4270 46247050 45855051 45110089 44427640 43765315 42949186 42232595 41458123 40902949 40132671
4261 40132671 39316262 38646760 37829921 37062332 36302644 35609287 34958438 34244269 33685194
4252 33685194 32924476 32193975 31451011 30645084 30000628 29493650 29061951 28412822 27770828
4243 27770828 27267274 26891370 26222645 25776740 25285936 24745178 24422176 23912480 23534433
4234 23534433 23074745 22625014 22307510 21983765 21590130 21357178 21088619 20838335 20414017
4225 20414017 20163444 20032678 19739805 19610637 19309224 18943540 18762441 18585124 18409693
4216 18409693 18197349 17917624 17648498 17458354 17306505 17141296 17105126 16836637 16688770 16441413
4206 16441413 16244737 16147640 16068919 15901353 15797780 15617302 15463832 15357503 15240626 15145665
4196 15145665 15138819 15021475 14877454 14819721 14749276 14669288 14522839 14534056 14357711 14310486 14287712
4185 14287712 14351314 14331444 14317872 14335412 14295931 14116863 14122353 14052240 14129315 14137011 14070015
4174 14070015 14084956 14011214 13973542 13992102 13882419 13813605 13932326 13967138 14130582 14067279 14054924
4163 14054924 14080970 14070639 14176977 14125118 14242036 14263561 14260894 14264488 14310185 14380830 14287865
4152 14287865 14386912 14507417 14582537 14692800 14693609 14738730 14810340 14853725 14866797 14889836 15016673
4141 15016673 15017085 15048761 15076183 15271963 15489421 15539839 15707743 15705365 15699042 15830298 15918655
4130 15918655 15960563 15919371 16091448 16297841 16515251 16750170 16855676 17021448 17159295 17299611
4120 17299611 17334739 17485121 17725657 17985641 18146913 18266486 18560026 18781383 18858842 19157757
4110 19157757 19300561 19637992 19994193 20163986 20438975 20743496 20936225 21151216 21381886
4101 21381886 21629476 21913808 22125166 22458671 22854395 23183134 23394857 23757257 24054597
4092 24054597 24526087 24913360 25380010 25635892 25964610 26369427 26755939 27328179 27716705
4083 27716705 28115892 28691383 29132164 29543127 30146482 30802787 31345313 31897067 32542248
4074 32542248 33208490 33837360 34225173 34730153 35475211 36216164 36884319 37536454 38312489
4065 38312489 39074707 39730176 40485477 41302351 41876378 42811746 43669585 44492854 45289474
4056 45289474 46122989 46839083 47572818 48362940 49115390 50037559 50646267 51255075 51784307
4047 51784307 52383870 53176927 53876449 54573032 55312516 55864897 56293038 56891915 57549935
4038 57549935 58028462 58663856 59384522 59970880 60514287 61143102 61948112 62514995 63382171
4029 63382171 64145490 64962314 65817954 66740398 67788014 68810840 69946102 71305095 72654691
4020 72654691 73963957 75559818 77189485 78959730 80700907 82676916 84570946 86503375
4012 86503375 88572304 90698377 92702514 94824815 96762572 98720046 100533332 102095624
4004 102095624 103642673 105104789 106608521 107770760 108805004 109890434 110697338 111217495
3996 111217495 111690678 112031477 112041875 111717838 111294047 110603281 109472172 108307006 107044665
3987 107044665 105510593 103677104 101845451 99855766 97855740 95533684 93354593 91133570
3979 91133570 88782180 86353467 84032854 81705787 79238509 76892977 74599221 72301840
3971 72301840 70082333 67901969 65813671 63774662 61702764 59957141 58128469 56436365
3963 56436365 54656942 53067291 51800320 50382391 48891927 47546344 46288718 44967419
3955 44967419 43732392 42662978 41476908 40478293 39493093 38618344 37765529 37030464 36313856
3946 36313856 35478516 34856885 34296716 33634799 32888964 32256589 31734856 31256173 30768204
3937 30768204 30309741 29832663 29484456 29164150 28625948 28162448 27940059 27739585 27426578
3928 27426578 27117107 26937168 26727135 26594705 26420764 26293005 26081909 26067473 25913922 25860518
3918 25860518 25676657 25673439 25799603 25763973 25806176 25778478 25820589 25928482 26099470 26261248
3908 26261248 26386182 26482981 26692639 26758486 26951476 27070126 27352412 27656137 27874508 28124362
3898 28124362 28372821 28718038 29186193 29478837 29913062 30288633 30743074 31036044 31249806
3889 31249806 31464080 31724092 31883311 31941731 32205658 32276248 32378439 32629431 32759289 32880571
3879 32880571 33076266 33246991 33431866 33599266 33811000 34036180 34323104 34695486 35260111
3870 35260111 35787023 36185768 36860591 37655545 38421572 39128616 40018521 40916011 41857593
3861 41857593 42852775 44039242 45392146 46618297 47938312 49391420 50875134 52387532
3853 52387532 54161013 56087671 57813472 59633856 61600518 63701299 65863092 67943764
3845 67943764 70092218 72324948 74586049 76844069 78987162 81027506 83224397 85179457
3837 85179457 86917404 88470516 90006171 91397164 92615931 93632448 94437460 95137198
3829 95137198 95616266 96038026 96229994 96530048 96698651 96733758 96858619 96993473 97041193 97074645
3819 97074645 97115289 96867227 96797644 96834051 96699086 96514760 96336383 96424153 96395626 96233536
3809 96233536 96336133 96500908 96803656 97177862 97858990 98646276 99522058 100731212 102146861
3800 102146861 103531194 105267849 107175243 109420679 111505873 113769371 116132955 118468581
3792 118468581 120912131 123258322 125417256 127533078 129309934 130942631 132279501 133251376
3784 133251376 133853888 134025753 133858230 133163937 132058230 130714109 129028556 126945326 124699199
3775 124699199 122018103 119162267 116279022 113231945 110118228 106965792 103764696 100614542
3767 100614542 97456522 94653251 91676005 88537603 85581370 82735560 80037773 77373824
3759 77373824 74743231 72268556 69694403 67282777 64954847 62877770 60717890 58665110
3751 58665110 56672426 54788123 53067829 51462083 49891008 48411319 46850284 45559994
3743 45559994 44363056 43282230 42295807 41301314 40530804 39716798 38975425 38255334 37719066
3734 37719066 37218529 36602949 36110092 35579974 35075013 34769734 34384142 34011561 33616790
3725 33616790 33319486 33174785 32804134 32454754 32142930 31728664 31499451 31134301 30786333
3716 30786333 30605528 30140137 29574198 29135094 28762008 28189742 27593901 27029470 26599625
3707 26599625 26162459 25596910 25000788 24409099 23978537 23446087 22942285 22415750 21915379
3698 21915379 21467803 21025052 20602945 20097487 19699621 19502576 18939431 18531134 18234721
3689 18234721 18046670 17755856 17351537 17164850 17114902 16943155 16623795 16330523 16179466 15996877
3679 15996877 15850186 15774921 15579938 15556361 15544251 15385496 15224208 15121885 14965915 14829996
3669 14829996 14870078 14771712 14582923 14515995 14466236 14373251 14240788 14204555 14234408 14139605 13945393
3658 13945393 13840146 13992747 13959445 13799997 13744283 13834414 13733891 13614148 13729994 13686401
3648 13686401 13731433 13896793 13942216 13978672 14111250 14101859 14188297 14464716 14621589 14668710 14755099
3637 14755099 14864183 15074662 15365278 15583149 15798428 15896930 16114579 16198864 16379551 16670521
3627 16670521 16954503 17232860 17475559 17804936 18140690 18426591 18816301 19315351 19864143
3618 19864143 20323745 20764903 21384863 21993191 22529304 23143122 23917342 24444058 25049067
3609 25049067 25678182 26415550 26932611 27581463 28152228 28799415 29480866 30237218 30752713
3600 30752713 31118257 31597787 32068366 32576830 33033754 33348641 33587904 33858797 34100772
3591 34100772 34364735 34606654 34721354 34952535 35310975 35742252 36008384 36317892 36672933
3582 36672933 37108485 37756139 38208422 38755992 39377129 40057238 40721939 41779449 42926573
3573 42926573 44112709 45287120 46617536 48240480 49933840 51852970 54000252 56358641
3565 56358641 59126752 62101855 65174342 68573816 72300220 76186536 80343871 84996297
3557 84996297 89770389 94877310 100128789 105644701 111368715 117323126 123395018 129580732
3549 129580732 135577829 141552373 147351037 152844276 158135327 162952690 167477950 171320790
3541 171320790 174806231 177578357 179787739 181310699 182155349 182283175 181871241 180748767
3533 180748767 178904728 176570929 173822370 170447624 166809642 162774310 158394737 153556280
3525 153556280 148479761 143554685 138191515 132767749 127675533 122801050 117968588 113313012
3517 113313012 108916582 104860267 101058130 97581658 94379465 91407494 88886248 86656332
3509 86656332 84572300 82703030 81189529 79899699 78802482 77862056 77215486 76587413 76141667
3500 76141667 75830216 75662981 75592997 75595752 75708539 75676803 75633200 75626584 75760730 75788249 75936841
3489 75936841 76160553 76286773 76307629 76627140 76894472 77317147 78018681 78761209 79643163 80640771
3479 80640771 81339267 81424851 80617876 79380120 78511128 77846464 77393163 77066162 76158994
3470 76158994 74250287 71729838 68689604 65597658 62852702 60328661 58177101 56452701
3462 56452701 54995638 53923083 53154395 52422322 51977677 51914794 52165804 52498544 53235769
3453 53235769 54394118 55965580 57585334 58680644 58967936 58799813 58985958 59651876 60601653
3444 60601653 61546377 62328121 62389120 61380206 59873977 58139827 56560010 55224440 54148897
3435 54148897 53514662 53039929 52608160 52140450 51812097 51572639 51496040 51246165 51014029 50623993
3425 50623993 50260895 50021509 49623414 49471007 49283939 49118321 48941058 48828282 48542765
3416 48542765 48135639 47876571 47647070 47616250 47625277 47716210 48031822 48459235 49257584 50032455
3406 50032455 51007957 52192361 53772780 55479212 57346171 59492243 61780229 64383745
3398 64383745 67315400 70587669 74156053 78120138 82086050 86533538 91359669 96241656
3390 96241656 101161183 106015228 110741719 115094006 118497826 121116579 122311188 122206702
3382 122206702 120976178 118711875 115643801 111976971 108020509 104101491 100239181 96647198
3374 96647198 93409069 90350521 87597292 85236825 83017913 81212891 79647973 78165631
3366 78165631 76993135 75912817 74881435 73741635 72790489 71766902 70881727 69982962 69133505
3357 69133505 68190948 67226382 66279782 65453370 64723133 64241710 63723722 63311761 63176201
3348 63176201 63166561 63032802 62793980 62641459 61892019 60884102 59537839 57857842 56120640
3339 56120640 54474121 52948728 51539459 50067154 48515360 47048195 45469336 43937198
3331 43937198 42129035 40124263 38529923 37313383 36331061 35418477 34631239 34165690 33769017
3322 33769017 33553377 33599271 33650264 33704204 33731199 33665050 33356072 32652873 31861969 30924783
3312 30924783 30125078 29521400 29114919 28853897 28339035 27886056 27183648 26321283 25338843
3303 25338843 24155239 22928894 21999390 21249833 20614106 20041082 19659399 19408687 19036103
3294 19036103 18650097 18221477 18164507 18016766 17781430 17488189 17351173 17220268 16862643 16677541
3284 16677541 16338997 16022883 15744301 15476162 15180316 14905105 14614057 14376677 14068717
3275 14068717 13869756 13558784 13332957 13054692 12911680 12910750 12765048 12452037 12269150 12170590
3265 12170590 12025687 11942795 11700809 11771333 11694182 11569619 11498836 11358223 11261442 11186754
3255 11186754 11187044 11299144 11183919 11007186 11007163 11015253 11017629 11029886 10862474 10802375 10781156 10690425
3243 10690425 10686826 10717851 10710363 10729572 10629938 10445929 10521831 10592228 10461715 10467121 10498358
3232 10498358 10514225 10402808 10377055 10424418 10446017 10344265 10407493 10367314 10336317 10474865 10649528
3221 10649528 10714290 10775563 10725630 10824642 10974513 10965074 11071485 11033137 11110583 11052324 11082670
3210 11082670 11232103 11392721 11571367 11724964 11795657 11867910 11952836 12254255 12417704 12536767
3200 12536767 12714674 12867947 13004401 13264257 13489144 13620836 13758870 14204301 14578178
3191 14578178 14962940 15324093 15564683 15810422 16142131 16484096 16819982 17199404 17616469
3182 17616469 18056469 18387860 18786852 19032542 19580353 19994453 20322701 20930215 21560715
3173 21560715 22193280 22672113 23211366 23852703 24498099 25215968 26047465 26932545 27729526
3164 27729526 28599767 29588634 30601764 31721788 32767038 33760200 34951193 36330253 37801840
3155 37801840 39393041 41145824 42853461 44815984 46977958 49109330 51478462 54081789
3147 54081789 56757756 59832718 63142826 66852131 70848845 75198113 80088715 85434940
3139 85434940 91506137 98186019 105545771 113483165 122208887 131810222 142081903 153349049
3131 153349049 165499693 178659121 193131062 209034696 226557063 245647561 266226890
3124 266226890 287704895 308932068 328689491 344939199 355259806 357940933 352173252
3117 352173252 339125226 320890850 300133217 279172074 259330021 241378741 225270386
3110 225270386 211074995 198506530 187354814 177649245 168950254 161300634 154547231 148719627
3102 148719627 143781824 139566758 136020311 133308636 131226035 129792875 128914929 128413006
3094 128413006 128345897 128543970 128754474 129170670 129310954 128804294 127987834 127133017 126092007
3085 126092007 125023444 124501435 124343006 124781344 125612599 126713832 128000173 129941055 132521695
3076 132521695 135867331 140323816 145568688 151772369 158776848 166438525 174712147 182973373
3068 182973373 190740339 196827319 200339278 200357928 196717815 189655427 180265881 169859182
3060 169859182 159065782 148736456 139268437 130718483 122961164 116158643 110187860 104810208
3052 104810208 99751350 95138182 90754464 86506360 82070618 77761315 73492727 69514599
3044 69514599 65815723 62501553 59455495 56408368 53813582 51346074 49079817 46970113
3036 46970113 45317914 43660200 42307367 40946003 39591216 38488766 37392743 36268105
3028 36268105 35209005 34107352 32917583 31644489 30452048 29317670 28330962 27318941
3020 27318941 26258461 25444807 24592067 23921253 23320449 22597760 21827759 21359357 20736418
3011 20736418 20056148 19510304 19099142 18596361 18184690 17816771 17247836 16895084 16528097
3002 16528097 16085818 15874412 15446711 15023470 14607283 14368791 14129496 13745486 13624285
2993 13624285 13316982 12942600 12660343 12364376 12195861 11863898 11740876 11569690 11228985
2984 11228985 10978625 10899786 10725160 10454093 10344149 10000941 9802299 9682565 9424915 9134167
2974 9134167 8944009 8789683 8664785 8569400 8468616 8350564 8149920 7969007 7674078 7510917
2964 7510917 7408463 7357450 7133314 6984462 6973350 6802472 6886023 6878608 6680908 6367876
2954 6367876 6270590 6211316 6156329 5933122 5866782 5773605 5683407 5666534 5636993 5512952 5325356
2943 5325356 5232836 5223441 5219259 5065931 5005495 4832699 4762606 4788153 4666156 4537104 4299998
2932 4299998 4229329 4212022 4110713 4093793 4208213 4298067 4091672 3855829 3854934 3857923 3776979
2921 3776979 3765620 3796272 3660672 3607124 3529042 3433293 3446086 3295454 3194452 3345848 3385025
2910 3385025 3198623 3194910 3136103 3046087 3102030 2986227 3048692 3117470 2823352 2769341 2778460
2899 2778460 2934001 2878216 2793516 2740035 2718374 2733401 2584270 2517595 2530148 2547460 2630072
2888 2630072 2680154 2603841 2457813 2399627 2441187 2365029 2268146 2278021 2266380 2137778 2212188
2877 2212188 2258460 2191828 2245764 2231281 2155479 2126511 2051577 2083207 2034254 1962639 2065013
2866 2065013 2109870 2113870 2095219 2084175 2122996 2167442 2192624 2273358 2210039 2180486 2220718 2259362
2854 2259362 2200441 2186564 2188802 2251463 2229540 2249982 2362582 2643813 2655964 2652188 2712224
2843 2712224 2705582 2788238 2843257 2987663 3100165 3070285 3198290 3159903 3079269 3169715 3129816
2832 3129816 3138862 3187209 3018493 2766307 2578926 2470555 2407679 2311333 2303482 2237790 2149934
2821 2149934 2030059 2061457 2012403 1993973 1980712 1900230 1895762 1921088 1840781 1769708 1752372
2810 1752372 1813939 1807914 1875428 1762637 1760116 1718085 1721719 1632049 1732664 1722280 1660997 1692065
2798 1692065 1655986 1715744 1737141 1647874 1594591 1638982 1726883 1683797 1695794 1652564 1662511 1721260
2786 1721260 1659371 1770754 1752238 1700445 1627896 1740506 1896303 1772689 1751102 1673506 1628400
2775 1628400 1531082 1435892 1524642 1623780 1489915 1456886 1416029 1359004 1229333 1148594 1152210
2764 1152210 1150783 1225800 1141926 1150629 1007049 997789 1018156 1106288 1013810 951547 943285 913522
2752 913522 1049679 947541 717787 789715 881872 826302 842066 849972 839378 795450 853870
2741 853870 956448 875015 841899 785044 711323 623195 678457 554506 759006 876969 799196
2730 799196 695381 563763 709913 711773 707404 623773 670644 710484 684952 636275 608141
2719 608141 650335 636469 571103 567302 497294 458542 569819 626597 569145 565868 687675 681423
2707 681423 564772 434766 477381 575504 649808 503074 544216 595672 552855 476133 579421
2696 579421 550474 410263 355145 439481 502253 573421 507754 530945 448794 327828 397326
2685 397326 453196 580560 515190 437693 271189 196581 309215 326020 383140 409821 551653
2674 551653 527941 492972 233900 330663 503701 398585 389692 415154 405492 193129 255568
2663 255568 428527 384802 261202 191175 200362 457445 494608 453214 266118 192990 285709
2652 285709 210629 273522 369067 252118 376811 322179 378374 397878 505689 515501 457540
2641 457540 455272 268119 187144 234461 275622 301361 344434 268965 233899 267415 314080 295378
2629 295378 151031 260204 350970 303978 392413 442558 188651 154900 209580 205777 248546
2618 248546 128358 152587 277226 288491 270210 115719 70606 87279 146482 273642 252065
2607 252065 109652 171403 145543 273413 165611 232411 258507 108099 173024 217478 149395
2596 149395 214395 170609 185669 58788 235574 194564 47750 137148 58814 90538 46829
2585 46829 196936 203896 207095 131224 156623 146380 179073 222602 140750 122930 196818 186753
2573 186753 10847 11869 123524 25419 162608 51772 105522 131543 -89177 -67284 177583
2562 177583 194056 248217 158676 127173 103643 147383 205871 63859 37068 63510 91681
2551 91681 107387 147838 167063 240663 232569 126628 64107 82749 51240 77199 166588 119264
2539 119264 -56940 24902 77759 39012 105190 42394 80583 -7409 83296 19882 -74444
2528 -74444 -16775 -67743 -173751 -125519 -124281 -97106 34670 21245 -56476 18049 97711 45993
2516 45993 115638 136777 75499 -129139 -41255 -20734 -25986 110812 186017 152496 30515
2505 30515 20535 1049 1313 -9750 22386 -91515 -81000 -4304 -48616 -29510 -27178 -6095
2493 -6095 75668 85712 96041 -14322 27322 31283 106689 165769 134146 64394 77709 74498
2481 74498 108684 147870 184650 83168 53713 -18736 29021 67470 -5719 -45730 -31747 -6176
2469 -6176 -78128 8038 13724 147053 94383 127054 48894 -112533 18441 172561 85546
2458 85546 107397 86760 136226 63877 44828 20969 17827 77279 29461 -84545 -116688 -68871
2446 -68871 -72701 98673 192733 105710 100110 1190 115125 96355 188655 115353 61875 136013
2434 136013 46707 10403 -191174 -125136 -21542 22491 -67837 -12276 5282 -14215 -108424
2423 -108424 -266568 -74511 -12148 39190 36173 -10468 -24897 57328 57842 26800 -10103 97916
2411 97916 199929 287081 231371 135647 113725 6016 44791 60445 71740 41400 -65371
2400 -65371 -40601 -11773 20614 10978 8761 45881 43237 82994 101232 87603 46383 20794
2388 20794 -19379 -57803 -61906 -165004 -187052 -92567 -26005 -14475 -3115 -42419 -30190 25458
2376 25458 106072 98928 41496 135369 141602 128592 995 -77779 -63978 -22022 63589 155732
2364 155732 177198 134950 135086 105132 145627 219362 123166 111842 123722 88762 67996 146021
2352 146021 234881 174747 178385 213404 76652 161629 146806 149617 145067 128230 27561 48502
2340 48502 43504 139197 185774 176168 312335 286144 282791 165861 326293 322624 203306 201858
2328 201858 259911 315269 354468 433725 355016 242147 300127 333413 297382 250344 450837
2317 450837 608994 486274 591308 723396 676179 758426 800268 761703 888945 853625 852452
2306 852452 1000894 1199826 1200311 1335990 1514812 1519760 1613005 1840158 2066032 2383203 2674776
2295 2674776 2865737 3034309 3298866 3731311 4138884 4674098 5096843 5565427 6236067 7217436
2285 7217436 8475584 10156237 11993024 14104788 16641599 18819459 18400904 15011125
2277 15011125 11747752 9486366 7978106 6909410 6111259 5494081 4849605 4289264 3951809
2268 3951809 3798392 3713481 3528237 3263464 2959304 2734640 2592059 2357473 2165329 2095532
2258 2095532 1855204 1738894 1635629 1617261 1450405 1137437 1136975 1166472 1009045 992786 1031106
2247 1031106 919756 791995 883308 952631 788733 688290 645293 709611 773169 710505 738229
2236 738229 597335 547135 591883 406300 406691 340164 273325 301825 269441 230448 207977 165087
2224 165087 219391 204291 82576 164524 238725 274538 431496 339156 357472 421712 375213
2213 375213 263441 149484 164986 240924 373920 448616 182509 166801 262359 264805 271494
2202 271494 124494 31335 72908 20062 66681 129282 146566 26933 83193 163156 112394
2191 112394 32546 -18554 117696 5458 -41085 103574 135740 146048 199971 195135 42524
2180 42524 -35130 89357 223985 158167 121382 154385 182029 19381 -140727 -41745 6885
2169 6885 -71521 -9795 73099 -29927 -189182 -154508 -32718 -20138 -75827 -82928 -25862 22499
2157 22499 -28143 -4590 40301 36808 -61609 -160555 -133358 3975 67021 83274 -14686 -11017
2145 -11017 111854 83494 113760 170741 33274 -47662 -8510 32786 167461 106283 -64213
2134 -64213 -64043 -38221 41055 17903 -103753 -69542 -65397 -186292 -123016 3190 -17360 -21668
2122 -21668 29004 49217 -81032 -57394 61594 -32666 -3538 -37741 -82384 -74840 -178482
2111 -178482 -181899 -76568 20015 34994 -43144 -124448 -107066 -186541 -42468 21881 84649
2100 84649 -69833 -63166 -53748 -68942 -41012 -133494 -135559 -34446 66365 280785 170698
2089 170698 69219 89008 162664 -60627 -184242 -123648 -102932 -92306 -118752 -15904 -53572
2078 -53572 -158893 -227229 -290414 -283351 -143840 -84857 -88837 -96449 27399 73109 6397 -106460
2066 -106460 -153086 -185475 -124168 -12293 -171849 -228718 -165973 -113718 -142056 -67943 26806
2055 26806 -36431 -135266 -84667 -73582 -184758 -180644 -72533 -186793 -162058 -181197 -214847
2044 -214847 -190799 -146186 -32851 34115 -13226 19550 26355 -59946 -17703 -1329 53955 196852
2032 196852 212645 -9956 -56058 -93641 -55278 -24864 -69431 -68738 -77063 -52402 -27434 -115782
2020 -115782 -68195 -69843 -14964 -25280 -128552 -63702 11903 -35602 20980 -26834 -3470 -20996
2008 -20996 -68519 -19390 -134400 -137262 -98979 -58730 -131181 -41588 167018 85189 60288 31709
1996 31709 -67432 -106886 -56684 -98006 -111261 -142460 -239322 -121988 10043 21960 -47744
1985 -47744 -216793 -114599 -241809 -131331 -29662 -45278 -134245 -43119 -36844 -98323 -133370
1974 -133370 -117849 -76478 -74356 -97025 -169417 -218971 -267116 -224853 -138025 -87099 -104326 -124258
1962 -124258 -131621 -185866 -47006 -55644 -108815 -137713 -153337 -140723 -60093 91210 -18815
1951 -18815 -8496 15297 17561 -38345 -152120 -28863 -90764 -240840 -181222 -164137 -81963
1940 -81963 -176051 -213607 -198942 -157566 -219090 -253209 -137382 -145189 -172512 -110431 -34254 -13310
1928 -13310 -66072 -125367 -54827 23977 68235 59289 -83451 -137379 -88724 9279 -162707 -123958
1916 -123958 -112227 6964 -71192 -11370 -11923 1904 81322 11206 -12912 -47588 -146517 -169363
1904 -169363 -80508 -87671 -132998 -142120 -94558 -228772 -292019 -275508 -86551 -157817 -232954 -52629
1892 -52629 -142947 -167499 -110413 -189222 -61555 -36096 -59255 33456 -35448 -32548 -2244 -17378
1880 -17378 -106674 -148414 -137867 -243977 -170120 -36879 -24048 29064 -11743 -203017 -134532
1869 -134532 -82840 -10905 15412 -71217 9769 28785 72992 -96557 -181471 -153115 -49907
1858 -49907 -17837 44442 -138134 -72436 -23820 13137 -43147 -82447 -170432 -206748 -188209 -137643
1846 -137643 -122646 -172124 -122194 -146072 -102698 -137791 59473 -29501 -164568 -172654 -242669
1835 -242669 -214811 -119998 -33814 81084 64603 -50024 -167361 -82162 18752 -19966 -86494
1824 -86494 -178006 -195034 -169782 -168021 -122198 -171798 -81369 -7994 47979 27476 13689 -86459
1812 -86459 -126543 -172400 -176727 -152241 -95878 -24412 -61351 -124513 -135531 -19371 94100 63491
1800 63491 -40621 -148211 -35337 -128542 -94675 -28812 28299 55181 -37612 -104750 -180375
1789 -180375 -74369 -35075 -75831 -74411 -93884 -63610 -83033 -44336 -98165 -180757 3292
1778 3292 60884 -88264 -172219 -221344 -193504 -184942 -203392 -150989 -161458 -69567 -124216 -178908
1766 -178908 -123096 -74161 -213934 -325371 -199161 -147872 -149155 -77047 1973 38496 -73345
1755 -73345 -107702 -170544 7187 -1366 -21498 -33495 -64708 -54045 -69396 91284 -142251
1744 -142251 -162373 -41345 -124125 -211403 -102142 -5554 17393 -13836 -44106 69280 28889
1733 28889 -103435 -181849 -108916 -146192 -50114 -28975 -141612 -110501 -40381 -271775 -256913
1722 -256913 -173435 -218151 -126468 -95103 -79011 -82799 -140928 -192494 -108155 -152867 -109031 3039
1710 3039 -130076 -151321 -127398 -218694 -255447 -192936 -41648 -55283 -162082 -56445 -11050
1699 -11050 -148515 -93298 -155388 -149864 8428 -13099 -143965 -265426 -222244 -177928 -223229
1688 -223229 -100263 -128855 -60840 76998 92775 59572 34780 27173 -38120 -219021 -214213
1677 -214213 -270409 -230811 -190340 -195996 -169148 -99867 -22893 124882 22150 -104223 -25880
1666 -25880 -68387 -100438 -223220 -198446 -166214 -211886 -184824 -21669 -70147 -105293 -168983
1655 -168983 -107896 -9053 -5737 -22500 -33960 -51392 -184154 -171647 -91632 -123180 -171686 -123815
1643 -123815 -91003 -35831 -32951 -130502 -246183 -308494 -374032 -372023 -362348 -337582 -249622 -83559
1631 -83559 -9931 -126028 -135791 -228906 -147186 23770 -8442 -52828 -122024 -128954 -96885 -37945
1619 -37945 35905 109511 31391 -140587 -228429 -244343 -142913 -21490 117938 -7015 -99112
1608 -99112 -75875 -10476 -206572 -197830 -95794 -54197 -38644 -69654 -56939 21670 -21338 -45136
1596 -45136 -213023 -247131 -162018 -209265 -247810 -273039 -205083 -241982 -183006 -129784 -169031 -58357
1584 -58357 -82750 -92227 -131608 -97163 -63743 -2662 -132585 -220148 -210941 -144620 -177868 -172858
1572 -172858 -21384 -3435 -197118 -244982 -99848 -119879 -208321 -146489 -83237 -185988 -48546
1561 -48546 -163673 -45236 -66496 -100419 -62810 -254950 -322903 -251225 -144529 -196309 -191796
1550 -191796 -104329 -141026 -194110 -263228 -93641 -5542 -128019 -130931 -200838 -157807 -124292
1539 -124292 -123908 -68012 -133396 -84583 -231783 -178891 -93680 -97705 -53187 -31633 -63854 -139060
1527 -139060 -123667 71273 49518 -1622 -55691 -48995 -119877 -37186 11963 97987 4847 -44788
1515 -44788 35125 -127098 -132870 -196057 -122599 55144 -95041 -126521 -125736 -80818 -46251 53680
1503 53680 46389 -56022 -96718 -62534 -52981 -83035 2390 -69891 -300127 -254100 -314589 -169556
1491 -169556 -18524 -170993 -177191 -66791 -141274 -175746 -118783 -124534 -114817 -124420 -90912 -145827
1479 -145827 -21855 58199 8096 -94754 -127942 -94238 -47372 -30407 18133 -71676 -95821
1468 -95821 -253250 -128152 -83605 -193489 -135477 -91018 -29094 2198 42527 -23588 -59696
1457 -59696 -130059 -207975 -217319 -195916 -114557 -37062 -78483 -97801 -88650 -118812 -75414 -161125
1445 -161125 -90854 -148238 -91459 -128695 -63507 20787 51921 -27194 -70157 -121947 -166836 -246881
1433 -246881 -88249 -82163 -44554 -86035 -161131 -4599 -33703 -66958 -134998 -55797 -172812
1422 -172812 -122706 10725 22310 -18665 -20792 -62911 -2965 28774 -47544 -100294 -230702
1411 -230702 -127930 -18686 -47146 -36560 40255 -22793 20239 -14610 -121894 -8109 50698
1400 50698 18344 62767 48389 111858 29299 -107600 -65799 -13591 44098 65529 84910 -37714
1388 -37714 -62487 -92726 -20532 -52764 -116933 -63176 -204502 -175364 -94769 -19320 4695 -39571
1376 -39571 -67902 -119334 -162420 -95747 -37364 -137971 -135577 -25622 -47867 -79249 -78789 -19483
1364 -19483 -83072 -105982 37676 -83791 -59275 -96555 -212904 -217583 36705 71767 -172978
1353 -172978 -209617 -74775 60886 50836 4858 -154746 -71191 -30149 22129 122595 171906
1342 171906 48348 -3419 23374 -57729 -2678 -43166 -36049 -90667 -143390 -202640 -171520 -55876
1330 -55876 -70392 -106439 -46883 -37202 78090 74404 142877 55323 -55485 -131345 -49869 -73752
1318 -73752 -66395 50918 -32922 -58102 77210 104451 -51264 -42714 -52334 -95942 -108807 -93425
1306 -93425 -51938 -51903 -124376 -145277 -107971 -14797 -47906 -103651 -81846 -96531 -98916 -47477 9321
1293 9321 108883 201253 8903 7649 -36030 -20357 -18171 -113069 -67837 -158682 -123118 -54493
1281 -54493 -81349 97719 105719 13777 -95326 67930 62913 -48273 -63215 -60604 -71348 -73795
1269 -73795 -50651 -93207 -58116 -144026 -130398 16970 -6911 -81697 -86242 -188088 -174104 -69654
1257 -69654 -15088 -980 -101477 -91711 -68049 -44530 -113613 -38023 -62849 -54174 -25396 -86494
1245 -86494 -112640 -104539 2893 7721 -83968 -159567 -92080 -120897 -82554 -25616 -33167 -69288
1233 -69288 69237 -7561 -81720 -127533 -172249 -84412 -19918 -94094 3680 51127 93404 57133
1221 57133 1741 -88123 -147401 -247481 -175911 -140856 -164055 -112809 -118976 -91775 -151473 -173145
1209 -173145 -116627 -189482 -56817 -179666 -104381 -90222 -238060 -228036 -99180 -201573 -246378
1198 -246378 -131512 -254002 -150854 -56058 -192030 -203016 -114541 -285248 -312677 -91295
1188 -91295 -100135 -17024 122053 -41216 -116173 -64719 -7868 24599 -49925 -14524 -116072
1177 -116072 -109887 -108172 -3228 -3519 -17079 93974 104830 47840 -89346 -133648 -151306 -100902
1165 -100902 -59291 -172065 -137494 -3484 62463 39522 -99924 9554 5216 19985 96626
1154 96626 141668 -88102 -248408 -106671 34621 -6435 -74390 41124 -26121 -88814 16925
1143 16925 -66162 -780 -45729 -27473 -37320 -118466 -26447 26133 -70715 -26483 -27686 55585
1131 55585 -26223 -19774 31307 -7028 -110265 -197097 -177490 -10846 -69532 -39871 -25863 -92186
1119 -92186 -83911 -117051 -107322 -182337 -104620 -117286 -91449 -67101 -248338 -291913 -214419 -193049
1107 -193049 -190281 -168875 -199489 -43919 -1663 34770 -63618 -29119 -61772 -105617 -126221 -178580
1095 -178580 -209591 -146555 -50411 -93601 -173109 -57148 41795 -92722 -55018 -163892 -6351
1084 -6351 -8211 -23993 -38603 71539 -44755 -138820 38294 161585 90949 39581 67491
1073 67491 13339 -54643 42526 -75048 9569 40401 -60975 -90926 -56696 2072 -52697
1062 -52697 -20250 -164118 -64979 -68173 17598 6076 -87598 -121397 -58782 2667 -62329 -146749
1050 -146749 -104045 -34995 -51951 34609 103069 87034 46522 -19763 -135050 -103489 -36035
1039 -36035 2380 -167611 -200275 -142922 -186128 -78312 -67578 -134404 -198133 -153083 -133784
1028 -133784 -68357 52731 0 50641 -15292 -137310 -117554 -156884 -17570 -162384 -166504
1017 -166504 -151018 24261 35547 -31455 -236454 -235515 -156287 -194745 -112243 -119500 -83993 -53415
1005 -53415 49992 2579 -59235 97118 123125 -3179 54457 -8452 -3821 -122212 -74473
994 -74473 -42315 41325 8492 -59237 -87750 -30284 -190812 -155063 -95455 49532 -9064 -123579
982 -123579 8031 -43645 -39762 -6381 -85331 -149962 -190076 -182193 -180000 -241607 -239078 -72350
970 -72350 -124222 109601 109005 -25366 -19333 27253 -63270 -62957 37276 -60948 -157372 -210858
958 -210858 -174104 -143854 -185667 -144540 -5351 -44745 -143275 -6935 -27088 -135043 -160424
947 -160424 -255599 -200001 -187631 -206829 -82783 7905 -49002 -104962 -220521 -183065 -139957
936 -139957 -141684 -113024 -92753 -194881 -98971 53284 -72981 -168110 -94931 -74853 -81621 -281867
924 -281867 -247242 -100734 -69298 -88749 -118386 -89174 -65736 -142615 -108003 -62382 -121702 -106961
912 -106961 -79342 -250465 -128504 -46272 -33773 -178864 -219298 -232680 -118526 -162592 -135063
901 -135063 -106662 -16765 3297 -40466 3323 -53053 689 -28587 -133908 -128371 -75019 -146028
889 -146028 -95049 -51076 -2469 -30739 -55818 -124769 -6502 373 102650 197445 -24576
878 -24576 9221 -14147 -1970 -110431 -72975 4076 -87617 -126566 -222304 -104284 -76448 -79238
866 -79238 -92036 -78618 -145912 -26645 54313 37008 41428 -108737 -58024 -2892 -88566 -96655
854 -96655 -172696 -47317 -69596 -89393 -218068 -310736 -87916 -62709 -65430 -172460 -41627
843 -41627 -22341 2480 -30689 -141629 -143119 -10385 -136837 -174978 -37041 95881 47138
832 47138 -19436 -103345 -160013 -23471 -120301 -116155 -23461 47676 23355 38130 -20075 -837
820 -837 3627 -14679 -39505 -75394 -125925 -64445 -104392 -18615 -34778 -106275 -166587 -192263 -102211
807 -102211 -41083 16579 53088 100235 131769 119035 -37132 17287 -120192 -61619 44996
796 44996 54719 38083 -44930 -98213 -51577 16468 -212485 -173761 -140821 -51365 -83812 -215444
784 -215444 -99731 -45930 -80430 -38275 -5045 -55186 -56468 -16160 -48417 -22075 36658 169632
772 169632 24597 43902 1249 54418 77946 5739 16878 -14450 -44051 -113272 6907
761 6907 -87680 -236757 -142457 -76682 -120102 -15281 -18257 -39408 85630 -19457 -237028
750 -237028 -182408 -117481 -15738 42190 -56522 -14962 31285 -60887 -43672 -66772 -80574 16039
738 16039 -37466 -23786 -27699 52785 70745 19603 -34339 -82019 -70296 -56604 -175371 -74322
726 -74322 92735 21892 -12515 -121505 -141474 -179102 -140231 -178593 -159529 -53197 -49236 24277
714 24277 -56256 -66098 -98212 -121424 -228526 -238545 -253666 -247701 -125822 -98853 -146909 -161009
702 -161009 -44072 9668 -3657 -96521 -61125 -71103 -157953 -209612 -201220 -91683 88835 59513
690 59513 39918 -123363 -88807 -124062 -74206 -88748 -119340 -90600 -15406 685 -37964 26018
678 26018 -91554 -147552 -90170 -177079 -182147 -59169 94202 278144 133488 -22157 -22173 13559
666 13559 81221 69077 -87208 -129009 -125623 -177500 -84493 -128659 -197896 -117772 -181760 -98742
654 -98742 -91467 -144079 -91934 -113457 -65595 28647 56914 51615 -13309 26240 -15541 -95738
642 -95738 -53576 -178643 -172352 -185033 -155664 -12794 38768 -25116 -172221 -126078 -70096 -155428
630 -155428 -154413 -12844 45497 -60420 -50090 -52371 -26956 -37324 -77350 -56919 -7556 -115520
618 -115520 -144313 -64299 17411 11054 -38926 92926 104362 -5024 -21218 -105132 13363
607 13363 -5328 -194328 -13089 -925 -20915 49325 -17818 -84771 -94204 -99547 -104002 -184780
595 -184780 -121499 -136325 -122138 -21815 43338 171475 92526 119 57790 -23018 44346
584 44346 2714 -171404 -137399 -130441 -50127 -92608 -167349 -20841 80128 -51421 -39711
573 -39711 -2202 -33583 -104718 -67269 16046 130982 -56231 -80887 -326 -27828 -68118 -166534
561 -166534 -76488 -69129 -59672 -152680 -167753 -141231 -37302 -7747 25046 -153608 -187949 -217347
549 -217347 -208451 -142132 -8232 -14566 -51024 1474 21323 37301 105812 -35135 -138882 -59655
537 -59655 -93944 -171765 -161208 -212429 -90611 -117078 -119818 -277725 -236861 -157006 -155816 27774
525 27774 -40096 10472 -83221 -119229 -31907 15271 2949 -33100 -111206 71994 54144 -106920
513 -106920 -121356 -115948 -190877 -53570 66287 12321 -55279 -134168 -231992 -289175 -10910
502 -10910 -39667 14833 166415 221547 143689 103345 104003 22199 -66284 -56545 -75524 -53477
490 -53477 99742 -6779 -85852 -79268 -88754 -91682 -65184 35759 26286 -125295 -121381 -28817
478 -28817 56620 138307 116093 5217 67399 -142535 -142582 -55480 -54818 -102670 -92915 -79264 -78712
465 -78712 -85652 -115650 -30325 -3199 -37174 -140524 -44548 16345 2729 54430 34090 86126
453 86126 -33844 23440 -35538 -108933 -35814 -58621 -31888 160043 32796 5966 85439
442 85439 161027 123193 76401 54121 -52607 -53299 -118553 -84836 -35488 -182663 -35338 46215
430 46215 -94758 -75945 126959 137889 50519 -15430 -66091 -70037 -96270 -93818 -17730 -41066
418 -41066 -116591 -94688 -135155 -136991 -286890 -177268 -198752 -202379 -174600 -116722 -116893 -43143
406 -43143 -36976 -49295 35715 -50231 -100123 103422 202131 185272 107815 80686 -19454 -118025
394 -118025 -105321 -99571 -70310 -141751 -152488 -220707 -92387 -62761 -121929 -99742 -100846 -49803
382 -49803 -45731 -26787 58646 92447 -26585 -102456 -85391 -16847 -151136 -291738 -170197
371 -170197 33796 -12698 -100844 -81271 -65554 -22300 4950 -18971 55826 39247 34797 -16587
359 -16587 -198292 -31702 14975 -10715 67586 -75619 -141920 30224 15783 -24835 30259
348 30259 89464 -7450 -43030 -54589 -142992 -62665 -945 -28773 -42797 -2520 7436 227853
336 227853 114887 -18011 -73355 -65161 -114649 -119254 -140858 -134591 -72854 -127976 -112998 -154150
324 -154150 -200576 -77853 -98671 -99978 -91650 -156374 -40858 -35079 55801 32904 5647 28648
312 28648 -76554 83662 54008 87138 135615 58327 112147 121407 -25577 -62078 -140741 -219585
300 -219585 -94982 -103526 -118738 -73563 10108 -98202 -152207 -250245 -187737 -121061 -83390 -166290
288 -166290 -121137 45878 38166 18883 -117541 -4689 -4992 -125893 -155534 -47163 -121852
277 -121852 -261842 -183454 -59345 7064 -81220 -45646 -65073 -74631 24907 34070 -72616 -162381
265 -162381 -60909 -30003 -168996 -173602 -199295 -49285 62309 -53445 -145439 -125920 -179387
254 -179387 -32909 86963 115038 87410 68292 -96494 -103968 -48586 -46570 2855 -44559 -68058
242 -68058 -24080 -51895 -143951 -81341 -4338 9079 -50972 -34083 23250 -13521 -189796 -142625
230 -142625 74537 137815 92514 -51198 -31825 10377 -44749 -139903 -208902 -124429 -89251
219 -89251 -110779 -129973 -188104 -154654 -89015 -65002 17667 58258 17637 -13765 -6765 -20761
207 -20761 -134472 -153968 -246103 -118533 -41984 -115855 -91365 -94192 -105671 -75582 -28553 -21181
195 -21181 98903 59824 9935 -43688 117841 149718 -369 -86156 -179838 -161927 -141170
184 -141170 -15343 -37944 42555 -92565 -128999 -107520 21390 24362 -12181 -69101 -88101
173 -88101 14614 -55354 -15708 -99517 -115020 -86906 -40657 -173456 -211766 -159491 -200585 -165222
161 -165222 -121826 -173672 -172454 -334422 -395313 -308226 -128186 -151891 -132869 -115706 33269
150 33269 -37237 -158806 -215006 -133581 -74231 -148920 -285718 -230937 -145942 -167266 -197848 -134742
138 -134742 -228935 -263973 -301664 -218242 -165591 -121556 -70244 -197734 -304858 -282926 -160095
127 -160095 -177640 -163778 -57677 -82463 -106630 -98923 -36870 -130041 -224054 -157934 -293097 -290283
115 -290283 -295841 -281850 -184150 -111420 -127852 -212617 -230198 -270919 -380150 -238439 -214974 -160855
103 -160855 -175581 -159346 -292737 -303582 -294359 -212823 -176931 -189452 -264133 -187340 -55934 -69808
91 -69808 -138725 -170957 -141892 -56131 -62790 -143617 -307849 -276130 -184054 -196664 -194162 -234510
79 -234510 -248206 -136489 -230102 -246435 -229841 -376241 -221826 -269364 -243469 -331857 -389236
68 -389236 -441322 -437276 -378196 -339585 -309887 -379926 -337785 -344309 -322132 -343737 -322171 -319925 -293640
55 -293640 -360531 -385601 -329623 -298131 -331442 -321450 -330238 -313110 -246601 -242479 -262747 -285444 -304597
42 -304597 -337784 -253368 -254151 -341577 -358460 -319789 -327771 -427557 -507424 -489215 -463963 -427012 -358428
29 -358428 -333227 -337783 -386545 -326561 -313065 -330378 -297736 -378332 -371444 -379160 -367769 -412417 -360687
16 -360687 -414088 -497036 -466382 -398506 -401089 -385422 -465948 -473876 -376549 -425420 -415098 -431730
4 -431730 -522955 -458579 -490381 -494657
0 -494657
$$ Imaginary data points
##PAGE= N=2
##DATA TABLE= (X++(I..I)), XYDATA
16383 -2367229 -2358905 -2387532 -2349007 -2336494 -2317796 -2227849 -2162287 -2112077 -2074397 -2006535 -2008558 -2036343
16371 -2036343 -1933706 -2021124 -2022208 -1916566 -1929998 -1856104 -1702087 -1640624 -1691550 -1666919 -1634610
16360 -1634610 -1509032 -1471406 -1552849 -1525501 -1465519 -1366314 -1342629 -1307810 -1212674 -1310448 -1311439
16349 -1311439 -1204927 -1202716 -1214379 -1178606 -1183178 -1153641 -1114387 -1172537 -1062071 -998380 -1017184
16338 -1017184 -1017682 -959512 -815510 -862254 -819508 -740477 -723561 -605527 -593645 -576603 -578740
16327 -578740 -494573 -525334 -586394 -479072 -481740 -529224 -435334 -356914 -283741 -248167 -289613
16316 -289613 -318953 -303530 -183440 -100241 -179429 -118353 8842 -62646 -99483 -150165 -68567
16305 -68567 -5730 -36214 79178 250876 214225 180862 301704 358233 324740 252874 207514
16294 207514 299417 407740 464579 410494 493637 562119 455096 435932 562504 608121 632628
16283 632628 597131 584145 797920 880493 846757 861964 846933 843911 853042 881636 1008475
16272 1008475 944765 904272 950599 1092260 1100118 1047663 1055632 1148458 1111582 1215009 1256237
16261 1256237 1137161 1220101 1222148 1254187 1234648 1231871 1372677 1387284 1312648 1299155 1284101
16250 1284101 1384387 1457041 1456779 1359352 1450755 1562493 1545599 1519879 1572728 1623362 1594630
16239 1594630 1673839 1798479 1841562 1809228 1806483 1780241 1785950 1770361 1745800 1798436 1728290
16228 1728290 1755281 1875574 1719705 1703947 1831005 1868384 1873808 1883905 1965678 2001104 1952301
16217 1952301 1965903 1976975 2073007 2014046 2075824 2087348 1993795 1930919 2018280 2182487 2211715
16206 2211715 2162880 2152185 2205794 2311248 2374646 2219458 2129619 2071885 2197503 2380680
16196 2380680 2344215 2274253 2208825 2212624 2237509 2191844 2284921 2248027 2356214 2339662 2390541
16185 2390541 2438961 2454050 2525170 2300032 2340113 2482276 2415076 2470084 2395169 2429902 2453925
16174 2453925 2487004 2587752 2525264 2597936 2678837 2794974 2702674 2559860 2568432 2560951 2519133
16163 2519133 2476706 2520316 2512879 2517200 2617168 2657972 2538231 2564363 2706212 2646059 2661268
16152 2661268 2678797 2519495 2592646 2667445 2704548 2804608 2808713 2726104 2650421 2750227 2754919
16141 2754919 2741200 2635267 2539517 2736253 2892945 2755997 2754019 2760408 2713380 2800047 2825517
16130 2825517 2829211 2865866 2725818 2529128 2762314 2765128 2761039 2767037 2786022 2820928 2901838
16119 2901838 2892659 2797748 2923574 2803963 2728685 2899435 2947509 2969330 2776053 2883262
16109 2883262 2925663 2909132 2866097 2732300 2883578 2962451 2986583 2860382 2848789 2819335 2839578
16098 2839578 2888773 2811896 2851606 2918466 2863949 2868324 2939451 3068558 2951235 2971572 2868912
16087 2868912 2822058 2894235 2971690 2974710 3005316 2940023 2922769 2851743 2779534 2821383 2903524
16076 2903524 2992172 2998660 2952114 3005969 2958156 2935687 3003569 2946295 2948582 2888490 2917139 2998102
16064 2998102 3002946 2887270 2939186 3010642 2964582 3000477 2977567 2890632 2817412 2956521 2948172
16053 2948172 2784417 2796745 2802273 2862647 3016801 3085816 3066001 2972430 2911162 3013646 2952456
16042 2952456 2691323 2753469 2951553 2961490 2988265 3008966 3047248 2998663 2966768 3171868 3138539
16031 3138539 3070599 2992684 2959535 3005188 2943834 2972771 3039423 2946454 3040308 3020522 2841021
16020 2841021 2871734 2929434 3041396 2937219 2915781 3001642 3019425 2947807 2829443 2792767 2868475
16009 2868475 2770001 2823544 2890194 3044562 3049059 2980422 2873194 3028785 3142379 3257283
15999 3257283 3193091 3076681 3156156 3021284 3044671 3100924 3163165 3111045 2969480 3034909 2976951
15988 2976951 2926494 2931019 3059025 3131686 3093140 3158164 3088485 3023116 3020566 3065579 2974217
15977 2974217 2934893 2943869 2996999 2950090 2900509 2961391 3107660 2918558 3007105 3238733 3026036
15966 3026036 3073528 3051478 3095411 3153360 3102836 3056815 3126257 3162113 3143907 3118031 3110827
15955 3110827 2997971 3124369 3030366 3074687 3140537 3207118 3134888 2976441 3016435 3120177
15945 3120177 3143519 3020613 3032284 2933954 2971605 2831966 2852054 3020238 3045255 3084012 3116670
15934 3116670 3088095 3056971 2948546 2963828 2975583 3049799 3077792 3213675 3294834 3130606 3029541
15923 3029541 3057226 2917750 2977645 2940334 2891909 2835241 2843174 2920342 2967803 2964634 3024734
15912 3024734 3028513 3078712 3120608 3067297 3021697 3072173 3022816 3010224 3058217 3062170 3040779 3024323
15900 3024323 3070823 2917305 2850223 2940186 2823128 2955254 3092251 3033793 3058905 3008810
15890 3008810 2925549 2975680 3120067 3299226 3327785 3139185 3107894 3022015 3021532 3007416 2955326
15879 2955326 3024588 3034354 3076250 3011744 3018886 2955963 3055957 3182891 3019907 3033483 3147696
15868 3147696 3221955 3048658 3062485 2957795 2862433 2925654 2992543 3072346 3040968 2922380 2919868
15857 2919868 2905524 2960688 3045216 3004748 2979989 3030654 3047039 3035462 2938591 3068692 3119596
15846 3119596 3083199 3183656 3234553 3107909 2937581 2974151 3036078 3018392 3051035 2969144 2981294
15835 2981294 3030453 3079935 2977229 3021960 3144709 3112331 3169831 3103845 3173086 3183622 3128176
15824 3128176 3157474 3226115 3139706 3140754 3203745 3247286 3206395 3167927 3172859 3122048 3032744 2866794
15812 2866794 2929744 2983432 2967628 2958863 2980092 3020652 3088561 3150451 3096464 2972084 3046574
15801 3046574 3079569 3073811 3078840 3038308 3022743 3006629 3038503 3002147 3105952 3045167 2989417
15790 2989417 2972805 3166339 3179087 3060010 3097876 3043769 3069658 3039316 3008506 3088217 3119843
15779 3119843 3036068 3211443 3206079 2991021 2956841 3090146 3171470 3116367 3123369 3130909 3060792
15768 3060792 3046114 3049283 3063401 3090372 3068032 3109875 3033570 2945228 3094817 3255240 3165596
15757 3165596 3099115 3175319 3180866 3026310 2942202 3028666 3177871 3169930 3092211 3083122 3073862 3120770
15745 3120770 3051391 3067715 3099204 3048052 3066614 3064364 3002935 3008482 3125362 3055442 2975889
15734 2975889 2907220 2945419 3085933 3143364 3136540 3180040 3158770 3198947 3136528 2990339 3066188
15723 3066188 3145598 3089036 3105688 2859672 2837020 3017530 3021953 3181430 3120214 3073735 3017653
15712 3017653 2992971 2974713 2944026 3037222 3041662 3135777 3302499 3124262 3142767 3130074 3091575
15701 3091575 2990595 3142706 3247242 3115050 3172640 3094431 2928364 2960233 2960746 2969779 2976916
15690 2976916 3091924 3109623 3076071 3170212 3137551 3090269 3156225 3098230 3030650 3172665 3242384
15679 3242384 3167350 3102377 3116971 3053766 3089250 3159592 3147812 3136236 3031516 2990714 3020469
15668 3020469 3027379 3193506 3209052 3126237 2989895 3153633 3156735 3062179 3051450 3075030 3042205
15657 3042205 3174296 3307294 3318891 3330063 3376780 3233275 3197880 3094897 3073359 3038891
15647 3038891 3070598 3078214 3120414 3167234 3255240 3266986 3151910 3147394 3079017 2987073 3022389
15636 3022389 3143500 3238241 3327004 3411164 3192919 3183120 3197174 3119230 3243693 3298654 3201455
15625 3201455 3197067 3352341 3196317 3177684 3019189 3076278 3102922 3160884 3127718 3157958 3087244
15614 3087244 3184755 3146469 3004920 3045808 3189356 3096530 3059696 2972696 2910150 3152743 3221504
15603 3221504 3062878 3063067 3184101 3127537 3098838 3159849 3171590 3193749 3212259 3189645 3074415
15592 3074415 3233363 3350567 3255743 3342566 3177944 3052057 3074804 3176931 3089338 3124709
15582 3124709 3154390 3065263 3103742 3212285 3163295 3090402 3217299 3168645 3194702 3222208 3127272
15571 3127272 3236891 3254684 3172463 3128860 3154996 3182121 3202990 3149498 3170734 3280351 3270748
15560 3270748 3264372 3339528 3255518 3072870 3125914 3127817 3036538 3044480 3163664 2938605 2979758
15549 2979758 3236085 3224171 3186014 3175227 3193354 3179277 3116502 3139569 3145078 2996315 3017555
15538 3017555 3059319 3034239 2992126 3083715 3150181 3201451 3232929 3107823 3246301 3293304 3263620
15527 3263620 3173823 3144948 3296462 3294529 3255859 3283043 3221696 3173233 3167155 3124549 3209061
15516 3209061 3277372 3237121 3182185 3120269 3126280 3011327 3143639 3174996 3178979 3256661 3228450
15505 3228450 3328918 3279063 3184173 3114993 3227215 3309335 3207327 3086907 3274255 3290923
15495 3290923 3234860 3207073 3001110 3100455 3264878 3270087 3212853 3169450 3212097 3216039 3328831
15484 3328831 3274035 3406685 3315854 3193477 3043238 3108949 3061899 3183457 3310531 3351022
15474 3351022 3310807 3190692 3294268 3314095 3253601 3190204 3260962 3251137 3183251 3115356 3140426
15463 3140426 3186482 3217832 3349152 3275722 3207209 3278856 3225037 3207191 3276553 3225040 3184516
15452 3184516 3218267 3274068 3319510 3244004 3178631 3226112 3140543 3074336 3044475 3088374 3124916
15441 3124916 3119549 3264877 3169069 3092813 3015086 3026916 3013467 3146668 3232245 3198884 3152080
15430 3152080 3242145 3180074 3263321 3232252 3292819 3266861 3341702 3367640 3309724 3210446 3136650
15419 3136650 3174233 3246502 3219090 3214351 3297103 3284713 3214472 3095665 3147954 3141155 3174485
15408 3174485 3128232 3180085 3294648 3177543 3089791 3120858 3179015 3190947 3251966 3184675 3158715
15397 3158715 3179832 3143750 3172539 3152985 3220719 3274255 3332736 3326122 3260985 3157009 3168668
15386 3168668 3058506 3137310 3147196 3156861 3214212 3306983 3442319 3335201 3255725 3220184 3282532
15375 3282532 3305979 3261551 3229958 3187055 3224024 3161151 3208999 3258638 3156801 3233685 3204041
15364 3204041 3247533 3279323 3290336 3358002 3225245 3194160 3099737 3119972 3074585 3140168 3187442
15353 3187442 3226635 3132539 2996437 3147867 3177582 3242660 3168773 3249961 3301728 3254398 3222731
15342 3222731 3290112 3215299 3201779 3249286 3189282 3278402 3251042 3277078 3232160 3184516 3243090
15331 3243090 3156169 3322494 3445870 3424566 3305491 3273578 3232071 3202961 3213320 3187953 3305191
15320 3305191 3398187 3384854 3288154 3266638 3160516 3222648 3251607 3361039 3219960 3182917 3257162
15309 3257162 3253603 3282441 3260537 3262903 3260100 3283090 3206940 3214653 3308779 3261197 3238706 3256290
15297 3256290 3236554 3193472 3268636 3262406 3235318 3316173 3350938 3250836 3220279 3190467 3267715
15286 3267715 3290844 3289402 3314097 3241732 3269692 3178165 3202526 3150715 3157399 3186575 3186878 3182611
15274 3182611 3195401 3240729 3362986 3326455 3161444 3264994 3357099 3314735 3243222 3215561 3304189
15263 3304189 3183425 3234144 3291754 3254833 3239921 3252687 3245703 3173674 3193722 3375881 3293115
15252 3293115 3266297 3383991 3311642 3229419 3234180 3288042 3181858 3236946 3355097 3297136 3224821
15241 3224821 3237549 3250484 3227828 3361514 3288520 3112158 3001260 3069186 3170200 3168190 3321869
15230 3321869 3349153 3211007 3162532 3142301 3168690 3192227 3110037 3078086 3293603 3280700 3224686
15219 3224686 3288019 3253528 3162216 3114055 3292678 3220816 3218335 3259698 3269133 3216943 3158967
15208 3158967 3199232 3270205 3193568 3208359 3243924 3291654 3365815 3353241 3239167 3188490 3307132
15197 3307132 3240293 3285178 3334233 3192058 3249956 3283863 3259166 3201732 3322372 3296794 3382289
15186 3382289 3235872 3211933 3271750 3334347 3414766 3329446 3388895 3183642 3220003 3314553 3327281
15175 3327281 3347458 3344558 3338020 3388745 3487888 3334060 3341244 3433048 3314277 3254876 3357665
15164 3357665 3421266 3467001 3408134 3348270 3318821 3178905 3343142 3318135 3395849 3403820 3359409
15153 3359409 3301119 3207512 3259243 3264564 3355227 3433207 3428964 3325793 3210967 3150703 3225197
15142 3225197 3278124 3300581 3355863 3295075 3264137 3348788 3373200 3433540 3387656 3264127 3201629
15131 3201629 3261121 3406102 3445405 3464880 3450587 3369174 3316100 3326870 3426755 3565378 3536489
15120 3536489 3347617 3108669 3247573 3279245 3265477 3335773 3372311 3427588 3416991 3372802 3380101
15109 3380101 3414283 3441723 3408849 3459010 3368372 3310033 3362659 3395421 3454539 3458016 3434031
15098 3434031 3398928 3396879 3231278 3241223 3212765 3246050 3248562 3315813 3283161 3295725 3417210
15087 3417210 3456760 3450521 3391339 3446417 3422438 3348703 3272816 3282533 3246041 3142802 3336285
15076 3336285 3388094 3315305 3445025 3381170 3205499 3262758 3276392 3482139 3478456 3382504 3483341
15065 3483341 3377706 3324957 3299718 3375862 3155053 3214716 3224282 3230182 3154165 3289496 3354803
15054 3354803 3398987 3349959 3383325 3403508 3354754 3378512 3361822 3468033 3358366 3253248 3310910
15043 3310910 3320485 3203213 3281373 3376382 3329774 3349958 3467477 3460907 3429932 3375875 3374284
15032 3374284 3349846 3435386 3489108 3312163 3210740 3275400 3360689 3578413 3693682 3601820
15022 3601820 3534761 3469241 3333594 3360051 3312552 3328492 3378786 3363230 3367511 3357455 3266562
15011 3266562 3298696 3330224 3362478 3231233 3351859 3359607 3293880 3310353 3337812 3274587 3292002
15000 3292002 3316135 3341543 3346799 3414685 3369144 3297538 3345887 3319382 3346518 3379002 3437660
14989 3437660 3385834 3355109 3459573 3435434 3370785 3362476 3329910 3380753 3476120 3421840 3256958
14978 3256958 3364550 3430873 3431834 3494583 3465743 3391904 3330247 3266272 3272973 3369720 3429989 3465628
14966 3465628 3432194 3401500 3408467 3373409 3331811 3337803 3363554 3281674 3387594 3367089 3261762
14955 3261762 3380444 3293160 3371018 3573622 3434974 3246008 3174920 3369110 3334438 3238075
14945 3238075 3291729 3353851 3393740 3395307 3425484 3438737 3431309 3339318 3279408 3296632 3373713 3470739
14933 3470739 3437118 3596183 3599217 3508342 3570444 3559045 3507783 3463913 3519924 3500229 3475504
14922 3475504 3592389 3632264 3624087 3498349 3463549 3470353 3356870 3268851 3309263 3434162 3487986
14911 3487986 3429721 3225834 3278525 3363845 3265094 3353802 3401089 3387790 3352603 3446442 3496437
14900 3496437 3492125 3513578 3562938 3545854 3510751 3445798 3507375 3432480 3337387 3322685 3366943
14889 3366943 3332095 3357709 3432297 3365844 3240177 3084879 3094103 3297670 3420430 3318688
14879 3318688 3372004 3432814 3329227 3365724 3473437 3432288 3452307 3502379 3424462 3453525 3508861
14868 3508861 3352237 3453298 3473729 3415585 3534768 3479107 3373152 3350130 3425154 3340658
14858 3340658 3346706 3306898 3343888 3453514 3498534 3476018 3451575 3473798 3478322 3517321 3377288
14847 3377288 3342861 3387080 3351450 3328293 3384487 3482748 3553030 3427996 3254463 3270253 3420843
14836 3420843 3420815 3588211 3405148 3352279 3388528 3508642 3492965 3448054 3374169 3486642 3624507
14825 3624507 3437391 3293076 3305032 3371880 3564643 3601745 3588252 3603871 3498187 3429284
14815 3429284 3477855 3492133 3531485 3551835 3526824 3442426 3456844 3491082 3447996 3468346 3457665
14804 3457665 3545250 3457129 3516222 3515489 3463075 3448615 3486835 3467305 3447933 3347339 3417398
14793 3417398 3473304 3594189 3538400 3631290 3652988 3523243 3348734 3441844 3486936 3416769 3455122
14782 3455122 3425206 3391768 3368859 3491717 3445593 3448346 3450362 3481376 3477307 3591621 3664010
14771 3664010 3551939 3575993 3547842 3556871 3576649 3531430 3558365 3559639 3596471 3622262 3511587
14760 3511587 3415641 3499860 3463397 3567213 3554152 3446394 3480391 3533731 3421389 3443732 3502106
14749 3502106 3469044 3409637 3449512 3386263 3433704 3616423 3556530 3522757 3607879 3597760 3617653
14738 3617653 3517611 3589132 3626526 3547654 3440746 3413707 3396720 3409375 3458495 3403319 3553745
14727 3553745 3601469 3545890 3535718 3591538 3646010 3599166 3539855 3597790 3649721 3597913 3585957
14716 3585957 3535066 3389623 3447323 3380308 3416946 3605754 3685452 3679398 3670588 3604843 3633680
14705 3633680 3595881 3674344 3723446 3553686 3438432 3440907 3511421 3512024 3649554 3659260 3696993
14694 3696993 3744464 3616158 3547399 3520112 3557092 3559986 3605611 3580399 3480657 3551315 3603877
14683 3603877 3584805 3630773 3567913 3489642 3469199 3551175 3447934 3535430 3578317 3526197 3401543
14672 3401543 3409606 3491654 3574381 3575971 3589140 3478450 3482449 3474569 3416192 3489798 3620251 3595069
14660 3595069 3570503 3534362 3576538 3545076 3555637 3489668 3522126 3473441 3323855 3440372 3418025
14649 3418025 3472087 3524053 3547285 3493107 3572674 3624846 3584840 3554635 3707548 3832208 3722007
14638 3722007 3581944 3627673 3490384 3492437 3673519 3775219 3866433 3776857 3716837 3634807 3648661
14627 3648661 3673949 3573642 3619661 3542700 3537101 3645404 3537652 3513928 3734490 3772928 3625752
14616 3625752 3589230 3665870 3631498 3500055 3442269 3581411 3705478 3810731 3602269 3630362
14606 3630362 3593869 3611273 3756707 3762974 3657363 3675921 3536613 3554094 3674312 3611624 3660620
14595 3660620 3723609 3729814 3681017 3591827 3612073 3659267 3629742 3563231 3646438 3551711 3520983
14584 3520983 3610148 3627071 3556935 3559313 3573555 3642661 3656550 3570678 3498400 3547373 3605950
14573 3605950 3609977 3716362 3793607 3718236 3615561 3681490 3639967 3524028 3536233 3584759 3544080
14562 3544080 3617509 3577251 3544444 3626058 3728063 3742523 3630759 3624903 3581787 3631727 3618169
14551 3618169 3629345 3644705 3582109 3625395 3604981 3528580 3558261 3656166 3626868 3717547 3762868
14540 3762868 3820940 3669300 3480256 3470573 3568952 3535383 3670664 3688998 3723667 3772130 3723322
14529 3723322 3711843 3708689 3743766 3798013 3707347 3751270 3664044 3548415 3560517 3541351 3530630
14518 3530630 3667594 3736227 3661711 3544842 3558860 3579999 3601886 3451091 3455799 3468343 3532285
14507 3532285 3543775 3431522 3606555 3638727 3486648 3523398 3527600 3503247 3574985 3584743 3623513
14496 3623513 3624667 3672880 3702549 3675396 3662724 3725827 3617718 3709870 3684852 3700128 3681790
14485 3681790 3678255 3716206 3663159 3622703 3637390 3747482 3806988 3734249 3622055 3720030 3727493
14474 3727493 3624579 3521448 3436974 3426844 3522165 3677393 3635285 3525428 3635009 3632976
14464 3632976 3639734 3736339 3803564 3698593 3681313 3533816 3593555 3708959 3724553 3750037 3765924
14453 3765924 3666867 3677890 3764805 3648959 3801849 3654006 3632457 3579353 3664931 3705338 3644571
14442 3644571 3756629 3771524 3762540 3759300 3751869 3659428 3559534 3437096 3467587 3596047 3640732
14431 3640732 3590811 3582621 3644419 3620081 3720067 3716288 3714918 3574733 3559073 3475652 3500416 3661279
14419 3661279 3663729 3612414 3473058 3514097 3611161 3592131 3614076 3708272 3789847 3598120 3615770
14408 3615770 3825509 3784596 3629486 3562911 3578529 3513702 3616887 3601788 3617583 3671499 3811999
14397 3811999 3869902 3744609 3650767 3594400 3662403 3678555 3627593 3673758 3673796 3602828 3620373 3758986
14385 3758986 3694865 3719483 3786277 3826439 3805757 3723618 3727497 3646633 3819275 3900665 3818557
14374 3818557 3647059 3632335 3649610 3814634 3793479 3740172 3725101 3681820 3584842 3651768 3762830
14363 3762830 3755752 3818292 3844731 3788215 3758877 3706371 3547555 3604364 3660703 3672843 3579971
14352 3579971 3685681 3775226 3867911 3759904 3617651 3589556 3715218 3697089 3639217 3704641
14342 3704641 3738591 3845436 3993622 3891382 3726560 3771165 3814922 3761032 3718834 3695712
14332 3695712 3698238 3699975 3766690 3811256 3686510 3736195 3656667 3743437 3836330 3745469 3718592
14321 3718592 3685139 3787729 3716898 3795418 3866581 3832884 3952027 3925429 3801328 3889875 3910141
14310 3910141 3966492 3861947 3737390 3671505 3789853 3796621 3720366 3769460 3806394 3891179 3876914
14299 3876914 3796545 3693658 3618970 3751098 3783277 3660617 3659734 3625924 3569571 3723597 3831157
14288 3831157 3661565 3618126 3652064 3820549 3758339 3847486 3846760 3775423 3786146 3753397 3825004
14277 3825004 3920786 3855768 3811697 3838354 3834780 3698718 3700374 3763280 3605698 3606682 3696209 3862246
14265 3862246 3945086 3934610 3811940 3734926 3660285 3703298 3824352 3740776 3783959 3754679 3792998
14254 3792998 3775250 3751178 3697279 3684509 3607363 3632666 3779899 3770508 3657797 3691186 3685707
14243 3685707 3724103 3723674 3701574 3832376 3781576 3800247 3733414 3648732 3765751 3912836 3840829
14232 3840829 3670691 3608538 3666306 3745237 3823274 3716274 3590002 3702286 3676579 3624704
14222 3624704 3707326 3706778 3650610 3713862 3752675 3801215 3746398 3711379 3852488 3896949 3788605
14211 3788605 3750729 3809588 3723324 3865373 3964354 3929221 3813239 3892468 3803881 3857353 3873492
14200 3873492 3888960 3836346 3767512 3739654 3738979 3704230 3716165 3606098 3696577 3768477 3824547
14189 3824547 4001124 3984102 4013283 3842490 3733247 3718110 3853782 3778804 3758218 3704232
14179 3704232 3755889 3815034 3894734 3794830 3768317 3891618 3844737 3852783 3740655 3770009 3893848
14168 3893848 3913278 3886635 3717076 3670633 3881871 3914844 3841207 3689593 3727542 3827936
14158 3827936 3825453 3972021 4001981 4060344 4009427 3951244 3944288 3913364 3907087 3819477 3884508 4026098
14146 4026098 3971691 3945328 3984759 3890578 3849013 3884124 3878502 3953045 3960834 3971034 4112392
14135 4112392 4118655 3997050 3900031 3863732 3852629 3825770 3985074 4013689 3921170 3710396 3777416
14124 3777416 3839338 3979171 3915631 3872729 3853096 3872102 3944000 3903157 3872642 3818941 3847344
$$ [...]
##END NTUPLES=NMR SPECTRUM
##END=
