##TITLE=1H_DE-80H_X3
 200.13MHz, d2o
 8 sc
 
 19ns.26.2.2025
##JCAMPDX= 6.0         $$ Bruker NMR JCAMP-DX V2.0
##DATA TYPE= NMR SPECTRUM
##DATA CLASS= NTUPLES
##ORIGIN= UXNMR, Bruker Analytische Messtechnik GmbH
##OWNER= pz
$$ XWIN-NMR		Version 3.5
$$ Fri Jul 25 14:06:58 2025 Russian Standard Time (UT+4h)  Yarkov@DPX200
##.OBSERVE FREQUENCY= 200.1313
##.OBSERVE NUCLEUS= ^1H
##.ACQUISITION MODE= SIMULTANEOUS
##.ACQUISITION SCHEME= undefined
##.AVERAGES= 8
##.DIGITISER RES= 18
##SPECTROMETER/DATA SYSTEM= spect
##.PULSE SEQUENCE= zg30
##.SOLVENT NAME= CDCl3
##.SHIFT REFERENCE= (INTERNAL, CDCl3, 0, 15.51)
##AUDIT TRAIL= $$ (NUMBER, WHEN, WHO, WHERE, WHAT)
$$ ##TITLE= Audit trail, XWIN-NMR		Version 3.5
$$ ##JCAMPDX= 5.01
$$ ##ORIGIN= Bruker BioSpin GmbH
$$ ##OWNER= Yarkov
$$ C:/Bruker/XWIN-NMR/data/yarkov2/nmr/H-C/1/pdata/1/auditp.txt
$$ ##AUDIT TRAIL=  $$ (NUMBER, WHEN, WHO, WHERE, WHAT)
(   1,<2025-07-25 14:05:40.39 +0400>,<Yarkov>,<DPX200>,
      <created by zg, POWCHK disabled, PULCHK disabled
       configuration hash MD5:
       00 E9 B6 7A A2 85 ED C7 34 08 36 98 17 FE 4E 26
       data hash MD5: 16K
       DB B7 AB F2 B4 45 E5 F3 E7 0A 27 9E D6 B7 D0 47>)
(   2,<2025-07-25 14:05:44.35 +0400>,<Yarkov>,<DPX200>,
      <Start of raw data processing
       efp BC_mod = 2 LB = 0.25 FT_mod = 6 PKNL = 1 PHC0 = -1358.956 PHC1 = 13.59091 SI = 16K 
       data hash MD5: 16K
       B1 79 16 A3 38 64 51 B8 D5 7F 65 C9 B8 37 67 56>)
(   3,<2025-07-25 14:05:48.92 +0400>,<Yarkov>,<DPX200>,
      <abs ABSG = 5 
       data hash MD5: 16K
       C6 A7 33 3E 44 24 03 DF 65 F0 3C EC CD E1 18 51>)
$$ ##END=
$$ 
$$ hash MD5
$$ 07 36 99 A7 93 16 41 5B 34 F6 0F 86 34 7C 9B B2
##$RELAX= 
##$RELAX= 
##$RELAX= 
##$RELAX= 
##$RELAX= 
##$RELAX= 
$$ Bruker specific parameters
$$ --------------------------
##$DU= <C:/Bruker/XWIN-NMR>
##$EXPNO= 1
##$NAME= <H-C>
##$PROCNO= 1
##$TYPE= <nmr>
##$USER= <yarkov2>
##$AMP= (0..31)
100 100 100 100 100 100 100 100 100 100 100 100 100 100 100 100 100 100 
100 100 100 100 100 100 100 100 100 100 100 100 100 100 
##$AQSEQ= 0
##$AQ_mod= 1
##$AUNM= <au_zg>
##$AUTOPOS= <>
##$BF1= 200.13
##$BF2= 200.13
##$BF3= 200.13
##$BF4= 200.13
##$BF5= 200.13
##$BF6= 200.13
##$BF7= 200.13
##$BF8= 200.13
##$BYTORDA= 1
##$CFDGTYP= 0
##$CFRGTYP= 5
##$CHEMSTR= <none>
##$CNST= (0..31)
1 1 145 1 1 1 1 1 1 1 1 1 1 1 1 1 1 1 1 1 1 1 1 1 1 1 1 1 1 1 1 1 
##$CPDPRG= <>
##$CPDPRG1= <>
##$CPDPRG2= <>
##$CPDPRG3= <>
##$CPDPRG4= <mlev>
##$CPDPRG5= <mlev>
##$CPDPRG6= <mlev>
##$CPDPRG7= <mlev>
##$CPDPRG8= <mlev>
##$CPDPRGB= <>
##$CPDPRGT= <>
##$D= (0..31)
0 0.7 0 0 0 0 0 0 0 0 0 0.03 0 0 0 0 0 0 0 0 0 0 0 0 0 0 0 0 0 0 0 0 
##$DATE= 1753437940
##$DBL= (0..7)
120 120 120 120 120 120 120 120 
##$DBP= (0..7)
150 150 150 150 150 150 150 150 
##$DBP07= 0
##$DBPNAM0= <>
##$DBPNAM1= <>
##$DBPNAM2= <>
##$DBPNAM3= <>
##$DBPNAM4= <>
##$DBPNAM5= <>
##$DBPNAM6= <>
##$DBPNAM7= <>
##$DBPOAL= (0..7)
0.5 0.5 0.5 0.5 0.5 0.5 0.5 0.5 
##$DBPOFFS= (0..7)
0 0 0 0 0 0 0 0 
##$DE= 6
$$ [...]
##$SUBNAM3= <"">
##$SUBNAM4= <"">
##$SUBNAM5= <"">
##$SUBNAM6= <"">
##$SUBNAM7= <"">
##$SUBNAM8= <"">
##$SUBNAM9= <"">
##$SW= 18.0517328524113
##$SWIBOX= (0..15)
0 0 2 0 0 0 0 0 0 0 0 0 0 0 0 0 
##$SW_h= 3612.71676300578
##$TD= 16384
##$TD0= 1
##$TE= 0
##$TE2= 300
##$TE3= 300
##$TEG= 300
##$TL= (0..7)
0 120 120 120 120 120 120 120 
##$TP= (0..7)
150 150 150 150 150 150 150 150 
##$TP07= 0
##$TPNAME0= <>
##$TPNAME1= <>
##$TPNAME2= <>
##$TPNAME3= <>
##$TPNAME4= <>
##$TPNAME5= <>
##$TPNAME6= <>
##$TPNAME7= <>
##$TPOAL= (0..7)
0.5 0.5 0.5 0.5 0.5 0.5 0.5 0.5 
##$TPOFFS= (0..7)
0 0 0 0 0 0 0 0 
##$TUNHIN= 0
##$TUNHOUT= 0
##$TUNXOUT= 0
##$USERA1= <user>
##$USERA2= <user>
##$USERA3= <user>
##$USERA4= <user>
##$USERA5= <user>
##$V9= 5
##$VALIST= <valist>
##$VCLIST= <CCCCCCCCCCCCCCC>
##$VD= 0
##$VDLIST= <DDDDDDDDDDDDDDD>
##$VPLIST= <PPPPPPPPPPPPPPP>
##$VTLIST= <TTTTTTTTTTTTTTT>
##$WBST= 1024
##$WBSW= 4
##$XGAIN= (0..3)
0 0 0 0 
##$XL= 0
##$YL= 0
##$YMAX_a= 240929
##$YMIN_a= -264475
##$ZGOPTNS= <>
##$ZL1= 120
##$ZL2= 120
##$ZL3= 120
##$ZL4= 120
##$ABSF1= 15.46923
##$ABSF2= -2.58262
##$ABSG= 5
##$ABSL= 3
##$ALPHA= 0
##$AQORDER= 0
##$ASSFAC= 0
##$ASSFACI= 0
##$ASSFACX= 0
##$ASSWID= 0
##$AUNMP= <proc_1d>
##$AZFE= 0.1
##$AZFW= 0.1
##$BCFW= 0
##$BC_mod= 2
##$BYTORDP= 0
##$COROFFS= 0
##$CY= -3
##$DATMOD= 1
##$DC= 0
##$DFILT= <>
##$DTYPP= 0
##$F1P= 0
##$F2P= 0
##$FCOR= 1
##$FTSIZE= 16384
##$FT_mod= 6
##$GAMMA= 0
##$GB= 0
##$INTBC= 1
##$INTSCL= 3.241238e-09
##$ISEN= 128
##$LB= 0.25
##$LEV0= 0
##$LPBIN= 0
##$MAXI= 10000
##$MC2= 0
##$MEAN= 0
##$ME_mod= 0
##$MI= 1.114404
##$NCOEF= 0
##$NC_proc= -7
##$NLEV= 6
##$NOISF1= 3.799351
##$NOISF2= 2.8
##$NSP= 0
##$NTH_PI= 0
##$NZP= 0
##$OFFSET= 15.51
##$PC= 1
##$PHC0= -1358.956
##$PHC1= 13.59091
##$PH_mod= 1
##$PKNL= yes
##$PPARMOD= 0
##$PSCAL= 0
##$PSIGN= 0
##$REVERSE= no
##$SF= 200.130002341218
##$SI= 16384
##$SIGF1= 3
##$SIGF2= 2
##$SINO= 0.751879
##$SIOLD= 32768
##$SREGLST= <19F.Aceton>
##$SSB= 0
##$STSI= 16384
##$STSR= 0
##$SW_p= 3612.71676300578
##$SYMM= 0
##$S_DEV= 0
##$TDeff= 16384
##$TDoff= 0
##$TI= <>
##$TILT= no
##$TM1= 0
##$TM2= 0
##$TOPLEV= 0
##$USERP1= <user>
##$USERP2= <user>
##$USERP3= <user>
##$USERP4= <user>
##$USERP5= <user>
##$WDW= 1
##$XDIM= 16384
##$YMAX_p= 506718952
##$YMIN_p= -1362810
$$ End of Bruker specific parameters
$$ ---------------------------------
##NTUPLES= NMR SPECTRUM
##VAR_NAME=  FREQUENCY,     SPECTRUM/REAL,   SPECTRUM/IMAG
##SYMBOL=    X,             R,               I
##VAR_TYPE=  INDEPENDENT,   DEPENDENT,       DEPENDENT
##VAR_FORM=  AFFN,          ASDF,            ASDF
##VAR_DIM=   16384,         16384,           16384
##UNITS=     HZ,            ARBITRARY UNITS, ARBITRARY UNITS
##FACTOR=    0.220516191357247, 1,           1
##FIRST=     3104.01638211841, 0,            0
##LAST=      -508.700380887367, 0,           0
##MIN=       -508.700380887367, -1362810,    0
##MAX=       3104.01638211841, 506718952,    0
$$ Real data points
##PAGE= N=1
##DATA TABLE= (X++(R..R)), XYDATA
$$ [...]
8347 -29033 -111192 -190752 -139710 -91083 -187262 -270652 -215639 -132485 -123316 -136585 -187749 -211867
8335 -211867 -184996 -201849 -240156 -281868 -362445 -351496 -221397 -162661 -164087 -312154 -329057
8324 -329057 -265652 -128768 -193521 -140554 -71317 -136460 -264461 -163751 -166396 -224659 -101360
8313 -101360 -101309 -54499 -45595 -97113 -191296 -166636 -293673 -210641 -145249 -190522 -257826 -238019
8301 -238019 -221893 -172117 -112949 -179330 -120145 -176151 -199476 -269020 -304926 -236514 -127476
8290 -127476 -246807 -152433 -178645 -138429 -120593 -217454 -192701 -134401 -207814 -245778 -201766
8279 -201766 -190057 -199426 -401153 -354650 -321139 -256841 -302482 -161245 -212207 -282995 -380736
8268 -380736 -317832 -165940 -165093 -80215 -34 -147855 2871 27757 -174393 -331971 -276558
8257 -276558 -193659 -33808 -143570 -256955 -148752 -211181 -179004 -142730 -174378 -162497 -158340
8246 -158340 -193527 -183162 -107947 -167918 -215655 -214823 -174200 -99329 -145509 -171057 -144682 -147401
8234 -147401 -145625 -172536 -167716 23354 -17637 -56194 -51167 -4682 -18428 -244848 -249586 -217577
8222 -217577 -137884 -31509 37055 -70583 -121242 -52870 -120285 -198264 -207688 -186588 -245500
8211 -245500 -147427 -11956 -17807 -97127 -126641 -117446 -142851 -82098 87067 128309 112097 -19276
8199 -19276 105055 -8338 111204 76803 346641 329867 835323 -479398 -1362810 -531082
8189 -531082 -434031 -360911 -444696 -169119 -228276 -374592 -475180 -476525 -545109 -414829 -419496
8178 -419496 -317081 -301477 -326980 -291277 -145664 -159443 -314029 -360862 -178896 -218209 -105221
8167 -105221 -190725 -178860 -220890 -274154 -184822 -184348 -252470 -271457 -236820 -233420 -226423 -132876
8155 -132876 -166926 -214822 -253459 -234247 -237751 -155039 -229392 -158293 -238568 -233240 -163157 -80610
8143 -80610 -40277 -147456 -202785 -146059 -71778 -76386 -192120 -294680 -128728 76547 52561
8132 52561 -209230 -220457 -312467 -310642 -360642 -219409 -188784 -165882 -261042 -254637 -258982 -288564
8120 -288564 -340246 -344011 -255000 -88232 -138794 -136555 -241576 -272961 -297535 -65201 -249885
8109 -249885 -220595 -222213 -181953 -170229 -302406 -146580 -220202 -224923 -155792 -57034 -224262
8098 -224262 -177591 -158765 -186859 -202189 -245285 -81417 -106489 -143004 -47731 -157464 -159357
8087 -159357 -105395 -157596 -265747 -163044 -241169 -298609 -210821 -123573 -92055 -105243 -138846
8076 -138846 -84227 -38172 -86133 -47209 -30151 -149376 -151592 -79248 -16081 -69118 -71217 -61318
8064 -61318 -66879 -62344 -37428 53649 -120508 -172149 -235105 -190365 -198874 -283734 -237171 -306733
8052 -306733 -70101 -43915 -71214 -78096 -134139 -164884 -123810 -80847 9936 -36574 -91098 -67814
8040 -67814 -71737 -68524 -71798 -109799 -212244 -142574 -133121 -197584 -183686 -99618 -18453 -5093
8028 -5093 23937 43514 -34906 -82113 -199509 -213056 -97297 -134732 -156239 -109694 -46987 -42517
8016 -42517 -83992 19779 -48225 -26563 -60742 -68859 -11172 -5888 9345 118307 60761 -21394
8004 -21394 -5566 -67212 -54101 -97571 -137677 -159489 -243204 -134593 -3529 -146011 -281689
7993 -281689 -254945 -125093 -124984 -165313 -97442 -73468 -23253 33478 53861 -71214 -164417 -236733
7981 -236733 -114822 -50605 -101391 -106509 -78380 -14912 -127461 -54101 -76140 -33089 -136956
7970 -136956 -92928 -93442 -55446 -62799 -139754 -105253 -22553 -34768 -144043 -217875 -244692 -243197
7958 -243197 -259635 -205632 -89913 32800 -115423 -198281 -205708 -247459 -295041 -101538 -18411
7947 -18411 -38042 -15636 -125961 -124940 -62066 -106523 -173791 -152041 -106477 -101782 -139027 -159240
7935 -159240 -145917 -19644 22297 -98347 -327904 -101250 -87205 -186036 -169408 -235340 -120513
7924 -120513 -70076 -119421 -144640 -110670 -99827 -166599 -177156 -15112 -82534 -250825 -97578
7913 -97578 -36129 -146310 -56713 -21026 -109262 -135737 -192685 -243488 -122778 -106639 -83544
7902 -83544 -229934 -133944 30206 -27160 -106690 -185576 -105500 21449 -39542 7828 -22650
7891 -22650 -83397 73630 -34258 -138917 -96482 -183433 -265923 -83531 2163 -46416 -59161
7880 -59161 -63441 -95128 -200690 -171504 -55662 -343252 -367144 -253254 -343327 -310704 -276928
7869 -276928 -128567 -129859 -21464 -128227 -102930 -136178 -56297 -86211 -176873 -159129 -174583
7858 -174583 -263544 -142045 -177018 -227882 -116552 59538 78421 -96383 -127149 -126845 -205998
7847 -205998 -155118 -63807 -140506 -2803 -39762 -80954 -84381 -33822 -70937 -82320 -143953 -19508
7835 -19508 120408 138517 -165925 -240872 -195171 -158503 -84419 -122076 -170653 -253349 -232065
7824 -232065 -80172 -60286 -109148 -57843 -101288 -75651 -205138 -208764 -229837 -131607 -110506
7813 -110506 -264936 -101577 -107679 -59851 -167962 -182250 -153463 9428 -73686 -174988 -129406
7802 -129406 -2796 -108714 -542283 -370248 -249518 -153903 -188099 -325536 -241360 -274084
7792 -274084 -219863 -40911 -42490 -26492 -84079 -125152 -168478 -134971 -31501 31475 -128358
7781 -128358 -228651 -300681 -298318 -230642 -182691 -278277 -275661 -208116 -123528 2272 -107834
7770 -107834 -204988 -197818 -143297 -187119 -202603 -118119 -43821 22414 172414 2661 -81496
7759 -81496 -68630 -81269 -74832 -19575 10549 33334 -31295 -98179 -216730 -174784 -129244 -12945
7747 -12945 -83060 -148742 -110801 -116720 -130396 -225141 -205755 -10881 162500 72228 -14630 -139518
7735 -139518 -131291 -286721 -262493 -154311 -151333 -82560 -40457 36670 -36887 -51391 -140690 -273454
7723 -273454 -219359 -159695 32414 22043 -137728 -191306 -64273 -28484 -225275 -243238 -189030
7712 -189030 -181851 -94549 -91669 -120276 -149618 -80620 -23741 -122161 52332 63072 57981 103502
7700 103502 45585 4290 -70205 -95213 -152993 -98408 -120363 -232213 -155742 -15985 -180530
7689 -180530 -233088 -187035 -148200 -94863 -57009 -110544 -240335 -265424 -147719 2547 45644
7678 45644 -144462 -121224 -140679 -53552 24272 -79229 -108894 -214096 -186241 -48242 -34539
7667 -34539 -209665 -240459 -210628 -183027 -215157 -208492 -152589 -170474 -166521 -112118 -129730 -170556
7655 -170556 -79706 158038 46731 47084 102021 -10322 68927 29485 35087 41684 -69027 -169793
7643 -169793 -73234 -136396 -57744 -97855 -25992 -95323 -96427 -22300 -161741 -132244 -83032 -90429
7631 -90429 -109770 -184254 -202789 -107568 -38824 -111225 -265715 -262254 -173919 -138315 -101427 -144849
7619 -144849 -182192 -43441 -116264 -104317 -41983 -98156 -108872 69958 35349 -100359 -71473
7608 -71473 -112599 7583 17770 -84195 27672 15891 62363 -537 49657 -2205 -63028
7597 -63028 -110532 5917 -43984 -51536 -140845 -29872 57442 -111154 -71714 -161739 -157252 -118021
7585 -118021 18627 102131 56319 53838 24852 -8114 -140858 -154996 -134219 -136508 -18600
7574 -18600 38785 -134037 -119153 -167580 -203302 -206698 -246710 -121487 -51959 -89248 -661 55448
7562 55448 100114 61203 -86910 -59925 -5983 -99495 -42361 54750 21499 61279 9276 -66223
7550 -66223 -51153 63861 -50988 -136655 -164146 -169500 -106209 -71452 -95113 -111389 -143300 -95539
7538 -95539 -176448 -124693 -66131 -66897 -202618 -223074 -77261 -55029 -17342 1759 752 -174
7526 -174 -119529 -64680 -183462 -175342 -186954 -164021 -193578 -146458 -79220 -120445 -75704 -145524
7514 -145524 -139279 -98972 -61984 -114923 -176384 -158880 -121492 -141927 -263213 -234445 -196444 -242099
7502 -242099 -187783 -73423 -139540 -47797 -70691 -133590 -128074 -194514 -195737 -198135 -195325 -115935
7490 -115935 -59874 -66863 -163581 -174854 -201337 -60224 -127614 -181074 -103672 -71957 17563 60453
7478 60453 83840 -19410 22677 -65532 -156417 -109836 -103706 -238944 -96186 -374 10914
7467 10914 -60308 -91121 -86351 -81037 -49650 101991 -21454 -6013 -121419 -94219 -63751 -73108
7455 -73108 -153188 -191543 -144555 -177418 -133884 -97636 -71002 -47906 -156649 -90331 -13304 -84782
7443 -84782 -109248 -234801 -247164 -201003 -53894 -155942 -299370 -50968 -109005 -214748 -168237
7432 -168237 -33656 129602 113586 -6902 67549 89635 29652 -21581 24263 37259 60772
7421 60772 67822 -17571 -20974 -187604 -290226 -90045 -83188 -19206 43825 -87562 -195630
7410 -195630 -262610 -128573 -108432 22448 27055 38685 109845 62175 -61203 96835 14789
7399 14789 -5614 -12749 -100639 -168535 -97733 -38612 13400 -22154 16264 -3687 -94183 -176809
7387 -176809 -71918 83230 46845 72206 76928 -45333 -128106 -161325 -122680 -157589 -33445
7376 -33445 -11408 -68262 -64666 -83992 -80392 -199628 -179021 -77224 -133312 -239889 -72922
7365 -72922 -100023 -6582 31744 2554 121923 97343 9977 -14218 -149754 -139416 -8802
7354 -8802 73508 -31036 -143042 -145186 -14811 26985 61731 15375 30968 161552 33270
7343 33270 -162792 -17020 90089 -176080 -63158 26883 66390 -19476 -95287 -65510 -136643
7332 -136643 -58976 -24842 -50735 4379 78141 89608 24565 7017 9615 50409 20940 -78659
7320 -78659 27121 -69544 -31938 -41513 29001 58281 -114354 -8758 5492 100376 119270
7309 119270 -108288 -181035 -62014 48467 -25326 -222142 -184468 -132411 82072 72911 43769
7298 43769 13857 -103495 -38607 43759 80714 67863 52166 74673 -128777 -131241 -41849 -46948
7286 -46948 -81749 -245770 -202028 -201612 -187613 -191655 -122508 -86095 -9670 -23763 -46711 -135751
7274 -135751 -19308 32847 -19486 2469 53060 -4184 -53188 34317 137024 134696 -59260
7263 -59260 -142735 -188688 -140180 -38204 30088 -77534 -240497 -190849 -182457 -96224 88542
7252 88542 76661 -7862 110925 139740 79103 -12184 7648 -66155 -75297 -36192 -67265 -151323
7240 -151323 -150031 -153117 -193656 -117219 -143650 66913 28592 -192012 -110638 -1368 52528
7229 52528 34648 -185328 -191372 -191332 -79546 97393 23424 20643 -378 34616 -11238 -60738
7217 -60738 -33946 -135537 -184311 -158964 -94806 -126738 -186347 -105094 105100 77638 -32723
7206 -32723 -113767 -219061 -142203 -98741 -90734 52555 18281 -16223 -68214 22540 128383
7195 128383 49276 -38510 -55294 47468 168785 145202 145575 24598 -78917 -92416 -73295
7184 -73295 -14227 -32569 -144690 -178435 -47749 -55233 -58062 33786 -105198 -126949 58898
7173 58898 -3347 -68560 -113501 -87415 -49622 9659 -3156 -53244 -47752 -26714 1578 -25271
7161 -25271 73403 115775 19896 28439 -17658 37500 87775 85037 45104 -9024 14722 24832
7149 24832 51947 97314 -39610 9545 -61828 -18486 -54882 -111288 -44993 -138644 -55709 -3142
7137 -3142 -6042 -8225 -30985 -68630 32194 -114471 -50201 57055 25694 88719 137194 95835
7125 95835 24480 80579 -53074 87466 171262 44032 -8031 -151804 -92981 6637 -77100
7114 -77100 -23180 12882 -114123 -24798 156003 67870 67831 -25166 2343 59784 131351 43315
7102 43315 -90991 -143079 -137080 63426 230703 192124 81112 25077 -54848 -19634 59148
7091 59148 -5835 71449 116553 -29199 85350 77593 15673 -139109 -89658 4450 126795
7080 126795 -62271 -33759 -97792 -82879 -56593 -12686 -43338 12731 -31732 -74104 -6124
7069 -6124 86836 107864 106903 108334 -28274 -94115 -95115 63066 102138 174176 139149 121104
7057 121104 37998 18311 41844 126663 48639 -47930 174717 199008 113615 162238 83746
7046 83746 87472 87723 94378 75972 32608 27609 1586 21037 -7741 123452 114409 -46208 94669
7033 94669 76317 209713 109329 6630 -31873 50146 242476 173666 142589 4843 121289
7022 121289 58520 -72844 139789 125378 157132 159492 21669 7848 166597 147951 146941
7011 146941 158799 31701 198646 178346 114852 316136 309598 266289 257886 381572 406813
7000 406813 330480 277719 240560 90292 168139 144926 159833 196479 147273 48076 -94008
6989 -94008 -68131 67822 71523 -49068 -2361 7236 -40191 -59742 -62843 -199 2733 -21735
6977 -21735 74940 137924 143567 104920 216871 301229 194640 171258 148054 79367 -101723
6966 -101723 929 57765 120211 143373 133914 131585 126709 142267 -30670 31698 -14234 -45800
6954 -45800 -58060 127595 83151 29871 -118380 -13806 71285 28335 69205 194880 179243
6943 179243 74022 5250 -48161 -53847 40143 146500 188346 93546 -10116 -50189 12222
6932 12222 100145 79934 57259 12025 -1303 -45718 195399 138860 99199 131293 61944 40599
6920 40599 -34780 -111464 -205730 -144556 7532 89874 82212 -53878 -125285 -37213 15102 -1427
6908 -1427 -33676 116891 118732 140152 263317 251106 75180 -19637 46717 110613 63079 44111
6896 44111 147762 103325 131287 48981 75289 55745 53324 163073 71338 114059 -4934
6885 -4934 -139727 -5955 -68444 -118803 -45649 63175 48261 99207 38653 86511 58562
6874 58562 -58278 27754 46448 31769 -3175 62933 -8835 93196 66497 124864 50972
6863 50972 120997 95496 -4853 82724 163345 106693 90143 183091 107380 124083 102400 95557
6851 95557 129970 123647 136672 215929 188788 26102 -109290 -38523 13814 184917 204256
6840 204256 213299 175461 99231 69093 97730 147293 154366 55203 -62821 18031 62924 143062
6828 143062 59050 57750 -17090 13818 87624 -10712 94283 100484 -1876 17444 113313 112448
6816 112448 51884 46381 16024 -112790 -34630 11038 128039 140372 244217 213302 123355
6805 123355 72890 139561 208434 246739 260704 120446 -30457 -68170 -6491 101850 141156
6794 141156 149116 63221 59341 133403 208786 186996 72242 38510 45848 145811 176192 143131
6782 143131 88991 155495 37107 66226 135344 59636 118259 131791 131367 192816 247265 169845
6770 169845 159804 226170 125870 113263 87292 194375 149100 171171 169124 214726 104229
6759 104229 137923 228723 306338 272619 206191 213129 158228 56914 43860 96785 -19414
6748 -19414 79513 110041 164537 285013 212995 243388 186476 211560 383314 237032 200095
6737 200095 310970 328491 180126 88833 149315 282902 295194 240213 201317 227632 298757
6726 298757 338430 253029 138396 144282 241650 218825 354996 306645 283083 364434 304853
6715 304853 211846 220281 168752 304238 294283 300676 300522 211445 84240 29238 138622 161311
6703 161311 177738 160542 187321 227928 402859 306235 133294 185312 235013 267058 316087
6692 316087 347861 222881 186343 221532 144044 164200 193819 215089 172447 301839 415302
6681 415302 454907 348538 375830 261453 183115 169540 22606 131991 164511 174062 252230
6670 252230 265496 248822 292715 311253 207962 301678 342949 200471 200428 271127 235157 329985
6658 329985 244287 197239 242908 230108 253077 287944 264755 358025 343660 276030 156651
6647 156651 316217 359300 264700 196040 132153 249697 187440 16530 57476 123699 128338
6636 128338 89174 44864 190891 246788 231980 192039 195682 43366 97446 180993 102787
6625 102787 -45152 17859 9238 13421 50238 8935 29178 119263 192601 171525 5672 57711
6613 57711 54667 183839 296113 229885 246178 276128 275141 147375 277838 313481 120271
6602 120271 -9023 57245 102690 109174 65473 178993 173053 225150 254451 132102 80426
6591 80426 83587 81381 70971 214815 213502 226946 305111 154634 127936 187560 114237 187191
6579 187191 61405 119382 170530 68553 64995 164782 175060 72136 26086 32339 179891
6568 179891 61731 53953 163621 174175 125458 11462 228161 192540 89716 59195 144883
6557 144883 231535 189292 86756 -5874 114653 137312 167489 106661 151144 178246 87873
6546 87873 168144 139608 200207 179331 68015 140890 230925 304251 331708 140761 124957
6535 124957 112564 134319 181704 71235 152017 184372 133430 189591 207239 178360 98830
6524 98830 11481 76010 149753 260509 276175 246914 84391 137498 98640 67301 151208
6513 151208 156186 201899 157897 69205 39900 -49121 -106624 38315 53690 147087 156968 155319
6501 155319 311753 282582 229535 199160 193343 229757 180094 181919 182020 272421 179505 205417
6489 205417 338322 241450 233278 248859 190082 191647 289458 167074 15384 23560 116310 164993
6477 164993 226473 231486 220450 175065 64496 127880 238022 154656 153900 279051 286065 153985
6465 153985 100862 193551 55729 129867 307774 365269 370190 248809 277051 161065 85743
6454 85743 107045 175729 165572 154187 230708 271323 284870 229072 144489 191579 219266 224421
6442 224421 195267 203576 372428 369517 124654 109692 277345 225257 127623 110189 215793
6431 215793 217627 174045 246464 198279 284543 215102 74782 27615 165859 197343 224664
6420 224664 236133 282714 345648 113943 138147 249631 330748 221933 179714 253831 222115
6409 222115 249804 149441 103762 118105 213047 374686 231287 204143 198151 255623 352056
6398 352056 355271 215457 149286 237215 222599 124078 48392 -53769 -49842 95246 207070
6387 207070 276972 223141 186424 186741 177528 153719 210067 292330 238682 348834 295902 105426
6375 105426 92090 146007 163961 165042 262488 208638 289516 295135 134444 156062 190606 132305
6363 132305 221498 280267 268395 278830 190998 172457 273035 157550 108982 146596 135341
6352 135341 114708 212680 254448 170430 100712 193992 246532 169679 276214 173566 181274
6341 181274 287745 358320 227586 145643 147753 213125 191594 154077 214476 279143 179019
6330 179019 111195 181232 208287 229053 194390 236458 198039 166160 270876 196025 195165 190682
6318 190682 230129 109721 112314 104187 167319 208808 295899 390639 305151 229463 273913 406548
6306 406548 293691 366204 365000 226559 176275 136164 158325 185215 240257 342619 338054
6295 338054 390046 178330 282874 183937 166360 365634 250094 173706 281497 247987 143097
6284 143097 242702 276990 301352 252772 228007 221838 383556 303778 104661 177452 257371
6273 257371 238350 229886 179177 37491 92245 55663 187497 219684 189804 314656 326391
6262 326391 338882 244805 83542 191178 308631 325763 338246 335340 314076 380678 331550
6251 331550 252730 458797 402461 369468 353705 262347 335079 305570 387321 379504 213855
6240 213855 64042 11090 173442 69298 5031 228904 208926 224899 268138 276459 340743
6229 340743 294141 352643 335651 405398 431183 354605 384060 413734 410514 344170 430462 554654
6217 554654 340970 345810 336084 265451 325863 359741 289151 457797 528757 492750 456400 366705
6205 366705 481532 466185 384331 321132 382336 466847 495941 429970 451060 447263 375257 422957
6193 422957 378431 439348 413918 273789 287176 279504 266344 408142 363288 426151 479839
6182 479839 335685 514994 437412 450344 427449 445850 430890 424409 392957 447776 488262
6171 488262 466997 415726 328059 450837 386122 313459 447041 613708 534356 497340 340237
6160 340237 328603 593233 442939 373543 410088 444477 527107 574416 502604 539910 493591
6149 493591 529402 581049 458929 455786 436000 407626 500601 532700 585726 628782 711396 654201
6137 654201 524394 665740 597104 434938 366230 459402 488443 526502 554471 438444 546948
6126 546948 600534 460130 440658 435900 501588 564728 583011 656348 642143 698542 725688 661459
6114 661459 685243 617899 611592 656163 691638 663079 649337 736532 656553 694780 693900 618882
6102 618882 615363 706411 741033 777908 728609 710132 722955 630160 679530 558440 747406
6091 747406 868571 764484 688109 849350 709046 610753 546522 601312 598990 588116 666573
6080 666573 675714 608172 604735 554998 512743 496473 475684 484213 504394 360492 460950 664112
6068 664112 689527 634949 532042 580448 496926 482461 486777 492376 581374 439110 305285
6057 305285 456695 419084 420418 549383 497764 417437 375004 383250 438892 409843 437889 292356
6045 292356 269513 277007 327730 482595 481820 417012 394681 427727 448185 380387 392926 564045
6033 564045 568817 437696 499174 423830 448262 364482 406028 455021 391719 387228 296068 350050
6021 350050 324626 379671 356847 377691 436674 440948 408777 369334 338459 441503 346681 334661
6009 334661 529439 477385 580574 520043 418771 428512 479594 335495 266555 392871 433360
5998 433360 452056 460030 463530 438672 261916 302614 264199 221333 254876 280520 301467 290370
5986 290370 325653 382759 349578 343759 362960 377378 477500 460628 477922 458769 459407 587790
5974 587790 601614 535463 403908 336737 419264 481109 511671 525404 497139 372640 364969
5963 364969 330216 324991 335182 387581 406479 362852 441220 320326 298040 449438 379381
5952 379381 235103 322723 256403 263378 282223 330693 462138 411991 390690 553202 471916
5941 471916 356136 442172 437739 421318 430687 492411 494524 451601 426714 454787 473984 402859
5929 402859 370145 351223 477531 574837 598364 601323 535244 513572 392078 393652 402885 367645
5917 367645 462369 401769 447819 512428 392710 325284 315521 379128 433809 430386 394477 334065
5905 334065 264119 485764 501264 545784 440690 315291 278671 349344 418041 353924 498050
5894 498050 562338 653775 579030 572826 734737 682196 740785 803963 686738 812462 798781
5883 798781 856834 956499 1017735 958473 1081093 1124556 923034 886661 858360 741384 609788
5872 609788 630637 552667 587323 501923 598317 514063 555936 553395 563629 590132 631095 627029
5860 627029 608384 613259 639314 755819 699201 502835 620348 526549 431000 523377 486286
5849 486286 562155 565077 580374 596129 667175 696887 647286 748821 716943 656011 542439
5838 542439 464514 717721 667002 483199 539394 637632 656795 494952 471576 395373 566476
5827 566476 637327 602639 548035 574298 566854 610495 648430 697312 638410 571014 442667 450412
5815 450412 492975 454140 448703 386349 601675 695929 537750 542305 639951 423420 521148
5804 521148 539233 592423 487714 557679 585727 636456 576555 569942 542562 614731 492353
5793 492353 478933 464491 465897 629775 720556 721447 617400 668645 687742 495403 416327 440661
5781 440661 522959 539208 458875 397494 461671 462510 471225 347886 299069 427179 377043 417547
5769 417547 362004 290386 409185 413718 507903 612449 615930 541586 428381 577640 591018
5758 591018 604722 676006 621871 690375 512670 576454 539824 744466 726558 584855 663192
5747 663192 678219 642816 579291 632265 659834 578708 529943 568530 587207 550485 450054
5736 450054 440142 456383 627745 525185 650068 657644 538081 601204 516438 551111 691866
5725 691866 649040 568926 573802 513738 485478 491294 481572 441927 490760 531690 433449 566973
5713 566973 611147 765806 764962 586799 447122 523283 758014 802984 699437 715670 705158
5702 705158 848834 773812 696852 713451 774454 727389 668740 645526 718071 655816 651185 675655
5690 675655 689244 711990 706313 769350 710995 651646 565781 538739 655674 805579 656622
5679 656622 738962 871000 886055 916144 815285 730447 765856 836310 887160 821342 822392
5668 822392 730525 672221 651698 690957 780428 664707 693606 707590 787252 734945 693908
5657 693908 627429 693234 705994 720693 830309 900753 858034 754496 680690 690071 643253
5646 643253 593113 724263 748938 617778 636614 706824 759214 730586 633765 656146 716423
5635 716423 734783 755570 765704 875221 896827 634410 705964 785150 752035 797777 805264
5624 805264 823899 764089 690887 709670 849208 847800 916389 955133 1003740 1036040 950877 939070
5612 939070 931489 979410 859791 999955 906828 938072 990008 901462 1011774 986233 905229
5601 905229 1057429 992172 1035521 1188894 1191627 1234399 1102731 1082884 1105633 1159271 1088461
5590 1088461 1092313 1120754 1194752 1406503 1419448 1210242 1209002 1341042 1327122 1469807 1415724
5579 1415724 1440668 1412614 1444198 1472305 1517352 1630184 1580871 1539617 1485869 1667501 1745109
5568 1745109 1725657 1854637 1895286 1966302 2014164 1850965 1799915 2055795 2070018 2152854 2208437
5557 2208437 2098294 2138994 2049361 2335731 2292081 2161561 2252700 2250055 2329710 2300165 2504094
5546 2504094 2538909 2501959 2505297 2511435 2518650 2629732 2454364 2452733 2616543 2684334 2742039 2754618
5534 2754618 2679395 2680613 2751081 2733181 2781620 2722143 2721064 2807511 2931273 2948501 2892636 2949275
5522 2949275 2944018 2859014 2893968 3006744 2834960 2793516 2750452 2708886 2751723 2856472 2896607
5511 2896607 2855193 2911325 2962876 2973615 3018635 2950243 2930877 2883112 2886162 2944647 2983559 3058957
5499 3058957 2868382 2746278 2961822 3037730 3026916 2962908 2880724 2833837 2755616 2794006 2753511
5488 2753511 2629918 2656967 2781943 2679138 2735418 2697728 2786952 2804765 2713697 2634755 2678769
5477 2678769 2659810 2608606 2564489 2606512 2558247 2406114 2198907 2401992 2501633 2425110 2448542
5466 2448542 2507281 2372359 2274403 2097620 2093053 2076583 2051942 2077089 1986334 1871959 1836282
5455 1836282 1877416 1811069 1815494 1820860 1761070 1761235 1623504 1507188 1549185 1584590 1640736 1554247
5443 1554247 1567895 1433639 1441693 1500238 1417338 1284285 1182512 1407736 1432704 1383340 1327100
5432 1327100 1257927 1193812 1176410 1153487 1081377 1019461 988517 1106881 1205941 1240420 1204381
5421 1204381 1086632 1148309 1209919 1179823 1203290 1129958 1040812 1079796 1053393 1026400 1041096
5410 1041096 1024149 930341 847396 941770 1029543 1060589 1039076 1016999 951753 936510 845975
5399 845975 855516 915278 970179 921662 1029883 1047603 934201 820845 805825 727645 890135
5388 890135 839910 894145 900842 1021747 933634 805178 869109 869600 980936 1020539 956492 878685
5376 878685 954430 951195 892059 856111 884128 804266 923806 894106 722366 655955 745871
5365 745871 760474 773422 801850 770737 821180 816488 814626 843435 872756 825286 773649 760993
5353 760993 761748 854892 797070 902423 863851 890101 794104 609168 728128 624067 624627 778984
5341 778984 840044 712900 774826 867514 830298 872723 938662 813173 718963 757941 710343
5330 710343 662688 847206 849438 707735 732492 850805 686003 664201 646310 639574 595170
5319 595170 723953 837242 781941 830864 783672 759785 724789 769056 925259 830327 806323
5308 806323 869501 787585 846575 844900 780992 810863 816455 821115 894887 716402 892902 1013456
5296 1013456 926774 860429 870553 769577 785700 744295 712336 817094 841138 746701 744075
5285 744075 664419 640542 745238 735664 681417 832679 811202 799375 843230 783555 717379
5274 717379 832104 813817 710590 602344 610628 814537 834743 724610 666180 639101 676465
5263 676465 826775 857931 931523 797120 807909 787283 857355 839632 838870 913491 876189 975371
5251 975371 815867 842796 907373 749720 667421 602264 648648 794489 861129 851936 835801
5240 835801 678984 760413 918354 755414 527101 724072 823776 691709 738155 784809
5230 784809 791979 834422 833874 775856 664996 626097 674116 687767 718397 757751 789260 795687
5218 795687 797822 802879 856810 985475 932068 813916 779908 792128 862903 846957 817889 881261
5206 881261 925557 974524 868189 877301 749618 749826 710290 734521 915223 879486 819939 925791
5194 925791 1041223 1022098 922867 873174 929113 904774 888635 871054 922664 878870 934638
5183 934638 871814 944676 958574 1064165 1018576 921995 950856 944757 989941 970417 1021352 1056337
5171 1056337 973426 845136 770153 951175 1027868 967393 1045266 1021602 974967 899630 1010946
5160 1010946 1105422 946084 939630 966268 1008337 985638 1012098 1097170 1000101 1015328 1043553
5149 1043553 1018587 977201 1014878 1034682 1044221 1045845 1084440 1147204 1168768 1206591 1232225 1389792
5137 1389792 1270739 1315553 1289345 1334144 1366666 1342621 1588668 1551894 1579334 1604221 1599721
5126 1599721 1636853 1763376 1757495 1578776 1646103 1674266 1595994 1573314 1660004 1628137 1646927
5115 1646927 1608948 1696237 1802566 1802971 1926622 2025858 2096953 2060922 1992948 1977480 2032547
5104 2032547 2085443 2046904 2079672 2166699 2064021 2051062 2025523 2125648 2244003 2305139 2359322
5093 2359322 2416903 2442030 2488709 2446278 2412559 2426755 2497697 2432920 2489911 2512989 2499101
5082 2499101 2558968 2611580 2631905 2638589 2672491 2783313 2807007 2914187 2893789 2922004 2927616
5071 2927616 3005634 2974705 2935917 2987410 2995774 2986695 3117490 3245024 3220812 3249864 3180298
5060 3180298 3293734 3328499 3355232 3331941 3308902 3177499 3212035 3412991 3345231 3268940 3272925
5049 3272925 3134028 3199028 3128934 3079653 3158888 3026596 2946114 3056183 3052565 2867562 2830336
5038 2830336 3029939 2995668 2852193 2933580 2917962 2888859 2877692 2919602 2891644 2826165 2808066
5027 2808066 2765437 2801142 2803978 2807270 2757927 2804470 2706244 2753020 2736057 2751435 2790502 2784663
5015 2784663 2680316 2466065 2528060 2507913 2369383 2320283 2258056 2265021 2381507 2292904 2369692
5004 2369692 2456005 2396749 2314107 2300464 2215046 2079623 2074023 1968363 2079100 2137530 2086715
4993 2086715 2083853 2029601 2055819 2001914 2006832 2040444 2134389 2034683 2013978 1980062 2012526 2023626
4981 2023626 1919392 1835906 1782097 1802449 1830881 1782510 1740134 1782535 1724933 1636989 1702247
4970 1702247 1650125 1638962 1708629 1668539 1586362 1614791 1696661 1645507 1681769 1652571 1664037
4959 1664037 1562467 1508050 1594610 1571008 1536971 1604019 1510358 1502326 1494316 1542426 1453402 1402969
4947 1402969 1542672 1552201 1498762 1466583 1355987 1421142 1496772 1532861 1508782 1431570 1385003
4936 1385003 1419722 1376074 1486418 1496451 1437435 1382029 1426803 1334053 1330953 1331001 1506256 1651941
4924 1651941 1537715 1496331 1343826 1283090 1298075 1351243 1369739 1429909 1343572 1295304 1187620
4913 1187620 1315552 1442400 1386014 1359035 1396147 1284890 1205681 1222285 1245675 1366850 1396354
4902 1396354 1440028 1495832 1366577 1505925 1519537 1511021 1549046 1549735 1543778 1662111 1781503
4891 1781503 1636394 1712326 1947438 2051019 2107582 2097103 2093667 2105456 2015993 1897677 1867232
4880 1867232 1885933 1820872 1754642 1707502 1634015 1577217 1646317 1588392 1484195 1489463 1567941
4869 1567941 1483472 1373753 1423704 1380401 1377751 1421322 1397894 1341708 1423164 1324795 1254494
4858 1254494 1260406 1292233 1145303 1204058 1189342 1140106 1127250 1108783 1306022 1303384 1290022
4847 1290022 1434609 1363776 1273156 1191325 1226243 1275943 1259483 1242807 1159686 1151051 1139175
4836 1139175 1189651 1175997 1128608 1060272 971667 1121167 1257277 1144476 1118810 1145023 1232519
4825 1232519 1160657 1072581 1133895 1177364 1243087 1218326 1221253 1147763 1094369 1293772 1260230
4814 1260230 1184801 1193943 1301044 1287371 1260486 1250246 1281891 1256686 1312653 1325904 1172166
4803 1172166 1164581 1160672 1279294 1298223 1322732 1192188 1001309 1076338 1158846 1127618 1165172
4792 1165172 1183582 1066593 1084379 1131136 1058229 1070225 1113577 1151043 1195948 1321917 1444142
4781 1444142 1442408 1452393 1259281 1075230 1200470 1202258 1080065 1122592 1242695 1186316 1181344
4770 1181344 1113784 1190347 1223993 1138447 1095703 1043359 1164659 1230160 1172056 1119684 1287584
4759 1287584 1296801 1292766 1214729 1249527 1286240 1261736 1344974 1387026 1432632 1413068 1345206 1225075
4747 1225075 1249427 1278759 1274215 1358842 1246453 1305712 1462206 1540478 1366661 1388448 1431262
4736 1431262 1469959 1580204 1390943 1479416 1490999 1396738 1376980 1386582 1414612 1445716 1409959
4725 1409959 1463739 1485090 1462657 1520950 1438135 1457652 1345420 1445931 1476075 1536828 1548762
4714 1548762 1429297 1354799 1508390 1514948 1485889 1357655 1413605 1390510 1361880 1364179 1243983
4703 1243983 1273495 1402799 1488082 1568070 1662149 1451102 1443388 1547357 1639552 1499779 1468371
4692 1468371 1552805 1526876 1559980 1589507 1548093 1541061 1485566 1640037 1761508 1804511 1775705
4681 1775705 1668419 1693674 1587289 1341509 1326889 1424199 1513710 1563488 1599530 1574527 1592502
4670 1592502 1628010 1607897 1516666 1655777 1771971 1701108 1722863 1729063 1783887 1752685 1656567
4659 1656567 1880555 1906662 1731317 1704230 1668037 1735413 1680820 1701714 1821298 1719617 1780441
4648 1780441 1957478 1917089 1762822 1877204 1827904 1679899 1850816 1869616 1904652 2060335
4638 2060335 2008485 1992501 1989395 2027724 2097089 2128542 1986332 1993566 1994686 1968739 2049044 2151323
4626 2151323 2039321 2128080 2113131 2120207 2220055 2118667 2169744 2200016 2232976 2151533 2183789
4615 2183789 2117687 2143240 2162364 2122292 2306221 2245114 2158496 2235891 2223719 2075863 2157989
4604 2157989 2218697 2323127 2289867 2175149 2137535 2282317 2354720 2244400 2307626 2329005 2413318
4593 2413318 2495503 2412357 2356351 2341562 2368045 2365228 2265069 2321623 2372006 2432989 2580179
4582 2580179 2583337 2502877 2487847 2370105 2354604 2456376 2544688 2527143 2501565 2514776 2561530
4571 2561530 2716774 2703587 2546801 2556185 2448150 2473379 2593999 2592210 2624484 2572279 2625007
4560 2625007 2594944 2526492 2658992 2694906 2667104 2741715 2822783 2853247 2759588 2865683 2890198
4549 2890198 2900733 2931927 2852534 2887774 2903273 2988873 2922535 2916782 2868030 2934872 2910544 2997671
4537 2997671 3086952 3085272 2995331 3085599 3201062 3139118 3165918 3209019 3276482 3405096 3433529
4526 3433529 3523640 3407436 3390700 3527641 3636924 3739916 3659051 3392253 3557608 3687437
4516 3687437 3617946 3718458 3902293 3962853 4036910 3978399 3994894 3956226 3955260 4137840 4113797
4505 4113797 4090548 4309397 4292384 4191155 4421019 4475651 4555068 4633272 4570970 4601456 4729004
4494 4729004 4800551 4977006 4940585 5008954 5150529 5256603 5313231 5309832 5366162 5432271 5464548
4483 5464548 5716873 5896820 5962736 6022503 6035950 6051691 6209202 6475706 6644527 6746281
4473 6746281 6876862 7058936 7111021 7208500 7280384 7350696 7560376 7800355 8065791 8205031
4463 8205031 8200069 8390532 8648426 8902879 9014659 9257257 9572153 9703280 9909785 10108032
4453 10108032 10361549 10558327 10911807 11090268 11422087 11764076 12049938 12396921 12824771
4444 12824771 13173374 13526546 13836203 14235925 14824896 15247532 15615796 15873812 16352721
4435 16352721 16839124 17408652 17993856 18255639 18694037 19242674 19835779 20382697 20899563
4426 20899563 21394438 22085908 22531416 23039113 23399110 23959861 24644904 25070181 25334099
4417 25334099 25523313 25916137 26314747 26429669 26581288 26839189 26929868 26896087 26948387 26769345
4407 26769345 26701909 26586759 26413972 26259752 25765784 25616347 25306414 24910984 24670310 24406628
4397 24406628 24015977 23676146 23334860 22950654 22681783 22380543 21982034 21540739 21279036
4388 21279036 20926340 20589179 20386945 20033366 19655350 19274127 19132043 18836119 18650007
4379 18650007 18487567 18255424 18043280 17922777 17861968 17648320 17415035 17390257 17185771 17088909
4369 17088909 17085681 16992821 16981924 16882673 16924882 16945090 16907630 17032408 17079413 17037799 17223925
4358 17223925 17522289 17594504 17848889 18025361 18226398 18645351 19130867 19444304 19897493 20493574
4348 20493574 20990522 21476732 21926046 22632458 23249670 23976966 24751182 25455831 26290059
4339 26290059 27383763 28224586 28986784 29902507 30879549 32086145 33240834 34272336 35318192
4330 35318192 36471449 37622326 38911266 40143895 41407112 42604993 43844145 44950190
4322 44950190 46036960 47110826 48258556 49129388 49910942 50703134 51491200 52277717 52914203
4313 52914203 53614141 54150483 54494163 54946789 55204922 55321547 55519357 55352764 55198762
4304 55198762 54740704 54215961 53633331 52991239 52245878 51538090 50912039 50076944 49133409
4295 49133409 48361383 47359827 46222634 45098330 43834857 42673423 41445718 40176069
4287 40176069 38906462 37582050 36376810 35182178 33869056 32455576 31273328 30152839
4279 30152839 29043738 27920009 26739429 25750552 24659198 23444834 22473992 21529205 20551383
4270 20551383 19818015 19073324 18467555 17672861 16798429 16172001 15680873 15108993 14700329
4261 14700329 14246980 13704934 13070806 12703509 12199353 11792569 11451323 11048338 10795318
4252 10795318 10601018 10248306 9964935 9801728 9661591 9464020 9068274 8948518 8895473 8636307
4242 8636307 8416252 8284418 8103655 8062288 7847308 7788745 7550185 7396520 7328702 7253929
4232 7253929 7284336 7052296 6889027 7138129 6927760 6876119 6801660 6565683 6630204 6715523
4222 6715523 6560153 6408155 6424311 6382358 6408089 6509939 6473479 6300854 6282858 6312137 6245470
4211 6245470 6284280 6162368 6131607 6141637 6151108 6084883 6037553 6145338 6093095 6140083 6135673
4200 6135673 6131113 6099695 6027161 5861487 5946078 5987407 5928310 6074316 6054621 6032012 6070519
4189 6070519 5983966 6125705 6123451 6052914 6039987 6116026 6041825 6061311 6230811 6210105 6211101 6240049
4177 6240049 6229672 6257590 6214677 6337915 6501698 6472218 6584685 6635088 6675778 6660643 6835003
4166 6835003 6794415 6864125 6992540 7022802 7069151 7058437 7023981 7109267 7236651 7117476 6998599
4155 6998599 7055155 7206557 7164473 7192472 7163840 7124351 7206089 7204336 7376715 7463515 7405158
4144 7405158 7381743 7510757 7506163 7369108 7465736 7566083 7694086 7771632 7796979 7913443 8007226
4133 8007226 8016219 7967994 8019518 8041593 8031680 8055961 8089146 8137371 8238591 8270053 8243043 8355402
4121 8355402 8460930 8578177 8540215 8632961 8543459 8616001 8866437 8957830 9125891 9237852
4111 9237852 9364037 9554865 9622647 9671223 9842544 10051254 10063612 10182630 10289374 10468240
4101 10468240 10661387 10753094 10898744 11079482 11394433 11485273 11784720 11951601 12151940 12483164
4091 12483164 12911899 13168327 13266162 13565944 13905546 14321085 14646808 14957835 15255736 15682628
4081 15682628 16102613 16488950 16954643 17325659 17713363 18156211 18703838 19186692 19596712
4072 19596712 20201234 20737702 21403394 21923920 22629298 23232617 24009607 24967632 25736202
4063 25736202 26552537 27443092 28582886 29635982 30668646 31659091 32883531 34246051 35666633
4054 35666633 37258721 39038773 40754578 42418174 44582069 46833167 49144497 51605941
4046 51605941 54233938 57024095 60069982 63377705 66928384 70502008 74251595 78190791
4038 78190791 82199268 86408082 90683401 94835610 98935266 102929655 106679094 110158723
4030 110158723 113114481 115810173 118210414 120171039 121490886 122484697 123286406 123582493
4022 123582493 123426810 123136960 122664508 121730101 120464238 119047714 117286794 115101412 112402648
4013 112402648 109470193 106214292 102717144 99044092 95298266 91451694 87383497 83486804
4005 83486804 79811876 76081273 72354402 68760973 65291894 62098709 59178817 56427805
3997 56427805 53739481 51271605 49033569 46953405 44898051 43061165 41285326 39580525
3989 39580525 38129120 36716647 35523477 34461678 33327387 32273271 31303171 30406395
3981 30406395 29665452 28823390 28149469 27505499 26946299 26375252 25678537 25126847 24653464
3972 24653464 24143708 23646160 23303242 23048025 22817992 22505231 22184109 21964189 21725505
3963 21725505 21457442 21447685 21392247 21111559 20879684 20733881 20682015 20650956 20639115 20503179
3953 20503179 20556181 20584334 20472322 20611617 20665939 20714973 20885575 21233044 21388869 21602641
3943 21602641 21930517 22045270 22351825 22614488 22975783 23503936 24031426 24442417 24954549
3934 24954549 25461615 26097147 27013362 27922091 28652905 29482079 30580596 31573094 32626247
3925 32626247 33737726 34864744 36013279 37107739 38087205 39232908 40128441 40751779 41345847
3916 41345847 41871632 42280379 42442908 42415905 42407903 42224506 42129560 42146794 41920828 41763548
3906 41763548 41744002 41798199 41753775 41999773 42468343 42864947 43335679 43953084 44863478 45784939
3896 45784939 46807309 47895831 49146081 50585928 52135965 53883900 55874329 57997614
3888 57997614 60189919 62737797 65393222 68252403 71410834 74932874 78754864 82898700
3880 82898700 87099682 91718501 96769945 102050959 107527938 113427354 119493008 125747708
3872 125747708 132302092 138882045 145504495 151979930 158187574 164090053 169534417 174391573
3864 174391573 178644131 182283490 185206529 187405049 189046967 190239419 190897947 190934084
3856 190934084 190765669 190062612 189061378 188074928 186877101 185256888 183400050 181183433
3848 181183433 178505512 175605067 172396666 168768919 164841217 160510906 155662322 150664542
3840 150664542 145379915 139945393 134518164 128847628 123269757 117913381 112502617 107341323
3832 107341323 102384520 97560195 93062472 89060796 85297223 81546648 78268694 75215522
3824 75215522 72345579 69816693 67472615 65213826 63297963 61588879 59940680 58446101
3816 58446101 57161593 56146941 55145929 54176016 53265760 52408807 51651937 50936289 50494095
3807 50494095 50055476 49615623 49305605 49016402 48681245 48451186 48114872 48085896 47960936 47706377
3797 47706377 47488722 47185061 46665480 46242711 45640980 44923257 44070908 43070881 42006408
3788 42006408 40805281 39640174 38370021 37085964 35726088 34316548 33133523 31921963
3780 31921963 30776940 29709948 28590674 27531017 26601530 25543475 24582394 23893595 23066715
3771 23066715 22399211 21733827 21099768 20449085 19949078 19383499 19027584 18630591 18177359
3762 18177359 17790095 17379613 17205489 16896705 16549359 16270416 15966409 15732382 15577194
3753 15577194 15362259 15101711 14974195 14831455 14693363 14517636 14302657 14090702 14009465 13845545
3743 13845545 13695484 13445877 13331515 13114277 13111875 12867863 12656863 12474701 12358651 12349763
3733 12349763 12155000 11980706 11867204 11798805 11767457 11571153 11368553 11200914 10922601 10832691
3723 10832691 10853804 10673753 10571009 10457821 10383241 10300187 10354906 10292312 10134566 9980739
3713 9980739 9828640 9803327 9823263 9920665 9802199 9696613 9639871 9622333 9547171 9504266 9350372
3702 9350372 9443588 9520943 9406414 9415037 9324644 9272713 9291824 9167114 9168007 9117528 9259682
3691 9259682 9303557 9362864 9342360 9288609 9454789 9432514 9384424 9388428 9483898 9660928 9808789
3680 9808789 9796831 9805315 9684505 9700903 9954723 10076863 10280895 10274572 10262320 10298978 10374289
3669 10374289 10495442 10625314 10866596 10914178 10940867 11095092 11143762 11328952 11450489 11748976
3659 11748976 11786793 11973050 12250249 12368956 12582906 12791807 13052721 13191829 13391345 13587536
3649 13587536 13762033 14117910 14420708 14739899 15212568 15587990 16121114 16661414 17032439
3640 17032439 17362037 17936000 18523865 19245188 19843687 20454464 21184256 22051820 22830159
3631 22830159 23850896 25018556 26101899 27268406 28257771 29566850 30767961 31856353
3623 31856353 33055991 34170664 35240059 36267340 37235670 38117770 38976482 39675677 40258494
3614 40258494 40727218 41166680 41410337 41572072 41872509 42108268 42239770 42273172 42475327 42357829
3604 42357829 42227755 41880001 41562937 41220974 40799326 40411416 40139298 40020275 39775568
3595 39775568 39462931 39320764 39448253 39782876 40099216 40557511 41070569 41849311 42694263
3586 42694263 43870625 45129195 46467142 47917309 49602966 51598385 53585498 55854089
3578 55854089 58450043 61158815 64028388 67080686 70307100 73719422 77273268 81046397
3570 81046397 84607811 88506129 92308644 96086711 99826038 103632195 107117963 110206401
3562 110206401 113064462 115762505 118001848 119976279 121557829 122787743 123761737 124409661
3554 124409661 124868748 124951425 124628025 124259848 123333788 122333245 121267739 119929011 118327164
3545 118327164 116478994 114558769 112681825 110796411 108842727 106925991 105150592 103638049
3537 103638049 102211086 101254037 100544553 100124465 100009067 100107237 100671203 101640544 102657868
3528 102657868 103915254 105334158 106920614 108605029 110261302 111828143 113184046 114626767
3520 114626767 115978842 117033909 117731239 118186362 118555927 118620522 118373077 117950104 117347608
3511 117347608 116444476 115455464 114138531 112447669 110592706 108629421 106210770 103411920
3503 103411920 100471060 97236695 93829349 90252277 86665225 83165049 79786443 76395049
3495 76395049 73140304 70173999 67362953 64813473 62249719 59941661 57889693 56069261
3487 56069261 54532832 53032019 51750366 50671390 49686604 48851629 48337054 47946692 47712980
3478 47712980 47662245 47625093 47526951 47792711 48206061 48557222 49045105 49562241 50173335 50833125
3468 50833125 51513139 52395832 53219289 53932780 54823322 55622776 56284861 57042030 57727884
3459 57727884 58323806 58878189 59300056 59617363 59855320 60126419 60335666 60444586 60445925 60374262
3449 60374262 60037575 59906892 59653694 59144621 58455125 57589955 56440379 55165369 53844322
3440 53844322 52128341 50320627 48520416 46813642 45313286 43784955 42324409 41108260
3432 41108260 40125209 39105822 38421652 37840727 37345130 36869334 36638177 36498051 36403035
3423 36403035 36486096 36767724 37121111 37454909 37954783 38493227 39340920 40113056 41156472
3414 41156472 42010705 43005454 44288911 45482828 46747598 48131018 49469787 50806499
3406 50806499 52308247 53917354 55734028 57442469 59381811 61514805 63798993 66242103
3398 66242103 68705454 71496245 74374060 77471029 80401920 83324191 86170682 89078145
3390 89078145 91826453 94342482 96791908 98883112 100736004 102376152 103781742 104873178
3382 104873178 105835791 106676899 107163390 107564753 107894420 108265009 108288763 108025225 107570846
3373 107570846 107059504 106248362 104848102 103193842 101224647 98878475 96177707 93179498
3365 93179498 89795109 86097522 82399320 78389946 74638448 70877816 67126577 63522474
3357 63522474 60192062 57042870 53931048 51067584 48556062 46120969 43732160 41742661
3349 41742661 39780405 38110013 36455841 34873016 33316076 31903675 30699499 29809222
3341 29809222 28657995 27748800 26821430 26023119 25271180 24643572 24060054 23439549 22964657
3332 22964657 22512694 22173766 21887825 21409757 21120662 20882350 20555798 20392019 20476968 20346804
3322 20346804 20435987 20471618 20492141 20681472 20948541 21019396 21062120 21239277 21264113 21308456 21119885
3311 21119885 20851491 20582901 20248628 19782326 19308211 18769764 18291907 17727359 17193802
3302 17193802 16628845 16114096 15733637 15260417 14694711 14318154 13839789 13500743 13037587
3293 13037587 12762149 12395536 12122985 12050303 11806302 11512501 11304953 11185051 10932120 10879517
3283 10879517 10791409 10738852 10503304 10342424 10201824 10130089 10150936 10017642 9987284 9782931
3273 9782931 9774100 9735772 9666892 9611459 9544337 9552918 9467481 9456702 9538092 9454490 9499263 9566178
3261 9566178 9478075 9445599 9555080 9452538 9352570 9435251 9248573 9053584 9116403 9015174
3251 9015174 8951151 9019137 8978600 8995801 9068135 8994092 8927754 8886881 8852281 8963596 8923605
3240 8923605 8860253 8991121 9095596 9100888 9133408 9045462 9078114 9143934 9096063 9130580 9147779
3229 9147779 9195282 9295221 9270806 9321419 9328087 9230635 9315347 9293416 9344296 9522137 9543621
3218 9543621 9584487 9760616 9831426 9854280 9810438 9754076 9766746 9892550 10046797 10086694 10135444
3207 10135444 10203223 10384813 10615821 10637482 10649900 10602122 10721643 10930693 10992547 11153481
3197 11153481 11309855 11433806 11713034 11712189 11958761 12234309 12443723 12521367 12642550 12797897
3187 12797897 13089840 13307646 13524654 13758193 13960503 14250292 14358571 14695618 15009851
3178 15009851 15333786 15685297 16028234 16280692 16600877 16936595 17308960 17785372 18368637
3169 18368637 19009663 19605311 20089487 20718380 21328055 22170911 23107498 23897041 24801515
3160 24801515 25993554 27031882 28188587 29490168 31043816 32537918 34150598 35930104
3152 35930104 37784995 39858159 42354693 44797875 47189311 49401585 51505549 53166915
3144 53166915 54044085 54317159 54076043 53227294 52246921 51516435 50972604 50637176 50538903 50686462
3134 50686462 51078766 51583535 52215428 53089822 54311560 55552816 57006381 58536169 60231929
3125 60231929 62280498 64152754 66217354 68509913 70905031 73485616 76321570 79414583
3117 79414583 82781383 86336667 90394182 94524073 98980000 103860536 109322348 115146731
3109 115146731 121608737 128603573 136056027 144236916 153192458 163023881 173791002 185660693
3101 185660693 198663642 212998248 228610698 245818205 264295722 284131847 305414405
3094 305414405 328201523 352349123 377807796 403712205 429581411 454149176 475699771
3087 475699771 492781290 503466058 506718952 501899067 489739822 470848969 447218961
3080 447218961 420611120 392828328 365099767 338383458 313361555 290306790 269099047
3073 269099047 249775401 232117302 215998489 201343504 188043507 175859926 164751254
3066 164751254 154536731 145208945 136695503 128924781 121725617 115044971 108859142 103132752
3058 103132752 97848318 93109925 88567454 84267032 80248798 76556775 73126669 69821845
3050 69821845 66820698 64010164 61195472 58595524 56262445 54025298 51786267 49732868
3042 49732868 47923594 45962406 44232097 42678121 41146364 39609223 38250574 36818290
3034 36818290 35539352 34152781 33118606 32219216 31292318 30198008 29365885 28640041 27765284
3025 27765284 26868172 26184333 25588783 24953786 24343177 23798728 23184017 22615536 22144418
3016 22144418 21487223 20976098 20456181 19989010 19504490 19159204 18817766 18445202 18017555
3007 18017555 17603112 17205927 16698604 16404103 16229722 15962024 15703831 15286660 15062613
2998 15062613 14782742 14412478 14167120 14083079 13712671 13292055 12990074 12777746 12615632 12400672
2988 12400672 12117361 11743862 11673035 11325470 11141002 10948189 10676384 10468231 10360977 10241176
2978 10241176 10002410 9911637 9762880 9658458 9401885 9131133 9021424 8953131 8826354 8699582
2968 8699582 8572604 8271469 8117782 8076434 7889323 7779828 7629554 7532630 7386242 7061010
2958 7061010 6821905 6624397 6510417 6384987 6248907 6180689 6060252 5957435 5740209 5736501
2948 5736501 5673584 5588238 5309900 5098235 5122913 5108256 5093144 4929302 4806376 4662920
2938 4662920 4547577 4419600 4466395 4469474 4307747 4152883 4111422 4145157 4165131 4023209 3860703
2927 3860703 3854052 3978868 3962945 3772721 3731498 3636314 3555334 3382241 3232238 3200929 3198999
2916 3198999 3184932 3149894 3127743 3100374 3046456 2868850 3021089 2933106 2846870 2813811 2953644
2905 2953644 2950755 2971534 2876530 2993692 3100115 2947859 2959803 2892724 3036706 2998885 2954907
2894 2954907 2763226 2681497 2680817 2742594 2717182 2483080 2454385 2333559 2398305 2488563 2516228
2883 2516228 2498963 2505606 2501372 2380876 2358904 2315022 2288353 2240096 2190572 2064244 2084051
2872 2084051 2144803 2197700 2078067 2200041 2139784 2121502 2129821 1956266 1965092 2014245 1951619
2861 1951619 2054438 2217635 2177342 2030675 2105048 2010215 1873803 2048504 2174009 2089416
2851 2089416 2107077 2130748 2088767 2055913 2006806 2025125 1817111 1862370 1858906 1835395 1820128
2840 1820128 1777151 1749587 1894686 1744486 1721323 1707322 1595457 1544862 1581940 1596517 1756255
2829 1756255 1766547 1684197 1613682 1591150 1567772 1645108 1742489 1770457 1648239 1689167 1836792
2818 1836792 1810978 1945021 2012848 2085834 2179724 2376382 2440988 2455897 2397017 2563939 2746419
2807 2746419 2916244 2943885 3052073 3099597 3070863 2997909 3065758 3149835 3114658 2949535 2971917
2796 2971917 2965326 2796741 2587298 2485765 2313564 2134913 2170085 2016785 1995558 1929867
2786 1929867 1764698 1616643 1574964 1516537 1340692 1271282 1353216 1207069 1300176 1154296
2776 1154296 947482 993308 918360 888691 772800 862211 916630 943357 838879 800945 726983
2765 726983 700589 709561 760091 728455 802815 680713 563712 499529 509351 508108 417220 387425
2753 387425 453274 548433 438356 379066 432024 446210 498870 458649 347464 290662 369717
2742 369717 323956 312532 301010 319538 444706 391862 392910 270828 380853 317164 194503
2731 194503 108086 135192 206445 152120 156691 234235 236909 210461 214444 186419 120055 197845
2719 197845 290208 241831 245628 267160 202552 177968 112418 119291 78821 71593 175438 316445
2707 316445 307159 94940 55431 56474 62967 233814 123189 164698 165483 29581 -27534 6479
2695 6479 -13217 -11609 197765 218891 110803 167183 70213 130737 206079 179157 158613 -47421
2683 -47421 -73635 49623 188327 168713 209552 76470 18023 47745 151810 38661 -6104
2672 -6104 -47438 -113018 54153 122200 112366 99221 243432 205323 108153 139134 68518 38906
2660 38906 154479 135897 56420 83664 114062 108517 53507 -5896 96176 174293 138160 113321
2648 113321 120829 10122 -12030 20848 -71331 -72168 -51412 -88506 105620 45832 40037 -36575
2636 -36575 -45515 -52640 42210 233585 68794 75248 64667 -104753 -82220 -46647 4697 74753
2624 74753 68845 26502 37774 132008 19677 -20937 32864 49828 -72190 -5837 19967 31036
2612 31036 -66726 -99815 -127394 -101110 -29433 -52754 59390 -32280 -161409 -85704 -42070
2601 -42070 -65467 -73688 -66757 4919 -29458 3033 -1749 -8588 -65094 -82697 -49852 -72659 -178341
2588 -178341 -114304 -2975 -28155 -51800 -23851 -54472 -98512 -139664 -159135 -121045 -45835
2577 -45835 -133096 71382 215149 90727 10653 29071 32058 62268 88013 16244 -173256
2566 -173256 -321689 -349858 -295982 -70246 -113263 -131950 -176155 -122188 -179032 -255575 -183629
2555 -183629 -144334 -159586 -157256 -247444 -110225 -30578 51558 12430 -102893 -162536 -181136
2544 -181136 -294873 -282356 -226840 -164179 -218351 -99254 -11918 -88437 23691 169264 -30938
2533 -30938 -109785 -189760 -94317 -295086 -216335 -224068 -99332 -51435 -79596 -42633 -3773 -8574
2521 -8574 -39080 8662 -36565 -93959 -136329 -49511 -35749 -34862 -173919 -287322 -305867 -163650
2509 -163650 -147585 -60407 -103419 -222415 -118557 -28208 -130871 -193915 -250635 -218121 -171460
2498 -171460 -121709 -150508 -194533 -232898 -252083 -230973 -139555 -195702 -65337 -107628 -26696
2487 -26696 -204350 -164016 -224529 -206004 -76554 -89287 -133016 -142857 -135836 -123103 -94801 -35543
2475 -35543 -132592 -267025 -158054 -116286 -132291 -143267 -248789 -236447 -273635 -271986 -247027
2464 -247027 -149537 -220085 -197798 -127616 -132530 -245640 -193008 -36575 46053 64157 64045 -144543
2452 -144543 -73671 -32898 -95447 -93255 -170556 -142999 -155280 26160 18352 -3696 53551 117524
2440 117524 53966 -17527 83769 -78058 -145029 -168112 -238392 -333907 -189005 38483 34808
2429 34808 -111605 -229224 -155501 -125922 -47787 -183360 -191674 -108600 -9549 -139632 -146922
2418 -146922 -112323 -117089 -85382 -70377 -121314 -127079 -126694 -92897 -69611 -8490 -102572 -84145
2406 -84145 -66686 -135876 -27858 -10872 98557 -19456 -52832 -5953 -5985 34520 11971 -19547
2394 -19547 -5295 43303 114105 78393 3313 123901 177243 40724 -19925 -14606 -26778 -21419
2382 -21419 -62047 46818 12347 -43357 -124212 -155218 -37625 -90231 -30221 113028 32597
2371 32597 26615 -11087 -23394 -90613 12991 141556 161562 188000 144407 127156 182006 29903
2359 29903 275667 252926 255692 198965 290519 248797 292393 368149 369932 423109 317726 314552
2347 314552 445694 628126 604956 614321 599171 607880 635397 735225 820086 857375 772560 867456
2335 867456 1069889 1148482 1192967 1301871 1401461 1536269 1736496 1764923 1933169 2139076
2325 2139076 2409578 2674868 2828292 3011863 3336861 3778352 4042491 4555540 5099733 5695688
2315 5695688 6345371 7007094 7857496 8800046 10005489 11391095 12582684 13456291 13614214
2306 13614214 13150250 12267354 11003722 9457328 8025037 6802805 5920336 5226335 4559556
2297 4559556 4133993 3901941 3608224 3305596 3082273 2840926 2577540 2381928 2283145 1976044
2287 1976044 1818173 1666626 1571497 1603694 1498982 1476934 1272985 1061086 975083 1036471
2277 1036471 972748 1023972 1034451 900441 774084 679587 535009 650288 578297 551979 475245
2266 475245 548213 507676 526714 542082 464275 539432 408041 268680 336359 330517 338808 320987
2254 320987 284390 221874 85905 40060 56817 182650 242353 198362 202729 193160 217508 281867
2242 281867 57140 66405 25906 -40759 -32936 77489 233829 99552 29539 73807 44307
2231 44307 54312 110617 98971 111030 113870 84000 6204 49059 55787 62897 -80043 -158793
2219 -158793 -73800 -96574 60497 78834 103211 -74158 -53026 11183 96620 -6439 -64757
2208 -64757 113222 44295 -3726 -48568 -86701 -31185 -38250 -137697 -102945 -89038 -21818 4171
2196 4171 28058 46836 66067 -82755 -79598 89075 -68623 -190960 -93322 13136 -30625
2185 -30625 17667 147235 101468 -14553 43343 168153 10464 -54099 -179557 -123876 -8814
2174 -8814 -108208 -102653 -72642 -155962 -187747 -93100 -92956 -147141 -145940 -169323 -311709 -158727
2162 -158727 -78339 -54178 -100250 -105984 -156551 -185123 -134354 -191155 -173327 13309 2152 -98323
2150 -98323 -118904 -24449 -85884 -172222 -230097 -53545 28455 -182151 -153314 19104 33992
2139 33992 59844 25298 -50945 -19233 74225 -47402 -169326 -69208 75061 44091 -49884
2128 -49884 -50309 1777 -80119 -42399 -130156 -156105 -146790 -67495 -106788 -64459 51667 -64973
2116 -64973 -116360 -224664 -79359 -35327 -6764 86336 23022 -76503 10841 1599 17134 30306
2104 30306 7675 -136223 -172875 -194323 -256529 -261438 -209443 -75531 -109915 -215259 -227900
2093 -227900 -236142 -193531 -230862 -195316 -131434 -53513 5190 -91440 -5793 -60541 -86024 -48128
2081 -48128 -230145 -148934 -28629 -23223 -25607 -47118 23649 58650 15660 -4108 -39576 39015
2069 39015 38445 37107 -37979 -172322 -147076 -160367 -134776 -202921 -162804 -194148 -183559 -138189
2057 -138189 -186769 -212433 -247671 -316890 -243901 -43203 -90516 -29672 -2101 -147319 -109766
2046 -109766 -32082 -52783 20697 -125695 -267731 -203670 -125733 4166 168585 94723 34153
2035 34153 -100335 -82776 12103 -40135 -122583 -33200 33888 38508 -50026 -37495 -82393 -20801
2023 -20801 -15714 -158630 -162484 -177792 -217268 -206158 -180972 -263973 -176736 -241494 -171705 -55645
2011 -55645 -114183 -131201 -166033 -46766 -25065 -61494 -131094 -92529 -131731 -196966 -115548 -105027
1999 -105027 -108767 -204861 -85490 159 3806 -43012 -238619 -201783 -175402 -223001 -266715 -125173
1987 -125173 -70615 -75569 -48634 -78559 -70744 -27830 5427 4945 -74605 -20008 -27858 -47595 -23421
1974 -23421 814 -30948 -88106 -38694 -87854 -93902 -250000 -391069 -228245 -68513 -102348
1963 -102348 -102921 -92714 -87730 -40947 -71130 -44663 40194 -36905 -126896 -237396 -310099 -237413
1951 -237413 -193844 -243811 -84459 -106912 -20813 -59956 -155747 -147026 -165270 -150345 -100562 -31085
1939 -31085 -199 -99175 -30059 -159430 -213319 -27868 -29915 -102333 -19118 -103009 -114969 -117261
1927 -117261 -138524 -128730 -64493 -97848 -52385 -6702 8681 -75636 93045 61313 -154148
1916 -154148 -199789 -186913 -74358 -50845 -95589 -42586 8183 -23346 -53005 -113452 -189243
1905 -189243 -189088 -181759 -151113 -134819 -195328 -133140 -106689 -88063 -105225 -65420 -180019 -219179
1893 -219179 -301148 -398205 -294214 -261370 -68100 -126951 -202205 -182622 -106038 -68458 -118094
1882 -118094 -136604 -197476 -151628 -161891 -62855 -131279 -27717 -113609 -120168 -206698 -156485 -93654
1870 -93654 31419 -52122 -124323 -22740 37621 -35315 -29924 33335 -89110 -41971 -49615 -95942
1858 -95942 18354 -7295 -85490 -20925 131869 30718 32266 -103443 -145764 -116894 -126245
1847 -126245 -116031 -47480 -115771 -144211 -49661 -202545 -86950 -157734 -222684 -154644 -84888
1836 -84888 -155390 -203852 -74108 -54991 6825 81751 -68999 -173127 -248334 -121910 -31055
1825 -31055 -127235 -248220 -227931 -73581 -199156 -164316 -235522 -240923 -54636 -24037 -201388
1814 -201388 -259191 -65573 -86298 -122266 -9018 28466 -27792 -115600 -167377 -150221 -110964
1803 -110964 -166183 -223469 -123708 -45714 -116622 -103325 100190 64272 -18443 -40800 58928
1792 58928 -11429 78559 -18751 -224554 -54713 18939 -64701 -234565 -385212 -226787 -71416
1781 -71416 -77416 -134403 -63733 -35140 2731 59949 -101146 -150050 -142833 -60264 45877 30639
1769 30639 29849 -47541 -179003 -74911 -42998 -89898 -43748 53240 211034 216953 142528 154181
1757 154181 86869 -4555 18231 -28190 -59808 -124449 -36069 19665 -44424 -94057 -171616 -88503
1745 -88503 -91409 -145728 -59158 102833 34150 -153148 -110453 -205869 -275818 -198084 -210936 -227686
1733 -227686 -136629 51692 35958 -7014 39288 -35587 -12918 -29536 -44733 -24076 -155266
1722 -155266 -238525 -147691 -104273 -125955 -116748 -11574 -965 63514 104228 88319 156356 41810
1710 41810 -41797 -43260 -39183 34396 -19154 -102676 -74444 -126906 -89055 -75482 -189050 -255103
1698 -255103 -156415 -222401 -320613 -290119 -208230 -167317 -166379 -151872 -96024 -148402 -67877 -38699
1686 -38699 20694 -30383 -71661 -107005 -136549 -162394 -200222 -129051 -115816 -77085 -83561 -117534
1674 -117534 -126995 -39931 -38890 106650 -104429 -163270 -17533 -39308 -87260 -59475 -103347
1663 -103347 -218911 -156586 57698 21125 -72227 -32772 -170325 -177328 -69715 53948 29559
1652 29559 49387 -56837 -14627 42318 38963 55702 12544 135378 121394 136955 175914 -37716
1640 -37716 -3901 30267 -124524 -120284 -115025 -131520 -15467 -71437 -198979 -173764 -114615 -78112
1628 -78112 -35145 10998 9866 93547 -161680 -148684 -121545 -77992 10047 -72895 -150748 -79890
1616 -79890 -115748 -85580 4016 -48680 -154653 -148963 -94131 26771 3056 -40513 31102 -53105
1604 -53105 -32144 -68162 35126 106694 -75767 -65238 4493 74145 55790 -70368 -4188
1593 -4188 -91995 5900 -68578 87841 -23075 -246490 21784 59372 -23460 45632 -27933
1582 -27933 -1679 -40851 -14086 106925 86725 -25028 -72672 53503 66542 34452 117930
1571 117930 58352 -96071 -6819 -46148 -167626 -154172 -77395 17113 3744 1166 57527
1560 57527 20988 21474 136806 31417 -37354 -53026 -30987 3172 -83819 -54713 -53159 -106788
1548 -106788 -139616 22431 -32403 -89275 -107676 -75892 -191365 -127763 -174554 -207682 -64979
1537 -64979 -131534 -86094 -16955 -141878 -134641 -42973 -88259 2558 96869 -26918 -139916
1526 -139916 -65586 -176565 -24833 82573 131116 104989 31148 114052 118610 93546 66509
1515 66509 -86387 -84034 -45734 -57091 -150045 -217302 -39474 -115186 -224619 -291887 -158474
1504 -158474 -73552 -41500 -28989 1237 -42559 3903 -111768 -268841 -235665 -229268 -239671
1493 -239671 -175635 -61616 -108092 -85199 -121077 20164 25400 -130260 -134595 -69690 -62444 23404
1481 23404 -69950 8027 130328 70570 -33320 -99312 -18220 -12568 -37835 -46140 40344 -47653
1469 -47653 -49984 -42962 25590 169214 60320 21872 -2949 -15452 8582 -12287 -71504 -104362
1457 -104362 14814 57435 -122852 -132217 -180103 -30535 -77373 -229447 -8734 48738 -14650
1446 -14650 -48065 -59552 -42180 22708 163283 229447 70756 -125618 -104731 -109168 -55179
1435 -55179 -77094 -143043 -19963 -111146 -196007 -135748 -87998 -18933 -14420 -82796 129311 240030
1423 240030 142297 106642 119858 -51745 10039 17787 36717 59464 -26694 -170890 -88467
1412 -88467 -27145 -98689 -119207 -45703 -32644 -249016 -275130 -257736 -150404 -210519 -65544
1401 -65544 -177273 -190209 4833 -53211 -20928 -73063 -114866 -43851 -35881 34493 -6784 29695
1389 29695 164338 -21781 5439 100155 111605 12245 -60812 -160664 -117486 -81908 -74452 -103682
1377 -103682 -8673 28331 55846 53672 76110 74120 132382 44696 -75697 -76202 -186798 -203771
1365 -203771 -11396 56313 124338 -60004 -90284 10778 -131632 -16537 -29461 -47249 1117
1354 1117 6356 4693 -54054 -78104 -144856 -125660 -106864 -169885 -26236 -80002 48825 -69207
1342 -69207 -50759 19047 9406 33559 21683 -2643 -72821 -148969 24356 76224 -13199 -543
1330 -543 -80477 -68152 -50870 92649 -17442 -227298 -91925 19358 46125 24501 41428
1319 41428 -68743 -35440 -81200 -63490 15314 101301 117060 96009 66409 47509 72683 -2433
1307 -2433 563 100574 250631 166350 180665 139637 70649 115242 64127 -6849 -122765 52922
1295 52922 101457 78990 90960 100250 -23188 -133776 -232648 -70265 157394 257956 227982
1284 227982 54835 -51711 -45885 142356 33387 -95441 -41881 120473 154863 63780 -43676
1273 -43676 -65647 1748 149675 34019 30238 77918 -58794 15227 -60607 -123602 -153651
1262 -153651 -203865 -211535 -124007 -60049 -163667 -218714 -172969 -34826 34119 7254 -44475
1251 -44475 -54431 34069 -17177 74481 68413 97135 111717 73789 227135 99202 65671 106036
1239 106036 149371 -37159 -119962 -100962 -14416 65614 -5063 -43722 -164989 -26074 62093
1228 62093 14063 -25515 -67199 -24672 -61304 -138534 -200873 -14224 27190 -18082 -104985 -11072
1216 -11072 -39984 -63003 -9612 -74761 52040 90920 -82211 -7700 -133180 -166956 -90991
1205 -90991 30653 -14863 58964 13709 -67195 37501 18563 -74765 74450 160077 127305
1194 127305 91588 -23497 111758 158451 -50332 -138864 -4907 -6364 9359 13354 -19447
1183 -19447 -108881 -142302 -104445 9950 146211 52378 56137 110972 103873 119097 2185 73685
1171 73685 -11847 -107414 -78422 -154674 -24110 -107240 -169816 -109059 26571 20218 5503 -16408
1159 -16408 -14192 86512 3059 1295 82835 73015 10731 69839 27093 45111 37861 96145
1147 96145 88373 -21257 -2884 2956 -6600 -34446 -187365 -149704 -84395 49939 87459 145535
1135 145535 105791 13807 -115958 -150221 -107615 -138486 -200173 -187208 -126544 22603 95100
1124 95100 216265 101593 123973 105762 20061 -46019 -21016 -20165 -46899 -126049 103338 36480
1112 36480 -12861 -1457 38482 129050 9590 64593 4409 -42076 23036 102803 1614
1101 1614 -104278 -47049 -38684 -28700 -121727 -75388 -54271 26062 60525 271541 332885 178170
1089 178170 251222 81895 55742 10392 21150 121618 160431 11923 100521 -29126 19651
1078 19651 121099 15958 35541 170232 208324 78563 24157 42761 30295 124518 135282
1067 135282 24918 47950 -44352 -36635 110966 -6253 63377 179059 119450 68463 45005
1056 45005 -70561 -139986 -91610 -17501 -77635 35456 80617 25524 52819 120737 114059 21620
1044 21620 31139 63527 90266 124878 -3609 144495 90902 9228 -38175 121210 41244
1033 41244 -61519 -41161 -33106 41725 48563 48130 -1717 -86375 -134396 -120305 -84058 -17334
1021 -17334 -90317 -87462 88525 101543 630 17211 15199 127785 174743 144771 126199 151732
1009 151732 154500 113804 126864 118566 60423 52023 54208 -3359 -77382 -28784 -49697 -106049
997 -106049 -78284 -74225 -68037 -108075 -152620 -30125 22665 31046 144776 96278 117055 151535
985 151535 86774 -104191 -101802 66802 -21304 -4853 14606 47574 44825 -38095 -44506 61243
973 61243 67169 48897 -53672 -25079 8622 -23396 -149039 -159201 -172092 -2307 30826 -4687
961 -4687 -84376 -88032 -117743 21143 44122 97024 62262 120807 94055 71892 -16201 -209080
949 -209080 -181320 -94809 24405 -3027 44691 64284 76005 58317 -57993 -32981 120447
938 120447 105634 69500 21788 30318 -63738 102970 129127 242327 177539 227374 244572 114563
926 114563 72793 20349 -85845 -114193 34014 97531 81149 110774 -33904 -35542 -30322 94809
914 94809 125515 21058 35245 59571 243311 237278 208358 179111 95307 73823 119137 148904
902 148904 108335 46906 29979 35037 11950 14123 9299 -87148 -89195 3508 51928 83150 191051
889 191051 159318 56022 46846 51558 -7638 -79616 -78683 20376 2212 -2128 136922 56567
877 56567 144163 208634 183672 145462 27694 -18325 -91490 -57228 -48864 -118354 -92310 -77160
865 -77160 -51127 4021 70039 -13728 -61954 -46425 -34162 83633 36369 18337 -18669 -54105
853 -54105 -152064 -156642 -64392 62490 -65746 -120083 -28521 87833 102474 -29263 -89024
842 -89024 -57044 -38748 -6180 -39702 -50499 -13729 -45580 7816 82330 106880 113665 30046
830 30046 19640 69124 88001 26191 52345 67302 119989 -8264 -28841 -86850 -46222 859
818 859 152828 168097 24733 -98760 -78091 -26689 -58874 72098 61095 47636 -137454
807 -137454 -102602 26880 -19339 -69248 33042 -19001 -146981 -90440 113346 50675 -2669
796 -2669 32038 41965 -4026 79143 20039 59920 83935 91607 72953 64455 53648 23003 -10565
783 -10565 91697 119218 -23696 -31100 148499 139166 93787 144425 204876 37931 17002 34010
771 34010 36603 58534 31065 76053 80247 -2689 43109 27430 15516 62708 -27572 21354
759 21354 101014 140314 82258 89812 171177 159965 168651 6997 -172936 -81226 21192 81692
747 81692 175609 126778 20929 37467 -13466 59193 143176 42653 25301 132392 177982
736 177982 143656 32487 91280 -23011 -539 106184 64082 66596 -39743 26380 -43336
725 -43336 11457 -79390 -98670 18535 7919 -89704 -211396 -42990 87877 173452 145000
714 145000 129655 15314 132664 20251 91528 111176 -69421 -166214 -103113 11307 35096
703 35096 14679 14666 -32574 110379 41664 -67100 -41949 -59610 55615 97317 7439 45795
691 45795 -75566 -11048 118011 -73208 -73260 -98108 5087 -30668 -14692 108899 17445 79309
679 79309 160628 110705 63960 104059 29654 -25876 86730 46719 10712 58268 34833 127236
667 127236 170064 64368 121580 242219 146118 5483 2823 119464 145807 -19324 22234
656 22234 71372 25329 29381 100453 -10110 51212 34736 -27495 -22198 -39935 -16691 -6015
644 -6015 12541 -12812 82876 111436 121003 25671 -178905 -73096 24533 -147010 -127708 -121301
632 -121301 -32344 164437 229876 178397 138970 156436 146110 123528 104270 104807 46490 87150
620 87150 206149 165799 164573 119279 38939 135212 114208 82173 147479 219880 87235 146749
608 146749 99544 39527 89679 21828 40006 89352 81119 -63779 -88273 4745 77498 68919
596 68919 143424 69377 19697 24598 -85143 -90475 -34985 -13290 9542 115588 52974 -5194
584 -5194 45775 109393 73030 48816 60065 186493 250210 210565 110981 63580 46061 55354
572 55354 128866 89119 100481 110969 -13346 94615 155515 201759 115936 27554 76643 23737
560 23737 96129 47444 77012 17010 -69606 -116653 -37631 76016 27367 -83657 -170833 39117
548 39117 54923 81797 89824 137635 136976 28138 48235 93109 96481 -22405 -31974 71422
536 71422 74257 111338 127533 63199 17772 96306 182769 -17729 3638 -16089 -50960 69261
524 69261 85690 148666 76407 -68958 -98372 -107682 -15217 88238 94658 60942 -56904 -52742
512 -52742 107352 133466 171470 105757 32360 -91929 -7389 125510 77149 102888 92248
501 92248 4286 -375 -54237 -201874 -4983 39289 40824 165098 51429 -6311 25919 -90734
489 -90734 51982 67910 -4655 70458 13073 -32445 -28646 164506 147550 44052 21356 10068
477 10068 -18480 115378 116309 114014 92474 -14444 -19449 -28229 -96225 -31465 78999 206608
465 206608 31513 -4760 85138 71298 59434 125452 239262 143669 33233 9773 160004
454 160004 91452 32203 178109 97888 156 5325 47939 6939 31785 160771 121264 18618
442 18618 81076 27060 27045 2587 -41599 3564 -29306 -25161 21515 75049 81544 -16301 -24200
429 -24200 158765 110007 28748 5769 -22050 99422 282453 233500 193651 240362 218623
418 218623 45774 20818 -39572 43336 31763 147658 192602 123741 226350 109313 16594
407 16594 80955 143740 150079 -35522 12622 42649 -28227 -38556 -2416 -95349 -2850 130060
395 130060 -38053 -79222 56203 16811 -110637 24907 141214 219039 201372 119921 110127
384 110127 83586 125128 107983 -30763 -3079 273252 266766 142781 264584 286163 286710 191498
372 191498 67729 94484 21340 -51831 -30499 24012 55867 -18945 54178 -6167 99805
361 99805 109891 144210 117851 149437 131861 33302 61477 151740 135993 118316 146197 164419
349 164419 224160 214998 129559 24137 36042 35776 87388 20145 47232 128849 172308 193565
337 193565 44183 148319 81877 -21993 38949 72585 100875 77957 -53940 6902 129026
326 129026 -48481 -65787 -53831 66258 74543 6421 -18289 160527 178742 -11681 -38453
315 -38453 21292 -61463 6636 56934 47134 8599 10244 129043 175512 105409 128169 132627
303 132627 219486 168458 44508 65004 -46170 12213 17588 -110 48400 121421 183366 124223
291 124223 -77867 -15636 41875 5094 -32740 52475 691 -21482 3020 85535 79589 4814
279 4814 135073 44621 13409 22216 129750 104556 23466 -142337 -6354 22888 18454 95301
267 95301 289228 253847 123982 101312 -48392 55437 247085 111405 -27915 -27787 84938
256 84938 111233 135534 184997 46684 -70714 28799 107254 97092 76370 171281 348681
245 348681 242917 197487 -39874 115519 143730 153850 102243 178728 251476 280640 146980
234 146980 150296 143457 128931 133889 179639 44303 -5796 171463 33808 -35201 -40964 -172545
222 -172545 -62455 28122 -90221 -182401 -121195 123545 202364 102732 -17959 52303 61663
211 61663 76735 157728 -36033 -8667 55284 53969 80408 116011 196003 69654 135632 -10271
199 -10271 -42885 38768 109731 136062 124943 110411 52020 172352 99815 49437 -20500 65506
187 65506 233796 56233 -78095 77708 208904 129538 144656 187926 157959 77462 42148
176 42148 134947 145137 -27191 -17573 105638 114478 -20529 -14990 22388 6234 28676 100525
164 100525 44618 56988 98110 95932 181744 108164 160903 222290 139848 249780 182900 158763
152 158763 61582 53952 136997 54305 54982 131365 54815 135600 81490 9335 32145 98398
140 98398 86019 14134 35274 -73779 -104890 33189 97069 179705 173349 116418 155694 80763
128 80763 -48518 127572 189759 117532 154253 164299 125307 139394 58224 -27732 98458
117 98458 67241 41288 130288 63536 53285 119486 136843 164382 164314 165094 87692 -16358 13215
104 13215 47686 187421 140702 44641 85597 47212 159173 213160 134317 133708 79458 65877
92 65877 -39445 -146531 13385 4710 184230 183499 164066 68043 -14369 44207 83780 79994
80 79994 102761 431 8652 41305 15389 190813 168523 58197 69879 96886 121141 56784
68 56784 -13203 -111851 -17037 10867 71265 50378 81692 53585 28957 103402 167593 150844
56 150844 118794 102966 68449 63351 137892 140022 154085 253729 117806 91033 198783 169503
44 169503 122331 28245 -30682 -16027 11771 102468 66602 72007 114040 104090 68905 123118
32 123118 106961 -59977 14450 103547 103866 141425 142234 79251 48161 45926 17826 7339 49434
19 49434 135875 145121 191473 105221 26224 115877 128126 82043 76928 117908 82165 35174 66209
6 66209 129119 200779 110695 148797 93250 61250
0 61250
$$ Imaginary data points
##PAGE= N=2
##DATA TABLE= (X++(I..I)), XYDATA
16383 -2063503 -1980643 -1973770 -2003284 -2010928 -2034098 -2022518 -1969565 -1958787 -1914956 -1782685 -1800419
16372 -1800419 -1784655 -1771060 -1705781 -1730456 -1709215 -1497555 -1448514 -1479421 -1452564 -1430027 -1441462
16361 -1441462 -1424312 -1399464 -1431414 -1341368 -1164171 -1253888 -1252290 -1229920 -1233451 -1168677 -1113877
16350 -1113877 -1039849 -1049244 -1031363 -961112 -940390 -902602 -1077050 -1020391 -883046 -888822 -749450
16339 -749450 -725387 -772635 -704983 -750802 -695011 -587422 -557778 -439774 -488016 -532380 -570036
16328 -570036 -485941 -474166 -462894 -347792 -276813 -305490 -266715 -281715 -256351 -219648 -226388
16317 -226388 -236266 -310116 -234624 -296015 -196167 -71230 -25720 45655 -35521 46624 257988
16306 257988 229104 200365 174342 158831 300057 354342 206193 214643 248341 308808 335380
16295 335380 284559 235719 326100 363999 442414 398798 370037 527306 690904 714320 695579
16284 695579 640264 626857 602111 598965 804816 869897 815281 850732 931126 958989 903535
16273 903535 778209 850546 943296 919102 1061588 1082061 993800 1028975 1065860 1008218 1014794
16262 1014794 1107967 1108863 1081314 1047424 1089442 1071482 1093622 1086436 1165040 1257900 1273646 1361176
16250 1361176 1456204 1418285 1438891 1463012 1446382 1387852 1290247 1244588 1170449 1152714 1317733
16239 1317733 1494851 1602387 1558854 1469974 1585659 1633746 1489157 1431433 1482193 1538520
16229 1538520 1605554 1499430 1657530 1759703 1691126 1660924 1645717 1760746 1773626 1689042
16219 1689042 1793219 1781433 1792611 1767754 1788607 1892264 1873914 1804182 1839466 1922947 1732869
16208 1732869 1777342 1818224 1911900 1978536 1939058 1965691 1994307 1891597 1805428 1868244 1919807
16197 1919807 1971657 1923589 1941950 2023277 2077039 2066895 2051791 2044702 2140846 2212555 2166666
16186 2166666 2126530 2108244 2143454 2128898 2132840 2129948 2175728 2102191 2107816 2208333 2213209 2115530
16174 2115530 2063357 2055737 2103043 2152953 2175959 2131158 2183556 2188628 2146513 2215889 2301350 2389627
16162 2389627 2362435 2342587 2291307 2439598 2436568 2444525 2505882 2472197 2348449 2255638 2225875
16151 2225875 2284204 2380389 2532866 2502295 2436432 2490779 2283863 2255930 2311781 2309897 2386054
16140 2386054 2364286 2295445 2453002 2402339 2346722 2427225 2498982 2407080 2413057 2437884 2346789
16129 2346789 2301251 2509396 2479408 2454316 2440377 2497397 2475976 2583761 2659366 2522002 2430070
16118 2430070 2433801 2513568 2596746 2498380 2482759 2524505 2509401 2394410 2404645 2481305 2393826
16107 2393826 2421825 2539677 2588102 2562494 2647217 2606941 2616906 2557333 2458430 2454292 2563468
16096 2563468 2639238 2793143 2759183 2669721 2639979 2621728 2495325 2309683 2392625 2616350
16086 2616350 2569002 2556041 2521555 2441551 2380445 2356958 2364473 2271225 2379928 2518214 2515625
16075 2515625 2510242 2520365 2650074 2568513 2582965 2518026 2659355 2617096 2546986 2568729 2675055
16064 2675055 2633529 2524940 2686638 2631706 2466809 2497199 2497766 2547432 2556478 2809833 2800393
16053 2800393 2752398 2701348 2674891 2590271 2576051 2535275 2532733 2689201 2529492 2427257 2555648
16042 2555648 2720601 2707661 2702283 2612775 2668721 2688785 2681430 2706515 2657521 2559359 2673278
16031 2673278 2528263 2608741 2639390 2539747 2521052 2506610 2581238 2520155 2545331 2474553 2502805
16020 2502805 2497846 2407301 2466656 2489865 2492973 2562060 2555332 2523944 2545804 2620360 2599354 2624275
16008 2624275 2573249 2650987 2677860 2630870 2620025 2574474 2670126 2569952 2580051 2631263 2711551
15997 2711551 2712538 2670628 2642507 2609037 2568366 2654305 2436862 2535301 2616973 2589643 2592291 2649163
15985 2649163 2708525 2778271 2716914 2683123 2636290 2640723 2684890 2599131 2607324 2603980 2624236 2631504
15973 2631504 2572068 2753861 2828780 2766996 2663584 2604855 2626222 2701629 2679963 2677895 2710571
15962 2710571 2730762 2685526 2709267 2630789 2519835 2525048 2606224 2676727 2667482 2668117 2570144 2413547
15950 2413547 2472403 2677423 2650077 2595387 2607793 2695558 2682528 2684171 2767410 2776974 2691104
15939 2691104 2703438 2648312 2606596 2577129 2650875 2657266 2771718 2797500 2899325 2770218 2810594
15928 2810594 2774126 2681441 2698030 2804797 2629454 2586382 2704503 2663918 2725028 2788491 2749746
15917 2749746 2659244 2621961 2637249 2673114 2713116 2571367 2590618 2736648 2703066 2734839 2700501
15906 2700501 2753279 2565974 2483019 2567901 2711528 2664026 2675672 2726233 2669374 2617621 2628921
15895 2628921 2640567 2636810 2636536 2599976 2675318 2767739 2761851 2656722 2551124 2555235 2598737 2691039
15883 2691039 2698930 2730311 2659193 2689891 2780727 2627482 2716872 2807293 2649795 2644332 2676121
15872 2676121 2728999 2602334 2561663 2678627 2798174 2811378 2760856 2845944 2886804 2837494 2656045
15861 2656045 2621654 2561063 2611147 2629310 2641869 2712333 2740132 2717289 2642653 2568282 2678949
15850 2678949 2572441 2563839 2592832 2581682 2676877 2696122 2528563 2600274 2763430 2758199 2723786
15839 2723786 2686952 2603772 2549064 2565750 2540245 2615817 2546713 2527306 2426109 2526260 2542945
15828 2542945 2587167 2708805 2736045 2724588 2612748 2668943 2631127 2637359 2691520 2657355 2653283
15817 2653283 2703479 2689995 2749584 2759610 2707216 2603250 2560319 2688325 2667649 2719376 2851582
15806 2851582 2939097 2733695 2694851 2737161 2739683 2677696 2679222 2613154 2533341 2600606 2745638
15795 2745638 2770054 2631318 2849481 2807066 2632314 2564553 2613597 2584038 2632189 2659370 2731720
15784 2731720 2762215 2770574 2694892 2680258 2619908 2494210 2595901 2731447 2643234 2743003 2684331
15773 2684331 2480092 2483758 2586881 2670556 2747978 2742164 2638925 2580896 2553531 2602082 2666373
15762 2666373 2684968 2596310 2618481 2706909 2721023 2765105 2781204 2683672 2922500 2970817 2970983
15751 2970983 2842875 2709473 2663378 2563652 2630057 2684234 2683658 2816828 2683795 2732761 2622123
15740 2622123 2642132 2643972 2529254 2588338 2678870 2591893 2609644 2718145 2784328 2779815 2702840
15729 2702840 2696305 2780830 2720648 2702499 2713911 2757015 2852102 2842198 2754420 2701525 2698300 2695064
15717 2695064 2764112 2717375 2691717 2753555 2740011 2745733 2721453 2729995 2843499 2746532 2577827
15706 2577827 2841989 2870275 2729298 2622190 2775775 2773594 2604789 2776599 2743319 2693263
15696 2693263 2645649 2512038 2602456 2795068 2913511 2896126 2782434 2836764 2850992 2842228 2749331
15685 2749331 2703526 2691114 2720207 2599072 2613158 2720302 2752873 2640439 2665561 2744148 2722999
15674 2722999 2712405 2829132 2819053 2806929 2824018 2749409 2688610 2707017 2586536 2484832 2612667
15663 2612667 2695789 2586696 2666085 2736727 2862601 2741330 2706948 2703713 2669981 2770156 2720772
15652 2720772 2595851 2663931 2621065 2541563 2686538 2723977 2669683 2722061 2590091 2719658
15642 2719658 2699900 2686932 2699130 2707598 2603136 2587924 2502748 2491922 2583677 2571603 2833976
15631 2833976 2752839 2568134 2558498 2560144 2636266 2698725 2790746 2742665 2741498 2715601 2796540 2893732
15619 2893732 2728558 2721320 2642286 2798248 2749385 2681962 2690652 2743117 2839799 2792975 2668135
15608 2668135 2714418 2644358 2663223 2727861 2770010 2804584 2690606 2747392 2748916 2741660 2720979
15597 2720979 2778523 2823428 2795643 2788496 2718847 2692192 2519532 2663249 2750763 2870624 2831347
15586 2831347 2849227 2875446 2784375 2823839 2758540 2815364 2877536 2979178 2879517 2706310 2699860
15575 2699860 2756107 2898079 2887423 2800395 2815979 2814024 2668647 2645924 2687201 2815793 2851476
15564 2851476 2674104 2600370 2681955 2683259 2856627 2923063 2910123 2783757 2613887 2597148 2663255
15553 2663255 2657750 2704520 2746456 2819532 2722437 2728169 2874174 2847630 2797152 2783947 2746443
15542 2746443 2698640 2736922 2791931 2845207 2816736 2897750 2903612 2736684 2647885 2689304 2680979
15531 2680979 2577396 2602495 2654409 2673112 2774422 2746795 2592064 2697060 2693030 2756869 2805638
15520 2805638 2829331 2847887 2840775 2796959 2583404 2522614 2626519 2696346 2803044 2946093 2817412
15509 2817412 2713838 2668423 2713939 2594743 2644138 2800702 2796668 2760455 2638531 2644923 2580456
15498 2580456 2711274 2781141 2772981 2721973 2626193 2695850 2613181 2602095 2751270 2885403 2828680
15487 2828680 2588403 2645786 2896418 2653947 2658394 2685246 2611880 2727820 2809328 2741591 2835963
15476 2835963 2833170 2866188 2820926 2815276 2878580 2870674 2872442 2859251 2926575 2973301 2951058 2857771
15464 2857771 2807562 2808204 2714375 2761425 2725921 2852592 2815116 2719753 2755223 2638111 2639239
15453 2639239 2725136 2839332 2891815 2887916 2965951 2862424 2781763 2748704 2814481 2762626 2669057
15442 2669057 2663775 2691567 2704548 2691359 2810893 2888073 2829750 2924426 2862981 2769665 2705126
15431 2705126 2711517 2752012 2852011 2959851 2910200 2824917 2709644 2564270 2551199 2762961 2710507
15420 2710507 2724963 2639682 2584303 2643881 2795122 2714352 2682394 2677076 2732348 2856236 2745152
15409 2745152 2743844 2749776 2668175 2677944 2761491 2823906 2830888 2862075 2808181 2824561 2834824 2679995
15397 2679995 2666028 2792148 2703375 2618800 2695132 2780586 2847918 2923008 2894083 2777154 2862484
15386 2862484 2930371 2948914 2831956 2780671 2810077 2704833 2773770 2841847 2828455 2683475 2650230
15375 2650230 2647878 2732304 2642587 2689056 2859624 2973342 2920163 2875179 2820034 2778599 2658094
15364 2658094 2773117 2916796 2764165 2677788 2741725 2678273 2778271 2845694 2819025 2847293 2873212
15353 2873212 2909438 2913718 2824187 2873638 2896146 2789693 2764338 2688635 2805362 2840368 2798307
15342 2798307 2685207 2697998 2841484 2877631 2854751 2881068 2813850 2799621 2786520 2745595 2784324
15331 2784324 2729275 2793993 2823733 2727816 2748956 2838426 2918309 2853361 2877880 2895390 2966011
15320 2966011 2981820 2876003 2850824 2828374 2814402 2885446 2964629 2923990 2899294 2903763 2857391
15309 2857391 2794209 2741682 2919858 2905199 2844349 2898348 2827384 2775064 2704457 2703205 2790486
15298 2790486 2836505 2912954 2832885 2731313 2845161 2821304 2861789 2798293 2746435 2918207 2836071
15287 2836071 2973490 2958058 2984441 3023987 2884238 2825621 2823051 2902498 2867346 2711682 2762086
15276 2762086 2854402 2983051 2789736 2766347 2976265 2941778 2842379 2765781 2743385 2817012 2818530
15265 2818530 2736716 2809066 2952112 2973013 2822596 2895217 2805506 2787282 2783339 2673877 2622060
15254 2622060 2696746 2699299 2823603 2950501 2800056 2727572 2838084 2774929 2577746 2671671
15244 2671671 2699349 2745849 2708347 2843376 2871237 2922971 2934190 2836433 2767737 2920764 2739330
15233 2739330 2697311 2790206 2773074 2949653 3022375 2799867 2702438 2838385 2938700 2946392 2889053
15222 2889053 2996040 2804810 2853757 2927672 2957635 2850692 3061635 3010774 2884897 2837760
15212 2837760 2817347 2832596 2883729 2891437 2710159 2804090 2986774 2863125 2701211 2677313 2695530
15201 2695530 2744330 2881298 2916625 2876678 2769712 2766561 2683685 2701155 2888204 2842248 2844286
15190 2844286 2806181 2758273 2865425 2801571 2879160 2992280 2896283 2908187 2887687 2855281 2913387
15179 2913387 2943565 2860832 2822419 2881149 2861046 2852104 2742574 2789132 2802489 2815146 2931960
15168 2931960 2939078 3008403 2898821 2772937 2834621 2872446 2859479 3043799 2937098 2928862 2779855
15157 2779855 2795395 2710414 2714226 2727157 2734270 2757883 2882098 2946635 2830558 2842188 2823013
15146 2823013 2789228 2817979 2738291 2682557 2670397 2724978 2835117 2816192 2911903 2957916 3036643
15135 3036643 3095909 3122669 3024466 3036511 2995955 2919450 2780157 2843208 2849384 2796332 2881352
15124 2881352 2950555 2806731 2904707 2904445 2823231 2899485 2765471 2841985 2978799 2931852 2905692
15113 2905692 2879006 2875655 2894333 2917663 3002733 3027367 2970339 2855330 2874739 2849673 2744786
15102 2744786 2801551 2890017 2922374 2832527 2776309 2782866 2710233 2790899 2909574 2907013 2973443
15091 2973443 2972829 2961783 2918737 2908991 2936327 2997488 3110987 3094837 3020530 2953010 3019476 2958398
15079 2958398 2936456 2904296 2787587 2854002 2851393 2918874 2987260 2842910 2797837 2906682 2838161
15068 2838161 2809168 2890530 2967875 3005138 2857564 2853714 2890702 2748873 2850122 2884850 2829037
15057 2829037 2900958 2848291 2797784 2833180 2879366 2830198 2938112 2934885 3069300 3127088 3037233
15046 3037233 2968794 2943392 2963205 2864325 2884703 3007405 3039259 3087259 3015649 3084422 3027067
15035 3027067 2916773 2878112 2882672 2866773 2878345 2815011 2763905 2854688 2904412 2863927 2821214
15024 2821214 2784107 2825118 2938477 2955753 3036660 3011543 2951769 2879892 2966116 2985541 2947511
15013 2947511 3027933 3080668 2963875 2955227 2980222 3031074 3048040 2972781 2994433 3008712 3003425
15002 3003425 3032740 2971213 2975789 3015766 3078243 3051856 3071597 2951717 2833444 2863382 2907206
14991 2907206 2798144 2757477 2800858 2995724 2897369 2825834 2937430 3036188 3099346 2965683
14981 2965683 3028240 2921005 2815675 2746251 2797943 2907633 2807339 2765564 2757484 2861321
14971 2861321 2984020 3021854 2977781 2929317 3013229 3045616 2910821 2873991 2960485 2886704 2814950
14960 2814950 2947354 2891623 2928327 2922154 2880043 3013555 2963788 2994034 2961532 2858380 2767222
14949 2767222 2916052 2923149 2858017 2829190 2878620 2830151 2892928 2915187 2885454 2801191 2706845
14938 2706845 2780800 2779608 2872884 2979187 2920095 2862062 2768283 2889457 2938593 2797305 2823182
14927 2823182 3054850 3076381 3006254 2990730 2938151 2965795 3012661 2828412 2834055 2888260 2937690
14916 2937690 3067299 3073680 3013327 3073734 3182610 3000814 2897971 3013646 2950993 2853010
14906 2853010 2879050 2936060 2985576 2819467 2836563 2808825 2950016 2970847 2922068 2877118 2936274
14895 2936274 2984721 3088523 2994656 2822558 2943466 2979831 2960814 3006776 2985900 2998433 2975115
14884 2975115 2983063 2987693 2963473 3001437 2927383 2827950 2900024 2924704 2835416 2976566 3003941
14873 3003941 3124576 3112184 3050655 3018920 2897057 2901900 2967579 3080688 2991612 2890583 2932348
14862 2932348 3041466 3120451 3083478 2973581 3062721 2997744 2972906 2985292 2837483 2914182 2943585
14851 2943585 2867359 2960970 3062686 3211215 3028783 2989137 3061094 3091427 2888334 2914685
14841 2914685 3086041 3033003 2915212 2777176 2853124 2882927 2971738 2939021 2928649 2939845 2964658
14830 2964658 2972608 3100843 3028329 2934219 2909676 2925394 2972864 3014176 2997532 3057838 2990539
14819 2990539 2979255 2982044 2867946 2895395 2761004 2853092 2929870 2952651 3033214 2980127 3008979
14808 3008979 2926941 2806348 2935439 2910503 2859550 2955720 2995926 3141837 2972803 2930447
14798 2930447 3030051 3032548 2995851 2987932 2893614 2959757 3014484 3005176 2980315 2940613 2925435 2934965
14786 2934965 3031589 2982215 2870827 2932669 2999791 3069377 2971025 2953707 2970044 3031083 2896315
14775 2896315 2903295 2924313 2796184 2682752 2791485 2870573 2947954 3079081 3110136 3020488 2962344
14764 2962344 3045127 3041557 3141888 3030689 3097163 3117274 3107513 3018426 2955582 3027533 3066346
14753 3066346 2992730 3045745 3007399 3094421 3064768 3089911 3054097 3113901 3055059 3042555 3056963
14742 3056963 3054820 3032845 3130915 3113356 3177460 3156335 3125055 3165689 3145679 2996522 2918107
14731 2918107 3049104 3071531 3190781 3036820 3021008 3123688 3075212 3145934 3041716 2950674
14721 2950674 3070518 3168963 3178238 3157219 3077460 3016245 2978954 3012112 3036412 3031000 3083638
14710 3083638 3012099 2912299 2935771 2986983 2919542 2958342 2939772 3100483 3123090 3088818 3049105
14699 3049105 3064707 3010234 2997716 2992656 3026793 3061387 3039804 2983511 2876326 2887157 2933640
14688 2933640 2871688 2890374 2992658 2947534 2882732 3027793 3026260 3065173 3067300 3111204 3178193
14677 3178193 2963316 2822253 2875345 2837957 2949154 3087294 2973268 2962657 3065569 3042791
14667 3042791 3033859 3029887 3056877 3003441 2995507 3089675 3227463 3185322 3294055 3234503 3126497
14656 3126497 3105216 3076003 3031604 3088457 3049379 3006101 2974324 3020149 3030820 3045476 3054832
14645 3054832 2945778 3074385 3077473 3186925 3118686 3185642 3090945 2961632 3031401 3195333
14635 3195333 3007305 2993467 3032604 2970011 2850429 2864982 3049488 3007749 2943323 3077289
14625 3077289 3053272 3006015 3083051 3209075 3232473 3151133 3075585 3133729 3108588 3017420 3095844
14614 3095844 3181432 3082617 2900204 2957232 3050377 3080017 3030876 3018094 3042397 3079235 3092150
14603 3092150 3036933 2863234 2868134 3033940 2995584 3063331 3071323 3127547 2956297 3035786 3046836
14592 3046836 3027790 3118133 3189451 3144826 2973755 3012662 3099732 3117583 3006250 3023282 3088261
14581 3088261 3011894 3036195 3089129 3203508 3217633 3149926 3161606 3076926 3091600 3022450 3041410
14570 3041410 3148936 3166802 3132833 3039005 2997279 3054144 3066199 3128790 3060214 3239786 3169622
14559 3169622 3006838 2971865 3025867 3010026 3056506 3006471 2980769 3031320 2997371 3071044 3088513
14548 3088513 3016487 3033063 3013245 2875315 3106464 3170686 3033267 3078461 3000267 3094168 3075930
14537 3075930 3193963 3215076 3210389 3113108 3076502 3160375 3172548 3065573 2932702 2962990 2985817
14526 2985817 2974128 3069412 3061524 2940753 2959322 2863565 2938932 2946847 3047762 3086553 2941107
14515 2941107 3085618 3130327 3039603 3064762 3189106 3068962 2959698 3004061 3018919 2982863
14505 2982863 3033856 3045563 3165933 3211662 3131143 3204839 3261993 3068842 3042735 3114406 3000930
14494 3000930 2962786 3094406 3154542 3128697 3115482 2953998 2981127 2944449 2995627 2992037 2970215
14483 2970215 2995976 3133207 3135306 3092416 3103794 3165321 3182316 3228043 3101282 3135484 3117493
14472 3117493 3040496 3028703 2977133 3008733 3038998 3076310 3235039 3094726 2981886 3023468 3114939
14461 3114939 3104489 3124377 3042373 3075946 3057857 3174648 3258051 3128727 3156774 3148400 3142142
14450 3142142 3145608 3022642 2978691 3147922 3246846 3303874 3363877 3373294 3265866 3158753 3136907
14439 3136907 3077113 3051567 3077327 3158978 3158673 3107600 3117214 3092305 3091422 3029958 3034866 2969857
14427 2969857 3082298 3081222 3193884 3160521 3090813 3057339 3107641 3086657 3035541 3174231 3254614
14416 3254614 3067851 3072215 3157343 3253215 3270306 3171007 3084900 3200661 3362717 3400587 3324715
14405 3324715 3181376 3082464 3040181 3154300 3328188 3259688 3220854 3174073 3138805 3218393 3110957
14394 3110957 3057164 3020290 3090030 3129436 3182367 3095858 3011442 2996246 2985012 3130657 3134039
14383 3134039 3096702 2994051 3206448 3214845 3015775 3022977 3120958 3057139 2931777 2892390 3006794
14372 3006794 3089805 2925953 2873499 3061003 3136212 3147602 3319760 3378721 3283627 3163041
14362 3163041 3214362 3158158 3086540 3029841 3163185 3307024 3303003 3169137 3041049 3030439 3144443
14351 3144443 3044323 2956377 3183804 3256129 3210206 3207187 3202324 3221851 3238133 3281095 3325563
14340 3325563 3333217 3208137 3183628 3222471 3181784 3146981 3148515 3100783 3104422 3103888 3144244 3072409
14328 3072409 3091618 3208003 3276273 3106631 3143470 3286178 3182839 3170276 3377776 3249842
14318 3249842 3141384 3157247 3169063 3322108 3230658 3195604 3221419 3271411 3288240 3206357 3049693
14307 3049693 3047566 3123758 3126539 3185267 3197377 3267446 3247248 3186459 3235072 3235198 3181546 3260013
14295 3260013 3294567 3222665 3235135 3201761 3207068 3149469 3155994 3217600 3154155 3187024 3185059 3223643
14283 3223643 3239781 3150884 3155014 3241030 3257374 3122610 3048060 3057298 3133817 3188839 3309893
14272 3309893 3245661 3272847 3303608 3222428 3076587 3222016 3210240 3231341 3206187 3135773 3267087
14261 3267087 3265018 3196609 3327295 3207147 3014452 3198649 3260338 3287179 3395952 3293713
14251 3293713 3194779 3282714 3351590 3226952 3232867 3292933 3268792 3101289 3121425 3154443 3157559
14240 3157559 3202023 3303928 3199335 3046335 3177413 3141734 3307935 3274706 3157822 3079331
14230 3079331 3082311 3157558 3161673 3232689 3236035 3127625 3234025 3256937 3080187 3128652 3255590
14219 3255590 3237855 3353277 3425616 3362671 3182173 3307164 3267811 3261309 3287596 3252383 3252217
14208 3252217 3121796 3086044 3204995 3223336 3188094 3206178 3181049 3073752 3197323 3121357
14198 3121357 2995964 2964459 2987374 3185471 3299375 3301931 3434804 3437257 3285809 3147752
14188 3147752 2985165 3078513 3174722 3294130 3213254 3267423 3252561 3316389 3136453 3234145 3245122
14177 3245122 3216613 3149806 3130508 3200672 3249320 3206809 3198561 3234415 3241577 3328521 3296223 3285884
14165 3285884 3177686 3089662 3254918 3444053 3326191 3369239 3190954 3214622 3266302 3259224
14155 3259224 3226055 3112653 3149831 3198455 3184318 3220736 3212398 3190067 3145929 3200643 3155699
14144 3155699 3225466 3220898 3115234 3114016 3174763 3328758 3290828 3357873 3296052 3194480 3347598
14133 3347598 3325569 3116329 3117385 3156968 3057513 3152910 3270926 3355482 3318913 3407062 3373108
14122 3373108 3407747 3434378 3309649 3234718 3251471 3290029 3162816 3223644 3341234 3203876
14112 3203876 3262432 3431279 3466319 3271776 3217217 3385260 3377481 3265036 3376064 3359571
14102 3359571 3332025 3422969 3338493 3322590 3240530 3123068 3161568 3250714 3346344 3368058 3348167
14091 3348167 3417127 3337999 3353085 3272346 3300212 3477119 3478188 3262158 3486676 3492614 3470369
14080 3470369 3396749 3283890 3269233 3221893 3283976 3225631 3194819 3212422 3264422 3147203 3114591
14069 3114591 3195631 3292864 3436045 3343122 3407805 3268127 3251345 3199393 3277011 3357208 3287185
14058 3287185 3260227 3271219 3362330 3326084 3230881 3137378 3263809 3355547 3159553 3228521 3307989
14047 3307989 3336265 3228421 3274513 3357792 3365603 3165873 3059851 3156179 3157449 3230188 3226111
14036 3226111 3229690 3311405 3428767 3229491 3234942 3374041 3373960 3330626 3304910 3207377 3230754 3076276
14024 3076276 3105237 3324857 3442958 3358294 3402397 3389973 3245371 3166764 3215745 3199844 3222829
14013 3222829 3235387 3269970 3246283 3345640 3358933 3394447 3186215 3159742 3173682 3028496 3194756
14002 3194756 3212418 3325155 3283432 3230048 3243162 3315994 3250799 3062985 3172840 3284668
13992 3284668 3194059 3314258 3353287 3264869 3351763 3247284 3337998 3361596 3282813 3252871 3319398
$$ [...]
##END NTUPLES=NMR SPECTRUM
##END=
