##TITLE=1H_DE-80H_X3
 200.13MHz, d2o
 8 sc
 
 19ns.26.2.2025
##JCAMPDX= 6.0         $$ Bruker NMR JCAMP-DX V2.0
##DATA TYPE= NMR SPECTRUM
##DATA CLASS= NTUPLES
##ORIGIN= UXNMR, Bruker Analytische Messtechnik GmbH
##OWNER= pz
$$ XWIN-NMR		Version 3.5
$$ Wed Jul 23 14:37:56 2025 Russian Standard Time (UT+4h)  Yarkov@DPX200
##.OBSERVE FREQUENCY= 200.1313
##.OBSERVE NUCLEUS= ^1H
##.ACQUISITION MODE= SIMULTANEOUS
##.ACQUISITION SCHEME= undefined
##.AVERAGES= 8
##.DIGITISER RES= 18
##SPECTROMETER/DATA SYSTEM= spect
##.PULSE SEQUENCE= zg30
##.SOLVENT NAME= CDCl3
##.SHIFT REFERENCE= (INTERNAL, CDCl3, 0, 15.5133)
##AUDIT TRAIL= $$ (NUMBER, WHEN, WHO, WHERE, WHAT)
$$ ##TITLE= Audit trail, XWIN-NMR		Version 3.5
$$ ##JCAMPDX= 5.01
$$ ##ORIGIN= Bruker BioSpin GmbH
$$ ##OWNER= Yarkov
$$ C:/Bruker/XWIN-NMR/data/yarkov2/nmr/H-C/1/pdata/1/auditp.txt
$$ ##AUDIT TRAIL=  $$ (NUMBER, WHEN, WHO, WHERE, WHAT)
(   1,<2025-07-23 14:36:44.12 +0400>,<Yarkov>,<DPX200>,
      <created by zg, POWCHK disabled, PULCHK disabled
       configuration hash MD5:
       00 E9 B6 7A A2 85 ED C7 34 08 36 98 17 FE 4E 26
       data hash MD5: 16K
       CF EC FC 9B 6B 51 4A 5C B7 FD 3E 76 B8 C3 40 DF>)
(   2,<2025-07-23 14:36:52.48 +0400>,<Yarkov>,<DPX200>,
      <Start of raw data processing
       efp BC_mod = 2 LB = 0.25 FT_mod = 6 PKNL = 1 PHC0 = -1355.343 PHC1 = 7.190909 SI = 16K 
       data hash MD5: 16K
       0E 82 9B F7 89 2A 51 AA 4D F1 FB 13 9A 63 22 31>)
(   3,<2025-07-23 14:36:57.15 +0400>,<Yarkov>,<DPX200>,
      <abs ABSG = 5 
       data hash MD5: 16K
       AB 81 D0 C2 BF 6C AD A9 B3 41 F4 64 F9 59 49 D3>)
(   4,<2025-07-23 14:37:11.65 +0400>,<Yarkov>,<DPX200>,
      <pk PHC0 = 2.6 PHC1 = 0 
       data hash MD5: 16K
       DD DF B0 5A 92 2E 3C 0C 06 25 9F 62 6A 44 B0 5A>)
(   5,<2025-07-23 14:37:14.95 +0400>,<Yarkov>,<DPX200>,
      <abs ABSG = 5 
       data hash MD5: 16K
       3D 22 C4 E0 08 3C BF F2 8B E9 81 BA 3B B9 24 FD>)
$$ ##END=
$$ 
$$ hash MD5
$$ 59 83 DB 3F 7F 66 E2 50 22 7C 65 44 68 42 A4 50
##$RELAX= 
##$RELAX= 
##$RELAX= 
##$RELAX= 
##$RELAX= 
##$RELAX= 
$$ Bruker specific parameters
$$ --------------------------
##$DU= <C:/Bruker/XWIN-NMR>
##$EXPNO= 1
##$NAME= <H-C>
##$PROCNO= 1
##$TYPE= <nmr>
##$USER= <yarkov2>
##$AMP= (0..31)
100 100 100 100 100 100 100 100 100 100 100 100 100 100 100 100 100 100 
100 100 100 100 100 100 100 100 100 100 100 100 100 100 
##$AQSEQ= 0
##$AQ_mod= 1
##$AUNM= <au_zg>
##$AUTOPOS= <>
##$BF1= 200.13
##$BF2= 200.13
##$BF3= 200.13
##$BF4= 200.13
##$BF5= 200.13
##$BF6= 200.13
##$BF7= 200.13
##$BF8= 200.13
##$BYTORDA= 1
##$CFDGTYP= 0
##$CFRGTYP= 5
##$CHEMSTR= <none>
##$CNST= (0..31)
1 1 145 1 1 1 1 1 1 1 1 1 1 1 1 1 1 1 1 1 1 1 1 1 1 1 1 1 1 1 1 1 
##$CPDPRG= <>
##$CPDPRG1= <>
##$CPDPRG2= <>
##$CPDPRG3= <>
##$CPDPRG4= <mlev>
##$CPDPRG5= <mlev>
##$CPDPRG6= <mlev>
##$CPDPRG7= <mlev>
##$CPDPRG8= <mlev>
##$CPDPRGB= <>
##$CPDPRGT= <>
##$D= (0..31)
0 0.7 0 0 0 0 0 0 0 0 0 0.03 0 0 0 0 0 0 0 0 0 0 0 0 0 0 0 0 0 0 0 0 
$$ [...]
##$SUBNAM3= <"">
##$SUBNAM4= <"">
##$SUBNAM5= <"">
##$SUBNAM6= <"">
##$SUBNAM7= <"">
##$SUBNAM8= <"">
##$SUBNAM9= <"">
##$SW= 18.0517328524113
##$SWIBOX= (0..15)
0 0 2 0 0 0 0 0 0 0 0 0 0 0 0 0 
##$SW_h= 3612.71676300578
##$TD= 16384
##$TD0= 1
##$TE= 0
##$TE2= 300
##$TE3= 300
##$TEG= 300
##$TL= (0..7)
0 120 120 120 120 120 120 120 
##$TP= (0..7)
150 150 150 150 150 150 150 150 
##$TP07= 0
##$TPNAME0= <>
##$TPNAME1= <>
##$TPNAME2= <>
##$TPNAME3= <>
##$TPNAME4= <>
##$TPNAME5= <>
##$TPNAME6= <>
##$TPNAME7= <>
##$TPOAL= (0..7)
0.5 0.5 0.5 0.5 0.5 0.5 0.5 0.5 
##$TPOFFS= (0..7)
0 0 0 0 0 0 0 0 
##$TUNHIN= 0
##$TUNHOUT= 0
##$TUNXOUT= 0
##$USERA1= <user>
##$USERA2= <user>
##$USERA3= <user>
##$USERA4= <user>
##$USERA5= <user>
##$V9= 5
##$VALIST= <valist>
##$VCLIST= <CCCCCCCCCCCCCCC>
##$VD= 0
##$VDLIST= <DDDDDDDDDDDDDDD>
##$VPLIST= <PPPPPPPPPPPPPPP>
##$VTLIST= <TTTTTTTTTTTTTTT>
##$WBST= 1024
##$WBSW= 4
##$XGAIN= (0..3)
0 0 0 0 
##$XL= 0
##$YL= 0
##$YMAX_a= 407340
##$YMIN_a= -398909
##$ZGOPTNS= <>
##$ZL1= 120
##$ZL2= 120
##$ZL3= 120
##$ZL4= 120
##$ABSF1= 15.49568
##$ABSF2= -2.55617
##$ABSG= 5
##$ABSL= 3
##$ALPHA= 0
##$AQORDER= 0
##$ASSFAC= 0
##$ASSFACI= 0
##$ASSFACX= 0
##$ASSWID= 0
##$AUNMP= <proc_1d>
##$AZFE= 0.1
##$AZFW= 0.1
##$BCFW= 0
##$BC_mod= 2
##$BYTORDP= 0
##$COROFFS= 0
##$CY= -3
##$DATMOD= 1
##$DC= 0
##$DFILT= <>
##$DTYPP= 0
##$F1P= 0
##$F2P= 0
##$FCOR= 1
##$FTSIZE= 16384
##$FT_mod= 6
##$GAMMA= 0
##$GB= 0
##$INTBC= 1
##$INTSCL= 3.241238e-09
##$ISEN= 128
##$LB= 0.25
##$LEV0= 0
##$LPBIN= 0
##$MAXI= 10000
##$MC2= 0
##$MEAN= 0
##$ME_mod= 0
##$MI= 1.114404
##$NCOEF= 0
##$NC_proc= -5
##$NLEV= 6
##$NOISF1= 3.799351
##$NOISF2= 2.8
##$NSP= 0
##$NTH_PI= 0
##$NZP= 0
##$OFFSET= 15.51331
##$PC= 1
##$PHC0= -1352.743
##$PHC1= 7.190909
##$PH_mod= 1
##$PKNL= yes
##$PPARMOD= 0
##$PSCAL= 0
##$PSIGN= 0
##$REVERSE= no
##$SF= 200.130001679693
##$SI= 16384
##$SIGF1= 3
##$SIGF2= 2
##$SINO= 0.751879
##$SIOLD= 32768
##$SREGLST= <19F.Aceton>
##$SSB= 0
##$STSI= 16384
##$STSR= 0
##$SW_p= 3612.71676300578
##$SYMM= 0
##$S_DEV= 0
##$TDeff= 16384
##$TDoff= 0
##$TI= <>
##$TILT= no
##$TM1= 0
##$TM2= 0
##$TOPLEV= 0
##$USERP1= <user>
##$USERP2= <user>
##$USERP3= <user>
##$USERP4= <user>
##$USERP5= <user>
##$WDW= 1
##$XDIM= 16384
##$YMAX_p= 295941368
##$YMIN_p= -313966
$$ End of Bruker specific parameters
$$ ---------------------------------
##NTUPLES= NMR SPECTRUM
##VAR_NAME=  FREQUENCY,     SPECTRUM/REAL,   SPECTRUM/IMAG
##SYMBOL=    X,             R,               I
##VAR_TYPE=  INDEPENDENT,   DEPENDENT,       DEPENDENT
##VAR_FORM=  AFFN,          ASDF,            ASDF
##VAR_DIM=   16384,         16384,           16384
##UNITS=     HZ,            ARBITRARY UNITS, ARBITRARY UNITS
##FACTOR=    0.220516191357247, 1,           1
##FIRST=     3104.67884290063, 0,            0
##LAST=      -508.037920105148, 0,           0
##MIN=       -508.037920105148, -313966,     0
##MAX=       3104.67884290063, 295941368,    0
$$ Real data points
##PAGE= N=1
##DATA TABLE= (X++(R..R)), XYDATA
$$ [...]
8863 1581954 1521889 1523619 1483771 1454917 1397715 1357879 1334810 1293437 1250186 1230364 1227376 1208815
8851 1208815 1181823 1153887 1106503 1048708 1058800 1024911 1011696 1005124 1002571 966340 944583 936570
8839 936570 919594 923811 926462 878603 834471 886540 899064 890207 829501 863302 796989 760075
8827 760075 761445 782120 772443 756395 771613 747032 751607 750575 741080 686941 635813 658861 638645
8814 638645 660381 640955 651656 641965 646228 624369 587407 560049 549956 556253 574911 562399
8802 562399 541385 490231 479280 485199 491687 524433 495897 476888 450187 460815 462687 476510
8790 476510 497197 481049 440766 395231 416680 434707 413158 384884 397609 394718 410363 398533
8778 398533 367179 363175 376661 370779 338222 329035 305816 313637 338195 345987 340522 337819 317152
8765 317152 323473 305756 308273 300134 284041 298979 323936 330465 292440 289463 265896 274359 282526
8752 282526 276872 262218 265487 250735 239759 228544 267343 250726 221144 230826 255556 248103
8740 248103 256496 221896 250945 270877 262441 262187 238044 197495 198725 225556 226421 242771 240930
8727 240930 219932 220343 216659 215313 230187 238734 237411 231662 194537 181802 174242 212163 231818
8714 231818 218384 219412 185800 199295 195390 189515 163363 176140 170118 197174 181342 182733 179174
8701 179174 139539 120667 135991 135184 162744 191942 155608 90873 64218 101171 89402 118582
8689 118582 180431 162327 123644 125253 136651 160613 163104 140589 149102 167963 182330 158049
8677 158049 157075 183198 158116 129062 121131 95280 92178 87968 127223 142492 104225 117498 122567
8664 122567 120578 149632 138779 94849 113910 118421 101773 145102 134496 120455 132703 164115
8652 164115 149670 150453 135487 136534 122539 120025 120783 102877 129639 140999 96043 114111 119243
8639 119243 103916 98687 133160 117444 103514 119240 126088 110821 93881 90988 125382 109811
8627 109811 106194 107228 72411 89787 84882 93695 82464 67369 83952 114451 82343 87070 94724
8614 94724 60136 42273 56168 62741 95468 70492 73538 79800 61716 64753 90947 102111 104992
8601 104992 107157 91863 84703 91642 112588 113612 72192 76749 94808 83929 72777 46137 40421
8588 40421 56035 61085 50985 91480 70876 15174 18868 52093 77256 69471 76718 92588 64716
8575 64716 79100 91155 91296 112461 121102 80281 86869 81420 29281 35148 49174 40119 35271
8562 35271 44829 47548 78005 78803 60058 61391 63631 46873 44314 48642 58666 66493 58358 44447
8548 44447 30824 39208 52404 57383 75267 68136 66496 86864 78811 27826 33285 64407 66350
8535 66350 28486 21631 55381 67693 57761 37202 45753 68336 88420 86917 75100 50533 2906
8522 2906 15016 41925 65387 45737 31083 31508 40563 22563 32758 28032 53274 50141 45673
8509 45673 70424 52238 78875 75687 49577 44259 54011 67381 71238 59016 28095 21414 6804
8496 6804 33964 40283 37142 18568 53202 54864 20110 20222 22587 43574 28187 32389 63795
8483 63795 46596 59858 65899 56646 51733 14981 26957 21104 -1842 28166 8508 33734 52238
8470 52238 55613 86281 80893 70755 61899 78046 88127 88164 117120 100617 111864 136524 116730
8457 116730 125851 142729 187607 185808 207478 225101 255809 311649 392399 434464 459356 394885
8445 394885 311441 246523 214184 164390 133787 102816 86291 93974 119833 85271 93910 85962
8433 85962 114419 94520 60984 75809 77243 66807 35107 54638 43336 37684 65665 83108
8421 83108 48274 47643 60162 47577 55137 60778 52968 68356 65237 58893 27446 15891 30230
8408 30230 -2828 19506 25430 45613 42501 17222 -10799 -6213 -6591 23793 53168 39161 46178
8395 46178 25584 38719 27825 -5499 -8736 25216 57292 31645 35748 13319 25546 36355
8383 36355 -3371 -912 32875 29295 43950 31628 45925 55301 49661 8937 7482 25454 25549
8370 25549 31349 12903 4105 1251 25014 21049 11953 14620 20746 28329 50019 36546 42355 13756
8356 13756 40295 18784 27003 40356 36568 21624 7686 -2275 -10417 -20938 -13238 9042 -15612
8343 -15612 -2774 20078 28145 42739 25703 25470 701 -1893 -22446 -34108 -53921 -24784 -6871
8330 -6871 23631 -5257 8444 30177 11519 10124 39696 29722 -9999 -3715 17022 -25030 -24159
8317 -24159 -20629 36425 54709 35068 9840 -32979 -12058 -8723 12467 10695 -8240 -13573 1324
8304 1324 6147 -2390 5314 20023 -16934 -6177 32506 31907 -5232 -2557 9192 -9907 -15408
8291 -15408 15293 8818 16400 -18472 -16847 -19266 -4352 9944 -9222 13144 23670 4487 -34953
8278 -34953 -34110 -42166 -39273 -4284 -324 -20544 -41864 -30349 -32180 -2189 21234 -11989 -3667
8265 -3667 15800 -8663 -14504 4783 9521 -16499 4206 -13638 -13310 4496 1070 8038 -4264
8252 -4264 12375 2454 -20332 -3106 25815 21504 -2195 13333 3569 20740 8590 -2707 391
8239 391 16053 -7787 12518 39509 28413 -6678 -16052 -6797 36136 -2286 -3385 27690 15752
8226 15752 -22065 -35488 9308 10686 24597 -11001 -23464 8612 17286 -6865 6800 -5308
8214 -5308 14048 23786 8114 -11361 -653 -46328 -21954 10813 17491 -27151 -6839 -15447 -19789
8201 -19789 -52808 -38229 -58240 -73518 -92388 -83936 -113078 -106251 -313966 5661 350119 154332
8189 154332 173553 84893 76978 18523 46087 10577 5048 -7791 25584 33458 48627 48789 64559
8176 64559 25621 19730 25330 35457 7735 30376 58726 71462 82699 48394 -6642 3640
8164 3640 7779 -2686 28216 52215 16021 1932 -26682 -16499 6265 -5556 4752 -1559
8152 -1559 8908 3285 28791 60580 78714 69048 95629 61391 65159 60880 46579 79131 65913
8139 65913 42797 33691 42779 47325 48819 66744 744 -35005 32198 37786 10277 23585 16625
8126 16625 10208 -19934 9259 -16022 5965 24245 30704 6439 29520 2455 -4681 21429
8114 21429 55764 7648 -773 33399 22541 22461 18677 25461 50425 44131 13960 30722 51817
8101 51817 21432 21391 8544 -12511 -3934 -23445 -3166 10298 -3202 -18144 -5571 7531 29774
8088 29774 21964 -4443 -12410 -25382 -19715 -15698 356 8748 -13604 -24608 -62552 -21756 -14862
8075 -14862 -25648 -974 3872 18697 20339 24035 6733 9371 12084 17104 -8843 12268 26151
8062 26151 -19188 18923 4141 -1693 -4730 -8986 -5519 38858 37714 13143 9972 17657 15852
8049 15852 1892 27396 -2017 -22454 14906 454 -4768 -15746 -12810 1363 -2521 -16373
8037 -16373 -38849 -13798 7514 -8068 -14381 20842 -9680 -40687 -42443 -34305 -11978 -32901
8025 -32901 -17677 -13556 -27369 -24168 -12168 -4037 -14682 -26220 -8347 25297 30134 29057 33401
8012 33401 18479 1727 22562 -3446 -189 28924 -8519 -1472 -1938 -2135 -32145 -25941 -21882
7999 -21882 -25165 -26205 -15463 9341 1036 6180 -5031 7227 -15009 -29443 -27294 8238 50414
7986 50414 37481 -8546 8831 54096 45717 10229 254 -651 12963 8199 9253 12307 28634
7973 28634 14505 -27795 -11283 24220 -669 -37429 -11055 -5733 -3135 -158 -6980 -13383 -25909
7960 -25909 -63183 -62819 -68482 -53939 -12638 4930 1907 5891 -14599 -26748 -44622 -48001 -18439
7947 -18439 -9614 -14618 -3081 -17274 -14401 -26445 -16383 -31583 -49625 -17207 -13297 -12503 -1078
7934 -1078 -8913 -16298 -26213 -7215 19964 50140 22279 -8157 -10125 -27941 -4071 -23365 -17834
7921 -17834 -29697 -12114 -6649 4701 -11699 -16874 -29977 -24908 67 -7876 -16451 -32629 -23708
7908 -23708 -36095 -30436 -34306 -6005 -14939 -37600 -16788 16092 3020 7347 18464 33181 30025
7895 30025 19423 38665 26661 27069 9197 2995 -37606 -20627 7929 27200 11431 5537 12696
7882 12696 9355 30843 17028 12771 1872 -16281 -29184 -21177 -15125 6108 -996 -17914 4682
7869 4682 -37623 -5419 11143 11901 30533 27875 19703 -3857 -17280 -33871 -8175 2090 3358
7856 3358 3398 9571 8156 13033 -20292 -69148 -49475 -11940 -8079 -4121 16984 -20895 -26476 -53291
7842 -53291 -32690 -3014 5423 3854 17712 25131 1387 -5610 341 -15000 -788 -2788 -4091
7829 -4091 -23380 -61517 -50905 -15035 -29298 -32182 -13983 2784 4243 -6953 -1012 10906 -664
7816 -664 -19783 14750 10622 7681 -20767 -36038 -29120 -51770 -45763 -45779 -28286 -60592 -53471 -61707
7802 -61707 -35053 -63803 -51318 170339 112745 59222 42179 7474 3843 -6084 5726 -13139
7790 -13139 890 24715 9664 28817 4652 15141 -16720 890 17900 35774 30211 31442
7778 31442 27870 -3805 -6818 -6364 -19378 -54451 -14405 8204 3631 -24287 -16475 -5642 -27276
7765 -27276 -27254 -27302 9818 3307 -34208 -50725 -31604 -10501 12873 -13022 2221 5710 -2220 -6962
7751 -6962 -1471 -5556 10950 33967 -3016 24994 26114 4366 -1542 -21227 -25661 -12990 -1846
7738 -1846 8185 9973 22708 -7563 -19008 -5689 -7269 -19177 -24992 -8322 -22407 -11366 9914
7725 9914 -6144 1170 -14067 -17536 -26783 -3889 -20259 -15493 -18547 -20809 -37785 -34537 -39374 -6454
7711 -6454 3860 -31434 -19385 -16851 -11837 -14788 -58850 -51155 -31612 -39572 -9484 8975 19627
7698 19627 10079 11192 3320 -1787 -39 -6557 18623 19298 15002 2666 -13217 -23562 -33083 -24580
7684 -24580 -30748 -15357 2578 -17636 -13881 5585 15447 -16997 -22114 6189 20152 36516 26643
7671 26643 7753 -9430 26576 -3775 -31249 -32002 -46182 -18782 37009 27874 25200 17695 7077
7658 7077 -22174 -25646 -18537 -11715 -12548 -26849 -8771 -24468 -28353 3620 -10030 -30717 3337
7645 3337 -52178 -25153 -15484 10463 11559 -21308 -23399 10285 16318 -5923 26943 19711 12653
7632 12653 6465 8763 -16492 -47868 -11322 -3317 -13414 -23522 -16154 -8598 -1277 11784 7782
7619 7782 -8589 9372 -12110 -2952 10592 9321 7923 1554 28673 8323 -16799 -43324 -7399
7606 -7399 -27845 -16060 45858 8140 -19499 29872 -7644 -8635 -37461 -52721 -47948 -58045 -74221
7593 -74221 -62002 -29614 3583 -11443 20655 32997 18023 3780 -39591 -55074 -40708 18179
7581 18179 -28104 -41521 -24046 -10923 -19566 -27842 -20158 -22561 -13609 28755 39307 12692 12697 -10060
7567 -10060 -19099 5355 -9888 -3428 7196 16963 37556 15739 -11753 -11982 -21802 -39278 -41242
7554 -41242 -27314 -25173 -447 -2527 -14493 -32558 -33367 -7265 -874 -6289 26017 11478 -15126
7541 -15126 7204 11147 15956 -6501 -27585 -60589 -51618 -11714 1048 51363 24760 10040
7529 10040 18936 12097 16828 -2296 -14874 -36910 -26884 -12315 3767 -14671 -19041 426 -11594
7516 -11594 -15103 -18159 -31619 7548 -10428 -21958 20218 27299 11683 20225 -1225 -23176 -14890
7503 -14890 -24057 -26492 -20401 -17592 -12526 -5138 12276 -21687 -52632 -31482 -25609 -45370 -19955
7490 -19955 -40908 -35673 -38943 -26248 -9366 -11150 2009 19459 8343 -30180 -39807 -61289 -33593
7477 -33593 -14334 -6695 -6785 -21116 -31124 -29179 -39685 -22096 -33285 -29955 -19299 -10838 18174
7464 18174 9929 31214 13562 -25179 -491 -22544 -55125 -50793 -62151 -65485 -33769 21354
7452 21354 23047 -37255 -41743 -29443 -40765 -21664 536 -21387 -18756 -47907 -62228 9662
7440 9662 -185 -27999 -36199 -36010 -38050 -27650 -31483 -39637 -20326 -41001 -22521 -8463 -4842 -18516
7426 -18516 -8281 -17623 -29903 -56124 -75972 -50072 -29643 -16650 -27225 -74842 -19615 7320
7414 7320 -20896 -43516 -52000 -5535 10640 3016 14836 16076 20703 -15766 2582 73 -33852
7401 -33852 -7402 11216 -6579 -15524 -4285 -922 -5030 -19109 1750 -5217 -4642 -2640 -22920
7388 -22920 -16541 7028 9932 -10205 -28629 -7885 -15749 -5622 16494 -388 -57468 -52427 -11828
7375 -11828 -37449 -41409 -21893 -32566 -36685 -25520 -18244 -30091 -26167 -39096 -39711 -23559 -41632
7362 -41632 -66836 -42515 -29925 -38818 -47300 -11577 -47495 -64482 -4647 -15998 -24893 -23631 6756
7349 6756 10233 -5174 -4781 -19543 -26544 -30473 -46840 -37558 -18675 -25809 -24058 7909 -24605 -1285
7335 -1285 -10115 -21911 4060 -18605 1125 13178 -22677 -44858 -34945 -61134 -44676 -12717
7323 -12717 -39154 -62207 -27506 -8202 6254 4651 11899 2055 -26355 -17379 -24250 -22400 -934
7310 -934 -16535 -6861 -22526 -3623 13180 14851 19471 16833 20278 18527 -5947 -13848 -42240 -73322
7296 -73322 -81470 -28136 -24206 -19058 -33769 -58097 -29486 -33683 -24136 -24297 -7861 6316 -17283
7283 -17283 -16451 -11598 -25103 -10266 -22324 -18956 -40931 -38865 -24854 399 1391 -5559 -19195
7270 -19195 -28496 -56029 -8262 -4217 -40821 -21627 -21282 -24040 -37554 -45455 -15690 -22924 -65884
7257 -65884 -28067 -19853 -21017 -39123 -5864 -29227 -69461 -78067 -67501 -26374 -4923 -1704 3918
7244 3918 13945 -25693 -22785 -31778 -50544 -89017 -51949 -17171 -42334 -37923 -11743 -33455 -38953
7231 -38953 -2610 -13154 -36155 -31494 -20383 -16613 -34556 -42231 -25667 -28912 -14924 -31424 -42699
7218 -42699 -1528 12138 11950 -26215 -39793 -25623 -25147 586 -4269 -3669 -33703 -69423 -55813
7205 -55813 -66909 -26891 825 -35131 -62922 -40409 -1332 -1789 -35865 -29339 -19957 -45849 -60181
7192 -60181 -47653 -46877 -33930 -24982 -23201 -27870 -30537 -48807 -69161 -43438 6238 -27642 -51026
7179 -51026 -59386 -61346 -48390 -38827 -74063 -72696 -61727 -48335 -10572 -4143 21706 -27908 -54010
7166 -54010 -36857 -45513 -17368 -32936 -42098 -29654 -31854 -26699 -16306 -14723 -13091 11383 -21205
7153 -21205 -46841 -61717 -36227 -56942 -30581 -26183 -30845 -22052 -18370 -5610 16561 87 -24344
7140 -24344 -31459 -39567 -8803 -19426 -16070 -8117 -18828 -19718 -25604 -8936 -12216 -5292 -14126 82
7126 82 25259 13082 -34715 -19195 -5173 -15523 -35880 -22240 7731 21441 -9470 -21720
7114 -21720 -33672 -54002 -11984 -5055 -23914 -19956 -16461 -22685 -17031 -23646 -29186 -36865 -71780
7101 -71780 -83858 -69288 -57087 -15860 -7644 -20866 -22847 -7833 -22394 -31751 -17058 -18734 -25869
7088 -25869 -17962 -18732 -28278 -31335 -13227 -4890 -11885 3666 19693 3392 -22056 -35727 -65391
7075 -65391 -47330 -17406 -14783 -35140 -26119 -3370 834 -5199 -7835 11762 -9964 -36933 -30567
7062 -30567 -10260 -44033 -49853 -28847 18453 9949 -9452 -30563 -32923 -28577 -30820 -22415 -1219
7049 -1219 -25330 -52344 -55439 -51596 -27977 -29443 -4544 8854 -3579 -20481 -16432 8430 29391
7036 29391 -16072 -50275 -49788 -48578 -54747 -30903 -1362 15217 -6230 -57359 -31771 -29644 -37497
7023 -37497 -43481 -33459 9256 41236 34982 -21202 -54249 -46733 -7866 -937 -8056 -13386 -1109
7010 -1109 38182 47861 1201 8803 2720 18590 22509 -1941 -814 -20899 32952 67369 87688
6997 87688 90945 131502 116662 105211 53651 54544 50161 -15529 -12077 -16719 -35459 -10551 24048
6984 24048 -3234 20043 15229 2334 26 -2654 -48688 -49946 4473 -502 -22041 -43518 -50836
6971 -50836 -29123 -44822 -26265 4934 -26886 -34850 -51857 -15675 16458 -3552 -13637 -13500
6959 -13500 -3028 -17811 -29459 -66216 -33592 -599 -16234 10069 -14510 -49707 -39255 -6343
6947 -6343 -21077 1885 11708 -29344 -26979 -13143 -15766 -7506 -6884 -20724 -10308 -24786 -56309
6934 -56309 -45341 -51374 -47959 -29347 -6398 -4741 8270 21505 -21028 -68329 -58806 -18965 -22636
6921 -22636 -8524 -10915 -23229 -22745 17774 -4222 -43060 -34406 -8930 -4957 -32417 -48559 -22401
6908 -22401 -36805 -25365 1827 -7671 -39292 -60180 -32133 -15261 -30800 -28032 -16640 -15372
6896 -15372 -10247 -26015 -39749 -20873 -12595 -31665 -46401 -39940 -32523 10588 10229 -26204 -62402
6883 -62402 -70491 -47197 -35653 -8994 5051 -8422 -26384 3006 6633 -3395 -8512 -17619 -46547
6870 -46547 -57135 -52545 -45431 -15227 -36793 -41282 -59428 -18395 -9199 -27132 -23994 -4254 2948
6857 2948 -14291 -37634 -53190 -32801 -36432 -4376 -10042 -18284 549 -35342 -9265 -27053 -62226
6844 -62226 -37106 -20199 -9367 -35993 -10247 16508 5650 16314 -3736 -45511 -19967 -1260
6832 -1260 21145 15140 10920 -12473 15497 25963 16482 -4752 -10548 -36725 -52889 -17436 -28140
6819 -28140 -44801 -31518 -25774 -9125 -38393 -33236 17505 -11923 -33806 -62094 -33167 14017
6807 14017 -8112 -14784 -41717 -19723 -16110 -2499 -8403 -1403 -8657 -13051 16669 3708 23986
6794 23986 56981 52291 28233 5398 34527 44243 58739 42746 23352 38812 34793 54343
6782 54343 38884 38808 33970 56818 96343 51577 28622 19339 41930 73857 48526 45722 48216
6769 48216 86532 88703 98537 96023 68373 67210 126865 160733 161809 157782 173882 182065 221065
6756 221065 238920 204172 175226 181058 185040 182772 213212 192442 141195 140687 134153 173253 167065
6743 167065 143975 109591 112335 129294 143790 181925 180058 185242 169053 189732 215551 240958
6731 240958 293479 291450 291981 245998 225014 246663 200245 232422 241956 207126 190292 178678
6719 178678 169345 106962 101268 126585 127365 93829 78068 109826 118726 133353 143336 150969 139448
6706 139448 133184 185789 204627 214542 251044 233996 237056 257149 231631 172584 143700 148830
6694 148830 156993 159503 182350 165323 104337 108885 127495 102311 69977 59768 93365 81111
6682 81111 73050 74441 60469 9258 27057 102974 114459 76442 119786 123668 107173 91486
6670 91486 81269 113857 117521 111042 109572 104269 84342 71253 53716 42435 30116 47093 35160
6657 35160 26315 37802 25097 4785 26816 2558 -10523 7433 7150 -14120 3101 -542 17857
6644 17857 30989 15135 -16635 -40328 -20517 -1554 18494 8482 -6344 762 -3117 26317
6632 26317 44656 12128 9469 14816 13379 31482 23705 -44899 -52883 -48629 -29701 -17683 -44582
6619 -44582 -19560 11204 10498 22266 -18081 -29157 -8383 141 33983 30565 -24399 -13805 -13483
6606 -13483 -31071 -39296 -38011 -1434 3573 -16124 -62337 -18282 -651 10069 759 -1246 -319
6593 -319 -8994 -5254 -38879 -6035 -20012 -31691 -39507 2092 -8908 -5957 10640 -4086 -10379
6580 -10379 -27293 -40516 -25940 8295 -27308 -21792 -10686 -15405 -45295 -26843 -32083 -73210
6568 -73210 -58458 -50334 -51298 -15413 -38336 -67735 -52916 -28452 -39897 -26220 10112 -4916
6556 -4916 281 -3174 -4138 -14447 -13311 -5453 -7616 -5365 -30493 -37040 -9518 -31980 -51645 -26197
6542 -26197 -22835 -2383 9014 5337 11182 21264 6286 -1309 -2071 3824 4437 -25928 -8261 -120
6528 -120 9745 -6053 11489 13138 3181 14 19940 9101 20611 36761 4341 -19174 -22377
6515 -22377 -31551 -3085 8251 5523 14628 1851 -14354 3208 19477 -2827 -20022 -25359 -2773
6502 -2773 -6049 -12257 -21422 -32248 -27465 -41310 -54753 -46794 -49126 -37888 -2998 13099 -9045
6489 -9045 -24040 -29565 -21225 -352 -9299 -6 11168 9014 15346 3920 6722 -12367 -7261 -12043
6475 -12043 28235 15714 4700 -20463 -14526 -38337 -43736 -17747 -23575 -33693 -11731 -11966 -33972
6462 -33972 8829 -22555 -33869 8981 20958 16807 3582 -19542 2690 17727 16462 -5202
6450 -5202 -33986 -11110 -4236 18535 -27118 -36216 -17393 -10456 7619 -21806 -13134 -18899 -25469
6437 -25469 -8211 -7221 -17445 -33155 -9638 -6265 -45717 -35130 -15208 -32511 -34261 -23253 -26443
6424 -26443 -28479 -19955 6521 -39826 -62072 -40436 -25444 790 -2109 -8981 -28109 -41650 -43513
6411 -43513 -29954 -11090 -18142 -18380 -16972 -4532 -42794 -65475 -13719 -27027 -41403 -39072 -35011
6398 -35011 -12891 -26916 -31712 -45843 -61237 -48701 -46601 -56595 -40483 -58965 -51872 -42688 -36483
6385 -36483 -36356 -48955 -20951 9280 -40354 -48848 -26061 -12619 -37061 -57652 -52975 -35678 -35595
6372 -35595 -22278 -23494 -29532 -25681 -23722 -42903 -51406 -54194 -21222 -28508 -46587 -47558 -36983 -53364
6358 -53364 -26788 -24331 -17352 -28602 -41866 -38118 -28725 -4482 -36629 -33263 -13929 -17007 -53385
6345 -53385 -34874 -42944 -25745 -17254 3391 42082 27029 1486 1420 -47842 -28361 -9661 -44849
6332 -44849 -36267 34629 603 -3733 -9946 -13909 -18612 -14932 -2775 -26790 -37286 -34400 -24312
6319 -24312 -5085 -28803 -31232 -12276 5688 -2531 -8919 -3447 -44860 -13172 -21519 -32237 -23447
6306 -23447 -44428 -76314 -58549 -24596 -9059 -8103 -33051 -9325 -35295 -21179 -8070 -24933
6294 -24933 -3155 -346 -1126 -31610 -22126 -9961 14884 -4356 416 4978 -16766 2943 24372
6281 24372 -20757 -53767 -24927 -33906 -22849 -14969 14254 31062 3403 -5338 18870 37340
6269 37340 17670 43314 36968 41212 42314 11320 30071 -4753 664 49680 71915 49429 11122
6256 11122 19253 4118 -16785 4721 14645 27912 29662 9512 21761 24294 32759 68520 67109
6243 67109 53841 63756 87149 56898 62711 81352 94376 132324 125288 147806 185053 209625
6231 209625 216045 221934 225138 250814 284634 293470 331364 332560 362791 399652 413761 463818 491372
6218 491372 515079 538731 571256 566182 575457 641733 657878 708359 756435 799006 843388 894224
6206 894224 949755 983571 987563 997179 1017888 1003130 1000049 1006161 961294 957282 990699 985968 1035157
6193 1035157 1097984 1108820 1124469 1119095 1093502 1093828 1088947 1119110 1134742 1178790 1239826 1286764
6181 1286764 1374479 1444674 1447162 1394897 1329936 1255315 1136284 1041293 943807 905525 870819
6170 870819 789171 735708 687504 675373 696007 665315 653559 635263 610439 581433 591802 589807
6158 589807 637303 647434 634516 667055 683041 695307 709351 678068 667130 613620 539932 497114
6146 497114 454096 410558 354544 297900 286605 305407 298945 314532 307675 232731 236634 202275
6134 202275 220033 236026 223283 244164 223013 195197 161792 215011 226056 217955 215746 237883
6122 237883 242137 252674 227070 264395 312688 311797 318193 365750 415838 429086 417488 431734
6110 431734 401201 368292 355604 374786 331997 316813 359949 369577 349372 320950 343514 409553
6098 409553 388573 364571 394807 433366 490424 549270 600840 627824 647075 666187 721515 803852
6086 803852 821093 816305 804935 746052 715410 696892 692141 673133 627230 605194 597435 606401
6074 606401 590337 586157 557555 557098 534921 545543 567282 553007 588502 613379 652590 668752
6062 668752 658421 634777 618975 603264 562104 518699 467760 446110 426493 354803 339437 363245
6050 363245 389411 395595 393310 393775 404424 400440 400711 388152 344269 316434 286959 297057 292129
6037 292129 286324 293202 271144 275391 313190 315381 306094 276398 254806 258761 229710 254640 249598
6024 249598 225999 212302 169088 165069 206916 227651 225987 228833 227483 225579 211247 190565 199654
6011 199654 199213 196121 183005 201957 212860 205041 198786 210652 199329 202954 256478 309148 365827
5998 365827 375700 357975 350592 305355 267812 254577 250151 205440 215416 251981 232668 240191 250854
5985 250854 226440 249242 251011 265549 282634 284837 283956 300527 336708 370191 413397 483992
5973 483992 557456 625725 716584 777772 745646 691389 615342 544190 498485 454510 377581 323563
5961 323563 339011 328633 339633 344548 339980 318842 372698 396831 387902 406937 428353 481818
5949 481818 528985 542246 588592 648658 735235 839724 955273 981182 931813 850929 749432
5938 749432 615195 544175 519571 453170 438358 391571 384104 362709 343447 350280 317847 328871
5926 328871 324922 328104 355727 364149 387419 390530 386351 461992 538343 603284 656783 738189 787804
5913 787804 703729 604547 542902 463696 410277 319575 286509 284282 293632 270145 235541 230336
5901 230336 206001 210306 203825 211480 215139 204766 189608 183220 188831 204534 203011 219546 268527
5888 268527 296790 321780 346084 340619 293197 222952 205993 182118 164326 158619 132322 83208
5876 83208 72618 77031 70425 107834 115278 108554 62879 53731 86813 71393 73215 52264 80139
5863 80139 114745 107415 106695 103568 80055 85291 88221 50576 69292 57237 56416 52562 38183 34040
5849 34040 17296 10387 -28734 -37347 -10841 46855 35694 11043 29482 3548 -39236 7506
5837 7506 2800 -8697 -25433 -14793 22794 29308 40329 23080 37991 6227 -18946 10877
5825 10877 20379 27056 41794 29127 9581 1590 -41489 -28084 -5317 47844 40595 7419 -9260
5812 -9260 -17512 1024 -30800 -18299 -23333 -17210 -27540 -26902 -32558 -55418 -57650 -28978 -6512
5799 -6512 -11744 -24185 6435 1245 -8476 -6376 14289 -8992 -14784 -5544 -12303 -48838 -51983 -45857
5785 -45857 -23345 -5407 -13164 29389 -1885 -33212 -10120 21950 11190 20743 15055 2754
5773 2754 -20809 -27789 1704 9848 -1686 -40269 -30852 -13553 2313 680 -19229 -35863 -32284
5760 -32284 -32524 -13910 25615 28501 14623 8828 2391 -16274 -35179 -55705 -43024 11703 -16066
5747 -16066 -42123 -12364 -26584 8132 19284 -2281 -618 24748 16871 -22544 -7086 -23343
5735 -23343 -52006 -32430 -4168 -653 -1794 -23372 -4740 3760 21249 4343 3789 -1628 -19058
5722 -19058 1914 -21020 -14947 -19722 -23990 24041 44066 17979 -10385 -47306 5666 -22064
5710 -22064 -15375 -27970 -8062 -7574 -29650 -26292 -650 2828 -10744 336 18729 36563 61648
5697 61648 31344 29403 20564 37391 50115 44219 54636 62266 46779 51637 24638 21833 40169
5684 40169 50183 50458 27163 3528 -9393 35444 22175 32672 6556 9288 26904 33222 42282
5671 42282 54633 -2112 20162 67531 113776 126912 139239 137093 141803 161337 216201 264051
5659 264051 241246 217552 212099 175404 123314 116044 137606 123013 115748 116886 88100 105886
5647 105886 112976 95094 82978 88216 68060 45872 67063 95589 62233 69826 97602 114040
5635 114040 133979 127746 166704 160871 198571 252037 287980 296724 278485 270909 236056 185565
5623 185565 145818 117638 140637 158643 96341 101355 132368 73090 107215 123110 98071 112142
5611 112142 158801 161452 156065 138974 127503 121941 161682 172520 176023 191067 187704 229014 239661
5598 239661 271568 317181 306061 295753 295401 282405 261325 229362 227608 248158 279455 283193
5586 283193 264850 282307 297908 323523 310341 294486 306512 308043 332332 335097 372677 346690
5574 346690 369479 403153 451503 444221 462255 462008 450264 431383 411362 397584 400214 362894
5562 362894 354983 373312 377103 378409 372554 383917 395680 386438 385381 376595 336222 350611 366501
5549 366501 360434 370718 412788 389435 325188 324674 338099 335121 337032 311522 281003 243111 256432
5536 256432 256431 226371 169583 163933 180585 211943 216517 213154 220167 251246 272508 257274 247706
5523 247706 240442 270813 273912 277693 297472 292606 248992 216204 163522 159254 172219 165360 178317
5510 178317 172810 141884 133424 110283 106141 151783 149967 125658 144000 153375 150774 159225 178284
5497 178284 213666 183063 193755 214254 227318 211914 188010 196304 168848 131951 110390 108302
5485 108302 121917 95865 63986 97329 82008 98703 92366 99752 109506 102720 105912 118153 117637
5472 117637 100765 99275 115644 134226 154899 169654 194205 184469 157595 168872 179486 170780
5460 170780 187541 172571 187957 205437 205908 196818 181995 174823 167264 158473 139872 131128 123236
5447 123236 146733 183750 197682 166930 181440 194832 199557 214209 229013 239969 245460 216435
5435 216435 266212 261867 307500 340974 362432 410781 454458 431263 404994 379367 339433 329887
5423 329887 333097 359410 368394 335960 327037 338762 344086 345366 368889 375163 398178 418186 408744
5410 408744 363853 311951 308749 343073 371917 386017 392492 364955 380300 393207 366223 370876
5398 370876 367289 387847 380659 386592 354089 364162 348833 305833 303060 292715 264908 264963 254795
5385 254795 237732 240699 186131 189987 154618 127068 123073 156967 135584 103655 129795 132484
5373 132484 101949 116704 88591 100247 124415 146638 165202 150869 178924 157133 152478 185568
5361 185568 123082 140381 125702 82513 69313 100197 68279 27372 40358 47020 28116 36441
5349 36441 18280 3553 29967 60454 48546 61000 61076 49509 47066 6304 4004 -3215 2890
5336 2890 29975 30727 31101 30164 12224 2007 -17306 -17272 -6773 -12217 -15696 -26568 -32016 -3847
5322 -3847 26371 22580 18807 1895 -13580 -23153 -27820 -20014 -11472 -49872 -74824 -41258 -5162
5309 -5162 13707 -4193 -9852 -39116 -27967 -15117 -8940 -4119 18821 19387 14843 -6885 -9992
5296 -9992 10605 -10035 -23629 -36703 -39335 -535 -8799 12288 -18030 -34628 -40438 -34731 -12252
5283 -12252 -10910 -6138 -6613 -16790 -21674 25349 16121 -4714 19513 8635 -35241 -44710 -28783
5270 -28783 -12505 -2094 -36147 -15217 8289 4199 26547 19814 -17333 -26503 -9175 -33120
5258 -33120 -30571 -22959 -10598 -9810 -23366 -16652 -21304 -38293 -6793 14806 -21220 -32227 -33558
5245 -33558 -23200 3204 -51466 -79425 -50165 -35440 -41854 -41802 -1612 -22812 -41246 -29208 -13031
5232 -13031 10421 24507 9217 -13071 -13513 -38286 -1259 -11197 -26383 6043 11225 5168 -8564
5219 -8564 -30189 -24451 -28256 -46941 -30196 4956 -26596 -15090 -4860 -29616 23889 7794
5207 7794 8423 14359 5118 -13919 -13122 -441 -3789 -10074 -44953 -37146 -40918 -36423 4586 20344
5193 20344 13057 1022 -5610 -16780 516 -14250 -28155 -39768 -30438 -15778 -19518 10229 10129
5180 10129 -9261 -33039 -23420 -15160 -41006 -36888 10955 -14175 -32815 -19052 -21021 -10109 -19807
5167 -19807 5088 -15804 -8575 -14438 -10599 12318 39315 37625 33739 13120 10579 6653 4265
5154 4265 -6215 -53751 -33185 -34371 -23340 -23234 -8812 7279 9323 7440 42329 45595 -554
5141 -554 14600 -13918 -31996 -27995 -9955 19252 30805 28582 11640 24297 27625 61030 38089
5128 38089 10329 22426 30346 37545 78930 84079 61212 45438 35799 53677 64526 44693 55807
5115 55807 62411 77233 59477 61942 80000 78238 100146 134091 166346 165300 176756 226086 294191
5102 294191 305927 335340 348998 299623 259749 234146 224796 216135 217619 203278 186472 206569
5090 206569 193647 179851 212691 201714 236059 225076 212759 244746 259732 274128 314745 321853
5078 321853 339883 358235 381305 408099 440651 503332 540028 622879 642797 695613 785214 875392
5066 875392 966031 1067176 1226012 1393739 1583141 1815358 2105581 2460973 2806798 3029735
5056 3029735 3118910 3146515 3246698 3514210 3666268 3670778 3628905 3661252 3870041 4144072 4294853
5045 4294853 4091149 3646911 3174251 2780367 2571186 2414168 2325379 2285661 2190501 2033474
5035 2033474 1831897 1624444 1427706 1241317 1127519 1026596 973112 921820 841033 795240
5025 795240 738363 711673 676732 613072 582016 559606 547651 515332 480301 481316 462701 444752
5013 444752 410574 368057 380513 392614 367655 369471 342909 306143 274608 230052 239292 258642
5001 258642 261118 243503 221311 226333 201662 200993 211293 196590 212663 187117 198331 203364 196571
4988 196571 210531 161705 115149 134294 163184 193961 174106 149811 146557 103875 113164 126708
4976 126708 119595 111847 111879 98682 113402 117778 94486 92834 81349 99930 123221 98410 73054
4963 73054 74965 108958 121441 114587 136123 167000 157055 150373 135752 164224 130486 143476 172231
4950 172231 168094 183350 210240 185913 180224 175082 174399 184554 201081 207879 200299 212014 205958
4937 205958 181538 164822 223995 229051 196768 161356 162627 186847 192052 184251 175042 143928 155594
4924 155594 136516 130217 154811 149230 166837 171138 144963 165264 151773 136997 126828 123267
4912 123267 135013 151175 121041 104429 105796 149393 143594 107188 117721 114745 117864 116960 129295
4899 129295 135892 102123 103978 133567 122049 113347 86625 91091 132845 159235 157063 161880 134261
4886 134261 119590 114443 143387 170582 202531 188541 159689 148760 157062 183853 181205 161952
4874 161952 183364 200341 161633 177752 199914 179107 161649 196624 173090 148524 139793 123556
4862 123556 131981 165642 177096 199294 202889 187001 224940 280019 289356 268842 270809 293803
4850 293803 364454 397879 419637 395762 376321 395078 367444 342640 378653 330587 280438 259266
4838 259266 297640 333027 308669 274293 310711 367851 351631 332788 372487 408387 405734 400274
4826 400274 411113 460560 463762 456835 450064 444644 480906 496566 485026 502626 536460 544552 552220
4813 552220 571873 608471 607802 629413 655732 660874 696545 704224 697920 719670 792779 812304 836985
4800 836985 846806 905856 920440 958232 1014309 1053033 1133237 1197353 1233284 1258653 1319142 1428827
4788 1428827 1522521 1612215 1714632 1830384 1935949 2041735 2137046 2269560 2444539 2589677
4778 2589677 2722420 2855576 3044463 3246126 3479136 3703395 3932331 4180388 4449719 4750574
4768 4750574 5153395 5613392 6103708 6727512 7417446 8035412 8485686 8730995 8895025 9043114
4758 9043114 9205634 9362410 9452265 9554224 9624925 9767296 10038137 10337312 10599284 10886810
4748 10886810 11236525 11637210 12102207 12568166 12983143 13416046 13809347 14177666 14597412
4739 14597412 15055038 15611788 16273527 16942117 17678867 18489091 19222331 19692097 19659392 19221281
4729 19221281 18561920 17903900 17310881 16781207 16273232 15818089 15494364 15195455 14863211
4720 14863211 14479660 13998839 13495106 13019665 12633410 12273033 12016828 11846759 11617330
4711 11617330 11408248 11229387 11162157 11122993 11108057 11103237 10996442 10861879 10740787 10625380
4701 10625380 10288281 9684294 8908794 8158917 7496543 6930786 6495489 6137913 5843895
4692 5843895 5580981 5373643 5120662 4867909 4663716 4479301 4277492 4111169 3957278 3789165
4682 3789165 3599568 3424380 3288094 3177313 3037974 2915313 2812581 2673636 2565249 2475766
4672 2475766 2382397 2308178 2220504 2148977 2102237 1992063 1931928 1868235 1829274 1779476 1754430
4661 1754430 1743617 1699988 1636807 1604691 1589567 1588341 1575870 1532708 1490568 1453881 1451466 1415585
4649 1415585 1385334 1385094 1349978 1321549 1310808 1296988 1296903 1280697 1245215 1174257 1111622 1075596
4637 1075596 1057234 980717 978697 967616 935975 934735 897244 876030 878927 851070 827142 819872
4625 819872 824251 795354 794758 850452 801675 797198 787275 723848 714444 677894 671125 669686 684541
4612 684541 663477 657890 646722 635550 583606 556556 537342 524758 515546 523724 530807 500518
4600 500518 499555 439508 408599 370226 383535 367046 353429 399645 385157 344391 365810 364335
4588 364335 375352 383836 368084 341151 313121 328730 306477 289622 303564 300509 313357 304122
4576 304122 294443 257765 280425 294695 294129 294950 301054 287002 284902 281900 251825 246343 250020 246311
4562 246311 252115 230968 249968 266969 254318 245919 229295 231721 223610 262661 258157 245003 248824
4549 248824 293879 294788 282630 280143 286382 277356 270445 282160 303111 311732 253602 224915 228993
4536 228993 238303 248543 207732 257827 258382 260009 260626 253837 256830 263529 294277 282001 226914
4523 226914 222127 226332 215172 253280 254943 235163 245431 249651 224504 228723 228392 228813 195246
4510 195246 219333 255627 249520 218729 239130 226443 243338 192890 170938 198045 183794 184033
4498 184033 171246 187593 194654 181306 139023 137554 148101 175431 178502 178640 188171 178238 187306
4485 187306 156249 157254 148139 158577 153876 160895 161165 159598 177986 152644 138014 161190 193823
4472 193823 197203 149878 151218 157078 156193 191682 197349 172743 131744 153436 139020 149643 160699
4459 160699 144509 110165 150524 188164 151382 157683 194655 196012 176521 161286 132314 126893
4447 126893 171841 197888 150425 145501 190952 170659 192560 174357 160163 139480 138891 149179
4435 149179 178279 149830 122715 149493 184707 214999 213552 218852 240446 237942 244745 229424
4423 229424 224538 237047 228505 173364 188452 218103 217513 212871 202481 228836 215471 209288 202563
4410 202563 202255 226033 250784 210575 201082 218594 239191 230210 249157 220929 236540 241938 236236
4397 236236 241216 234838 246206 223405 206867 236781 203704 199443 205515 204682 216567 188299 189304
4384 189304 200925 181239 212340 206576 172911 189458 201630 163227 170265 198567 208564 209754
4372 209754 235526 231389 211519 217851 229065 239773 240377 245484 252620 258039 272579 300355 321922
4359 321922 316137 311299 266658 280300 293970 281955 282175 270405 274427 288894 308092 294228 284904
4346 284904 296790 297749 287488 271833 274441 327958 342983 309699 291342 282953 265802 261575 285581
4333 285581 289509 262747 282296 308061 315068 322025 355212 319989 355264 378499 391730 341755
4321 341755 356634 425927 444078 434281 472037 461447 443812 447274 431372 468941 496126 511975
4309 511975 507891 510711 530863 567128 569194 608397 661330 657814 653580 694388 718433 730422 783208
4296 783208 817722 815047 853842 908322 949868 973517 1010474 1082466 1169595 1241587 1270145 1385886
4284 1385886 1482135 1582769 1663094 1744670 1875190 1949100 2050206 2217645 2412562 2623971
4274 2623971 2821464 3010634 3219313 3436997 3629214 3804073 3943805 4120109 4352622 4567735
4264 4567735 4784305 5066675 5448224 5871020 6329238 6825351 7344943 7846388 8317700 8724478
4254 8724478 9037210 9258838 9437704 9622957 9800835 10069357 10417457 10849999 11438404 12083161
4244 12083161 12793201 13520594 14243328 14892379 15361061 15615061 15682139 15580091 15358062 15133306
4234 15133306 15044011 15047076 15202203 15487821 15894644 16469683 17103986 17741916 18263174 18474725
4224 18474725 18377149 18017117 17412260 16608833 15832765 15183132 14650712 14337192 14206968 14215187
4214 14215187 14393890 14624863 14865647 15004998 14910263 14499485 13840447 12953838 11999720 11134681
4204 11134681 10383373 9772837 9305294 8969928 8740930 8638701 8588215 8565715 8393180 8105770
4194 8105770 7711905 7197676 6683770 6150219 5674032 5263892 4911458 4677999 4459386 4259150
4184 4259150 4103617 3998823 3875450 3707425 3581518 3406288 3184424 3014389 2848728 2708465
4174 2708465 2560433 2451572 2342241 2205207 2155610 2097556 2005692 1894374 1860826 1836610
4164 1836610 1778624 1737944 1674527 1582424 1521453 1498268 1471766 1427896 1359082 1305923 1275743
4153 1275743 1258974 1225366 1165595 1132659 1142699 1131987 1095539 1094258 1091939 1088923 1035830 1016582
4141 1016582 991199 964725 984693 952742 940677 936137 918642 890665 899831 899411 860926 843067
4129 843067 839603 824973 805658 809822 821480 820141 804658 757947 783134 800908 783309 735220
4117 735220 764506 745060 724573 728890 741021 742750 777905 756951 733105 730420 725985 739942
4105 739942 747779 785870 769645 749292 734263 714487 715266 735202 723005 728542 757928 782532
4093 782532 787557 787608 831436 816799 793537 824985 848584 899236 905156 917788 909506 939911 969316
4080 969316 966649 993840 1027258 1075841 1107947 1122962 1163582 1209101 1194831 1206813 1244645 1230272
4068 1230272 1254847 1261085 1234736 1232391 1265589 1348614 1395301 1446282 1492953 1512728 1543179 1503150
4056 1503150 1468872 1447064 1419892 1393593 1391376 1361475 1403986 1450907 1474793 1491861 1515786 1512868
4044 1512868 1498358 1474613 1449205 1422727 1364041 1328970 1317525 1294269 1291730 1283816 1252896 1257626
4032 1257626 1273717 1301839 1280635 1220244 1215993 1238101 1248919 1246340 1224689 1228414 1239265 1266165
4020 1266165 1287325 1258282 1250972 1253171 1244002 1285117 1255522 1243266 1244461 1261025 1288005 1287085 1259968
4007 1259968 1279342 1332513 1328583 1328446 1362315 1360431 1366813 1393523 1404579 1419808 1460508 1499482
3995 1499482 1556797 1583932 1598319 1625585 1586394 1600970 1652730 1660157 1675102 1688198 1721484 1765609
3983 1765609 1776031 1757708 1711047 1736853 1756125 1763894 1794553 1850148 1832812 1845496 1827608 1814453
3971 1814453 1833902 1889397 1937316 1961828 1965253 1928441 1938934 1940364 1993249 2029464 2040688 2042878
3959 2042878 2065818 2095770 2070890 2050665 2065305 2053422 2083131 2056673 2070197 2100727 2142335
3948 2142335 2173584 2205153 2252863 2261414 2310792 2408349 2476014 2574981 2611067 2654430 2671955 2689815
3936 2689815 2679062 2671993 2686011 2707164 2717891 2748703 2813117 2861981 2987108 3064863 3153196
3925 3153196 3263704 3399635 3556447 3749879 3963047 4184823 4448412 4722543 4969135 5239489
3915 5239489 5514549 5847463 6181338 6638788 7134675 7740346 8441868 9150825 9799508 10280812
3905 10280812 10500241 10525953 10535755 10595963 10702708 10810439 10987468 11273652 11677917 12222210
3895 12222210 12799719 13402608 13948280 14381154 14621504 14789311 14911485 14959400 15031878 15174797
3885 15174797 15396520 15713850 16170146 16789077 17596441 18560530 19596093 20643679 21621032
3876 21621032 22200301 22080005 21225623 19996757 18706214 17629746 16759968 16129024 15685204
3867 15685204 15378081 15141430 15011630 14950848 14929074 14955756 14915900 14757055 14509339 14024723
3857 14024723 13392508 12752293 12156906 11676595 11318328 11083697 10974470 10893335 10810267 10753250
3847 10753250 10734803 10633845 10327173 9826822 9186897 8536095 7906565 7374756 6983225 6687389
3837 6687389 6402308 6166898 5949770 5712254 5500030 5272731 5083518 4896872 4758187 4603449
3827 4603449 4486751 4392288 4276991 4209487 4110868 4070096 4014405 3968865 3922697 3889768 3879170
3816 3879170 3922901 3891509 3844105 3845740 3807546 3730434 3637763 3557562 3511974 3450350 3399440 3351336
3804 3351336 3308409 3276087 3233479 3191291 3192903 3177382 3168350 3191782 3203013 3174536 3146107 3163288
3792 3163288 3182446 3187514 3159678 3172870 3183646 3223670 3199087 3177917 3155970 3130756 3144011 3130436
3780 3130436 3154085 3167186 3156991 3172036 3228490 3240836 3239546 3257864 3317711 3367492 3406728 3451699
3768 3451699 3508025 3571746 3638562 3687687 3738884 3829504 3905704 3991125 4074514 4180893 4296674
3757 4296674 4444339 4578071 4740082 4918459 5079755 5254363 5460432 5695863 5938668 6250832
3747 6250832 6546312 6876814 7228617 7609625 8075494 8618651 9218138 9893724 10714449 11602248
3737 11602248 12481627 13378580 14255256 15104585 15803548 16328577 16667302 16811927 16826087 16747742
3727 16747742 16580308 16379733 16205474 16078016 16094967 16160875 16329746 16528622 16697675 16748303
3717 16748303 16723891 16548936 16193856 15667070 15025851 14291782 13522003 12723992 11939021 11244912
3707 11244912 10644807 10119228 9616490 9204970 8830557 8533550 8262904 8049672 7811556
3698 7811556 7662998 7549305 7373690 7248940 7160240 7121618 7035955 6975173 6901468 6849117 6813029
3687 6813029 6808500 6740069 6729727 6718589 6676929 6657187 6658226 6715960 6750093 6735785 6700932 6702613
3675 6702613 6719250 6724635 6736970 6744858 6740372 6790905 6825600 6830146 6829339 6867396 6918538 6976426 7039830
3662 7039830 7110132 7167983 7203451 7238747 7309520 7371654 7425702 7483195 7587126 7681318 7769701
3651 7769701 7885573 7960490 8044382 8138177 8193860 8284764 8392340 8524833 8624375 8737215 8839071
3640 8839071 8953637 9062762 9190057 9344270 9495158 9666590 9816635 9960346 10170384 10361572
3630 10361572 10537656 10730646 10918287 11055163 11279466 11532772 11812469 12105508 12406632
3621 12406632 12724572 13036619 13426120 13869475 14328709 14850011 15454489 16058047 16743302
3612 16743302 17565533 18441630 19433791 20563215 21875881 23333931 25026059 26993223 29265070
3603 29265070 31768964 34441529 37221629 39912724 42422562 44571989 46339074 47620734
3595 47620734 48432687 48833995 48843347 48597561 48279006 47974918 47947784 48139020 48494608 48991284
3585 48991284 49602658 49981268 50049522 49733162 49025332 47877521 46291124 44277718 41936656
3576 41936656 39462690 36972336 34559774 32327550 30276099 28488103 27029166 25713406
3568 25713406 24582813 23664569 22839717 22100837 21441121 20859155 20373617 19967537 19640280
3559 19640280 19331813 19076968 18888722 18713630 18616298 18655295 18710335 18755353 18900225 19124348
3549 19124348 19354512 19692825 20136448 20606787 21177769 21857664 22663001 23551177 24509895
3540 24509895 25664995 26919960 28207580 29520275 30793147 32042068 33202699 34319865
3532 34319865 35395904 36361616 37230828 37968608 38569134 38980559 39185724 39213767 39106360
3523 39106360 38832922 38454080 37997078 37458131 36819697 36149526 35395756 34599305 33745698
3514 33745698 32883918 31994442 31091796 30180484 29313910 28531581 27809715 27194038 26736836
3505 26736836 26437524 26317466 26327358 26526086 26927031 27253983 27370176 27469541 27752918 28273858
3495 28273858 29056359 30014602 31069535 32267581 33685810 35335867 37223664 39257602
3487 39257602 41411270 43606813 45828076 47982039 50104936 52152540 54161255 56177190
3479 56177190 58302843 60651109 63342608 66551720 70304692 74657938 79521059 84745219
3471 84745219 90082251 95262950 100117246 104418526 107970222 110449373 111771615 111769489 110636436
3462 110636436 108727510 106323045 103790922 101492736 99664433 98359545 97556158 97067824
3454 97067824 96736714 96305128 95751907 94776769 93226026 90934645 87909947 84200912 79899306
3445 79899306 75229853 70460655 65795903 61406026 57328027 53613530 50350721 47490500
3437 47490500 45085604 43118803 41504084 40231803 39256592 38545915 38077926 37851577 37881763
3428 37881763 38192406 38749533 39582444 40738056 42281135 44206387 46573679 49395127 52573392
3419 52573392 56063155 59610339 63076294 66354038 69329129 72085530 74699317 77196684
3411 77196684 79512224 81522940 83000890 84206168 85114497 85092399 83821247 81682622 79430185
3402 79430185 77326990 75633583 74275679 73122192 72119528 71180649 70207610 69113999
3394 69113999 67809495 66205219 64252461 61989399 59452388 56744960 53875849 50963610
3386 50963610 48147643 45530821 43254036 41310842 39667775 38340301 37609308 37070776
3378 37070776 35932747 33922451 31483541 29194498 27208071 25642234 24360854 23279214
3370 23279214 22383420 21702028 21126620 20623116 20222129 19901811 19674955 19531814 19515143 19610741
3360 19610741 19710436 19818105 19799787 19603187 19352010 19133828 18915222 18715388 18624260 18605611
3350 18605611 18659654 18813887 18981135 19169995 19349522 19575510 19808972 19959022 20019235 19889703
3340 19889703 19636558 19343792 19017568 18690959 18415266 18222584 18063127 18012527 18016431 17969066
3330 17969066 17872861 17771331 17703915 17684155 17763727 17935827 18239407 18731140 19374450 20140151
3320 20140151 21049059 22024482 23133614 24295873 25523945 26812211 28207043 29693317
3312 29693317 31182752 32720833 34264534 35857018 37487457 39278437 41237571 43309166
3304 43309166 45415667 47465403 49358282 51009847 52550194 54054749 55518315 56936053
3296 56936053 58052324 58651817 58700709 58209516 57298288 56031763 54405418 52403852 50090692
3287 50090692 47465071 44567759 41537991 38530483 35548320 32745886 30096084 27650185
3279 27650185 25429444 23475471 21738448 20211833 18858132 17730163 16709479 15778618
3271 15778618 14997900 14244621 13595163 13026033 12463510 11934892 11471193 11072602 10682985
3262 10682985 10349366 10000045 9674687 9421118 9187269 8964423 8794909 8643874 8454610
3253 8454610 8310623 8232048 8128227 8013041 7901524 7811763 7712377 7610934 7522192 7438500
3243 7438500 7382247 7299753 7258727 7220104 7182775 7122667 7075038 7000555 6906951 6824336 6776417
3232 6776417 6691143 6556245 6416799 6251476 6079582 5918821 5768598 5607852 5434613 5279492
3222 5279492 5149175 5037218 4896387 4789355 4700986 4631589 4561034 4500266 4421089 4379233 4319215
3211 4319215 4254454 4212465 4144659 4126761 4109076 4046710 4024945 4008857 3972532 3938043 3910732
3200 3910732 3920389 3954854 3945959 3903556 3875356 3869608 3859651 3858669 3868199 3836792 3824519 3817022 3796156
3187 3796156 3785728 3805615 3799619 3810574 3826291 3815266 3816324 3820472 3837314 3831458 3819527 3826459
3175 3826459 3822454 3786567 3806778 3832331 3789854 3767635 3751788 3741318 3738730 3723107 3744138 3748656
3163 3748656 3733711 3749749 3766300 3742156 3742943 3759461 3757063 3796390 3792998 3815097 3844184 3861488
3151 3861488 3871859 3895628 3962543 3965666 4011967 4077493 4155501 4180003 4241411 4270408 4358143 4435115
3139 4435115 4485482 4561359 4625575 4683124 4751435 4824153 4915590 4980970 5051079 5179206 5258517
3128 5258517 5330164 5392548 5472101 5598215 5698965 5788347 5913986 6002080 6100518 6229366 6351500
3117 6351500 6451995 6596229 6731173 6907727 7068162 7301028 7572088 7883355 8169980 8515050
3107 8515050 8900406 9281926 9728908 10166260 10616765 11176644 11777480 12414483 13137238 13876554
3097 13876554 14618981 15434131 16317113 17284592 18332097 19537483 20894137 22390097 24061034
3088 24061034 25948016 28050495 30423626 33054919 36008483 39353171 43127190 47398572
3080 47398572 52240886 57755241 64006719 71032455 79080750 88437521 99438705 112238870
3072 112238870 126841378 143543508 162673849 183419161 203437507 220935711 237066310
3065 237066310 255548681 277357294 294847657 295941368 276023906 241847771 204676523
3058 204676523 172160310 146662551 127295848 112524971 101104047 91999722 84465837
3051 84465837 77947750 72051443 66699581 61850985 57486698 53595800 50123271 46915295
3043 46915295 43978174 41225252 38706611 36435520 34420375 32666895 31054674 29565908
3035 29565908 28200780 26878166 25622862 24485279 23402335 22401311 21428653 20486030
3027 20486030 19627471 18793239 18040665 17360075 16731945 16094042 15521091 15020455 14518134
3018 14518134 14053439 13569676 13139780 12732812 12347347 11980024 11626266 11294838 10933277
3009 10933277 10559549 10203866 9876305 9587319 9284065 9013534 8725854 8504138 8275640
3000 8275640 8056728 7859089 7638239 7434405 7187863 6958449 6796661 6630885 6515114 6391458
2990 6391458 6242439 6094683 5945966 5818770 5704266 5601794 5499572 5398263 5299950 5245899
2980 5245899 5135970 5041020 4957584 4898073 4827929 4759719 4676600 4562121 4519827 4462284 4437849
2969 4437849 4386998 4327948 4286025 4238575 4214232 4163014 4113654 4047448 3963696 3882076 3839979
2958 3839979 3800128 3739575 3665107 3637054 3581322 3506793 3475944 3441515 3431769 3369869 3306938 3250672
2946 3250672 3232025 3189112 3134107 3105895 3036367 3001738 2916164 2821124 2779859 2704052 2659154
2935 2659154 2601935 2554239 2519263 2494359 2493793 2461284 2452225 2382992 2340018 2332923 2294947 2246990
2923 2246990 2209790 2148626 2117479 2070778 2083073 2086630 2070089 2063217 1987760 1928588 1878991 1867904
2911 1867904 1830354 1803680 1786026 1808744 1759370 1707571 1685762 1695634 1707179 1705380 1673259 1643422
2899 1643422 1625575 1600735 1631364 1615780 1602922 1576258 1504534 1473734 1444276 1413776 1398017
2888 1398017 1378825 1390560 1367264 1384394 1388415 1357516 1355016 1370996 1379709 1410888 1380265 1355099
2876 1355099 1325146 1331628 1376394 1330817 1336642 1333367 1322966 1368091 1349065 1311857 1276451 1243821
2864 1243821 1248289 1265744 1273391 1225172 1193551 1179215 1208831 1202123 1167946 1183472 1156744 1139115
2852 1139115 1126815 1135236 1109533 1096385 1084798 1055921 1053762 1032886 1013887 1019654 1016426 1008231
2840 1008231 978480 957247 928951 918062 898093 885003 894567 887148 933018 927019 911282 882366
2828 882366 887348 913623 942326 941964 930353 906757 892899 910586 915422 898108 899471 896897 914010
2815 914010 919457 948397 929908 874229 836839 835744 879323 921741 931824 924249 893345 892543 906784
2802 906784 932769 967300 972084 948603 944453 1020310 1067692 1104949 1112078 1150939 1241920 1283349
2790 1283349 1318445 1371879 1450292 1513246 1614323 1752758 1884094 1948727 1992768 2110705 2227949
2779 2227949 2254530 2165759 1974759 1763856 1586268 1423262 1308879 1211327 1172700 1139520
2769 1139520 1071132 1032223 995062 951570 920468 885617 874714 823725 794666 801669 802858 760837
2757 760837 749934 762705 713807 678313 730273 701083 713432 671329 653150 620540 617514 610462
2745 610462 622433 656103 594505 579297 584439 594242 587251 583515 583331 547794 512417 512669 536204
2732 536204 554252 531398 533336 509191 545662 573470 560568 520747 526994 508617 480072 505830
2720 505830 513089 527141 527239 521008 502669 480018 504788 521668 478759 446687 457308 451826 440692
2707 440692 411671 407872 408063 426393 391213 392378 399994 404096 425890 394943 384901 385253 405467
2694 405467 407969 377531 369940 347548 339444 348348 339514 341692 326946 351631 347924 339905 367401
2681 367401 383344 415132 361037 372171 421088 394803 385810 386637 386678 359803 386002 407177 365097
2668 365097 350883 368530 342095 331586 332351 352648 351473 339348 308934 312762 295364 313862
2656 313862 310868 309859 307947 322570 316456 289166 276243 268417 319277 301570 313687 304064 299241
2643 299241 280936 299105 329225 306518 270959 278526 330523 324447 292572 306090 282256 260234
2631 260234 251306 232014 242401 273685 257702 254475 282605 292620 266125 242157 276671 296859
2619 296859 266486 248216 259182 261258 235691 249099 265681 269158 258942 243789 245543 223460
2607 223460 237561 281527 300685 284040 275164 275344 227116 227121 228986 206147 219681 213153 189123
2594 189123 179749 191324 219094 230798 232213 254319 267811 250410 233411 237055 240106 273363
2582 273363 269308 279598 267189 273626 264521 227499 256092 269693 307112 293178 264449 302045
2570 302045 332600 346649 315204 301450 275298 277751 277883 263437 243584 214145 218164 202536
2558 202536 211691 228466 228128 231314 200216 228353 235317 236416 207421 184338 186475 187976 242151
2545 242151 249343 246567 247237 225819 226228 242360 214949 205037 183767 233507 239176 221080 224753
2532 224753 203900 196977 206453 224896 234082 234346 210493 194502 181812 184157 194825 187668 240998
2519 240998 226426 208969 185305 170228 169053 177618 175021 165955 200344 191589 189397 192325 164525
2506 164525 157584 160907 183165 208853 165402 144151 200666 206713 170255 162733 154721 168497 178158
2493 178158 176476 186214 189479 203144 205007 196200 180592 195840 236837 212141 190278 174019 146271
2480 146271 182491 224319 189676 190224 190354 222241 219557 200961 189206 174908 192194 222410 248691
2467 248691 252208 216541 237429 220578 198136 163530 178014 204332 197045 188781 194860 208113
2455 208113 181225 173059 191201 159522 145495 166235 160758 112789 174802 224003 190934 191073
2443 191073 171575 165027 156777 136979 140315 148758 151231 155516 136532 145770 169529 155862 195493
2430 195493 205284 174466 167728 152908 166714 177749 171370 182829 189587 166684 165739 154570 143990
2417 143990 139198 185394 186639 186728 187328 186513 168447 155349 144466 164307 196712 195611 203828 213927
2403 213927 177725 152528 177183 185389 194537 206604 205018 195690 189825 221505 208691 215138 225417
2390 225417 232488 211763 223067 265190 265769 258842 262418 246207 230856 227163 277509 289575 283936
2377 283936 289908 289939 261425 261945 268597 274097 241557 251721 262195 234970 270604 279969 299231
2364 299231 325555 262838 242708 256888 281887 307828 343005 353493 338518 317655 326932 323159
2352 323159 331020 360847 344678 376204 430717 437158 446570 473377 449453 453425 475127 513915
2340 513915 583002 635009 688730 725887 716077 754034 798622 861080 924477 960313 1058547 1139868
2328 1139868 1225485 1343670 1474122 1581171 1708189 1879425 2059720 2298342 2563058 2854340
2318 2854340 3114760 3352875 3577946 3904675 4290036 4767682 5282760 5940541 6789484 7959149
2308 7959149 9413182 11139008 13086511 16071463 18835640 19544320 17490062 14332381
2300 14332381 11518574 9344743 7865035 6692176 5857898 5220586 4686439 4281704 4006766
2291 4006766 3799967 3682820 3521279 3343102 3106132 2904143 2649587 2439749 2248196 2116985
2281 2116985 1969988 1885532 1770705 1667637 1580029 1492229 1445048 1357998 1297350 1260194 1190886
2270 1190886 1139516 1086047 1024655 960988 935256 902481 896489 869185 807574 762215 740978 710233
2258 710233 716399 719463 705226 701727 690713 612676 616150 615112 597855 537061 522688 490887 476848
2245 476848 457077 455014 435810 401580 417063 435061 426395 389057 377099 393781 386877 389215
2233 389215 366066 364617 335302 335845 312511 336513 344251 291202 317599 338404 322378 306387
2221 306387 317500 310447 286424 300005 293903 244694 225442 215829 230289 246353 244277 233935
2209 233935 228302 243583 273832 251044 251625 247837 250033 227060 223503 226779 219924 241336 225072
2196 225072 214580 209811 188463 214511 201851 200011 193025 205631 227949 212662 184224 190985
2184 190985 202369 198358 184140 188177 207070 219380 192167 205783 224021 196494 146136 150623
2172 150623 173754 167558 121520 164019 184995 189304 185626 172082 160975 139399 144699 158386
2160 158386 144759 140018 124294 155648 157147 139246 145204 127728 135546 123292 122376 122486 101112
2147 101112 135437 157868 153425 149826 118237 87451 71712 98206 113968 90271 116759 135373
2135 135373 145887 118391 109794 101645 115502 119949 70858 64413 35213 84103 79345 62851 57650
2122 57650 62130 82170 63329 57302 79822 90629 91113 49216 36854 74629 129243 143481 102358
2109 102358 102490 124260 99582 79630 78011 82371 96676 113185 118377 144538 123388 62631 68282
2096 68282 98008 93368 106309 100677 95598 117543 127175 127842 110516 119319 118311 84152 85488 78432
2082 78432 88096 82375 57735 47050 75381 60666 71615 59712 56182 44696 24416 37345
2070 37345 57494 56502 49543 54513 69895 86720 63174 71161 111462 103962 71332 69722 70676 73594
2056 73594 69542 56789 40588 70973 83028 95031 93723 62371 55512 34226 100336 93626 99070
2043 99070 81178 94480 115585 111032 118177 147084 166374 127719 154898 157451 149226 124765 132012
2030 132012 122141 134742 118601 100378 99989 149790 74822 44117 48846 49091 59343 59059 47806
2017 47806 51684 63339 40059 52980 56339 20985 31527 33619 34294 25381 59646 93176 104510
2004 104510 77561 42040 62866 70861 45855 51419 88003 83588 91974 56628 57792 82948 36209
1991 36209 72104 63877 45210 67222 55740 79398 73161 97676 79707 87045 77477 48137 45345
1978 45345 64000 84155 58384 19302 35205 13184 28320 58128 77013 64860 39955 52053
1966 52053 44970 69942 76122 59302 50793 56023 42802 66236 62742 75259 59908 56594 49738
1953 49738 38828 -3850 -15166 34711 52311 52399 49740 23911 20716 67741 55241 42975 9547
1940 9547 34114 16267 -1535 19155 11854 -9509 16484 21823 6992 -723 22796 53988 57707
1927 57707 67711 53314 66438 46111 24629 17166 8935 47312 61811 54252 39928 63957
1915 63957 80100 80178 58145 25294 30925 40189 55147 62977 49221 65747 67777 52186 31841
1902 31841 29582 70372 62464 24969 27444 4654 36876 36555 36185 28001 10147 10266 -15964 -19346
1888 -19346 2623 9663 7843 34514 15860 15831 28970 24031 22472 27581 40620 43705 1653 -9347
1874 -9347 29988 23356 7815 20526 23355 35501 7537 6905 13099 24812 26493 38964 21536
1861 21536 36038 32602 39577 33342 31479 19967 5238 1527 23736 46493 18137 38672 29692
1848 29692 9433 41492 42477 28220 24493 8792 -1714 58413 62166 20321 19042 11967 25398
1835 25398 12419 8417 42091 39784 35823 48515 22747 6265 8230 -8152 50968 52510 21440
1822 21440 33831 -1300 5809 30993 46447 33467 31295 22022 31065 20554 34245 14059 16201
1809 16201 7751 25216 26083 14415 27893 33284 1625 -17211 -7130 1024 14438 10094 11315
1796 11315 31472 41091 14794 6779 23615 33485 16680 15693 9667 8620 -1764 -12931 27179
1783 27179 34848 13924 40886 27605 63622 53464 18112 11921 36565 55441 31179 17190
1771 17190 17227 25040 21131 29075 -7659 -3157 16745 5997 2091 -10683 -42592 -2023 2447 157
1757 157 -287 18822 55782 48343 25708 -5693 -569 -17099 14389 14725 22277 31811 17024 15745
1743 15745 53709 40309 20531 33564 10203 40791 5447 -22098 24040 60688 38488 -4255
1731 -4255 -1199 17759 13133 4626 29567 46158 44519 29250 32827 24090 260 14994 24141
1718 24141 36801 28405 21710 44428 20810 21759 42416 24195 705 -6239 -17308 -3107 5219
1705 5219 -26165 -8916 7987 4355 23260 29995 32855 -123 28486 38033 5893 24264 31574
1692 31574 37036 41816 30875 -8586 -40933 -15234 1813 28371 46621 15085 -5894 5723
1680 5723 -182 -20926 -2805 -8261 -7559 495 -19011 -33067 7891 20779 28245 7898 -16227
1667 -16227 26305 12354 19115 11146 17042 26260 12421 13933 14778 1388 -8241 20995 -1079
1654 -1079 -2514 10340 -8431 -22157 -13626 26959 23283 15360 -8961 -30110 -21672 -4562 -3567
1641 -3567 22575 16274 -36604 -8537 -3620 14452 7230 -8985 -538 21949 17232 -5422 -17366
1628 -17366 -4398 16911 38964 25950 8869 17849 25386 -17979 -9112 -22117 -17106 17255 17521
1615 17521 28584 30568 29916 24873 -6996 3469 44013 10847 -10531 10311 12543 9323 35516
1602 35516 25232 937 -8993 -11093 8195 30372 5511 7965 29499 17326 -26643 -17177 4426
1589 4426 -8441 -38014 -24401 -17866 -14671 -4372 -10970 -7123 952 10467 -809 -38515 -33471
1576 -33471 -37673 -25342 -44189 -20380 -10247 -38632 -28297 -12921 5143 5928 -4352 12371
1564 12371 54083 10456 321 -39127 -35550 20459 26849 10848 3603 9385 -2700 -11291 -9521
1551 -9521 19487 4904 -21127 -25330 -15037 -14606 23189 30203 25485 37747 55621 17324 -2453
1538 -2453 6899 -3828 10387 18395 -686 3773 -15952 -20132 32475 26911 13723 -8278 9889
1525 9889 56646 44658 35593 20183 -4373 2731 -14914 -17892 -43103 -24763 -1325 -7192 -7285
1512 -7285 -16332 -33939 -24944 -35258 -9991 -2516 20178 -16415 -7308 -17990 -26892 -18397 30788
1499 30788 18576 29252 31795 -13120 -3269 -12449 -8469 -23269 -12157 -46765 -24130 33777 46214
1486 46214 27363 -8254 -44995 -41537 -30933 -14418 -21886 -17765 3481 15836 -4503 453 9128
1473 9128 48195 30313 21572 11966 25105 14281 20677 13479 -8030 -2728 16253 -28108 1913
1460 1913 22454 51928 47434 34728 34754 24651 22503 -21286 -12094 9174 22667 -10046 -26726
1447 -26726 -43150 -8938 3054 22541 -2948 2657 -27043 -15476 9988 -4287 -3608 27038
1435 27038 39451 22592 -2137 -5749 15588 11910 -6350 4476 -6370 -23694 -30785 -45014
1423 -45014 -14557 2086 -11246 -17266 -13875 -14938 -34721 26482 26995 26884 11923 -16056 2042
1410 2042 27801 54113 13442 16202 -227 9733 23118 3766 18348 20058 -593 -17124 11203
1397 11203 -11481 -29958 -26295 -1464 14334 -2066 -11097 -23373 3613 14862 8541 -13237
1385 -13237 -24780 -38162 -12442 5859 -8006 3311 -2490 -21129 7946 -3571 36573 35449
1373 35449 13022 18471 24355 13635 28432 25002 20688 -6718 -3465 7675 -8626 -5457 8348
1360 8348 209 -29202 -28977 14521 -210 -38255 -2752 10757 -20711 -20666 32808 3830 -31030
1347 -31030 -23727 -24120 -33315 -6936 10758 33525 27027 -1878 16485 7030 8657 16508 259
1334 259 39060 32551 3754 22932 5303 -29674 5829 -25326 -34253 -2134 35827 31533 8698
1321 8698 -8337 -12472 -11442 -30644 -36670 -26596 -10319 -6223 -26967 -25032 -5097 -5982 -14373 -9389
1307 -9389 -10812 -38503 -41181 -2621 25535 49112 18266 25632 15530 6019 11989 5007 29619
1294 29619 -5277 -16717 -20615 -36698 -27874 -369 -36218 -33813 -17191 -16650 -28195 -4278 12430
1281 12430 1814 15362 -22755 -27330 -14705 -15958 -11707 12600 11898 -18501 -16666 8464 -30058
1268 -30058 -24031 -3486 -1011 19924 -8132 14872 -32773 -29626 -32586 -31971 1399 11540 -11763
1255 -11763 -37721 -48046 -12625 -10164 -31993 -13462 24393 17803 12974 -20931 -21092 4021 -14882
1242 -14882 -28029 -19668 3068 31954 43346 12282 -18241 5938 -2044 -11199 8304 650 -24613
1229 -24613 -42417 -25155 -39359 -11020 -16168 -23951 23292 41219 20724 48308 58507 39189
1217 39189 17948 -1819 10288 17272 -10325 -11890 -20484 8043 13511 -14227 -34438 32390 22006
1204 22006 13373 -1422 -1136 25733 2205 12231 34744 31415 4836 3620 -12317 -27297 -11058
1191 -11058 1350 6952 -19474 -35020 -340 25406 22649 5477 4491 2507 -10394 13514 -1668
1178 -1668 -10868 -14857 -2420 34049 23742 -26133 -59134 -44059 -53845 -41338 -36410 -23359 -23935
1165 -23935 -27983 -11000 6963 29948 23180 43930 -10034 -16358 25402 9506 -35468 -16294
1153 -16294 -14988 -19485 -9127 -21135 -14734 -26346 -2881 7171 5170 8451 37071 7506 -1898
1140 -1898 -8212 2275 8664 20896 -12096 -35980 -59493 -42926 -15687 -17351 -28354 -29506 -17884
1127 -17884 -13514 -16460 -8136 12585 -7413 -21350 -4326 -16392 -1641 16393 19587 28797 -18764
1114 -18764 -27104 -33461 -28205 22638 21299 -15900 -1039 -21201 -55385 -27239 -27653 -17751 -4778
1101 -4778 -1521 17848 34066 30446 33394 47726 21131 10507 1292 -43108 5436 -15048 -20626
1088 -20626 -17393 -37041 -54397 -31505 4559 -14861 -707 -13209 -28546 -6598 -6916 -1306 -7899
1075 -7899 -14895 -30843 -43846 -22974 -12574 -5190 -39617 -62131 -27434 -6631 15523 29640
1063 29640 -153 -45682 -24864 18558 6422 6534 21128 -21956 -43214 -4032 3973 13964 17701
1050 17701 11171 -7207 2223 11121 13542 15540 1992 -35439 -5705 -8123 -21623 -11406 1020
1037 1020 28869 34778 8000 23219 -11560 -13254 13093 26783 18157 30078 13723 7139 -1970
1024 -1970 -12781 -20163 -6103 -21126 -39835 -47104 -82220 -52525 -6412 -21746 -21925 -1710 40409
1011 40409 35668 13485 -3675 26262 10387 -17354 -10625 -54694 -40041 -8410 -5752 -23560
999 -23560 -29217 -30800 -36757 -40925 940 -4010 -27281 -6823 -1192 -3185 -2614 -8116 -2056 -2065 -1654
984 -1654 8029 -5829 -30796 -1657 -2028 5213 22203 7849 97 9731 14448 -1396 1850 20549
970 20549 -6966 11201 5531 9136 -46383 -52126 -37074 -42051 -47560 -39298 -8029 15824 20415
957 20415 -32406 -38617 -44836 -42521 -9059 -19665 -28572 -24194 -1321 21667 23231 19158 15012 1429
943 1429 7296 -16139 25168 -963 -27119 -21325 -22239 -17182 7812 -18503 -34216 -1661 -6160
930 -6160 -11376 -16223 -4051 -24691 -20192 22655 16122 21570 33214 2335 25827 61195 29334
917 29334 31870 81237 41695 44869 14620 -16059 2855 -19973 -34297 -31945 -17502 -25671 -24489
904 -24489 -28697 -20761 -19214 -36262 -35173 -47255 9870 20880 26650 8609 20907 4336 -1659
891 -1659 34411 22341 -967 -9214 -10587 -5354 -13990 -2271 -2232 -7916 6303 -5316 -813 12100
877 12100 -12065 -16289 -14276 -8946 8248 24878 15658 -17372 -29577 -24598 -10007 -24722 605
864 605 -1616 -8688 -5366 -3867 -7947 -11926 -9335 -22315 -20240 -7324 -17923 -7828 20208 -5835
850 -5835 -12020 -29131 -22147 -39944 -16849 -45381 -22144 3771 8886 3736 24244 26268 182
837 182 -11367 -5927 55425 19291 39600 51865 512 -29356 -15462 -8812 -19905 -32271 -37969
824 -37969 -37585 7057 28347 20068 19099 6045 44052 5882 -13264 3787 -8275 -7171 -41682
811 -41682 17925 25900 19297 57782 43155 13360 -2435 13505 39948 7916 -12165 -19122 14060
798 14060 5378 -31121 -30391 14671 7910 -1667 8055 -10548 -27945 -40606 -38565 -18128 12406
785 12406 8760 33054 14715 -25450 -10102 30546 38451 4300 19966 27831 -18265 -57871 -16505
772 -16505 -18628 -24542 -16632 20351 22909 -2030 9722 18318 34702 23250 12225 37941 25626
759 25626 -2246 -26862 -23399 17938 -32608 -23807 -19265 -4718 -627 5307 -15469 -45369 -41742
746 -41742 -37290 -16374 -4578 -50347 -37217 2641 8639 -8114 6730 15690 10182 -1711 -21549
733 -21549 22954 7046 12938 -34507 -43852 8892 15842 17463 -1578 -12516 -20773 -14419 -15710
720 -15710 -13698 29081 28842 16657 17720 -39424 -38225 2237 4047 3509 -4380 -24369 205 5055
706 5055 -8439 -13377 7812 7929 -11952 -13860 -7742 3210 -20155 -9426 20844 11814 -6925
693 -6925 4448 -709 16918 -4862 3496 54603 48385 37076 31972 -5626 -8532 -32022 -14019
680 -14019 -35477 -38879 -1739 625 8776 -27825 -47410 -48633 -45519 -32288 -26271 -18200 -11761 -4352
666 -4352 -12 -8398 15877 -23488 -13402 -12355 8326 -3456 12420 -8038 -34491 -22422 -27885
653 -27885 524 -1722 9222 -964 3659 1878 -900 -3155 -13799 -17325 -14572 -2957 7118
640 7118 -26459 -33343 -4064 -17793 -9891 8415 -11683 -3258 -2078 -8367 -35543 -64145 -29114
627 -29114 -35348 -15301 -15269 -10467 13021 9854 26913 22761 -6409 -22205 -31540 3787 233 -7696
613 -7696 -7952 -16335 -7590 -4195 5553 2688 -12586 -746 15449 -20427 -49539 -46713 -29271 -33832
599 -33832 -40699 -5997 -17928 -36092 -5191 -10772 4348 20675 22845 -18860 -17465 -12208 -18546
586 -18546 -21948 463 -9172 20690 24284 2183 -6900 3347 13154 4209 -9214 580 9361 4052
572 4052 1364 18973 41643 23169 32559 11523 -23307 -14755 -14083 -11262 2409 8608 -8162 -24297
558 -24297 -37421 -74714 -66329 -43267 -12912 -18764 16397 -8146 -28033 -25296 -10699 2453 -10414
545 -10414 -23231 -66336 -7844 20529 8179 20072 -1665 -10076 10614 6015 -10864 -23435
533 -23435 -7714 -2881 -12125 -13884 -50302 -47191 -21897 -22543 -70793 -36055 -10003 -21945 -6470
520 -6470 -20673 -44166 -39453 -13035 -34605 7301 5295 7337 25147 7830 -4413 -22752 -36499
507 -36499 -24708 -8253 21414 17543 -24566 -4860 -863 -10951 17315 23157 47766 74148 61229
494 61229 44605 38985 29281 10864 12363 -22055 -41256 3708 55827 23689 21446 4462 -17011
481 -17011 -2 -7592 8276 25595 -256 17998 22682 -24420 -695 4828 23628 14780 -24320
468 -24320 -32670 -11413 -3180 1907 20672 -11595 -2733 8013 25379 12250 -19313 -28420 -20290
455 -20290 -13552 8143 -445 -1282 -22662 7057 27525 24398 19075 11113 3178 8902 10436 -22067
441 -22067 -18927 -30890 -54029 -44735 -42556 -24869 -10777 -9638 -11178 -241 4473 8804 3856 989
427 989 14413 -13369 -12680 -33761 -23026 3620 8821 8141 -23414 -19457 6456 18837 18405 -35851
413 -35851 -52818 -54357 -7006 -3700 11396 -3131 6337 -27339 -58476 -56743 -41143 3291 31784
400 31784 15773 6539 -3586 -14551 1617 20966 30876 4867 5119 12655 -2870 2277 -19207
387 -19207 -50764 -24361 13273 -4339 -9297 -2898 769 10649 -17423 5754 3361 -10990 -165
374 -165 -14289 -7289 -140 23791 35842 40690 -2851 -44316 -12660 -30362 -18416 -8183 -5563
361 -5563 12813 14294 34247 30873 -7032 -40084 -55796 -29374 -13542 -4481 2564 4573 -19972
348 -19972 1251 -24227 -34474 -9799 -4890 9498 3554 14969 6320 27068 2258 -33308 -27417
335 -27417 -17077 13143 3594 27082 -1942 -11901 -14606 -21650 -5531 7159 9106 -12267 5071
322 5071 2280 -10326 -1214 -12862 17081 32601 6102 31498 24848 15150 40807 49123 25679
309 25679 7257 4436 4986 4729 11946 14611 -37387 -40389 2322 -780 -13929 -8550 -21296 -27174
295 -27174 -30500 -22206 11681 32540 14755 -20609 -23324 -18205 -3884 11056 -10482 -7061 -5875
282 -5875 -13842 -25744 -41527 -46801 -17355 -16112 -18186 -10445 -19452 -43461 -39398 -25014 -31314 -18913
268 -18913 -438 20608 16077 9741 -16835 -18075 4671 13421 43314 28881 -18775 -41237 -47673
255 -47673 -7950 -36603 -52085 -18210 7126 35048 11490 -15911 5988 -10198 -3426 -8502
243 -8502 -27524 -35491 -49721 -24472 -8403 -7169 -11836 -8361 -11341 24802 69141 29572 15745
230 15745 -11584 -24519 -12292 -21222 -1930 -5631 -29735 -21274 -26656 -7510 12837 34101 17105
217 17105 24941 14635 -25511 -6752 -82 -3571 -5605 -9117 -22998 -21741 -9934 10639 21906
204 21906 19095 19839 245 -18043 -8658 1523 -41119 -20735 -5771 34389 30374 -20966 -10104
191 -10104 2469 33592 917 -14171 -4562 5908 -38481 -29897 -18631 -6200 10481 9446 29915
178 29915 17278 10386 10099 6416 -4226 -17615 -8153 22737 18696 -32708 -23322 20131 3127
165 3127 28589 25860 11444 23099 -96 1515 29310 19562 -13945 -32618 -15760 7986 11303
152 11303 5491 4599 -21095 -25743 -2279 -15345 -6009 -27387 -9890 -5960 -14591 7648 -10212
139 -10212 -43895 -54603 -22417 4160 -16857 -35291 -9932 25549 5133 9165 -17619 -36004
127 -36004 -33378 -26102 -54903 -37466 2549 -11717 -5038 -6606 -5076 88 5642 5671 -4801 -39548
113 -39548 -32563 -14086 7321 26937 9969 -3601 -12244 -8331 -26243 -29254 -19009 5612 -13837
100 -13837 -46759 -50733 -1088 23078 9666 -12081 -24367 -20407 -13966 -10604 4814 9734 -7554
87 -7554 25589 26153 28628 29570 31545 -65 -5602 -22756 -50259 -44916 -28746 -21142 -8361 -14735
73 -14735 5915 -1953 2665 -5698 -2843 30209 29765 8090 -11764 2162 3435 -44574 -34599 -9605
59 -9605 -12454 -13304 -8523 -2243 4441 -15002 -34459 -39318 -38154 -24686 4518 9870 12847 5234 -14709
44 -14709 -8905 -7825 14586 -3719 -8112 -8715 6029 2765 -11597 -5123 11270 25494 7874 26639
30 26639 9934 -4243 -13668 -36110 -24417 -31547 -25108 -18352 -212 -17047 2275 10848 -24207
17 -24207 -24761 -10268 -11991 -11272 2272 8164 1399 3103 -23448 -23382 -5050 1097 -5864 -8772 -4805
2 -4805 -4844 -11966
0 -11966
$$ Imaginary data points
##PAGE= N=2
##DATA TABLE= (X++(I..I)), XYDATA
16383 -908740 -880644 -876185 -870973 -869034 -870048 -861043 -838599 -819860 -821208 -809513 -791158 -779780 -780805
16370 -780805 -767822 -745018 -746191 -749661 -743296 -724647 -700976 -699216 -690611 -688897 -669811 -641757 -630191
16357 -630191 -626017 -616981 -624273 -607563 -589552 -573676 -574086 -532565 -524722 -538196 -520704 -488244 -477939
16344 -477939 -483396 -459664 -453317 -436957 -425087 -402708 -414026 -418729 -412546 -397065 -357859 -354485
16332 -354485 -342117 -320543 -330999 -333970 -314433 -298999 -318100 -314818 -287169 -279254 -264827 -257258
16320 -257258 -263835 -257595 -229393 -200762 -192221 -172290 -177427 -161767 -138422 -127603 -114550 -119356
16308 -119356 -123357 -118072 -112394 -105301 -119147 -82670 -68170 -60677 -38649 -52738 -48971 -22834 -32171
16295 -32171 -27562 -47094 -56748 -30455 2534 32115 33656 19872 18586 39542 74163 76788 60226
16282 60226 72728 89154 103722 130066 127259 126320 120661 107283 120974 142912 140854 150183 182515
16269 182515 199366 200410 162541 190465 209606 247437 251537 226615 261030 259334 258888 263437 285188
16256 285188 294483 285677 302555 336207 347959 346756 341122 319072 330767 335760 338575 370548 367972
16243 367972 371770 406935 378344 376927 379185 380183 379892 421343 444912 427109 417547 415960 449299
16230 449299 463778 450155 452043 449665 474483 480791 497313 514575 498157 493055 481901 485829
16218 485829 525326 524349 508278 500926 522248 544025 560856 565030 551041 551317 573323 568172 573223
16205 573223 562863 570666 579844 579085 605405 595870 592206 601116 594054 606967 624872 654152 640066
16192 640066 609797 659818 641481 628013 607428 603798 608385 629988 637549 617656 631167 676278
16180 676278 676956 682636 701057 701907 699089 682685 670221 683381 706010 727069 711330 720602 715452
16167 715452 702076 724257 696568 698403 712577 715690 660079 647834 678489 707602 726434 743543
16155 743543 710549 699535 719335 729782 742015 702138 740644 738780 723406 720114 741949 707516
16143 707516 700526 723329 737937 761002 756535 731547 722252 764140 754237 749856 752509 743983 756959
16130 756959 733301 768302 776650 795051 810261 820044 784382 777193 819245 798901 768281 769239
16118 769239 797075 804199 815385 754605 754973 787414 781833 796632 797457 789328 792563 773657 793980
16105 793980 787547 776560 799528 821770 801601 809645 815029 784502 775268 827034 833316 814905
16093 814905 811050 809293 824766 834685 832940 779051 776138 780083 792208 798248 777228 785981 838165
16080 838165 823338 831983 837860 813458 830416 792558 813987 784778 784091 783695 800078 833881 818319
16067 818319 808385 812636 816719 814398 826466 813480 797356 790729 788369 783382 786891 811134 812120
16054 812120 818680 852225 874460 849866 839309 824203 832931 840351 811531 830071 810109 813800
16042 813800 805248 799160 832127 829362 807251 776041 801721 831313 850949 840303 805986 804079
16030 804079 835786 827151 796741 775781 780520 799464 792605 840659 845039 850495 831508 833110 832367
16017 832367 854870 858542 830136 812584 837400 837458 841518 842822 849671 852273 837387 886444 850772
16004 850772 822545 843361 824358 817900 824462 850165 867866 857009 841596 861756 881274 845121
15992 845121 819800 832947 814627 803680 815764 819726 798511 766895 777830 817434 814917 773125
15980 773125 786374 788343 800001 819768 827862 854673 854904 828532 815680 793657 796592 818948
15968 818948 820331 791957 831072 824292 812192 794393 795154 780407 790900 817353 815024 823433 804872
15955 804872 827064 830170 828390 848285 809201 823866 850366 857519 826157 826834 831871 835662 829822
15942 829822 825996 831063 816196 829544 809751 793974 796422 818323 833654 842907 842493 838705 802146
15929 802146 795211 816909 817479 768468 824698 843376 870553 864061 821997 848747 869182 858712
15917 858712 859570 844618 834692 824586 814387 817308 847970 833927 837458 849364 817059 814823 846683
15904 846683 873370 874554 837622 829825 830195 833812 839688 845545 863468 842127 867003 844274 852034
15891 852034 864495 867191 857405 808669 807558 840254 842665 844484 813966 831288 827873 813248 839715
15878 839715 858689 887825 888070 870317 853474 839127 839822 844937 835075 839541 822635 824188 853936
15865 853936 856234 857918 863730 837378 818181 840685 853199 836625 838498 840159 835870 805405 848495
15852 848495 850759 852378 863188 830009 854147 852198 849496 832615 851680 840484 854171 861834
15840 861834 867239 843884 840934 861772 842628 845141 831425 837315 833085 836106 841526 870380 862601
15827 862601 816101 840286 824913 800865 828056 870609 866976 855064 847867 823094 819436 831804
15815 831804 840955 838087 829814 833376 834042 833277 820918 824030 849456 866713 882782 874406 866707 857264
15801 857264 843563 860319 890378 872286 859112 846602 821409 818554 823121 815690 818569 821531
15789 821531 802185 803924 830142 832573 830941 822769 841289 875630 879001 842525 827322 853313
15777 853313 863449 849847 817187 839489 856063 857830 835113 822602 842188 830765 838221 813454
15765 813454 811848 818325 792031 823847 844688 836154 845206 841801 836277 822006 827267 865650 872730
15752 872730 852929 863127 864156 845905 843233 834418 834983 812420 845233 881479 854388 850860 860148
15739 860148 860822 859341 877608 902438 866700 859605 881468 877343 879891 852076 837375 817004 811395
15726 811395 836889 846004 835759 819842 832942 868338 854854 837584 833654 843511 872578 879670
15714 879670 859989 835494 854437 849442 836596 848564 811757 803399 807429 810961 830001 840174
15702 840174 792303 797361 842369 874166 869116 867442 869300 838727 812635 830962 857738 871892
15690 871892 878675 855775 844312 846450 863382 851950 846283 868325 861055 858393 897137 902236 874786
15677 874786 846482 822898 810205 851668 855070 840780 840284 836215 866730 842376 821578 848778
15665 848778 824840 824762 806211 844950 883673 882273 879123 852110 837672 839268 853888 862125 864401
15652 864401 884779 886950 881223 873398 860659 857341 867544 882656 877479 879939 887082 880884 844923
15639 844923 837399 861929 861443 868078 880165 836629 811288 835780 850350 811606 814655 835961
15627 835961 870949 857840 861943 840824 831033 841017 835841 835417 834340 846784 828300 846364 853639
15614 853639 869095 883206 856379 875370 862144 843985 887834 875696 859168 824128 865198
15603 865198 861127 859298 849177 845181 857662 841376 867572 863007 880130 856145 851117 846584 843644
15590 843644 824481 834687 856105 824799 867727 872189 862617 862893 840429 839772 881823 843707 819318
15577 819318 841715 835509 850847 864769 869340 870083 846125 820424 836418 828953 846606 882276
15565 882276 885975 889990 878362 854977 854454 882988 862393 844266 837993 842705 858769 886167 871441
15552 871441 844001 815865 845417 904638 878054 868295 878406 870254 856498 834176 830072 881289
15540 881289 910769 887885 867574 883186 887760 898407 893525 898888 855815 874253 872810 855913
15528 855913 844712 858247 842221 825443 859020 869037 865722 850966 851018 840571 837073 869283
15516 869283 907220 879324 840002 822040 850497 882142 873943 866521 886201 875248 847682 851656
15504 851656 849226 882962 909234 913690 909507 884941 863559 889719 879564 857670 873313 872884
15492 872884 836788 838210 855506 830578 830753 841019 874600 897437 867390 858607 855064 866333
15480 866333 888561 872536 849647 857066 844147 865590 860534 845700 872092 880304 889970 862552
15468 862552 896626 884318 886358 860678 851717 878536 908903 897031 884457 876627 899078 898145
15456 898145 895010 897785 895608 895375 932022 927182 877568 879721 869265 876317 877167 876978 867316 874170
15442 874170 887872 880777 881735 875290 880848 873566 915137 899244 865883 908796 899121 913260 878654
15429 878654 910538 893942 901580 871179 865493 900080 880032 878717 857932 870211 877639 897029
15417 897029 878460 860407 869110 865738 891077 882798 861849 882960 872865 834618 857854 898804
15405 898804 883643 883518 893024 898373 877415 878459 879394 862243 893044 917453 894334 886049 854868
15392 854868 861644 839081 847098 850656 837740 857838 853972 882631 892458 899254 879988 853444 846771
15379 846771 859896 852124 862281 859073 880657 873906 884003 874161 877903 899806 907286 931723 901838
15366 901838 916898 924522 934100 924710 888455 872149 875290 856950 827702 837424 877143 890756
15354 890756 874339 897576 891124 869728 861699 860945 880505 873375 874680 881464 855730 890033 888863
15341 888863 867524 868423 874115 899522 906151 878850 860609 841672 854579 889720 895752 920811
15329 920811 923765 908047 908588 903421 887691 876581 866315 869378 867083 878587 888807 927713 906771
15316 906771 911081 925664 934026 931408 913431 894897 890369 888711 846814 839584 858338 867760 849346
15303 849346 837579 850661 866217 872391 887270 898082 884189 860423 858156 833984 889376 926255
15291 926255 885461 861887 875318 914009 876963 872221 880588 887739 890369 874657 885255 878640
15279 878640 891351 904150 880440 888633 907257 917149 915807 875072 861091 867487 870828 893693
15267 893693 911997 890674 909477 894952 878406 868871 859754 889419 886461 871891 860505 878353
15255 878353 883270 903793 896026 889555 889798 892498 891565 869201 876454 884972 903002 885010 855043
15242 855043 855231 867470 869582 861344 856951 869185 876614 876389 877985 909517 914986 895550 889228 875577
15228 875577 874928 891403 879437 860272 878120 897742 871204 845179 860895 842769 857388 852497
15216 852497 866589 880073 859974 879615 891533 897941 853476 894159 915299 887922 860715 890856
15204 890856 907769 879512 883230 873007 860071 895591 898551 904497 884396 857834 874517 864978
15192 864978 874229 869793 872102 865633 817595 808556 819973 855170 909889 901731 875260 883377 892063
15179 892063 904005 900055 878596 888474 881954 908339 896816 889711 887142 899378 884822 885840 888364
15166 888364 882979 844486 865915 888336 901218 894373 912517 892841 882934 889413 891271 918376
15154 918376 908589 880323 895320 907549 912855 887878 874419 897852 917650 906190 896116 909959
15142 909959 906354 891865 854208 886512 879611 876297 865911 851809 862880 879533 867282 891337
15130 891337 878787 849415 868228 874807 880268 912547 912270 903859 907709 893980 852622 874460 884336
15117 884336 905465 896612 894640 868895 869351 897133 922453 921745 919365 879074 881425 871837 873893
15104 873893 909241 929658 924472 914827 908527 916398 946534 947175 930150 912695 909973 878828 890065
15091 890065 886731 903961 878305 874846 890129 897976 894336 918514 924968 883622 845434 871668
15079 871668 898429 886838 903206 896670 901633 888649 877466 883951 868695 880382 855297 844851
15067 844851 874579 937170 902071 894490 913042 896146 885835 897975 897713 920177 882812 872287
15055 872287 920419 909807 913592 917039 913738 898479 900382 898876 909661 886945 868454 903563
15043 903563 917730 913314 898318 910562 921385 881756 888140 900796 917036 926168 894707 901990
15031 901990 916871 906411 904687 915762 913556 908799 919381 909249 891705 907168 921089 902254
15019 902254 925186 933554 922612 887718 896487 912276 930351 928001 918214 916131 912490 906480 889277
15006 889277 865153 897488 913974 924586 931727 907663 927048 932982 920709 910709 926223 893502
14994 893502 862581 877413 869731 886923 919345 911944 899191 874310 891730 901279 900391 887655
14982 887655 898770 895231 899180 917043 907750 918482 942993 926992 905690 918896 911805 891839
14970 891839 870793 904009 906140 911387 913148 865717 846208 872131 886193 898070 913503 922814
14958 922814 926642 905775 936835 944142 928942 917102 904767 888601 890119 883488 881470 929984
14946 929984 952447 931796 914588 937024 929286 934750 925377 887954 888509 942128 960747 945688
14934 945688 909079 898247 929334 895744 876647 866724 877283 908970 910050 892760 903379 932874
14922 932874 955526 911352 920345 950815 945834 921538 911282 920050 931999 947619 930092 902792
14910 902792 895644 883264 879259 864072 869547 869482 877973 882691 864854 922220 937411 916268 882372
14897 882372 879571 900981 931360 933313 917294 906955 912405 920831 924476 958073 952110 917316 889968
14884 889968 899998 924409 922808 916334 904886 905570 933008 923146 913584 927671 907393 913016 907171
14871 907171 897809 896771 933811 928402 929804 916471 902251 947611 926053 902394 899610 907646 898068
14858 898068 902490 914919 914566 935000 904470 895328 915199 923666 905768 887474 905587 920060
14846 920060 937535 973663 956513 939498 910581 892646 883051 879440 898344 900133 915080 916528
14834 916528 891815 879099 884633 921275 933245 904337 917086 919221 889945 861024 866056 884297
14822 884297 901099 913956 882359 925001 967751 919811 903990 911170 919957 911816 919026 914139
14810 914139 910108 915830 926325 912568 915683 907828 910557 951262 943904 918046 903684 884729 879742
14797 879742 869241 903003 949334 923720 914586 930891 955351 927959 918561 953158 942798 945123
14785 945123 926366 894415 901123 896855 877371 874818 873338 891319 904138 928268 959416 971943
14773 971943 959924 929257 904802 918119 896422 896830 910760 883416 907383 936260 914388 928318
14761 928318 915291 939998 937550 934682 953855 919635 919345 909323 928477 923231 934407 943107 896469
14748 896469 899987 899381 928324 930092 913071 901450 914785 934536 907620 916343 921145 928604 937792
14735 937792 940814 951946 937526 914185 920974 907052 913538 908123 909742 927182 924644 950281 951004
14722 951004 947751 960946 965416 968326 931830 956125 940661 936911 932526 908274 916222 933857 942068
14709 942068 935335 895091 899727 929476 929137 910403 900959 920490 931230 966891 975175 925376 918769
14696 918769 924744 906778 893773 920453 951754 944478 956690 934950 953634 937875 932994 947011
14684 947011 928118 935285 904060 921503 920314 910396 896933 895720 901217 909822 918997 913888 930738
14671 930738 903210 925046 930932 956129 976723 957627 938556 914386 895749 908326 899399 887545
14659 887545 934191 959355 916278 920977 933113 930675 938695 937274 939680 930544 924307 892230 892859
14646 892859 912875 883105 871244 932997 961231 924299 919447 936273 941906 947137 943010 930841
14634 930841 933663 930020 928584 959321 949228 937721 922056 928028 902008 937636 959253 944465
14622 944465 952597 945957 935189 978145 993730 961289 935495 943977 942612 931433 940968 932116 946167
14609 946167 914438 912062 893279 902344 928179 953063 974475 971067 981355 979701 980789 969952
14597 969952 944880 921250 944757 961060 987095 966153 933112 937665 930229 950852 938888 939292
14585 939292 925593 930786 940927 945187 968155 956520 958965 987924 964434 947415 921075 898867
14573 898867 904559 909804 926263 906157 910506 897598 877539 911597 914162 917292 930359 950705
14561 950705 927324 942718 963650 963878 985154 977471 985103 981870 962835 992578 977109 974336 943859
14548 943859 936007 935774 897310 908668 942356 979973 974280 966849 951252 952357 950892 947753 937879
14535 937879 936220 961120 950208 935138 940925 958879 941605 948764 957410 963037 966807 966263 973324
14522 973324 953212 955465 947762 941843 948516 954770 940594 957397 977415 950511 914060 928641
14510 928641 948260 975395 965773 962432 993503 981511 950548 959852 980986 970682 961735 924733
14498 924733 901972 910877 942028 924339 927108 943103 932397 931840 927259 950476 976344 976737 937441
14485 937441 922459 935656 923330 934468 910345 922063 985839 972720 959312 943979 936873 944781
14473 944781 940007 931591 927840 952215 972518 949072 961641 940365 956099 951868 959263 992461
14461 992461 1006312 983842 951333 960120 951073 939766 940552 962066 999755 989648 981342 976649 938603
14448 938603 906613 928417 932200 944124 924293 919546 919591 913142 933578 952902 988632 955605 957762
14435 957762 971880 938005 954111 958573 964704 963868 962123 968182 949938 949203 960098 958671 956728
14422 956728 967839 982488 998197 965329 953007 940124 956859 987012 962682 929610 950649
14411 950649 971946 970033 994177 999975 988199 973121 954349 980054 957252 968777 953470 927710
14399 927710 957153 943855 928738 937650 900920 933264 935822 942157 955640 940884 931580 914383
14387 914383 935446 966375 987134 1007034 999039 954281 952337 919557 957534 964548 957038 960564
14375 960564 976676 982841 949602 961425 965311 971161 975758 968579 971532 993123 949493 945789 978654
14362 978654 959786 971015 964492 954112 949102 947332 989478 969094 981302 985436 998427 990674
14350 990674 939097 942988 946167 929450 913417 941905 949137 945890 965636 936145 946121 957238
14338 957238 964930 960521 951990 954482 951422 928646 943582 943301 914934 945344 941894 936208 974094
14325 974094 995868 986223 967899 965240 956798 987861 977348 988224 987573 1005265 964797 940237
14313 940237 962072 941466 984610 999229 987753 943214 941505 935684 966951 959489 943229 970893
14301 970893 974883 958269 958611 935666 956318 924431 930037 908518 903877 928424 955982 962516 968362
14288 968362 993413 985412 986670 1009304 979699 955928 931406 931017 922181 934401 959631 968082 950972
14275 950972 930885 977871 965161 988985 1016210 1014017 1010987 974487 962329 988385 963006 1012932
14263 1012932 1021888 979705 978627 970847 960241 958231 983840 999912 984394 982079 1004799 982685
14251 982685 951098 964600 955260 954985 953350 938871 981595 1003210 996492 986590 968026 958876 950685
14238 950685 957352 957718 953958 974621 988919 970424 969786 972382 986160 989658 981830 970934 976821
14225 976821 984540 1013669 1007665 995552 976912 972495 975411 991323 1013487 1005780 1011085 974271 953467
14212 953467 956915 974176 972364 976321 935026 969825 950781 925175 972774 965763 980677 1006844
14200 1006844 969740 983634 1003547 988459 956255 923932 969325 973677 960272 971788 980248 976388
14188 976388 960723 952563 977216 967317 978967 975463 972004 955395 913689 923290 966584 964097 952227
14175 952227 923044 899293 956669 973721 989542 981941 957504 972201 965682 964802 971451 994888
14163 994888 978597 982926 976238 935415 979692 976783 957448 956913 955246 984074 987136 1009393 1014017
14150 1014017 1014289 998937 1029961 1010495 967801 985816 1027446 999176 984825 1013179 1014315 998777
14138 998777 981100 1007990 1011856 1016126 1015630 957659 961688 958979 979783 965533 969544 980143 972181
14125 972181 994290 976186 970708 957182 956579 962469 1010234 1022813 1005689 973173 969135 977345 1031789
14112 1031789 1021206 1045460 1045211 1015790 1008068 983362 1008847 1021749 999377 969979 957853 959469
14100 959469 977090 943187 930581 957552 987882 1001963 988768 984881 972879 969917 992328 1011144
14088 1011144 1026382 1006127 997872 988311 985281 972802 990705 1003458 1005371 973630 980623 969264
14076 969264 956400 1008524 1020902 1011374 921421 927074 941552 958277 1000918 994265 976863 957648
14064 957648 960840 972346 957286 961105 984444 993040 958246 989595 992087 1013015 980683 989742
14052 989742 975329 969475 996193 988825 983296 958219 983877 1003985 1015282 1026425 990024 999972
14040 999972 1019252 1007424 999420 1009454 996133 983412 962060 957380 991960 962858 971938 980221
14028 980221 973906 960337 1016980 1041552 1032961 1004005 992516 973005 1009757 1028776 1024020 1015394
14016 1015394 999784 1017747 1022624 1013611 1009390 1020165 1030281 1012053 1041908 1030108 1013337 996656
14004 996656 1004224 989894 1003804 994350 980307 999343 1007743 965449 962266 1023399 1000349 988707
13992 988707 986483 992938 1003642 1001083 994147 1002678 1009997 977745 979258 1032529 986975 977174 973448
13979 973448 962256 966075 1000777 992123 985964 977853 987336 996000 1004504 983393 993303 991789 975244
13966 975244 983977 1040790 1041413 1002687 991835 988034 987385 992117 958969 951997 967497 1002748 1020886
13953 1020886 976573 990549 1006314 993620 972404 976934 1011612 1035657 993381 1019276 1008285
13942 1008285 1011001 990106 994772 1032910 1029005 1009119 1006475 987843 988820 983252 1000461 994843 985428
13929 985428 993725 976363 1005346 1007143 960258 945981 957881 973158 988129 1021169 1016130 984841
13917 984841 977099 1028070 1009769 996885 1011975 1013860 1005178 998413 1013612 987775 976987 983749
13905 983749 979096 977189 995679 987272 1014090 1023554 1001944 1010223 1030371 1032825 1009676 1019475 1039911
13892 1039911 1037354 1015824 996663 994433 963836 982978 997916 1023162 1043531 1017762 1007934 996170
13880 996170 1001313 1025986 1049253 1029156 1022842 1011209 991603 985808 1011127 1003497 987766 1025381
13868 1025381 1018149 1039116 1047042 1016361 995852 977120 1019079 1062316 1017374 1003265 1033486 1027408
13856 1027408 1001256 1014647 991344 990810 1035607 1022903 977962 999161 988039 1001159 1020636 1012538
13844 1012538 1018759 1022878 1028065 1022863 992818 1011215 1049342 1019989 1008050 1027778 1032749 1035893
13832 1035893 1001101 996613 1005613 1025354 1041227 1031232 1034295 1024261 1030882 1005971 994393 1001418
13820 1001418 1043124 1017193 1009908 1017925 1011129 1015732 985184 1001942 1033220 1062271 1058595 1064228
13808 1064228 1018760 1004874 1041136 1032090 1033369 1047829 995197 1006288 1024568 986871 1006333 1026852
13796 1026852 1017874 1030423 1045215 1026773 1020170 1030580 1019524 1000314 1006458 1062188 1053190 1003601
13784 1003601 1015706 1046565 1054507 1056227 1032000 1000700 1021207 1038413 1042569 1025732 994345 997185
13772 997185 1019988 1024544 1026402 1008222 994497 989980 1002818 992816 1052971 1067260 1030137 1032007
13760 1032007 1040469 1036179 1016746 1018986 1034418 1043838 1028892 1005820 1013907 1008260 993210 999762 1035361
13747 1035361 1049092 1042549 1050215 1007904 1002277 1024110 1039832 1015255 1014861 1010404 1018593 1016711 986344
13734 986344 1011852 1019836 1015212 1030537 1049570 979967 991408 1015399 1014149 998695 1013051 1030449
13722 1030449 1024671 1005747 1019524 1022183 1023681 1023647 1009227 1003282 1006855 1023137 1012708 995178 1019827
13709 1019827 1026340 1012166 1020947 1041717 1040991 1047611 1046142 1021062 1007753 993347 1015187 1007991 1005691
13696 1005691 1005790 988903 980203 967772 951389 964675 1026794 1014859 1002752 1026910 1038743 1050215
13684 1050215 1056049 1052236 1040794 1057969 1050502 1053291 1018042 1028628 1040728 1020861 1033620 1056487
13672 1056487 1023184 1024472 1065079 1061799 1017495 1008372 1020923 1018740 1023718 985825 974224 1018643
13660 1018643 1024555 1022422 1041252 1046728 1005859 1024277 1050508 1074381 1071903 1065042 1077358 1070422
13648 1070422 1046095 1027523 1040577 1019458 1015865 996310 1048585 1059330 1025317 1030069 1061102 1073471
13636 1073471 1077588 1066918 1086507 1053888 995047 1019819 1017625 1021703 1012998 1026667 1017851 1045887
13624 1045887 1054472 1031044 1046749 1042756 1027158 1034726 1056381 1054013 1042276 1064160 1065090 1061324 1027439
13611 1027439 1026850 1032132 1062894 1089525 1068501 1042954 1036634 1042588 1033902 1018229 1044926 1016434
13599 1016434 1007275 1007620 1022774 1019431 975058 1000715 1029043 1046974 1052344 1033368 1026035 1029449 1024825
13586 1024825 1047605 1040093 1027197 1040259 1047053 1073278 1071698 1044721 1013337 997088 1036225 1082059
13574 1082059 1067020 1050444 1063105 1065462 1039687 1048063 1077854 1090842 1096378 1058531 1049305 1035915
13562 1035915 1024300 993756 982918 984092 1025650 1027766 1020347 1027860 1051159 1030285 1048983 1047343
13550 1047343 1049645 1063677 1056393 1059516 1075992 1063246 1061587 1050044 1035120 1061937 1031347 1028496
13538 1028496 1048952 1040720 1063919 1050352 1051486 1080788 1048125 1059828 1041414 1034458 1056960 1060761
13526 1060761 1028413 1029300 1050995 1057776 1094726 1057152 1053542 1058540 1043822 1029951 1041901 1063477
13514 1063477 1034091 1039056 1038492 1032851 1048533 1021013 1017613 1024321 1056145 1061320 1019764 1031436 1039101
13501 1039101 1055609 1046271 1037698 1026303 1019129 1036472 1046562 1049608 1045521 1093202 1077511 1078419 1088000
13488 1088000 1080126 1076055 1084308 1069390 1067516 1092186 1073028 1063232 1058390 1065445 1044617 1044787 1054987
13475 1054987 1079768 1061411 1071548 1070749 1026762 1041199 1022896 978006 989780 1022238 1028447 1035357
13463 1035357 1064157 1037613 1036991 1057577 1034871 1010794 1044341 1057947 1050299 1074767 1066769 1046041
13451 1046041 1053718 1026894 1018860 1021421 1029281 1042213 1027331 1023753 1019567 998196 1011507 1048567
13439 1048567 1044458 1035964 1083317 1098498 1060846 1060697 1073673 1033099 1043239 1046016 1021571 1027999
13427 1027999 1030310 1012823 1032642 1048330 1062041 1048847 1042738 1050243 1058777 1056898 1065413 1066547 1062922
$$ [...]
##END NTUPLES=NMR SPECTRUM
##END=
