##TITLE=1H_DE-80H_X3
 200.13MHz, d2o
 8 sc
 
 19ns.26.2.2025
##JCAMPDX= 6.0         $$ Bruker NMR JCAMP-DX V2.0
##DATA TYPE= NMR SPECTRUM
##DATA CLASS= NTUPLES
##ORIGIN= UXNMR, Bruker Analytische Messtechnik GmbH
##OWNER= pz
$$ XWIN-NMR		Version 3.5
$$ Wed Jul 23 14:44:15 2025 Russian Standard Time (UT+4h)  Yarkov@DPX200
##.OBSERVE FREQUENCY= 200.1313
##.OBSERVE NUCLEUS= ^1H
##.ACQUISITION MODE= SIMULTANEOUS
##.ACQUISITION SCHEME= undefined
##.AVERAGES= 8
##.DIGITISER RES= 18
##SPECTROMETER/DATA SYSTEM= spect
##.PULSE SEQUENCE= zg30
##.SOLVENT NAME= CDCl3
##.SHIFT REFERENCE= (INTERNAL, CDCl3, 0, 15.5342)
##AUDIT TRAIL= $$ (NUMBER, WHEN, WHO, WHERE, WHAT)
$$ ##TITLE= Audit trail, XWIN-NMR		Version 3.5
$$ ##JCAMPDX= 5.01
$$ ##ORIGIN= Bruker BioSpin GmbH
$$ ##OWNER= Yarkov
$$ C:/Bruker/XWIN-NMR/data/yarkov2/nmr/H-C/1/pdata/1/auditp.txt
$$ ##AUDIT TRAIL=  $$ (NUMBER, WHEN, WHO, WHERE, WHAT)
(   1,<2025-07-23 14:43:15.40 +0400>,<Yarkov>,<DPX200>,
      <created by zg, POWCHK disabled, PULCHK disabled
       configuration hash MD5:
       00 E9 B6 7A A2 85 ED C7 34 08 36 98 17 FE 4E 26
       data hash MD5: 16K
       3B 53 C0 2D 4F 3C FB 87 43 F8 CA 91 25 F3 86 A6>)
(   2,<2025-07-23 14:43:21.43 +0400>,<Yarkov>,<DPX200>,
      <Start of raw data processing
       efp BC_mod = 2 LB = 0.25 FT_mod = 6 PKNL = 1 PHC0 = -1352.743 PHC1 = 7.190909 SI = 16K 
       data hash MD5: 16K
       35 5E 95 A9 C1 E4 35 CA F6 34 E0 9C 5F 0F 21 40>)
(   3,<2025-07-23 14:43:39.03 +0400>,<Yarkov>,<DPX200>,
      <pk PHC0 = -3.479956 PHC1 = 2.8 
       data hash MD5: 16K
       5B CD 32 A1 AB 06 3B 7A CB 48 74 8A C4 9C 60 30>)
(   4,<2025-07-23 14:43:41.90 +0400>,<Yarkov>,<DPX200>,
      <abs ABSG = 5 
       data hash MD5: 16K
       31 3D FF 05 DF D4 7D EF AA 98 22 B0 82 33 C9 0A>)
$$ ##END=
$$ 
$$ hash MD5
$$ 38 D0 80 83 8C 94 9D 0D BF A7 F5 B2 63 00 0A A6
##$RELAX= 
##$RELAX= 
##$RELAX= 
##$RELAX= 
##$RELAX= 
##$RELAX= 
$$ Bruker specific parameters
$$ --------------------------
##$DU= <C:/Bruker/XWIN-NMR>
##$EXPNO= 1
##$NAME= <H-C>
##$PROCNO= 1
##$TYPE= <nmr>
##$USER= <yarkov2>
##$AMP= (0..31)
100 100 100 100 100 100 100 100 100 100 100 100 100 100 100 100 100 100 
100 100 100 100 100 100 100 100 100 100 100 100 100 100 
##$AQSEQ= 0
##$AQ_mod= 1
##$AUNM= <au_zg>
##$AUTOPOS= <>
##$BF1= 200.13
##$BF2= 200.13
##$BF3= 200.13
##$BF4= 200.13
##$BF5= 200.13
##$BF6= 200.13
##$BF7= 200.13
##$BF8= 200.13
##$BYTORDA= 1
##$CFDGTYP= 0
##$CFRGTYP= 5
##$CHEMSTR= <none>
##$CNST= (0..31)
1 1 145 1 1 1 1 1 1 1 1 1 1 1 1 1 1 1 1 1 1 1 1 1 1 1 1 1 1 1 1 1 
##$CPDPRG= <>
##$CPDPRG1= <>
##$CPDPRG2= <>
##$CPDPRG3= <>
##$CPDPRG4= <mlev>
##$CPDPRG5= <mlev>
##$CPDPRG6= <mlev>
##$CPDPRG7= <mlev>
##$CPDPRG8= <mlev>
##$CPDPRGB= <>
##$CPDPRGT= <>
##$D= (0..31)
0 0.7 0 0 0 0 0 0 0 0 0 0.03 0 0 0 0 0 0 0 0 0 0 0 0 0 0 0 0 0 0 0 0 
##$DATE= 1753267394
##$DBL= (0..7)
120 120 120 120 120 120 120 120 
##$DBP= (0..7)
150 150 150 150 150 150 150 150 
##$DBP07= 0
##$DBPNAM0= <>
##$DBPNAM1= <>
$$ [...]
##$SUBNAM3= <"">
##$SUBNAM4= <"">
##$SUBNAM5= <"">
##$SUBNAM6= <"">
##$SUBNAM7= <"">
##$SUBNAM8= <"">
##$SUBNAM9= <"">
##$SW= 18.0517328524113
##$SWIBOX= (0..15)
0 0 2 0 0 0 0 0 0 0 0 0 0 0 0 0 
##$SW_h= 3612.71676300578
##$TD= 16384
##$TD0= 1
##$TE= 0
##$TE2= 300
##$TE3= 300
##$TEG= 300
##$TL= (0..7)
0 120 120 120 120 120 120 120 
##$TP= (0..7)
150 150 150 150 150 150 150 150 
##$TP07= 0
##$TPNAME0= <>
##$TPNAME1= <>
##$TPNAME2= <>
##$TPNAME3= <>
##$TPNAME4= <>
##$TPNAME5= <>
##$TPNAME6= <>
##$TPNAME7= <>
##$TPOAL= (0..7)
0.5 0.5 0.5 0.5 0.5 0.5 0.5 0.5 
##$TPOFFS= (0..7)
0 0 0 0 0 0 0 0 
##$TUNHIN= 0
##$TUNHOUT= 0
##$TUNXOUT= 0
##$USERA1= <user>
##$USERA2= <user>
##$USERA3= <user>
##$USERA4= <user>
##$USERA5= <user>
##$V9= 5
##$VALIST= <valist>
##$VCLIST= <CCCCCCCCCCCCCCC>
##$VD= 0
##$VDLIST= <DDDDDDDDDDDDDDD>
##$VPLIST= <PPPPPPPPPPPPPPP>
##$VTLIST= <TTTTTTTTTTTTTTT>
##$WBST= 1024
##$WBSW= 4
##$XGAIN= (0..3)
0 0 0 0 
##$XL= 0
##$YL= 0
##$YMAX_a= 651117
##$YMIN_a= -640849
##$ZGOPTNS= <>
##$ZL1= 120
##$ZL2= 120
##$ZL3= 120
##$ZL4= 120
##$ABSF1= 15.51331
##$ABSF2= -2.538539
##$ABSG= 5
##$ABSL= 3
##$ALPHA= 0
##$AQORDER= 0
##$ASSFAC= 0
##$ASSFACI= 0
##$ASSFACX= 0
##$ASSWID= 0
##$AUNMP= <proc_1d>
##$AZFE= 0.1
##$AZFW= 0.1
##$BCFW= 0
##$BC_mod= 2
##$BYTORDP= 0
##$COROFFS= 0
##$CY= -3
##$DATMOD= 1
##$DC= 0
##$DFILT= <>
##$DTYPP= 0
##$F1P= 0
##$F2P= 0
##$FCOR= 1
##$FTSIZE= 16384
##$FT_mod= 6
##$GAMMA= 0
##$GB= 0
##$INTBC= 1
##$INTSCL= 3.241238e-09
##$ISEN= 128
##$LB= 0.25
##$LEV0= 0
##$LPBIN= 0
##$MAXI= 10000
##$MC2= 0
##$MEAN= 0
##$ME_mod= 0
##$MI= 1.114404
##$NCOEF= 0
##$NC_proc= -5
##$NLEV= 6
##$NOISF1= 3.799351
##$NOISF2= 2.8
##$NSP= 0
##$NTH_PI= 0
##$NZP= 0
##$OFFSET= 15.53424
##$PC= 1
##$PHC0= -1356.223
##$PHC1= 9.990909
##$PH_mod= 1
##$PKNL= yes
##$PPARMOD= 0
##$PSCAL= 0
##$PSIGN= 0
##$REVERSE= no
##$SF= 200.129997490516
##$SI= 16384
##$SIGF1= 3
##$SIGF2= 2
##$SINO= 0.751879
##$SIOLD= 32768
##$SREGLST= <19F.Aceton>
##$SSB= 0
##$STSI= 16384
##$STSR= 0
##$SW_p= 3612.71676300578
##$SYMM= 0
##$S_DEV= 0
##$TDeff= 16384
##$TDoff= 0
##$TI= <>
##$TILT= no
##$TM1= 0
##$TM2= 0
##$TOPLEV= 0
##$USERP1= <user>
##$USERP2= <user>
##$USERP3= <user>
##$USERP4= <user>
##$USERP5= <user>
##$WDW= 1
##$XDIM= 16384
##$YMAX_p= 459766992
##$YMIN_p= -122023
$$ End of Bruker specific parameters
$$ ---------------------------------
##NTUPLES= NMR SPECTRUM
##VAR_NAME=  FREQUENCY,     SPECTRUM/REAL,   SPECTRUM/IMAG
##SYMBOL=    X,             R,               I
##VAR_TYPE=  INDEPENDENT,   DEPENDENT,       DEPENDENT
##VAR_FORM=  AFFN,          ASDF,            ASDF
##VAR_DIM=   16384,         16384,           16384
##UNITS=     HZ,            ARBITRARY UNITS, ARBITRARY UNITS
##FACTOR=    0.220516191357247, 1,           1
##FIRST=     3108.86736598343, 0,            0
##LAST=      -503.849397022352, 0,           0
##MIN=       -503.849397022352, -122023,     0
##MAX=       3108.86736598343, 459766992,    0
$$ Real data points
##PAGE= N=1
##DATA TABLE= (X++(R..R)), XYDATA
$$ [...]
$$ plain form
6136 1572927 1608935 1704104 1771907 1826464 1888739 1846210 1733981 1572269 1409018 1235161 1142649
6125 1142649 1047197 1012067 951080 876458 830895 800808 787622 765899 703238 708708 685344 670852
6113 670852 631052 608374 604898 603113 591548 584996 574327 568007 615575 589615 608708 652654
6101 652654 689394 724625 752233 786424 877224 951183 1017330 1094643 1144972 1142806 1120683 1123973
6089 1123973 1079479 1058628 1028516 994111 986588 961870 950511 923470 908108 955899 1026631 1048649
6077 1048649 1081543 1124187 1176770 1231018 1328164 1438345 1502326 1599556 1735100 1867297 2036959
6066 2036959 2129100 2133594 2065825 1958267 1862082 1812613 1736994 1702192 1675810 1622090 1630395 1623353
6054 1623353 1583079 1551206 1503814 1487627 1464890 1467737 1484923 1522682 1581483 1591573 1666376 1747224
$$ packed form
6136A572927L6008R5169O7803N4557O2275m2529j12229j61712j63251j73857r2512
6125A142649r5452l5130o0987p4622m5563l0087j3186k1723o2661N470k3364j4492
6113F70852l9800k2678l476j785j1565o552j0669o320M7568k5960J9093M3946
6101F52654L6740L5231K7608L4191R0800P3959O6147P7313N0329k166k2123L290
6089A123973m4494k0851l0112l4405p523k4718j1359k7041j5362M7791P0732K2018
6077A048649L2894M2644N2583N4248R7146J10181O3981R7230J35544J32197J69662
6066B036959R2141M494o7769j07558r6185m9469p5619l4802k6382n3720Q305p042
6054A623353m0274l1873m7392j6187k2737K847J7186L7759N8801J0090P4803Q0848
$$ plain form
6042 1747224 1770003 1766421 1712923 1665073 1565556 1411953 1334956 1259535 1187215 1122801 1100221
6031 1100221 1058698 1076664 1056771 1025304 1062285 1077925 1104915 1083987 1004807 958224 933732
6020 933732 917059 868604 852398 865483 861718 872123 834306 803928 778594 743564 696671 667087
6008 667087 653350 655421 613727 603522 614179 585169 567364 568505 594756 640067 645959 662033
5996 662033 703343 693949 683107 664769 654209 613878 572570 548996 549763 510346 469984 460970
5984 460970 440888 454460 492875 503968 519096 533554 532678 561295 583043 593551 614269 668318
5972 668318 751877 846901 919812 988519 949608 871971 798796 719586 678586 658312 633398 645646
5960 645646 627451 591568 588873 594887 606251 633358 668512 708928 705935 760687 842125 855488
$$ packed form
6042A747224K2779l582n3498m7850r9517j53603p6997p5421p2320o4414k2580
6031A100221m1523J7966j9893l1467L6981J5640K6990k0928p9180m6583k4492
6020I33732j6673m8455j6206J3085l765J0405l7817l0378k5334l5030m6893k9584
6008F67087j3737K071m1694j0205J0657k9010j7805J141K6251M5311N892J6074
5996F62033M1310r394j0842j8338j0560m0331m1308k3574P67l9417m0362r014
5984D60970k0082J3572L8415J1093J5128J4458q76K8617K1748J0508K0718N4049
5972F68318Q3559R5024P2911O8707l8911p7637p3175p9210m1000k0274k4914J2248
5960F45646j8195l5883k695O014J1364K7107L5154M0416k993N4752Q1438J3363
$$ plain form
5948 855488 905285 1013732 1148209 1265385 1488234 1743788 1939067 2035460 1910110 1695236
5938 1695236 1452263 1291847 1173871 1073706 1011517 983688 987209 957060 952270 945489 922285
5927 922285 911677 942029 983084 1037983 1036612 1062052 1145427 1230567 1317213 1451752 1681686
5916 1681686 1937420 2230905 2522341 2549235 2317769 2023508 1769360 1547680 1395346 1282979
5906 1282979 1172224 1111100 1038502 971387 964890 933132 941316 915034 917296 890282 902170 910233
5894 910233 904149 949530 1039100 1105505 1213071 1348973 1539862 1812710 2013071 1951999 1741875
5883 1741875 1501486 1269972 1132403 992757 928909 851103 809543 763801 710724 680128 612123
5872 612123 564207 555132 587414 581523 559142 562971 575778 582446 594088 632727 648283 729147
$$ packed form
5948H55488M9797J08447J34477J17176K22849K55554J95279R6393j25350k14874
5938A695236k42973j60416j17976j00165o2189k7829L521l0149m790o781k3204
5927I22285j0608L0352M1055N4899j371K5440Q3375Q5140Q6646J34539K29934
5916A681686K55734K93485K91436K6894k31466k94261k54148k21680j52334j12367
5906A282979j10755o1124p2598o7115o497l1758Q184k6282K262k7014J1888Q063
5894I10233o084M5381Q9570O6405J07566J35902J90889K72848K00361o1072k10124
5883A741875k40389k31514j37569j39646o3848p7806m1560m5742n3077l0596o8005
5872F12123m7916r075L2282n891k2381L829J2807O668J1642L8639J5556Q0864
$$ plain form
5860 729147 795191 851279 903531 882847 769190 678304 607259 546545 489213 430754 434416 415200
5848 415200 399398 405380 375057 356482 320884 314283 308611 302527 315164 307458 288159 294400 287889
5835 287889 263873 253245 263121 292060 324549 305560 321611 284301 259238 235200 190886 180448
5823 180448 192227 197510 186108 224232 205472 180774 179612 199205 164779 137678 163271 165803
5811 165803 160229 158374 181027 180400 143977 99707 99604 134854 113258 75839 118390 131708 178335
5798 178335 160495 99081 120719 125834 105180 112347 158428 168310 119766 109406 120152 112083
5786 112083 114232 96444 85657 103374 126740 116950 106599 98909 139479 134178 120229 120411 101755
5773 101755 114798 128915 141875 112005 107537 111862 110824 77976 87628 88701 96044 100076 98800
$$ packed form
5860G29147O6044N6088N2252k0684j13657r0886p1045o0714n7332n8459L662j9216
5848D15200j5802N982l0323j8575l5598o601n672o084J2637p706j9299O241o511
5835B87889k4016j0628R876K8939L2489j8989J6051l7310k5063k4038m4314j0438
5823A80448J1779N283j1402L8124j8760k4698j162J9593l4426k7101K5593K532
5811A65803n574j855K2653o27l6423m4270j03L5250k1596l7419M2551J3318M6627
5798A78335j7840o1414K1638N115k0654P167M6081R882m8544j0360J0746q069
5786A12083K149j7788j0787J7717K3366r790j0351p690M0570n301j3949J82j8656
5773A01755J3043J4117J2960k9870m468M325j038l2848R652J073P343M032j276
$$ plain form
5760 98800 119701 101796 99375 79662 90673 73448 67986 74663 78380 70536 92091 93172 108772
5747 108772 133391 112690 90840 73906 73111 109222 119915 100361 105613 94117 102478 85598
5735 85598 54390 104504 128432 112033 104210 95394 104251 66065 78280 126310 109210 77446
5723 77446 71053 104547 117593 149478 132653 150391 166973 144731 119283 131314 106947 112088
5711 112088 75957 75892 108673 113063 156357 148163 140723 133327 121479 106447 100342 101052 80801 118858
5697 118858 149284 145075 125286 121625 117928 107440 144202 141200 166776 155695 149195 147394 165185
5684 165185 197556 167736 189685 200665 201572 217105 209522 238452 248331 275103 291708 283596 309612
5671 309612 321191 335770 333722 369592 391050 440768 522827 596464 669976 810390 946297
$$ packed form
5760I8800K0901j7905k421j9713J1011j7225n462O677L717p844K1555J081J5600
5747A08772K4619k0701k1850j6934p95L6111J0693j9554N252j1496Q361j6880
5735H5598l1208N0114K3928j6399p823q816Q857l8186J2215M8030j7100l1764
5723G7446o393L3494J3046L1885j6825J7738J6582k2242k5448J2031k4367N141
5711A12088l6131o5L2781M390M3294q194p440p396j1848j5032o105P10k0251L8057
5697A18858L0426m209j9789l661l697j0488L6762l002K5576j1081o500j801J7791
5684A65185L2371k9820K1949J0980R07J5533p583K8930R879K6772J6605q112K6016
5671C09612J1579J4579k048L5870K1458M9718Q2059P3637P3512J40414J35907
$$ plain form
5660 946297 1167253 1351535 1290780 1137092 967669 837154 747558 752536 700412 675286 634559
5649 634559 588403 593504 592068 591438 620410 645492 656709 665860 676155 719327 792600 864866 896037
5636 896037 937475 1035894 1164641 1326442 1512706 1781400 2152395 2637158 3205049 3571591
5626 3571591 3384667 2917322 2470353 2095340 1811268 1604964 1454342 1349675 1258995 1177208
5616 1177208 1150828 1137962 1098320 1094779 1047760 1034224 1048144 1087239 1065020 1092282 1106888 1164287
5604 1164287 1254097 1345517 1462268 1628844 1814433 2090228 2500811 2992310 3572012 3875266
5594 3875266 3628064 3120706 2651631 2238994 1954164 1742461 1614069 1473207 1402985 1367455
5584 1367455 1287256 1199975 1158201 1142207 1128342 1149224 1186750 1210175 1199207 1176356 1190841
$$ packed form
5660I46297K20956J84282o0755j53688j69423j30515q9596M978n2124k5126m0727
5649F34559m6156N101j436o30K8972K5082J1217R151J0295M3172P3273P2266L1171
5636H96037M1438R8419J28747J61801J86264K68694L70995M84763N67891L66542
5626C571591j86924m67345m46969l75013k84072k06304j50622j04667r0680q1787
5616A177208k6380j2866l9642l541m7019j3536J3920L9095k2219K7262J4606N7399
5604A164287Q9810R1420J16751J66576J85589K75795M10583M91499N79702L03254
5594C875266k47202n07358m69075m12637k84830k11703j28392j40862p0222l5530
5584A367455q0199q7281m1774j5994j3865K0882L7526K3425j0968k2851J4485
$$ plain form
5573 1190841 1170527 1182591 1234208 1270612 1334009 1397134 1508719 1657622 1821417 2049792 2130779
5562 2130779 2052784 1877005 1769792 1641764 1572849 1529372 1503242 1471405 1399768 1382560 1390580
5551 1390580 1433222 1508676 1517967 1504692 1438254 1364660 1324972 1243645 1198528 1201700 1163563 1166057
5539 1166057 1133004 1115235 1122499 1136669 1171742 1165654 1202968 1236676 1224844 1217429 1206711 1217088
5527 1217088 1244301 1218251 1178458 1090682 1047077 1020126 973084 913447 842992 758570 768295 758962
5515 758962 705945 674117 670726 684273 656980 666757 673943 728588 768575 810150 843991 846138
5503 846138 868640 840708 844807 860091 853274 805611 739228 698140 633330 597516 580259 574688
5491 574688 527049 518774 495279 464797 478833 463300 463023 496964 524380 522713 546306 544659 547646
$$ packed form
5573A190841k0314J2064N1617L6404O3397O3125J11585J48903J63795K28375Q0987
5562B130779p7995j75779j07213j28028o8915m3477k6130l1837p1637j7208Q020
5551A390580M2642P5454R291j3275o6438p3594l9688q1327m5117L172l8137K494
5539A166057l3053j7769P264J4170L5073o088L7314L3708j1832p415j0718J0377
5527A217088K7213k6050l9793q7776m3605k6951m7042n9637p0455q4422R725r333
5515G58962n3017l1828l391J3547k7293R777P186N4645L9987M1575L3841K147
5503H46138K2502k7932M099J5284o817m7663o6383m1088o4810l5814j7257n571
5491E74688m7639q275k3495l0482J4036j5533k77L3941K7416j667K3593j647K987
$$ plain form
5478 547646 571921 606927 622854 626121 602623 593284 617555 645048 593028 552897 494786 467406
5466 467406 423502 374553 333975 363276 370800 378943 364677 385791 385343 384764 385843 365749 384926
5453 384926 411170 377251 394773 439618 445914 474447 448346 483243 504999 510167 535238 581665
5441 581665 591888 617524 655219 662902 633783 590678 539204 590755 554673 533941 512571 532659
5429 532659 569461 578225 565690 598032 616095 661460 705379 724452 739765 781903 795967 776308
5417 776308 804150 829958 875534 893038 976371 1050241 1118297 1103779 1067975 1017261 982965 982302
5405 982302 931953 897270 913415 915569 912076 940052 932937 945889 981106 1005546 1081346 1156520
5393 1156520 1186838 1130356 1083835 1043652 1013669 981433 989649 1020170 1047990 1066243 1024749 1002860
$$ packed form
5478E47646K4275L5006J5927L267k3498r339K4271K7493n2020m0131n8111k7380
5466D67406m3904m8949m0578K9301P524Q143j4266K1114m48n79J079k0094J9177
5453C84926K6244l3919J7522M4845O296K8533k6101L4897K1756N168K5071M6427
5441E81665J0223K5636L7695P683k9119m3105n1474N1551l6082k0732k1370K0088
5429E32659L6802Q764j2535L2342J8063M5365M3919J9073J5313M2138J4064j9659
5417G76308K7842K5808M5576J7504Q3333P3870O8056j4518l5804n0714l4296o63
5405I82302n0349l4683J6145K154l493K7976p115J2952L5217K4440P5800P5174
5393A156520L0318n6482m6521m0183k9983l2236Q216L0521K7820J8253m1494k1889
$$ plain form
5381 1002860 994740 977408 919459 903647 887554 907193 947569 977456 968945 896804 867825 841616
5369 841616 812409 809212 798588 747673 741362 722370 701234 649792 594895 577460 537263 502719
5357 502719 509071 500655 491641 456052 446790 446467 460197 427632 430879 431676 437867 439911 481605 536708
5343 536708 495452 464996 455484 421741 403986 335958 310974 330776 301879 278254 239889 233099
5331 233099 208023 200967 225803 250884 237705 232751 207803 206649 204913 200260 192447 193114 192227 180771
5317 180771 152185 149260 160328 160598 163306 175235 175357 178645 157598 180137 210504 199377 211635
5304 211635 204353 147843 139430 162567 170202 152132 161176 131063 143983 155203 156594 150180 159309
5291 159309 146674 141632 168593 161525 177458 158024 174809 180667 143450 168466 166191 166166 145806
$$ packed form
5381A002860q120j7332n7949j5812j6093J9639M0376K9887q511p2141k8979k6209
5369H41616k9207l197j0624n0915o311j8992k1136n1442n4897j7435m0197l4544
5357E02719O352q416r014l5589r262l23J3730l2565L247P97O191K044M1694N5103
5343E36708m1256l0456r512l3743j7755o8028k4984J9802k8897k3625l8365o790
5331B33099k5076p056K4836K5081j3179m954k4948j154j736m653p813O67q87j1456
5317A80771k8586k925J1068K70K708J1929J22L288k1047K2539L0367j1127J2258
5304B11635p282n6510q413K3137P635j8070R044l0113J2920J1220J391o414R129
5291A59309j2635n042K6961p068J5933j9434J6785N858l7217K5016k275k5k0360
$$ plain form
5278 145806 160309 174767 140961 101088 142276 178952 171023 137325 118179 140625 144432 151056
5266 151056 140944 151284 152152 148350 148668 166571 142279 125181 79672 97799 103134 116393 149706
5253 149706 159298 157291 153981 142188 130914 108713 110457 140826 129764 139350 126814 135737 151601
5240 151601 132845 130689 144738 165547 178452 184489 165112 97112 116208 120968 113634 116916 124834
5227 124834 142512 132844 125096 109048 163890 128534 99463 94841 125996 134372 128882 134599 130243
5214 130243 99580 109239 125924 145897 124658 93996 107564 90541 116345 135204 89114 55698
5202 55698 82518 131358 155846 169585 161486 170689 148248 117531 144245 154827 152110 144011 128598
5189 128598 96846 114390 149384 131199 137473 132479 121289 134338 141971 142314 157268 153512 146100
$$ packed form
5278A45806J4503J4458l3806l9873M1188L6676p929l3698j9146K2446L807O624
5266A51056j0112J0340Q68l802L18J7903k4292j7098m5509J8127N335J3259L3313
5253A49706R592k007l310j1793j1274k2201J744L0369j1062R586j2536Q923J5864
5240A51601j8756k156J4049K0809J2905O037j9377o8000J9096M760p334L282P918
5227A24834J7678r668p748j6048N4842l5356k9071m622L1155Q376n490N717m356
5214A30243l0663R659J6685J9973k1239l0662J3568j7023K5804J8859m6090l3416
5202E5698K6820M8840K4488J3739q099R203k2441l0717K6714J0582k717q099j5413
5189A28598l1752J7544L4994j8185O274m994j1190J3049P633L43J4954l756p412
$$ plain form
5176 146100 137163 100182 138624 127256 108813 134548 138655 133373 129700 144043 141481 145790 141622
5163 141622 137878 134345 151717 149122 147415 151204 150337 155037 129509 129821 117308 105901 109114 117415
5149 117415 108973 105782 124799 123582 119638 147940 114360 109984 158026 166518 159336 145102 157052
5136 157052 169915 165970 152663 137792 167264 124561 141630 178341 161855 187874 205518 193092
5124 193092 184504 175723 185667 179224 165583 153732 183844 185398 201356 241759 228044 217413 228035
5111 228035 192024 201019 194316 185622 200911 202812 177669 182879 233380 251428 271307 293191 321076
5098 321076 324354 324746 320829 338757 352513 368062 350835 366550 405438 438394 449280 513777
5086 513777 558494 595549 693876 771600 861637 887430 865040 814346 721195 650449 619753 599570
$$ packed form
5176A46100q937l6981L8442j1368j8443K5735M107n282l673J4343k562M309m168
5163A41622l744l533J7372k595j707L789q67M700k5528L12j2513j1407L213Q301
5149A17415q442l191J9017j217l944K8302l3580m376M8042Q492p182j4234J1950
5136A57052J2863l945j3307j4871K9472m2703J7069L6711j6486K6019J7644j2426
5124A93092q588q781R944o443j3641j1851L0112J554J5958M0403j3715j0631J0622
5111B28035l6011Q995o703q694J5289J901k5143N210N0501J8048J9879K1884K7885
5098C21076L278L92l917J7928J3756J5549j7227J5715L8888L2956J0886O4497
5086E13777M4717L7055R8327P7724R0037K5793k2390n0694r3151p0746l0696k0183
$$ plain form
5074 599570 581141 588436 616810 594902 555386 605914 612373 605002 627144 664231 696005 717502
5062 717502 752791 800293 847237 901850 974124 1034727 1053164 1125170 1213994 1300162 1366073 1454212
5050 1454212 1563176 1692546 1854402 2027132 2246637 2458124 2757143 3134465 3596183 4155851
5040 4155851 4890520 5777962 6369154 6507235 6615989 6947195 7610052 8297211 8450725 8312889
5030 8312889 8423136 8946026 9913873 10790930 10531218 9390173 8102223 7056198 6378478
5021 6378478 6023726 5850267 5738354 5699371 5455142 4967118 4379014 3866447 3470107 3164399
5011 3164399 2916617 2687787 2501000 2336878 2198160 2079260 1938608 1802436 1690316 1623429
5001 1623429 1557410 1465154 1375269 1329730 1292638 1256089 1201764 1145530 1103292 1063495 1010407
$$ packed form
5074E99570j8429P295K8374k1908l9516N0528O459p371K2142L7087L1774K1497
5062G17502L5289M7502M6944N4613P2274O0603J8437P2006Q8824Q6168O5911Q8139
5050A454212J08964J29370J61856J72730K19505K11487K99019L77322M61718N59668
5040D155851P34669Q87442N91192J38081J08754L31206O62857O87159J53514j37836
5030H312889J10247N22890R67847Q77057k59712j141045j287950j046025o77720
5021F378478l54752j73459j11913l8983k44229m88024n88104n12567l96340l05708
5011C164399k47782k28830j86787j64122j38718j18900j40652j36172j12120o6887
5001A623429o6019r2256q9885m5539l7092l6549n4325n6234m2238l9797n3088
$$ plain form
4990 1010407 991863 933650 899602 867955 800989 789620 788430 724132 681957 658326 645095 637819
4978 637819 654018 640430 598104 591888 566607 585971 562531 526726 550607 537383 514823 497720
4966 497720 488133 508256 474541 489376 471811 437727 460216 477574 471514 468417 474009 452023
4954 452023 454399 504982 463030 423450 406280 444336 434511 409641 415746 408576 421376 419787 418281
4941 418281 442908 449951 449109 472017 444558 471757 502793 532669 546797 545645 545335 553026 590890
4928 590890 615167 627021 622540 659294 707988 714523 706629 672731 680986 648025 653760 673094 640677
4915 640677 654821 636372 598188 586513 588704 559472 528990 554959 546241 537814 536710 501566
4903 501566 476562 465134 469543 450784 449036 443276 440171 461533 455042 427881 406664 398178 403156
$$ packed form
4990A010407j8544n8213l4048l1647o6966j1369j190o4298m2175k3631j3231p276
4978F37819J6199j3588m2326o216k5281J9364k3440l5805K3881j3224k2560j7103
4966D97720r587K0123l3715J4835j7565l4084K2489J7358o060l097N592k1986
4954D52023K376N0583m1952l9580j7170L8056r825k4870O105p170J2800j589j506
4941D18281K4627P043q42K2908k7459K7199L1036K9876J4128j152l10P691L7864
4928E90890K4277J1854m481L6754M8694O535p894l3898Q255l2961N735J9334l2417
4915F40677J4144j8449l8184j1675K191k9232l0482K5969q718q427j104l5144
4903E01566k5004j1428M409j8759j748n760l105K1362o491k7161k1217q486M978
$$ plain form
4890 403156 394315 407657 430783 424926 445869 466549 457568 477772 490126 475656 454619 450631
4878 450631 421690 429693 417751 404683 438001 445503 440514 449576 451872 443409 420873 418455 424321
4865 424321 456152 437223 442112 458288 411247 432597 474434 465423 489431 526397 545604 576635
4853 576635 514946 520131 529862 530455 509392 502550 483267 541147 557189 526645 528662 531474 523544
4840 523544 556729 592474 585922 629979 652149 666820 698639 714673 720870 769525 825383 905797
4828 905797 1002713 1069363 1142838 1146896 1087595 1009003 949501 914862 884908 868942 867986 889523
4816 889523 919878 917261 876169 888754 950380 987612 1002825 1035840 1046045 1086825 1097312 1110339
4804 1110339 1114121 1074836 1050322 1103821 1154190 1187624 1198437 1231277 1275199 1296873 1327094 1340591
$$ packed form
4890D03156q841J3342K3126n857K0943K0680q981K0204J2354j4470k1037l988
4878D50631k8941Q003j1942j3068L3318P502m989R062K296q463k2536k418N866
4865D24321L1831j8929M889J6176m7041K1350M1837r011K4008L6966J9207L1031
4853E76635o1689N185R731N93k1063o842j9283N7880J6042l0544K017K812p930
4840E23544L3185L5745o552M4057K2170J4671L1819J6034O197M8655N5858Q0414
4828I05797R6916O6650P3475M058n9301p8592n9502l4639k9954j5966r56K1537
4816H89523L0355k617m1092J2585O1626L7232J5213L3015J0205M0780J0487J3027
4804A110339L782l9285k4514N3499N0369L3434J0813L2840M3922K1674L0221J3497
$$ plain form
4792 1340591 1362153 1385554 1427559 1461796 1512534 1559896 1612493 1663501 1735685 1842450 1928470
4781 1928470 1994404 2100264 2221663 2325737 2416391 2505473 2587696 2743185 2882940 3037227
4771 3037227 3235712 3419107 3588033 3773592 4008539 4239714 4464383 4666776 4938051 5243291
4761 5243291 5582952 5946172 6279804 6613785 6967141 7453297 8098734 8886785 9865966 10923759
4751 10923759 11986050 12797022 13225186 13457067 13682641 13940554 14213700 14395642 14494836
4742 14494836 14617310 14856620 15219796 15591609 15956458 16326403 16811017 17355377 18004832
4733 18004832 18723403 19378548 19967222 20472057 20961987 21520095 22199455 22954922 23862821
4724 23862821 24974198 26240117 27621998 29047644 30188557 30554344 30074294 29204824 28183361
$$ packed form
4792A340591K1562K3401M2005L4237N0738M7362N2597N1008P2184J06765Q6020
4781A928470O5934J05860J21399J04074R0654Q9082Q2223J55489J39755J54287
4771C037227J98485J83395J68926J85559K34947K31175K24669K02393K71275L05240
4761E243291L39661L63220L33632L33981L53356M86156O45437P88051R79181J057793
4751A0923759J062291Q10972M28164K31881K25574K57913K73146J81942R9194
4742A4494836J22474K39310L63176L71813L64849L69945M84614N44360O49455
4733A8004832P18571O55145N88674N04835M89930N58108O79360P55467R07899
4724B3862821J111377J265919J381881J425646J140913L65787m80050q69470j021463
$$ plain form
4715 28183361 27229831 26388372 25651456 25003297 24434953 24027765 23601862 22993521 22247455
4706 22247455 21444512 20628596 19907413 19338976 18921801 18559976 18169164 17826247 17540420
4697 17540420 17389328 17324846 17341804 17331953 17208277 17047423 16941406 16854972 16567356 15810332
4687 15810332 14649372 13446709 12308781 11374388 10690523 10128317 9685960 9283637 8883760
4678 8883760 8493490 8087348 7695901 7351618 7077104 6777744 6484123 6205118 5970892 5721578
4668 5721578 5534473 5316193 5095159 4857836 4612121 4462631 4321073 4144034 4036078 3919763
4658 3919763 3757961 3591071 3482661 3345417 3216124 3135284 3041416 2940904 2908247 2858030
4648 2858030 2805605 2744413 2736539 2727688 2691168 2645816 2597413 2561500 2529579 2505843 2494997 2488010
$$ packed form
4715B8183361r53530q41459p36916o48159n68344m07188m25903o08341p46066
4706B2247455q02943q15916p21183n68437m17175l61825l90812l42917k85827
4697A7540420j51092o4482J6958r851j23676j60854j06017q6434k87616p57024
4687A5810332j160960j202663j137928r34393o83865n62206m42357m02323l99877
4678H883760l90270m06142l91447l44283k74514k99360k93621k79005k34226k49314
4668E721578j87105k18280k21034k37323k45715j49490j41558j77039j07956j16315
4658C919763j61802j66890j08410j37244j29293q0840r3868j00512l2657n0217
4648B858030n2425o1192p874q851l6520m5352m8403l5913l1921k3736j0846o987
$$ plain form
4636 2488010 2464034 2476388 2443752 2409377 2384201 2370766 2327517 2298106 2283024 2225215 2159276
4625 2159276 2104125 2038080 1989088 1936731 1911055 1847837 1791910 1731323 1671174 1668343 1655582 1612137
4613 1612137 1598985 1555689 1542830 1480141 1472256 1478747 1437823 1423810 1440414 1421605 1432584 1424583
4601 1424583 1374923 1310286 1308080 1339204 1278139 1253963 1210221 1199876 1190816 1175263 1124446 1102252
4589 1102252 1084115 1086202 1037043 969830 936971 918220 897030 856561 834564 826971 837395 810572
4577 810572 811020 780564 772322 806361 806769 792552 764341 738651 691964 674775 643382 646174 665828
4564 665828 675009 654866 659287 657908 639238 615985 560309 559370 607140 626670 601626 586044 584468
4551 584468 590455 595155 620350 576246 549853 537422 561385 528919 529232 572563 538313 543361 558139
$$ packed form
4636B488010k3976J2354l2636l4375k5176j3435m3249k9411j5082n7809o5939
4625B159276n5151o6045m8992n2357k5676o3218n5927o0587o0149k831j2761m3445
4613A612137j3152m3296j2859o2689p885O491m0924j4013J6604j8809J0979q001
4601A424583m9660o4637k206L1124o1065k4176m3742j0345r060j5553n0817k2194
4589A102252j8137K087m9159o7213l2859j8751k1190m0469k1997p593J0424k6823
4577H10572M48l0456q242L4039M08j4217k8211k5690m6687j7189l1393K792J9654
4564F65828R181k0143M421j379j8670k3253n5676r39M7770J9530k5044j5582j576
4551E84468N987M700K5195m4104k6393j2431K3963l2466L13M3331l4250N048J4778
$$ plain form
4538 558139 516833 516541 538682 540404 502109 511080 539977 537579 552560 573686 563628 560125 541342
4525 541342 524155 554612 548956 529403 532295 535468 553910 588654 597112 570010 552157 552867 538944
4512 538944 558998 551838 563648 565449 543541 539033 549539 576000 558057 562578 556551 515871 510521
4499 510521 513560 540448 519207 538137 526574 483413 508057 514029 502398 549883 497602 456138
4487 456138 468241 473328 480594 481317 488694 443168 426392 441691 428840 447113 477847 467674 482866
4474 482866 449414 439581 421729 398661 391029 416883 427287 411866 410318 410027 411754 399127 377939
4461 377939 366792 361980 379085 385551 399440 382161 347485 352645 399237 419743 412209 414411 420277
4448 420277 427536 438593 448668 403909 426320 436993 426818 410028 389558 387448 434558 423317
$$ packed form
4538E58139m1306k92K2141J722l8295Q971K8897k398J4981K1126j0058l503j8783
4525E41342j7187L0457n656j9553K892L173J8442L4744Q458k7102j7853P10j3923
4512E38944K0054p160J1810J801k1908m508J0506K6461j7943M521o027m0680n350
4499E10521L039K6888k1241J8930j1563m3161K4644N972j1631M7485n2281m1464
4487D56138J2103N087P266P23P377m5526j6776J5299j2851J8273L0734j0173J5192
4474D82866l3452r833j7852k3068p632K5854J0404j5421j548k91J727j2627k1188
4461C77939j1147m812J7105O466J3889j7279l4676N160M6592K0506p534K202N866
4448D20277P259J1057J0075m4759K2411J0673j0175j6790k0470k110M7110j1241
$$ plain form
4436 423317 434285 413879 426645 429989 417762 455014 454883 446711 456767 453738 444028 449023 431177
4423 431177 471573 449380 482763 513871 504092 509607 545449 515873 478163 478783 484124 527840 551590
4410 551590 534919 552703 598831 584243 563049 551287 561369 541463 518026 529302 552123 534270
4398 534270 517161 521027 522009 549464 556733 532989 521711 513607 544934 556735 534757 514244 529629
4385 529629 528530 555449 571456 528888 532878 559017 561390 549890 563934 575391 573751 552695
4373 552695 524133 517157 533350 555743 554959 531476 513352 531052 533539 515891 528171 515332
4361 515332 515304 537327 533852 521438 511962 530553 552167 553279 525598 513572 525813 530556 541292
4348 541292 582681 562272 531927 559816 577777 608515 628454 647909 632172 648157 649521 669723
$$ packed form
4436D23317J0968k0406J2766L344j2227L7252j31q172J0056l029r710M995j7846
4423D31177M0396k2193L3383L1108r779N515L5842k9576l7710O20N341M3716K3750
4410E51590j6671J7784M6128j4588k1194j1762J0082j9906k3437J1276K2821j7853
4398E34270j7109L866R82K7455P269k3744j1278q104L1327J1801k1978k0513J5385
4385E29629j099K6919J6007m2568L990K6139K373j1500J4044J1457j640k1056
4373E52695k8562o976J6193K2393p84k3483j8124J7700K487j7648J2280j2839
4361E15332k8K2023l475j2414r476J8591K1614J112k7681j2026J2241M743J0736
4348E41292M1389k0409l0345K7889J7961L0738J9939J9455j5737J5985J364K0202
$$ plain form
4336 669723 636004 644394 659783 630132 640724 610000 609995 644082 632838 637864 626112 615009 629869
4323 629869 646874 630456 633377 637513 644914 651640 655706 703598 714231 729633 712865 726218 738275
4310 738275 767714 784153 806273 781008 773971 788427 789871 826876 842634 850247 886272 889686
4298 889686 892668 906324 936176 953569 956944 973374 999746 995302 1007658 1066155 1063312 1088449
4286 1088449 1131636 1199604 1246945 1286603 1315872 1359083 1407214 1431313 1442470 1503768 1593069
4275 1593069 1663139 1741619 1850370 1922482 2020972 2110168 2193523 2286033 2400970 2507856 2615536
4264 2615536 2742534 2861955 2992818 3184036 3413213 3655043 3936049 4260712 4574281 4873889
4254 4873889 5168041 5447277 5688117 5922824 6185998 6417827 6706574 7007559 7387018 7857187
$$ packed form
4336F69723l3719Q390J5389k9651J0592l0724nL4087j1244N026j1752j1103J4860
4323F29869J7005j6418K921M136P401O726M066M7892J0633J5402j6768J3353J2057
4310G38275K9439J6439K2120k5265p037J4456J444L7005J5758P613L6025L414
4298H89686K982J3656K9852J7393L375J6430K6372m444J2356N8497k843K5137
4286A088449M3187O7968M7341L9658K9269M3211M8131K4099J1157O1298Q9301
4275A593069P0070P8480J08751P2112R8490Q9196Q3355R2510J14937J06886J07680
4264B615536J26998J19421J30863J91218K29177K41830K81006L24663L13569K99608
4254D873889K94152K79236K40840K34707K63174K31829K88747L00985L79459M70169
$$ plain form
4244 7857187 8433708 9073225 9742858 10421538 11117612 11782852 12396242 12949892 13442294 13841022
4234 13841022 14169844 14472259 14802369 15202600 15705792 16328414 17083248 17976502 18910641
4225 18910641 19861136 20847695 21810775 22644974 23309108 23694244 23779393 23612353 23306728 23087041
4215 23087041 23018681 23086259 23393820 23869263 24498670 25298046 26191650 27101731 27841082 28274383
4205 28274383 28156393 27526808 26518336 25375177 24231785 23243512 22528242 22067323 21851473
4196 21851473 21927259 22224669 22638637 23070686 23356294 23178375 22451527 21335337 20038048
4187 20038048 18626183 17266285 16146968 15271895 14596847 14060792 13790875 13655437 13618941
4178 13618941 13576278 13383756 12911204 12224933 11418819 10602120 9800230 9047000 8433911 7928433
$$ packed form
4244G857187N76521O39517O69633O78680O96074O65240O13390N53650M92402L98728
4234A3841022L28822L02415L30110M00231N03192O22622P54834Q93254R34139
4225A8910641R50495R86559R63080Q34199O64134L85136Q5149j67040l05625k19687
4215B3087041o8360O7578L07561M75443O29407P99376Q93604R10081P39351M33301
4205B8274383j17990o29585j008472j143159j143392r88273p15270m60919k15850
4196B1851473P5786K97410M13968M32049K85608j77919p26848j116190j297289
4187B0038048j411865j359898j119317q75073o75048n36055k69917j35438l6496
4178A3618941m2663j92522m72552o86271q06114q16699q01890p53230o13089n05478
$$ plain form
4168 7928433 7525135 7157838 6849094 6653314 6444759 6198667 5998392 5740516 5448475 5155869
4158 5155869 4915426 4647252 4378369 4193723 3988969 3821843 3662600 3505895 3400350 3299891
4148 3299891 3175931 3070565 2954109 2889092 2835104 2766260 2677497 2576188 2499695 2473915 2434234
4137 2434234 2379568 2302875 2238426 2215706 2215367 2138680 2078657 2032814 2023394 2055119 2019713 1963894
4125 1963894 1916637 1904012 1876122 1862862 1861442 1811202 1792391 1780796 1768937 1730430 1698414 1654204
4113 1654204 1593750 1636536 1644929 1629679 1575954 1576842 1594682 1562155 1547469 1541968 1552131 1526748
4101 1526748 1530572 1517562 1511097 1499004 1507275 1547917 1551127 1546152 1521836 1536573 1556939 1518896
4089 1518896 1472983 1487517 1504773 1512806 1525990 1537249 1528124 1498194 1490755 1541047 1539202 1549086
$$ packed form
4168G928433m03298l67297l08744j95780k08555k46092k00275k57876k92041k92606
4158E155869k40443k68174k68883j84646k04754j67126j59243j56705j05545j00459
4148C299891j23960j05366j16456o5017n3988o8844q8763j01309p6493k5780l9681
4137B434234n4666p6693o4449k2720l39p6687o0023m5843r420L1725l5406n5819
4125A963894m7257j2625k7890j3260j420n0240j8811j1595j1859l8507l2016m4210
4113A654204o0454M2786Q393j5250n3725Q88J7840l2527j4686n501J0163k5383
4101A526748L824j3010o465j2093Q271M0642L210m975k4316J4737K0366l8043
4089A518896m5913J4534J7256Q033J3184J1259r125k9930p439N0292j845R884
$$ plain form
4077 1549086 1591034 1612762 1627607 1649434 1690055 1749331 1753436 1779310 1796420 1879304 1971612 2045179
4065 2045179 2071145 2061668 2057369 2016472 2065150 2105176 2193664 2269112 2352229 2430694 2526664 2620133
4053 2620133 2681347 2720724 2695790 2707471 2734545 2738831 2740001 2784183 2823439 2865108 2989564 3129660
4041 3129660 3281625 3419361 3506669 3504365 3421001 3334144 3212744 3110009 3090069 3063497 3075277
4030 3075277 3128653 3227854 3269975 3314522 3416453 3451137 3405763 3328242 3274074 3199028 3106166
4019 3106166 3029779 2984349 2930204 2901882 2932659 2983383 2998542 3009774 2974098 2927595 2902165
4008 2902165 2855999 2812516 2791182 2826600 2831179 2831391 2827449 2815238 2806105 2765734 2774277 2767610 2746312
3995 2746312 2750929 2783386 2818325 2815114 2813893 2835189 2869315 2909503 2961176 2990730 3000735 3029129
$$ packed form
4077A549086M1948K1728J4845K1827M0621N9276M105K5874J7110Q2884R2308P3567
4065B045179K5966r477m299m0897M8678M0026Q8488P5448Q3117P8465R5970R3469
4053B620133O1214L9377k4934J1681K7074M286J170M4182L9256M1669J24456J40096
4041C129660J51965J37736Q7308k304q3364q6857j21400j02735j9940k6572J1780
4030C075277N3376R9201M2121M4547J01931L4684m5374p7521n4168p5046r2862
4019C106166p6387m5430n4145k8322L0777N0724J5159J1232l5676m6503k5430
4008B902165m6166m3483k1334L5418M579K12l942j2211r133m0371Q543o667k1298
3995B746312M617L2457L4939l211j221K1296L4126M0188N1673K9554J0005K8394
$$ plain form
3983 3029129 3080879 3122444 3150784 3169879 3227378 3330401 3397326 3476988 3529045 3582950 3636611
3972 3636611 3632415 3694202 3774991 3806192 3889702 3932485 3970650 3961461 3987173 4051300 4074650 4073208
3960 4073208 4097048 4166080 4256305 4317717 4296916 4290446 4283979 4276670 4319833 4349819 4401869 4461248
3948 4461248 4484899 4506481 4536405 4599289 4635614 4606935 4592566 4570594 4571675 4588420 4602505 4628859
3936 4628859 4602897 4544359 4538827 4573950 4570644 4618020 4633352 4665779 4784405 4908778 5047115
3925 5047115 5159090 5257605 5333537 5347936 5342801 5308386 5312788 5301720 5288579 5286764 5338329 5397079
3913 5397079 5506338 5602723 5755918 5965102 6180176 6390218 6600497 6848171 7113274 7442056
3903 7442056 7829229 8258856 8649118 8993989 9359750 9758941 10285395 10949290 11757448 12729355
$$ packed form
3983C029129N1750M1565K8340J9095N7499J03023O6925P9662N2057N3905N3661
3972C636611m196O1787Q0789L1201Q3510M2783L8165r189K5712O4127K3350j442
3960D073208K3840O9032R0225O1412k0801o470o467p309M3163K9986N2050N9379
3948D461248K3651K1582K9924O2884L6325k8679j4369k1972J081J6745J4085K6354
3936D628859k5962n8538n532L5123l306M7376J5332L2427J18626J24373J38337
3925E047115J11975R8515P5932J4399n135l4415M402j1068j3141j815N1565N8750
3913E397079J09259R6385J53195K09184K15074K10042K10279K47674K65103L28782
3903G442056L87173M29627L90262L44871L65761L99191N26454O63895Q08158R71907
$$ plain form
3893 12729355 13887915 15135737 16211895 16863810 17083881 17065750 17075817 17148533 17282521
3884 17282521 17452616 17669637 18110714 18782203 19712703 20701671 21671487 22529878 23130006
3875 23130006 23464874 23617019 23663757 23709741 23771417 23954640 24286686 24743820 25444772 26380606
3865 26380606 27632715 29199888 31002627 32980021 34803837 35798793 35403227 33893582
3857 33893582 31859119 29856195 28262177 27079398 26205585 25574168 25106833 24745867 24533714
3848 24533714 24500177 24530970 24584287 24567787 24386772 23940127 23142890 22136410 21047422 20102647
3838 20102647 19354287 18890792 18641189 18458342 18359704 18284345 18273834 18254734 18178571 17788736
3828 17788736 16944083 15924636 14861586 13929420 13203494 12586205 12112954 11734887 11389950
$$ packed form
3893A2729355J158560J247822J076158O51915K20071j8131J0067P2716J33988
3884A7282521J70095K17021M41077O71489R30500R88968R69816Q58391O00128
3875B3130006L34868J52145M6738M5984O1676J83223L32046M57134P00952R35834
3865B6380606J252109J567173J802739J977394J823816R94956l95566j509645
3857C3893582k034463k002924j594018j182779q73813o31417m67335l60966k12153
3848B4533714l3537L0793N3317j6500j81015m46645p97237j006480j088988r44775
3838B0102647p48360m63495k49603j82847r8638p5359j0511j9100p6163l89835
3828A7788736q44653j019447j063050r32166p25926o17289m73251l78067l44937
$$ plain form
3819 11389950 11042829 10682355 10298870 9962299 9625898 9325829 9074275 8864674 8695902
3810 8695902 8537406 8401895 8312215 8278265 8212043 8124528 8134407 8109308 8077376 8070086 8078837 8093851
3798 8093851 8083429 8118283 8101915 8033259 7917996 7854208 7760093 7647247 7608254 7571717 7540463
3787 7540463 7513245 7488722 7464758 7450928 7483973 7531721 7577390 7621481 7686889 7715189 7728392
3776 7728392 7772253 7804015 7832391 7916154 7990499 8059919 8128167 8176424 8277010 8375369 8413584
3765 8413584 8501358 8567190 8587210 8654829 8732062 8846514 8962615 9037240 9154211 9277578 9401760
3754 9401760 9528165 9665698 9843081 10014155 10187795 10380855 10539570 10707789 10890052 11097870
3744 11097870 11324469 11569810 11853280 12193118 12553318 12867283 13189415 13591946 14013914
$$ packed form
3819A1389950l47121l60474l83485l36571l36401l00069k51554k09601j68772
3810H695902j58496j35511q9680l3950o6222q7515R879k5099l1932p290Q751J5014
3798H093851j0422L4854j6368o8656j15263o3788r4115j12846l8993l6537l1254
3787G540463k7218k4523k3964j3830L3045M7748M5669M4091O5408K8300J3203
3776G728392M3861L1762K8376Q3763P4345O9420O8248M8257J00586R8359L8215
3765H413584Q7774O5832K0020O7619P7233J14452J16101P4625J16971J23367J24182
3754I401760J26405J37533J77383J71074J73640J93060J58715J68219J82263K07818
3744A1097870K26599K45341K83470L39838L60200L13965L22132M02531M21968
$$ plain form
3735 14013914 14458313 14959154 15461733 16049377 16644070 17284053 17958376 18748520 19613708
3726 19613708 20578503 21664529 22927447 24374009 25956669 27600606 29264454 30894479
3718 30894479 32324918 33539074 34522775 35240358 35684124 35894635 35919678 35855112 35824597 35835541
3708 35835541 35986815 36337293 36803586 37311203 37900110 38408380 38729473 38793758 38663970 38312677
3698 38312677 37697779 36882472 35920420 34956559 33967466 33018002 32185270 31449029 30774978
3689 30774978 30249175 29805181 29451489 29130594 28825248 28588603 28398831 28211068 28078274
3680 28078274 27975459 27893149 27736444 27590345 27494454 27355556 27201024 27088505 26990915 26883221
3670 26883221 26756475 26624001 26513433 26376709 26209622 26090002 25941488 25761907 25628241
$$ packed form
3735A4013914M44399N00841N02579N87644N94693O39983O74323P90144Q65188
3726A9613708R64795J086026J262918J446562J582660J643937J663848J630025
3718C0894479J430439J214156R83701P17583M43766K10511K5043o4566l0515J0944
3708C5835541J51274L50478M66293N07617N88907N08270L21093O4285j29788l51293
3698C8312677o14898q15307r62052r63861r89093r49464q32732p36241o74051
3689C0774978n25803m43994l53692l20895l05346k36645j89772j87763j32794
3680B8078274j02815q2310j56705j46099r5891j38898j54532j12519r7590j07694
3670B6883221j26746j32474j10568j36724j67087j19620j48514j79581j33666
$$ plain form
3661 25628241 25431610 25197769 24934956 24670771 24414907 24134980 23858426 23635859 23392062
3652 23392062 23077355 22823067 22525444 22234364 21969448 21715060 21455757 21185751 20928486
3643 20928486 20704321 20468051 20268593 20043149 19822631 19666803 19493645 19343753 19177163
3634 19177163 19042601 18861766 18702853 18570343 18395051 18229175 18073744 17891893 17719513
3625 17719513 17587757 17500373 17388401 17258863 17186581 17164333 17134013 17073261 17035142 17014658 16985572
3614 16985572 16985795 16987357 16968874 17011623 17063345 17074082 17129303 17223078 17331915 17490991 17652763
3603 17652763 17891992 18159275 18471899 18797443 19191265 19690569 20237410 20938730 21683444
3594 21683444 22535083 23501994 24569737 25854366 27350590 29152182 31274089 33842421
$$ packed form
3661B5628241j96631k33841k62813k64185k55864k79927k76554k22567k43797
3652B3392062l14707k54288k97623k91080k64916k54388k59303k70006k57265
3643B0928486k24165k36270j99458k25444k20518j55828j73158j49892j66590
3634A9177163j34562j80835j58913j32510j75292j65876j55431j81851j72380
3625A7719513j31756q7384j11972j29538p2282k2248l0320o0752l8119k0484k9086
3614A6985572K23J562j8483M2749N1722J0737N5221R3775J08837J59076J61772
3603A7652763K39229K67283L12624L25544L93822M99304N46841P01320P44714
3594B1683444Q51639R66911J067743J284629J496224J801592K121907K568332
$$ plain form
3586 33842421 36910152 40434415 44379674 48588439 52846339 56906198 60600414 63707876
3578 63707876 66098677 67766752 68697536 68921012 68620355 68053991 67448997 67090502 67122635
3569 67122635 67491982 68237434 69176572 69989685 70443254 70385596 69713804 68357076 66308801
3560 66308801 63608530 60325019 56617610 52779050 49071564 45489209 42156821 39168793
3552 39168793 36557479 34303888 32413901 30778770 29363689 28116704 27009799 26074910
3544 26074910 25256600 24509705 23908486 23396657 23029896 22755583 22543660 22432368 22387845 22446325
3534 22446325 22614796 22869341 23235596 23775256 24453860 25274510 26271915 27443702 28868836
3525 28868836 30477282 32257804 34246041 36295522 38277440 40221750 42051030 43852570
$$ packed form
3586C3842421L067731L524263L945259M208765M257900M059859L694216L107462
3578F3707876K390801J668075R30784K23476l00657n66364o04994l58495L2133
3569F7122635L69347P45452R39138Q13113M53569n7658o71792j356728k048275
3560F6308801k700271l283511l707409l838560l707486l582355l332388k988028
3552C9168793k611314k253591j889987j635131j415081j246985j106905r34889
3544B6074910q18310p46895o01219n11829l66761k74313k11923j11292m4523N8480
3534B2446325J68471K54545L66255N39660O78604Q20650R97405J171787J425134
3525B8868836J608446J780522J988237K049481J981918J944310J829280J801540
$$ plain form
3517 43852570 45559259 47238888 48816325 50194278 51378517 52274308 52921948 53368923 53567526
3508 53567526 53553709 53400888 53097022 52604000 51933055 51194393 50301222 49285103 48165665
3499 48165665 46906039 45578359 44206626 42780131 41413596 40092159 38845049 37680461
3491 37680461 36714053 35881734 35207398 34733258 34509824 34529027 34894961 35580254 36652186
3482 36652186 38106510 39707302 40621717 40859868 41159002 41922689 43321906 45212366 47351413
3473 47351413 49404844 51508857 53927170 56590190 59530769 62534405 65565144 68570078
3465 68570078 71439106 74196819 76881102 79513424 82287125 85347718 88976592 93277306
3457 93277306 98366119 104450171 111631250 119889184 129037346 138056951 146042046 152933670
$$ packed form
3517D3852570J706689J679629J577437J377953J184239Q95791O47640M46975J98603
3508E3567526j3817j52821l03866m93022o70945p38662q93171j016119j119438
3499D8165665j259626j327680j371733j426495j366535j321437j247110j164588
3491C7680461r66408q32319o74336m74140k23434J9203L65934O85293J071932
3482C6652186J454324J600792R14415K38151K99134P63687J399217J890460K139047
3473D7351413K053431K104013K418313K663020K940579L003636L030739L004934
3465F8570078K869028K757713K684283K632322K773701L060593L628874M300714
3457I3277306N088813O084052P181079Q257934R148162R019605P985095O891624
$$ plain form
3449 152933670 158762386 163386120 166608310 168225081 167843396 165699861 162447270 158648570
3441 158648570 154946172 151858358 149632325 148293214 147636800 147405805 147306820 147151459 146652559
3432 146652559 145546757 143465854 140201932 135706753 130100659 123728769 116969196 110174291
3424 110174291 103581760 97476103 91936934 86675180 81451994 76584854 72343357 68830404
3416 68830404 65961038 63658155 61889366 60535924 59552244 58969627 58844434 59089393 59785110
3407 59785110 60908237 62611370 64930562 67970359 71734768 76252477 81310937 86653417
3399 86653417 91924655 96915253 101625304 106155743 110588227 114869215 118884281 122531303
3391 122531303 125568196 127884262 128918486 128466504 127397072 126557616 126445062 127354155 129332148
$$ packed form
3449A52933670N828716M623734L222190J616771l81685k143535l252591l798700
3441A58648570l702398l087814k226033j339111o56414k30995r8985j55361m98900
3432A46652559j105802k080903l263922m495179n606094o371890o759573o794905
3424A10174291o592531o105657n539169n261754n223186m867140m241497l512953
3416F8830404k869366k302883j768789j353442r83680n82617j25193K44959O95717
3407E9785110J123127J703133K319192L039797L764409M517709N058460N342480
3399H6653417N271238M990598M710051M530439M432484M280988M015066L647022
3391A22531303L036893K316066J034224m51982j069432q39456j12554R09093J977993
$$ plain form
3382 129332148 131746093 131208937 127392980 122863639 118717198 115316618 112104137 108819937
3374 108819937 105340132 101578707 97439094 92955754 88198308 83316614 78498098 73905163
3366 73905163 69645798 65761377 62278075 59239348 56658227 54652508 53258916 52528030
3358 52528030 52548919 53146237 54197028 56103303 57799761 56133919 51804959 47227596 43415965
3349 43415965 40659002 38540684 36950797 35693463 34816625 34261394 34050511 34103737 34372066
3340 34372066 34556566 34495837 34169679 33679949 33214125 32658245 32067697 31639482 31342399 31244027
3330 31244027 31218544 31309986 31451405 31719493 31966788 32245031 32469041 32470364 32161152 31674206
3320 31674206 31114362 30558455 30075459 29722126 29484868 29373302 29487471 29823903 30041834
$$ packed form
3382A29332148K413945n37156l815957m529341m146441l400580l212481l284200
3374A08819937l479805l761425m139613m483340m757446m881694m818516m592935
3366G3905163m259365l884421l483302l038727k581121k005719j393592p30886
3358E2528030K0889N97318J050791J906275J696458j665842m328960m577363l811631
3349D3415965k756963k118318j589887j257334q76838n55231k10883N3226K68329
3340C4372066J84500o0729l26158m89730m65824n55880n90548m28215k97083r8372
3330C1244027k5483R1442J41419K68088K47295K78243K24010J323l09212m86946
3320C1674206n59844n55907m82996l53333k37258j11566J14169L36432K17931
$$ plain form
3311 30041834 30129963 30107754 29986114 29959396 29929237 29975499 30292301 30966602 31903674 33036071
3301 33036071 34325939 35703603 37249891 38888724 40681907 42604213 44574155 46586387
3293 46586387 48545363 50454739 52453292 54534869 56851040 59472135 62374472 65418795
3285 65418795 68451794 71335717 73940252 76372347 78777467 81291268 83878894 86279470
3277 86279470 88082166 89120660 89221371 88622370 87397472 85603311 83244295 80280372
3269 80280372 76690553 72599798 68119866 63535038 58986134 54538299 50237133 46260724
3261 46260724 42617652 39274858 36350413 33752766 31465071 29473638 27664848 26036617
3253 26036617 24643467 23367732 22135239 21036626 20087312 19165293 18329501 17637645 16980054
$$ packed form
3311C0041834Q8129k2209j21640k6718l0159M6262L16802O74301R37072J132397
3301C3036071J289868J377664J546288J638833J793183J922306J969942K012232
3293D6586387J958976J909376J998553K081577K316171K621095K902337L044323
3285F5418795L032999K883923K604535K432095K405120K513801K587626K400576
3277H6279470J802696J038494J00711n99001j224898j794161k359016k963923
3269H0280372l589819m090755m479932m584828m548904m447835m301166l976409
3261D6260724l643072l342794k924445k597647k287695j991433j808790j628231
3253B6036617j393150j275735j232493j098613r49314r22019q35792o91856o57591
$$ plain form
3244 16980054 16345160 15769913 15255419 14810680 14391600 14058567 13754559 13489152 13246318
3235 13246318 13028083 12859058 12695595 12523644 12328764 12131735 11929487 11726963 11492742
3226 11492742 11308605 11168440 11017039 10812121 10644710 10506011 10387199 10295591 10249797 10194541
3216 10194541 10118900 9992550 9839486 9690369 9511128 9292378 9088507 8821538 8596301 8283060
3206 8283060 8000484 7764610 7545448 7376570 7199701 7014276 6866930 6730733 6595242 6450786
3196 6450786 6318059 6163137 6034137 6010140 5982748 5930809 5833704 5739231 5629834 5568368 5546121
3185 5546121 5538198 5495169 5486520 5480550 5435440 5384340 5340469 5315269 5302992 5276498 5292925 5276056
3173 5276056 5266911 5244540 5249554 5271683 5300557 5336264 5353799 5346247 5412514 5442049 5471606 5517963
$$ packed form
3244A6980054o34894n75247n14494m44739m19080l33033l04008k65407k42834
3235A3246318k18235j69025j63463j71951j94880j97029k02248k02524k34221
3226A1492742j84137j40165j51401k04918j67411j38699j18812r1608m5794n5256
3216A0194541p5641j26350j53064j49117j79241k18750k03871k66969k25237l13241
3206H283060k82576k35874k19162j68878j76869j85425j47346j36197j35491j44456
3196F450786j32727j54922j29000k3997k7392n1939r7105r4473j09397o1466k2247
3185E546121p923m3029q649n970m5110n1100m3871k5200j2277k6494J6427j6869
3173E276056r145k2371N014K2129K8874L5707J7535p552O6267K9535K9557M6357
$$ plain form
3161 5517963 5520117 5507914 5472357 5476842 5497836 5473782 5492976 5499485 5472034 5470972 5483924 5433843
3149 5433843 5402479 5406628 5404484 5436608 5427962 5401581 5403458 5403116 5404663 5399195 5419848 5412681 5440075
3136 5440075 5467809 5468553 5458976 5478443 5521103 5544300 5514943 5515054 5546906 5597483 5662745 5662534 5718996
3123 5718996 5851811 6037447 6198609 6344264 6524530 6703077 6853053 7021461 7174650 7311070
3113 7311070 7472743 7646251 7815052 7982856 8160839 8376023 8613937 8844305 9121327 9356155
3103 9356155 9558328 9810127 10083645 10337017 10631457 10972916 11274155 11589960 11951026 12304422
3093 12304422 12646532 12994599 13337204 13708550 14060411 14462921 14934677 15415543 15958864
3084 15958864 16555525 17252985 18034222 18877173 19843657 20886467 22103536 23475830 24940088
$$ packed form
3161E517963K154j2203l5557M485K0994k4054J9194O509k7451j062J2952n0081
3149E433843l1364M149k144L2124q646k6381J877l42J547n468K0653p167K7394
3136E440075K7734P44r577J9467M2660K3197k9357J11L1852N0577O5262k11N6462
3123E718996J32815J85636J61162J45655J80266J78547J49976J68408J53189J36420
3113G311070J61673J73508J68801J67804J77983K15184K37914K30368K77022K34828
3103I356155K02173K51799K73518K53372K94440L41459L01239L15805L61066L53396
3093A2304422L42110L48067L42605L71346L51861M02510M71756M80866N43321
3084A5958864N96661O97460P81237Q42951R66484J042810J217069J372294J464258
$$ plain form
3075 24940088 26450243 28016052 29730713 31706364 33896491 36356203 39064267 42119592
3067 42119592 45552194 49371386 53722133 58688625 64299121 70698513 77971974 85990630
3059 85990630 94854518 104868554 116666260 130892475 148208715 169222911 194259707
3052 194259707 222596418 251181133 274710836 291647942 308199483 333209828 371715089
3045 371715089 419142270 456458073 459766992 425064581 370138257 314572466 268328695
3038 268328695 232560527 204913158 183104940 165596987 151300007 139114703 128184112
3031 128184112 118070191 108799098 100504313 93204285 86761827 81037818 75903245 71203977
3023 71203977 66887002 62864507 59139577 55764272 52647424 49782425 47158219 44717586
$$ packed form
3075B4940088J510155J565809J714661J975651K190127K459712K708064L055325
3067D2119592L432602L819192M350747M966492N610496O399392P273461Q018656
3059H5990630Q863888J0014036J1797706J4226215J7316240K1014196K5036796
3052A94259707K8336711K8584715K3529703J6937106J6551541K5010345L8505261
3045C71715089M7427181L7315803L308919l4702411n4926324n5565791m6243771
3038B68328695l5768168k7647369k1808218j7507953j4296980j2185304j0930591
3031A28184112j0113921r271093q294785p300028o442458n724009n134573m699268
3023G1203977m316975m022495l724930l375305l116848k864999k624206k440633
$$ plain form
3015 44717586 42472137 40310203 38295469 36503912 34908642 33529851 32276999 31071658
3007 31071658 29903871 28760194 27668793 26578419 25536251 24462077 23434878 22416959
2999 22416959 21408093 20449765 19548763 18696841 17992666 17402208 16799893 16270738 15827571
2990 15827571 15385207 14947075 14533406 14083240 13708926 13338589 12963909 12652374 12326146
2981 12326146 11988559 11690922 11392020 11076221 10825437 10583884 10367510 10117259 9907237
2972 9907237 9674154 9500457 9311120 9162447 9002379 8876527 8755902 8643525 8485907 8337647
2962 8337647 8229382 8057764 7862408 7693934 7555736 7380983 7221482 7072323 6923515 6827315
2952 6827315 6741351 6682627 6643325 6547726 6447992 6384583 6298500 6199416 6100568 5998155 5899100
$$ packed form
3015D4717586k245449k161934k014734j791557j595270j378791j252852j205341
3007C1071658j167787j143677j091401j090374j042168j074174j027199j017919
2999B2416959j008866r58328r01002q51922p04175n90458o02315n29155m43167
2990A5827571m42364m38132m13669m50166l74314l70337l74680l11535l26228
2981A2326146l37587k97637k98902l15799k50784k41553k16374k50251k10022
2972I907237k33083j73697j89337j48673j60068j25852j20625j12377j57618j48260
2962H337647j08265j71618j95356j68474j38198j74753j59501j49159j48808r6200
2952F827315q5964n8724l9302r5599r9734o3409q6083r9084r8848j02413r9055
$$ plain form
2941 5899100 5796896 5714329 5613346 5514095 5412366 5343520 5226528 5151709 5112029 5046996 4963243
2930 4963243 4919990 4857979 4793043 4717198 4646539 4577251 4526960 4454466 4374891 4311785 4274234
2919 4274234 4192208 4132378 4119045 4066551 3992220 3929990 3908102 3892437 3873346 3793569 3743952
2908 3743952 3721384 3666597 3604040 3528463 3487941 3421040 3375097 3368132 3341491 3270850 3165711
2897 3165711 3114863 3050991 3005145 2965555 2913721 2888257 2822680 2763114 2674257 2618921 2548783
2886 2548783 2526629 2507502 2465655 2437052 2445200 2424991 2365318 2311690 2220286 2175119 2166492 2154470
2874 2154470 2109917 2045444 2007030 1959459 1926396 1872571 1826706 1777237 1680824 1651469 1605667
2863 1605667 1547251 1488587 1464412 1426467 1410473 1400011 1416661 1439056 1436970 1468098 1512448 1513708
$$ packed form
2941E899100j02204q2567j00983r9251j01729o8846j16992p4819l9680o5033q3753
2930D963243m3253o2011o4936p5845p0659o9288n0291p2494p9575o3106l7551
2919D274234q2026n9830j3333n2494p4331o2230k1888j5665j9091p9777m9617
2908C743952k2568n4787o2557p5577m0522o6901m5943o965k6641p0641j05139
2897C165711n0848o3872m5846l9590n1834k5464o5577n9566q8857n5336p0138
2886B548783k2154j9127m1847k8603Q148k0209n9673n3628r1404m5167q627j2022
2874B154470m4553o4473l8414m7571l3063n3825m5865m9469r6413k9355m5802
2863A605667n8416n8664k4175l7945j5994j0462J6650K2395k086L1128M4350J260
$$ plain form
2851 1513708 1516644 1549945 1535117 1537130 1519907 1519418 1524365 1489983 1440130 1383871 1383944 1400810 1383401
2838 1383401 1351750 1333553 1316422 1298907 1264232 1260393 1242441 1201613 1172615 1178704 1208439 1182232
2826 1182232 1143550 1130352 1135976 1105838 1120173 1173076 1168783 1155272 1151491 1158040 1189281 1156552
2814 1156552 1145323 1141044 1100437 1089565 1094808 1109813 1121397 1072994 1055345 1088351 1075465 1053159
2802 1053159 1042604 1066653 1068359 1068359 1050031 1037303 1023709 1018309 1056468 1060302 1025088 995987 986181
2789 986181 956085 975044 973219 974354 937541 951229 1007019 971894 996997 999216 1024019 1083648
2777 1083648 1126200 1126590 1146823 1170124 1260995 1351454 1481342 1586320 1736197 1876343 1982962
2766 1982962 2081756 2189474 2335222 2509644 2774920 2985257 3052839 2879810 2602249 2305545
$$ packed form
2851A513708K936L3301j4828K013j7223m89M947l4382m9853n6259P3J6866j7409
2838A383401l1651j8197j7131j7515l4675l839j7952m0828k8998O089K9735k6207
2826A182232l8682j3198N624l0138J4335N2903m293j3511l781O549L1241l2729
2814A156552j1229m279m0607j0872N243J5005J1584m8403j7649L3006j2886k2306
2802A053159j0555K4049J706%j8328j2728j3594n400L8159L834l5214k9101r806
2789I86181l0096J8959j825J135l6813J3688N5790l5125K5103K219K4803N9629
2777A083648M2552L90K0233K3301R0871R0459J29888J04978J49877J40146J06619
2766A982962R8794J07718J45748J74422K65276K10337O7582j73029k77561k96704
$$ plain form
2756 2305545 1988545 1773446 1626636 1501633 1413614 1321157 1263110 1186749 1114577 1040813 991933
2745 991933 979926 941261 893063 873459 883224 825465 779183 768822 741567 729154 688830 691743
2733 691743 641666 625569 619072 592027 548744 523102 533924 507153 501822 513060 530449 534546
2721 534546 531903 549531 539818 492096 528563 515645 537997 523690 494779 473157 476477 498764
2709 498764 491581 491152 451771 446843 439619 419292 419323 413532 396139 435574 426249 408396 385667 409684
2695 409684 441113 438325 402569 400160 431640 443289 423835 397424 387197 383285 373941 341947
2683 341947 317659 334789 324334 291609 279743 288332 322618 304002 296848 304142 339813 317329
2671 317329 279933 281405 272252 297221 321524 311413 299053 301170 311984 277089 279958 285295 279582
$$ packed form
2756B305545l17000k15099j46810j25003q8019r2457n8047p6361p2172p3764m8880
2745I91933j2007l8665m8198j9604R765n7759m6282j0361k7255j2413m0324K913
2733F91743n0077j6097o497k7045m3283k5642J0822k6771n331J1238J7389M097
2721E34546k643J7628r713m7722L6467j2918K2352j4307k8911k1622L320K2287
2709D98764p183m29l9381m928p224k0327L1n791j7393L9435r325j7853k2729K4017
2695D09684L1429k788l5756k409L1480J1649j9454k6411j0227l912r344l1994
2683C41947k4288J7130j0455l2725j1866Q589L4286j8616p154P294L5671k2484
2671C17329l7396J472r153K4969K4303j0111j2360K117J0814l4895K869N337n713
$$ plain form
2658 279582 312933 315784 342931 313692 316839 302531 246359 241749 238045 229526 209062 204977 311876
2645 311876 284722 242615 273091 254431 256082 242244 234320 227405 222939 213367 189812 212960 182824
2632 182824 167006 195936 199950 195083 149628 141373 169650 196036 171383 161863 181979 195664
2620 195664 191587 154557 134197 150502 148925 139865 123403 103983 115159 153386 151824 143445 136789
2607 136789 153239 158157 171869 111508 88104 126112 126669 138751 138833 144367 140931 113695 119015
2594 119015 96494 83982 106148 114553 112413 103875 86858 79449 120954 123531 95449 81529 82490
2581 82490 119604 101376 85031 102457 100601 105778 114199 105482 89093 106568 123496 130336 126943
2568 126943 110869 110317 139974 121063 79903 101375 90340 97340 67234 63492 141406 166828
$$ packed form
2658B79582L3351K851K7147k9239L147j4308n6172m610l704q519k0464m085J06899
2645C11876k7154m2107L0476j8660J651j3838p924o915m466r572k3555K3148l0136
2632A82824j5818K8930M014m867m5455q255K8277K6386k4653r520K0116J3685
2620A95664m077l7030k0360J6305j577r060j6462j9420J1176L8227j562q379o656
2607A36789J6450M918J3712o0361k3404L8008N57J2082Q2N534l436k7236N320
2594A19015k2521j2512K2166Q405k140q538j7017p409M1505K577k8082j3920R61
2581H2490L7114j8228j6345J7426j856N177Q421q717j6389J7475J6928O840l393
2568A26943j6074n52K9657j8911m1160K1472j1035P000l0106l742P7914K5422
$$ plain form
2556 166828 165506 141987 144473 116196 169517 192803 143178 131960 146769 158320 148269 134635
2544 134635 109523 107714 121575 102010 66926 71831 57331 54319 55050 43613 32160 26550 47768
2531 47768 55602 53409 53051 47478 49579 67784 62823 81848 47462 20399 40532 40957 41258 59897
2517 59897 32655 38647 33699 19081 34118 23533 30207 44297 48557 68868 33598 16820 33781
2504 33781 31930 34765 17795 8687 -5978 31317 58154 33156 24329 46330 49191 39503 23932
2491 23932 3390 34215 39637 32875 44693 72939 86937 32278 13565 26019 51468 56011
2479 56011 53550 56633 43874 28674 58967 38337 55499 42462 18913 22109 53303 47200 33125
2466 33125 30481 36471 49517 10807 -14491 -9428 -1255 22171 19679 38821 43875 31866 45867
$$ packed form
2556A66828j322k3519K486k8277N3321K3286m9625j1218J4809J1551j0051j3634
2544A34635k5112j809J3861j9565l5084M905j4500l012P31j1437j1453n610K1218
2531D7768P834k193l58n573K101J8205m961J9025l4386k7063K0133M25L01J8639
2517E9897k7242N992m948j4618J5037j0585O674J4090M260K0311l5270j6778J6961
2504C3781j851K835j6970r108j4665L7295K6837k4998q827K2001K861r688j5571
2491B3932k0542L0825N422o762J1818K8246J3998n4659j8713J2454K5449M543
2479E6011k461L083j2759j5200L0293k0630J7162j3037k3549L196L1194o103j4075
2466C3125k644N990J3046l8710k5298N063Q173K3426k492J9142N054j2009J4001
$$ plain form
2453 45867 60080 40808 45566 70461 71821 49904 50407 58394 68341 82289 49046 55834 63550
2440 63550 40081 26775 48118 35043 10929 11110 43992 50358 50114 51083 21872 1302 47445
2427 47445 27734 24406 22556 55714 31961 3121 13096 30636 14675 23132 28260 48049 48636
2414 48636 27985 47538 27503 40738 21380 30763 45093 58498 56045 25286 32976 57840
2402 57840 43915 25001 27721 41677 59569 75775 52223 42405 49642 61730 78406 58253
2390 58253 54953 72068 73433 46203 43927 51112 60173 70914 104793 113251 92922 68368 52987
2377 52987 95223 91635 127851 102104 103391 145608 100202 64327 41261 51925 62242 88562
2365 88562 68769 55016 61085 104013 124575 121189 117843 122876 126983 135824 151322 130054 141200
$$ packed form
2453D5867J4213j9272M758K4895J360k1917N03P987R947J3948l3243O788P716
2440F3550k3469j3306K1343j3075k4114J81L2882O366k44R69k9211k0570M6143
2427D7445j9711l328j850L3158k3753k8840R975J7540j5961Q457N128J9789N87
2414D8636k0651J9553k0035J3235j9358R383J4330J3405k453l0759P690K4864
2402E7840j3925j8914K720J3956J7892J6206k3552r818P237J2088J6676k0153
2390E8253l300J7115J365k7230k276P185R061J0741L3879Q458k0329k4554j5381
2377E2987M2236l588L6216k5747J287M2217m5406l5875k3066J0664J0317K6320
2365H8562j9793j3753O069M2928K0562l386l346N033M107Q841J5498k1268J1146
$$ plain form
2352 141200 198585 197976 165343 183252 166004 160577 175047 169542 134702 152301 188156 158947
2340 158947 214506 225577 222162 230598 218895 225843 237942 269900 258147 295954 315961 337004
2328 337004 316001 326610 317991 317322 360010 393094 414706 411563 455167 513532 536881 569049
2316 569049 625342 653725 688226 706511 751663 823958 902787 945046 1048382 1171683 1244345
2305 1244345 1363124 1545679 1688738 1879917 2136109 2414681 2598931 2696541 2855559 3082902
2295 3082902 3348367 3669867 4105937 4693890 5498438 6441779 7719800 9454894 11883685
2286 11883685 15187414 18677282 18919397 16149607 13019036 10445994 8794141 7533931
2278 7533931 6595525 5826799 5191579 4673482 4283348 3983053 3769726 3589497 3417958 3179231
$$ packed form
2352A41200N7385o09l2633J7909j7248n427J4470n505l4840J7599L5855k9209
2340A58947N5559J1071l415Q436j1703O948J2099L1958j1753L7807K0007K1043
2328C37004k1003J0609q619o69M2688L3084K1612l143M3604N8365K3349L2168
2316E69049N6293K8383L4501J8285M5152P2295P8829M2259J03336J23301P2662
2305A244345J18779J82555J43059J91179K56192K78572J84250R7610J59018K27343
2295C082902K65465L21500M36070N87953Q04548R43341J278021J735094K428791
2286A1883685L303729L489868K42115k769790l130571k573042j651853j260210
2278G533931r38406p68726o35220n18097l90134l00295k13327j80229j71539k38727
$$ plain form
2268 3179231 2915784 2678629 2447855 2268777 2125486 1992624 1878526 1730009 1637817 1516217
2258 1516217 1450571 1384787 1276044 1175247 1134349 1091988 1027778 985030 944623 898590 883067
2247 883067 864274 837940 810617 746417 734291 699504 628211 593927 574396 559704 516525 484455
2235 484455 451722 449344 416489 399776 393660 376157 355597 366258 365405 366626 368761 349183 308227
2222 308227 271614 254025 257226 255136 237728 255644 263103 244685 220589 242596 212600 203554
2210 203554 190383 222242 222327 200757 191634 210033 193259 184507 174876 156463 173332 183819 178074
2197 178074 169611 167241 143703 152851 148189 131468 113355 121029 135019 134702 113048 122944 143132
2184 143132 109519 114667 114563 130417 160144 141226 120318 134697 137625 113060 73482 85070
$$ packed form
2268C179231k63447k37155k30774j79078j43291j32862j14098j48517r2192j21600
2258A516217o5646o5784j08743j00797m0898m2361o4210m2748m0407m6033j5523
2247H83067j8793k6334k7323o4200j2126l4787p1293l4284j9531j4692m3179l2070
2235D84455l2733k378l2855j6713o116j7503k0560J0661q53J221K135j9578m0956
2222C08227l6613j7589L201k090j7408J7916P459j8418k4096K2007k9996r046
2210B03554j3171L1859Q5k1570r123J8399j6774q752r631j8413J6869J0487n745
2197A78074q463k370k3538R148m662j6721j8113P674J3990l17k1654R896K0188
2184A43132l3613N148j04J5854K9727j8918k0908J4379K928k4565l9578J1588
$$ plain form
2172 85070 104322 116042 90929 57910 62292 60465 69443 58284 53646 75278 64057 54439 56936
2159 56936 43032 82886 65943 54037 34848 79098 93167 90903 93114 83659 68764 87079
2147 87079 86298 81340 87871 72556 56512 41447 44254 79834 76459 68827 77396 42911 22723
2134 22723 25275 35240 20739 26849 49608 18922 5021 15888 18395 10819 -5877 16602 13877
2121 13877 9584 26694 32756 20258 13814 7459 3488 6192 -11644 -39014 -6916 -33782 3929
2108 3929 21084 15016 4151 -8069 -34924 -16153 -4459 16163 14150 5624 4271 5672 10548
2095 10548 34457 29006 16862 25443 15409 22073 6460 -29304 -53787 -51567 -30667 -17733 -46221
2082 -46221 -23355 -5541 -31576 -50081 -25901 -7425 8924 -16914 4396 20291 6880 9620
$$ packed form
2172H5070J9252J1720k5113l3019M382j827Q978j1159m638K1632j1221r618K497
2159E6936j3904L9854j6943j1906j9189M4250J4069k264K211r455j4895J8315
2147H7079p81m958O531j5315j6044j5065K807L5580l375p632Q569l4485k0188
2134B2723K552R965j4501O110K2759l0686j3901J0867K507p576j6696K2479k725
2121A3877m293J7110O062j2498o444o355l971K704j7836k7370L2098k6866L7711
2108C929J7155o068j0865j2220k6855J8771J1694K0622k013q526j353J401M876
2095A0548K3909n451j2144Q581j0034O664j5613l5764k4483K220K0900J2934k8488
2082d6221K2866J7814k6035j8505K4180J8476J6349k5838K1310J5895j3411K740
$$ plain form
2070 9620 -32472 -27330 -8241 -10828 7960 -14372 -19133 -21265 9079 14709 18307 21891 18814 29035
2056 29035 9391 -56106 -32584 -24837 -20453 3476 -19299 -17738 -18260 -36494 -58665 -47518 -64662
2043 -64662 -22660 23709 4913 10169 25018 1750 -13732 -13183 8710 17077 4422 -13808 -6404
2030 -6404 -1183 -1655 -22740 -48224 -21087 10788 16972 11142 -834 22345 25781 12167 27209
2017 27209 30990 42366 63987 54825 36534 21963 25358 36645 33409 20008 -3155 -7279 6946
2004 6946 25767 16915 -738 -570 6483 -11565 -829 13517 573 -679 -16419 -36752 -55511
1991 -55511 -47529 -26356 -28524 -38020 -71362 -52323 -53659 1506 27685 -38594 -59750 -54204 -26078
1978 -26078 -39868 -68851 -52817 -23433 -9294 -29094 -68388 -82980 -43502 -20783 -2071 42240
$$ packed form
2070I620m2092N142J9089k587J8788k2332m761k132L0344N630L598L584l077J0221
2056B9035j9644o5497K3522P747M384K3929k2775J561n22j8234k2171J1147j7144
2043f4662M2002M6369j8796N256J4849k3268j5482N49K1893Q367j2655j8230P404
2030f404N221m72k1085k5484K7137L1875O184n830j1976K3179L436j3614J5042
2017B7209L781J1376K1621r162j8291j4571L395J1287l236j3401k3163m124J4225
2004F946J8821q852j7653J68P053j8048J0736J4346j2944j252j5740k0333j8759
1991e5511P982K1173k168r496l3342J9039j336N5165K6179o6279k1156N546K8126
1978b6078j3790k8983J6034K9384J4139j9800l9294j4592L9478K2719J8712M4311
$$ plain form
1966 42240 10273 7980 -9267 -52510 -57906 -35873 -38443 -36301 -61350 -46211 -36639 -37947 -28943
1953 -28943 -54458 -44103 -25690 -31867 -35802 -17284 -15628 -37971 -35382 -42232 -47443 -48940 -91286
1940 -91286 -62493 -39903 -55195 -71422 -87536 -69643 -39553 -31238 -29625 -54249 -57443 -91806
1928 -91806 -71107 -50161 -41594 -20501 -32003 -25553 -57881 -45366 -10846 -31577 -50204 -39694
1916 -39694 -4560 -7972 -24137 -18612 -31116 -55384 -48810 -64189 -66838 -82930 -62521 -78244 -39763
1903 -39763 -9771 -33319 -24082 -32532 -58798 -39768 -33117 -42614 -19451 -21766 -25019 -14684 10650
1890 10650 -32935 -37836 285 -5703 -20156 -29521 -44149 -41177 -37263 -29753 -30926 -48526 -38062
1877 -38062 -42932 -65038 -45031 -48325 -29175 -9584 -37506 -31040 -31756 -40590 -55298 -44312 -32514
$$ packed form
1966D2240l1967k293j7247m3243n396K2033k570K142k5049J5139R572j308R004
1953b8943k5515J0355J8413o177l935J8518J656k2343K589o850n211j497m2346
1940i1286K8793K2590j5292j6227j6114J7893L0090Q315J613k4624l194l4363
1928i1806K0699K0946Q567K1093j1502O450l2328J2515L4520k0731j8627J0510
1916c9694L5134l412j6165N525j2504k4268O574j5379k649j6092K0409j5723L8481
1903c9763K9992k3548R237q450k6266J9030O651r497K3163k315l253J0335K5334
1890A0650m3585m901L8121n988j4453r365j4628K972L914P510j173j7600J0464
1877c8062m870k2106K0007l294J9150J9591k7922O466p16q834j4708J0986J1798
$$ plain form
1864 -32514 -49374 -47021 -75291 -80975 -89331 -77626 -45765 -12895 -36329 -32684 -63370 -46977 -45972
1851 -45972 -38002 -45524 -66616 -84987 -33506 -37926 -22331 -30930 -67979 -90634 -70112 -43087 -64829
1838 -64829 -59894 -30523 -27582 -37553 -35261 -69113 -56489 -72451 -60426 -14168 -14303 -56462 -37085
1825 -37085 -35947 -38269 -40703 -65685 -72670 -49272 -53286 -50634 -48619 -33217 -38839 -11010 -38298
1812 -38298 -40569 -27515 -28981 -44293 -58867 -28510 -29176 -63422 -80870 -71459 -31358 -34250 -59984
1799 -59984 -60074 -58815 -57185 -80947 -71092 -78109 -96181 -83331 -52494 -64434 -62739 -80049 -86968 -66052
1785 -66052 -20822 3296 -14028 -39243 -69649 -56768 -20730 -19716 -29173 -43073 -56848 -58066
1773 -58066 -94632 -66495 -36145 -21260 -36080 8810 1043 -32967 -34813 -49569 -33561 -32667 -51023
$$ packed form
1864c2514j6860K353k8270n684q356J1705L1861L2870k3434L645l0686J6393J005
1851d5972P970p522k1092j8371N1481m420J5595q599l7049k2655K0522K7025k1742
1838f4829M935K9371K941r971K292l3852J2624j5962J2025M6258j35m2159J9377
1825c7085J138k322k434k4982o985K3398m014K652K015J5402n622K7829k7288
1812c8298k271J3054j466j5312j4574L0357o66l4246j7448R411M0101k892k5734
1799e9984r0J259J630k3762R855p017j8072J2850L0837j1940J695j7310o919K0916
1785f6052M5230K4118j7324k5215l0406J2881L6038J014r457j3900j3775j218
1773e8066l6566K8137L0350J4885j4820M4890p767l4010j846j4756J6008Q94j8356
$$ plain form
1760 -51023 -45749 -50745 -41424 -9827 -20212 -40712 -26753 -38928 -56296 -66529 -50884 -85859
1748 -85859 -88881 -62156 -65624 -48710 -51514 -53542 -45341 -61623 -70098 -67698 -40491 -25692 -34495
1735 -34495 -31192 -66396 -75165 -63554 -40845 -51696 -58038 -60836 -38599 -23075 -47598 -57978 -66059
1722 -66059 -75498 -35690 -31474 -57284 -52801 -67324 -45556 -24659 -34550 -14268 -9967 -37127 -43496
1709 -43496 -55787 -64538 -50172 -58491 -32731 -30681 -44276 -13589 -19805 -27868 -43074 -60680 -58586
1696 -58586 -44289 -34125 -41075 -29900 -34441 -17502 -23456 -30519 -38385 -48060 -56222 -25922 -47328
1683 -47328 -52458 -41501 -53455 -59530 -71728 -79085 -47043 -14033 -36973 -45590 -45423 -34586 -10341
1670 -10341 -42955 -56494 -75537 -69709 -52614 -43590 -34737 -57252 -58163 -58289 -74595 -68433 -29790
$$ packed form
1760e1023N274m996R321L1597j0385k0500J3959j2175j7368j0233J5645l4975
1748h5859l022K6725l468J6914k804k028Q201j6282q475K400K7207J4799q803
1735c4495L303l5204q769J1611K2709j0851o342k798K2237J5524k4523j0380q081
1722f6059r439L9808M216k5810M483j4523K1768K0897r891K0282M301k7160o369
1709d3496j2291q751J4366q319K5760K050j3595L0687o216q063j5206j7606K094
1696e8586J4297J0164o950J1175m541J6939n954p063p866r675q162L0300k1406
1683d7328n130J0957j1954o075j2198p357L2042L3010k2940q617J67J0837K4245
1670a0341l2614j3539j9043N828J7095R024Q853k2515r11j26j6306O162L8643
$$ plain form
1657 -29790 -11745 -38756 -47330 -61557 -64155 -46766 -23250 3112 -45065 -38173 -64920 -64826 -3919
1644 -3919 -23395 1796 10633 -5335 -16425 -25498 -34196 -42226 -38149 -36915 -41007 -74160 -35510
1631 -35510 -31330 -46303 -41613 -31641 -44579 -23038 -18147 -63619 -13709 -9525 -30437 -29462 -35839
1618 -35839 -20875 -50604 -59737 -66576 -42850 -60006 -66451 -47335 -60646 -107562 -70457 -60292
1606 -60292 -54574 -41402 -69211 -57405 -55329 -54986 -11212 -20622 -36567 -25300 -10885 -29261 -77559
1593 -77559 -62799 -43708 -50199 -42727 -24358 -51770 -48947 -42724 -55211 -59073 -55214 -52214 -35964
1580 -35964 -31736 -72092 -49866 -40415 -60819 -30912 -33416 -57541 -68403 -47294 -34564 -31961 -57018
1567 -57018 -64054 -67821 -37909 -29299 -29257 -19708 -55368 -51555 -15440 -32637 -8436 4383 -14254
$$ packed form
1657b9790J8045k7011q574j4227k598J7389K3516K6362m8177O892k6747R4O0907
1644c919j9476K5191Q837j5968j1090r073q698q030M077J234m092l3153L8650
1631c5510M180j4973M690R972j2938K1541M891m5472M9910M184k0912R75o377
1618c5839J4964k9729r133o839K3726j7156o445J9116j3311m6916L7105J0165
1606f0292N718J3172k7809J1806K076L43M3774r410j5945J1267J4415j8376m8298
1593g7559J4760J9091o491P472J8369k7412K823O223j2487l862L859L000J6250
1580c5964M228m0356K2226R451k0404K9907k504k4125j0862K1109J2730K603k5057
1567e7018p036l767K9912Q610M2R549l5660L813L6115j7197K4201J2819j8637
$$ plain form
1554 -14254 -1723 -5039 -7777 -22906 -45793 -74256 -51919 -35977 -36165 -3863 -43116 -54291 -71624
1541 -71624 -39953 -36426 -19820 -12772 -10464 -17863 -41856 -62037 -35677 -40691 -85035 -55332 -37398
1528 -37398 -47026 -36793 -34806 -46548 -12644 -44806 -37080 -24410 -19857 -19405 -15060 -6684 -21281
1515 -21281 -10309 -2040 -21872 -26015 -42764 -18849 -21660 -12136 1603 -23445 -25788 -53141 -40018
1502 -40018 -24507 -44624 -37293 -17472 -22476 -36945 -44518 -41461 -53739 -47458 -27579 -31127 -42414
1489 -42414 -24495 3977 13488 2331 -36541 -22256 -27961 -40582 -19486 -14048 -18189 -26067 -51677
1476 -51677 -48067 -23078 2864 8553 -2274 -14154 -16286 -239 -17363 -27126 -1661 -19760 -32758
1463 -32758 -42036 -34467 -15126 4824 10421 -23378 -40377 -20273 -11925 -29077 -26904 -33864 -29588
$$ packed form
1554a4254J2531l316k738j5129k2887k8463K2337J5942j88L2302l9253j1175j7333
1541g1624L1671L527J6606P048K308p399k3993k0181K6360n014m4344K9703J7934
1528c7398r628J0233J987j1742L3904l2162P726J2670M553M52M345Q376j4597
1515b1281J0972Q269j9832m143j6749K3915k811R524J3739k5048k343k7353J3123
1502d0018J5511k0117P331J9821n004j4469p573L057j2278O281J9879l548j1287
1489d2414J7919K8472R511j1157l8872J4285n705j2621K1096N438m141p878k5610
1476e1677L610K4989K5942N689j0827j1880k132J6047j7124r763K5465j8099j2998
1463c2758r278P569J9341J9950N597l3799j6999K0104Q348j7152K173o960M276
$$ plain form
1450 -29588 -24824 -11645 -47079 -35629 -28605 -55870 -56668 -67387 -61357 -77119 -63010 -55618 -30185
1437 -30185 -45545 -8072 212 -9977 6796 2138 13234 -3230 -30578 -27089 -10286 6668
1425 6668 3881 -4825 -40498 -26169 -39481 -35468 4830 -13977 -60705 -53618 -18810 -9869 -27608
1412 -27608 -57125 -76540 -51175 -52729 -55183 -30245 -56238 -64322 -56507 -44172 -67538 -74339 -76923
1399 -76923 -16552 -28010 -29676 -38023 -22535 -7892 24134 -4577 -43637 -29579 -36332 -33615 9905
1386 9905 -24902 -43503 -34778 -46832 -29915 -21950 -45363 -62917 -42584 -52852 -24695 -2299
1374 -2299 25444 -424 -14972 -19564 -17178 36371 24454 13204 10978 7574 22643 -2308 -30538
1361 -30538 -13201 -17301 -17525 -42770 -42057 -8619 13153 -5160 -8733 -35940 -58322 -11172 299
$$ packed form
1450b9588M764J3179l5434J1450P024k7265p98j0719O030j5762J4109P392K5433
1437c0185j5360L7473Q284j0189J6773m658J1096j6464k7348L489J6803J6954
1425F668k787q706l5673J4329j3312M013M0298j8807m6728P087L4808Q941j7739
1412b7608k9517j9415K5365j554k454K4938k5993q084P815J2335k3366o801k584
1399g6923O0371j1458j666q347J5488J4643L2026k8711l9060J4058o753K717M3520
1386I905l4807j8601Q725j2054J6917P965k3413j7554K0333j0268K8157K2396
1374b299K7743k5868j4548m592K386N3549j1917j1250k226l404J5069k4951k8230
1361c0538J7337m100k24k5245P13L3438K1772j8313l573k7207k2382M7150J1471
$$ plain form
1348 299 -12502 -9466 -19424 -41014 -30439 -33357 12326 11897 -11811 -16442 -18508 -29547 -14125 -10378
1334 -10378 -293 -3736 -34174 -10793 -23988 -4688 -38634 -70132 -42819 -19298 -15649 -30514
1322 -30514 -35585 -17720 -27056 -27293 -20832 -8052 -17549 -18625 -15345 -16876 -33804 -44666 -40157 -44344
1308 -44344 -25627 -44671 -24882 -6429 -21652 -3101 6169 5270 -19105 -20393 -1859 -17549 -29540
1295 -29540 -34709 -832 812 -28945 -65712 -42332 -9600 -2447 -16150 11672 1402 -32221
1283 -32221 -24708 -15751 -41034 5290 2346 9294 8804 5054 35301 7836 -13612 -37077 -37661 -25346
1269 -25346 -11866 8599 -20710 -10139 -1368 -3488 -16438 -32714 -1507 3221 -28641 -26329 -21814
1256 -21814 6412 -6087 -37827 -32809 -16661 -46916 -39950 -27177 -57835 -27934 -40415 -43884
$$ packed form
1348B99j2801L036r958k1590J0575k918M5683m29k3708m631k066j1039J5422L747
1334a0378J0085l443l0438K3381j3195J9300l3946l1498K7313K3521L649j4865
1322c0514n071J7865r336k37O461J2780r497j076L280j531j6928j0862M509m187
1308d4344J8717j9044J9789J8453j5223J8551R270q99k4375j288J8534j5690j1991
1295b9540n169L3877J644k9757l6767K3380L2732P153j3703K7822j0270l3623
1283c2221P513Q957k5283M6324k944O948m90l750L0247k7465k1448k3465n84J2315
1269b5346J3480K0465k9309J0571Q771k120j2950j6276L1207M728l1862K312M515
1256b1814K8226j2499l1740N018J6148l0255O966J2773l0658K9901j2481l469
$$ plain form
1244 -43884 -39879 -26985 -26176 -3566 28064 38103 23186 15732 -28315 -22342 -25865 -2424 -1634
1231 -1634 -14727 9032 -6224 -26186 -1120 23816 5815 21900 21440 2811 -8160 -8204 15645
1218 15645 -1828 -16436 -14466 -23367 -24621 -43025 -45867 -45595 -26264 -46142 -50565 -55567 -30450
1205 -30450 -41553 -30193 8303 26173 43793 10457 -37653 -41642 -44483 -38832 -19507 -26422 -48988
1192 -48988 -43598 -601 10743 22955 2624 -21842 -11804 -22198 -21048 7321 8362 1937 5501
1179 5501 6846 -7332 -7329 -18774 -25078 -47272 -25181 -33971 -30764 -10399 24737 22182 -10914 -43678
1165 -43678 -16571 -23840 -28589 -37663 -30340 38237 1088 4576 22141 3191 2352 -14731 4872
1152 4872 -20169 3337 2773 -26675 -21197 -12300 286 14385 8294 -37474 -36452 13486 12467
$$ packed form
1244d3884M005J2894Q09K2610L1630J0039j4917p454m4047N973l523K3441P90
1231a634j3093K3759j5256j9962K5066K4936j8001J6085m60j8629j0971m4K3849
1218A5645j7473j4608J970q901j254j8404k842K72J9331j9878m423n002K5117
1205c0450j1103J1360L8496J7870J7620l3336m8110l989k841N651J9325o915k2566
1192d8988N390M2997J1344J2212k0331k4466J0038j0394J150K8369J041o425L564
1179E501J345j4178Lj1445o304k2194K2091q790L207K0365L5136k555l3096l2764
1165d3678K7107p269m749r074P323O8577l7149L488J7565j8950q39j7083J9603
1152D872k5041K3506n64k9448N478Q897J2586J4099o091m5768J022M9938j019
$$ plain form
1139 12467 4576 2738 -11738 -8881 -25187 -38591 -32145 -46618 -55050 -17251 -37969 -35732 -44218
1126 -44218 -83676 -99819 -49921 -9510 -15435 12046 -6785 -29593 -29452 -38567 -26962 -30551 4970
1113 4970 -3171 -13233 -27179 -13576 14362 23499 31156 26703 19638 13546 45061 21656 16154
1100 16154 8484 -3491 9854 3216 -1488 5694 22770 44353 29255 15912 43875 -11014 -44751
1087 -44751 -62118 -47964 -38312 -11485 35190 9467 -3011 506 9769 -7556 13583 21047 6897
1074 6897 6312 -14929 30808 5142 -41389 -40649 -1585 -1013 -42262 -18169 4020 7830 -6610
1061 -6610 -47164 -33110 23511 -1376 -21854 -5204 -5411 23379 34392 -30194 -26892 4763 -7072
1048 -7072 -647 -13579 8984 1357 -33044 -25792 -49787 -50221 -19230 -27577 -11101 -3638 -27124
$$ packed form
1139A2467p891j838j4476K857j6306j3404O446j4473q432L7799k0718K237q486
1126d4218l9458j6143M9898M0411n925K7481j8831k2808J41r115J1605l589L5521
1113D970q141j0062j3946J3603K7938R137P657m453p065o092L1515k3405n502
1100A6154p670j1975J3345o638m704P182J7076K1583j5098j3343K7963n4889l3737
1087d4751j7367J4154R652K6827M6675k5723j2478L517R263j7325K1139P464j4150
1074F897n85k1241M5737k5666m6531P40L9064N72m1249K4093K2189L810j4440
1061f610m0554J4054N6621k4887k0478J6650k07K8790J1013o4586L302L1655j1835
1048g072O425j2932K2563p627l4401P252k3995m34L0991q347J6476P463k3486
$$ plain form
1035 -27124 -21788 -12511 -20737 -23416 -45379 -12437 -16840 -7997 -24722 -5987 20812 -9055 -26581
1022 -26581 -35700 -3239 12037 19885 10918 2364 17956 24186 -19344 3417 -8410 -21155 -23610
1009 -23610 14301 3725 4009 13721 24395 17313 -828 -5670 -20866 -6749 -31189 -12296 -5349
996 -5349 9834 -4704 -16155 -8435 -7370 -12918 -421 4053 -916 18883 34407 -1005 5537
983 5537 -27578 -27111 28104 28710 12499 4833 -12605 -22728 1009 21664 -14040 -16518 -33225
970 -33225 7118 11663 -16354 11220 13414 -3263 -35268 -7341 3281 -12666 13753 29839
958 29839 12779 30831 -6352 12237 -16403 9133 21583 -1335 -7554 16225 2227 938
946 938 12297 -4021 -15549 23312 6403 15567 15193 -17900 -4671 -12774 12950 5026 5522 -503
$$ packed form
1035b7124N336R277q226k679k1963L2942m403Q843j6725J8735K6799k9867j7526
1022b6581r119L2461J5276P848q967q554J5592O230m3530K2761j1827j2745k455
1009b3610L7911j0576K84R712J0674p082j8141m842j5196J4117k4440J8893O947
996e349J5183j4538j1451P720J065n548J2497M474m969J9799J5524l5412O542
983E537l3115M67N5215O06j6211p666j7438j0123K3737K0655l5704k478j6707
970c3225M0343M545k8017K7574K194j6677l2005K7927J0622j5947K6419J6086
958B9839j7060J8052l7183J8589k8640K5536J2450k2918o219K3779j3998j289
946I38J1359j6318j1528L8861j6909R164l74l3093J3229q103K5724p924M96o025
$$ plain form
932 -503 18663 3839 -143 27682 35618 17221 -42265 -45737 -17846 -8884 10162 8169 14071 8457
918 8457 5873 13381 -7845 -27547 -34348 -2167 12503 23898 34092 32803 22398 10363 14569
905 14569 41879 9830 -4298 -508 -23659 -13427 7721 -16333 3394 19084 3761 34082
893 34082 47543 33614 10172 2203 -10680 13880 31309 2504 3661 -6274 18273 14077 -94
880 -94 -6505 -2375 6198 -664 9710 17554 -3216 13730 17188 12124 -2893 2291 7331 8936 -7290
865 -7290 -5181 23062 19314 27120 20448 34606 18701 43549 49398 30513 21533 22964 8757 16470
851 16470 -5767 -1359 -2519 29324 15789 -14432 18314 29906 8134 19579 4923 31370
839 31370 35046 25898 -9700 -20522 9338 23511 12062 35617 38400 19443 26287 10502 -13306
$$ packed form
932e03J9166j4824l982K7825P936j8397n9486l472K7891Q962J9046j993N902n614
918H457k584P508k1226j9702o801L2181J4670J1395J0194j289j0405j2035M206
905A4569K7310l2049j4128L790k3151J0232K1148k4054J9727J5690j5323L0321
893C4082J3461j3929k3442p969j2883K4560J7429k8805J157r935K4547m196j4171
880i4o411M130Q573o862J0374P844k0770J6946L458n064j5017N184N040J605j6226
865g290K109K8243l748P806o672J4158j5905K4848N849j8885q980J431j4207P713
851A6470k2237M408j160L1843j3535l0221L2746J1592k1772J1445j4656K6447
839C1370L676r148l5598j0822K9860J4173j1449K3555K783j8957O844j5785k3808
$$ plain form
826 -13306 4591 -5237 11399 16400 812 11025 -5780 -17015 662 -1719 -1081 16424 32704
813 32704 27130 -2412 -9419 30655 16412 17044 19901 5147 24954 26677 28156 219 13093
800 13093 7732 36074 37510 18968 12570 -5565 -17137 -2697 -4664 15211 5401 -932 10242
787 10242 -2072 488 15620 36556 30114 36531 16138 10019 43891 30681 103 2977 14618
774 14618 19995 1173 -7898 -16207 -11411 -9645 1111 8545 -21731 9359 22875 6692 -14783
761 -14783 -13936 -8909 -15691 -12369 30025 8747 -37112 -41332 -56514 -23045 11217 9769 22445
748 22445 -490 -5610 10553 -9511 7792 38768 -3866 -7300 6268 -3275 16452 19245 12514
735 12514 39725 13816 -6938 -4634 29952 46179 25414 20595 29821 29934 20383 14709 26103
$$ packed form
826a3306J7897r828J6636N001j5588J0213j6805j1235J7677k381O38J7505J6280
813C2704n574k9542p007M0074j4243O32K857j4754J9807J723J479k7937J2874
800A3093n361K8342J436j8542o398j8135j1572J4440j967J9875r810o333J1174
787A0242j2314K560J5132K0936o442O417k0393o119L3872j3210l0578K874J1641
774A4618N377j8822r071q309M796J766J0756P434l0276L1090J3516j6183k1475
761a4783Q47N027o782L322M2394k1278m5859m220j5182L3469L4262j448J2676
748B2445k2935n120J6163k0064J7303L0976m2634l434J3568r543J9727K793o731
735A2514K7211k5909k0754K304L4586J6227k0765m819R226J13r551n674J1394
$$ plain form
722 26103 23344 27943 34322 38383 20501 10364 1895 -12467 21248 33477 37805 41378 43629 69380
708 69380 33618 17912 34384 33527 30770 12482 -8132 -4485 -21246 -22135 9288 52054 37828
695 37828 8954 8137 6720 36449 42458 35379 53057 52814 39258 33685 35310 23905 35137 7608
681 7608 14183 41928 76614 31919 19172 36908 31328 2908 -20545 -24254 -13697 23072 8133
668 8133 -6091 -29860 -2891 54876 37667 -7182 -19135 -17081 -13674 16762 52416 82568 65897
655 65897 11447 14978 26439 5830 -19671 16078 6261 27828 -9729 27333 16546 30618
643 30618 55832 32924 51767 61098 7547 10180 16630 18218 29887 43738 33526 32417 26143
630 26143 54068 60681 38877 8812 -10187 -17515 -3884 33426 3013 -39804 -4947 43697
$$ packed form
722B6103k759M599O379M061j7882j0137q469j4362L3715J2229M328L573K251K5751
708F9380l5762j5706J6472q57k757j8288k0614L647j6761q89L1423M2766j4226
695C7828k8874q17j417K9729O009p079J7678k43j3556n573J625j1405J1232k7529
681G608O575K7745L4686m4695j2747J7736n580k8420k3453l709J0557L6769j4939
668H133j4224k3769K6969N7767j7209m4849j1953K054L407L0436L5654L0152j6671
655F5897n4450L531J1461k0609k5501L5749r817K1567l7557L7062j0787J4072
643C0618K5214k2908J8843R331n3551K633O450J588J1669J3851j0212j109o274
630B6143K7925O613k1804l0065j8999p328J3631L7310l0413m2817L4857M8644
$$ plain form
618 43697 76020 72878 61769 35202 21270 18230 38728 16112 2069 2168 6007 16852 -5843
605 -5843 4186 8794 -6620 23587 18214 31563 37138 -7486 28564 47675 16899 34673 32047
592 32047 -298 27693 18154 1725 -12276 19902 32724 63542 55134 34299 56499 53571 62418
579 62418 50916 55601 36437 22124 27741 30171 51727 55070 70470 42985 27166 26868 15372
566 15372 6597 22885 22745 29915 7473 13296 16653 25666 34328 33738 29942 46073 74362 86822
552 86822 33821 38795 44174 29699 11482 22897 20128 43714 20399 42205 55418 44111 53840
539 53840 81820 62325 13702 -4931 26609 31423 37455 53763 64663 65115 41675 37965 39356
526 39356 41076 53564 44308 36798 27672 13981 37344 -6745 18969 41238 55779 36153 47699
$$ packed form
618D3697L2323l142j1109k6567j3932l040K0498k2616j4043R9L839J0845k2695
605e843J0029M608j5414L0207n373J3349N575m4624L6050J9111l0776J7774k626
592C2047l2345K7991r539j6429j4001L2178J2822L0818q408k0835K2200k928Q847
579F2418j1502M685j9164j4313N617K430K1556L343J5400k7485j5819k98j1496
566A5372q775J6288j40P170k2442N823L357R013Q662n90l796J6131K8289J2460
552H6822n3001M974N379j4475j8217J1415k769K3586k3315K1806J3213j1307R729
539E3840K7980j9495m8623j8633L1540M814O032J6308J0900M52k3440l710J391
526C9356J720J2488r256p510r126j3691K3363m4089K5714K2269J4541j9626J1546
$$ plain form
513 47699 2056 9731 2954 -3335 39982 66439 82092 53738 31926 5303 745 10041 23452
500 23452 4662 32139 55626 53609 37295 31047 29091 37652 27831 23632 7249 430 4524 -7414
486 -7414 20408 -19814 -10760 24458 55877 51826 82372 36691 8252 25230 31728 33998 46011
473 46011 80839 71246 50484 67511 71710 46725 25502 30543 -6385 -12755 49667 28640 50722
460 50722 48008 60994 87833 61039 60335 39467 59483 71401 28049 22007 6098 -24665 24737
447 24737 55098 62266 45105 72924 78524 69443 35648 30146 35837 90507 104194 66538 44428
434 44428 27537 53471 55783 27133 27786 38222 8398 44396 39327 65337 77945 81200 25833
421 25833 25554 38076 65519 46866 15012 566 38671 30204 10449 45673 41232 16503 24797
$$ packed form
513D7699m5643P675o777o289M3317K6457J5653k8354k1812k6623m558R296J3411
500B3452j8790K7477K3487k017j6314o248j956Q561r821m199j6383o819M094j1938
486g414K7822m0222R054L5218L1419m051L0546m5681k8439J6978O498K270J2013
473D6011L4828r593k0762J7027M199k4985k1223N041l6928o370O2422k1027K2082
460E0722k714J2986K6839k6794p04k0868K0016J1918m3352o042j5909l0763M9402
447B4737L0361P168j7161K7819N600r081l3795n502N691N4670J3687l7656k2110
434D4428j6891K5934K312k8650O53J0436k9824L5998n069K6010J2608L255n5367
421B5833k79J2522K7443j8653l1854j4446L8105q467j9755L5224m441k4729Q294
$$ plain form
408 24797 14567 34462 50654 59166 53824 72505 58197 2164 8833 20835 28177 37635 53212
395 53212 30168 42472 38713 29142 27259 37896 42936 86069 83768 77145 60220 84306 70602
382 70602 52068 55244 52078 73627 40628 32290 75902 55351 45243 43891 44223 55920 40925
369 40925 28523 43763 63565 47497 52327 67443 62414 77228 61083 45261 41938 58735 91608
356 91608 103066 87417 84547 72261 56893 62197 34495 24470 25109 58625 65474 35797 37466
343 37466 60252 94305 85435 42912 53006 66670 61034 7416 25805 38838 42687 64781 33696
330 33696 24543 23935 39774 11555 38854 58776 38967 26730 33433 38858 40579 -6003 -3710
317 -3710 43884 51198 51155 75274 86135 65725 57686 60892 52537 73661 62879 47185 51149 57737
$$ packed form
408B4797j0230J9895J6192Q512n342J8681j4308n6033O669J2002P342R458J5577
395E3212k3044J2304l759r571j883J0637N040M3133k301o623j6925K4086j3704
382G0602j8534L176l166K1549l2999q338M3612k0551j0108j352L32J1697j4995
369D0925j2402J5240J9802j6068M830J5116n029J4814j6145j5822l323J6797L2873
356I1608J1458j5649k870j2286j5368N304k7702j0025O39L3516O849k9677J669
343C7466K2786L4053q870m2523J0094J3664n636n3618J8389J3033L849K2094l1085
330C3696r153o08J5839k8219K7299J9922j9809j2237O703N425J721m6582K293
317c710M7594P314m3K4119J0861k0410q039L206q355K1124j0782j5694L964O588
$$ plain form
303 57737 72530 66893 43581 29868 17719 31120 7020 -4555 23957 47032 51955 58823 52467
290 52467 40265 41485 13343 49101 77122 62918 32404 31891 46871 85656 56887 54308 30462
277 30462 25091 32349 44758 69018 52387 34908 49179 33433 45044 46361 51387 49138 54353
264 54353 13433 60524 64850 63556 55552 54578 51975 38158 86717 50894 50168 57535 53332 35873
250 35873 45424 48790 60584 74000 47170 28102 49982 44257 40805 48742 42145 34150 33821 42384
236 42384 45345 72018 57439 57596 35517 79461 79561 37180 20458 37525 65121 40109 17089
223 17089 21156 52184 29451 38212 47377 64978 81003 81362 80230 85033 59948 42055 35305 27936
209 27936 5741 -1560 1181 45013 43101 42821 67314 74402 54858 34723 47672 62342 68321
$$ packed form
303E7737J4793n637k3312j3713j2149J3401k4100j1575K8512K3075M923O868o356
290E2467j2202J220k8142L5758K8021j4204l0514n13J4980L8785k8769k579k3846
277C0462n371P258J2409K4260j6631j7479J4271j5746J1611J317N026k249N215
264E4353m0920M7091M326j294q004r74k603j3817M8559l5823p26P367m203j7459
250C5873R551L366J1794J3416k6830j9068K1880n725l452P937o597p995l29Q563
236D2384K961K6673j4579J57k2079M3944J00m2381j6722J7067K7596k5012k3020
223A7089M067L1028k2733Q761R165J7601J6025L59j132M803k5085j7893o750p369
209B7936k2195p301K741M3832j912k80K4493P088j9544k0135J2949J4670N979
$$ plain form
196 68321 46875 71407 76551 56784 47687 46695 56097 74979 59058 61252 104439 79110 40832
183 40832 65876 74014 43977 55634 86550 85903 84850 64349 25054 22975 -648 42423 51745
170 51745 71848 62478 48196 73498 82015 51233 90223 79696 66203 46620 42075 34260 59480
157 59480 46039 25666 63101 63213 55129 52465 63168 57383 56156 64019 38732 70048 77469 54841
143 54841 48725 29372 25268 34561 59136 29070 30008 21205 42242 29948 53669 72491 35718
130 35718 36439 28968 26802 45254 30856 28602 32153 36709 72225 46173 56916 75681 68121 64377
116 64377 59470 61756 41337 53305 89691 91286 60163 73049 73438 69512 46289 22324 46140
103 46140 75196 68190 64493 47995 48895 54751 67453 55000 74094 50301 56614 64145 71871 56589
$$ packed form
196F8321k1446K4532N144j9767r097r92R402J8882j5921K194M3187k5329l8278
183D0832K5044Q138l0037J1657L0916o47j053k0501l9295k079k3623M3071R322
170E1745K0103r370j4282K5302Q517l0782L8990j0527j3493j9583m545p815K5220
157E9480j3441k0373L7435J12q084k664J0703n785j227P863k5287L1316P421k2628
143E4841o116j9353m104R293K4575l0066R38q803K1037j2294K3721J8822l6773
130C5718P21p471k166J8452j4398k254L551M556L5516k6052J0743J8765p560l744
116F4377m907K286k0419J1968L6386J595l1123J2886L89l926k3223k3965K3816
103D6140K9056p006l697j6498R00N856J2702j2453J9094k3793O313P531P726j5282
$$ plain form
89 56589 76501 39821 43039 64868 50786 40685 29987 37087 34747 38595 57076 58836 24341
76 24341 20158 27320 42245 21456 43621 45775 52577 57615 62420 60463 25087 13162 35341 47637
62 47637 25474 59332 76171 68476 67119 71670 47794 54857 64968 71407 72653 54227 45340 27859
48 27859 23089 33938 55935 48075 48603 55841 66388 53009 48154 33756 41106 47581 62068 72530
34 72530 63435 68883 75511 60299 63672 63463 58170 48957 54472 60429 44100 38926 54228 65815
20 65815 62436 52879 51866 43298 44073 53183 46626 65002 69177 59945 62082 76693 75365 61162 59321
5 59321 45461 49839 49273 40580 34974
0 34974
$$ packed form
89E6589J9912l6680L218K1829j4082j0101j0698P100k340L848J8481J760l4495
76B4341m183P162J4925k0789K2165K154O802N038M805j957l5376j1925K2179J2296
62D7637k2163L3858J6839p695j357M551k3876P063J0111O439J246j8426q887j7481
48B7859m770J0849K1997p860N28P238J0547j3379m855j4398P350O475J4487J0462
34G2530r095N448O628j5212L373k09n293r213N515N957j6329n174J5302J1587
20F5815l379r557j013q568P75R110o557J8376M175r232K137J4611j328j4203j841
5E9321j3860M378n66q693n606
0C4974
$$ Imaginary data points
##PAGE= N=2
##DATA TABLE= (X++(I..I)), XYDATA
$$ plain form
16383 -1455255 -1422255 -1403433 -1385803 -1360348 -1374623 -1368651 -1361130 -1345218 -1316247 -1291089 -1264344 -1255346
16371 -1255346 -1230195 -1216289 -1206919 -1176401 -1146569 -1134433 -1117324 -1096072 -1081917 -1074217 -1068253 -1036233
16359 -1036233 -1015350 -996213 -989244 -982820 -949098 -942311 -926280 -906568 -926728 -914495 -882299 -846032
16347 -846032 -816872 -807798 -794419 -766455 -730952 -743026 -744506 -719910 -719037 -698593 -678189 -667685
16335 -667685 -625180 -608127 -600026 -571728 -562340 -542716 -515109 -514635 -500508 -494866 -501431 -474374 -437729
16322 -437729 -422686 -428880 -394876 -383815 -375305 -338854 -326932 -299930 -309958 -292246 -268561 -270872
16310 -270872 -249541 -231126 -225894 -207798 -209137 -177812 -147086 -164443 -122437 -105706 -91652 -75494
16298 -75494 -83069 -69833 -79919 -75562 -37167 -22444 27425 62168 72349 71986 86482 77386 62171
$$ packed form
16383a455255L3000J8822J7630K5455j4275N972P521J5912K8971K5158K6745Q998
16371a255346K5151J3906R370L0518K9832J2136J7109K1252J4155P700N964L2020
16359a036233K0883J9137O969O424L3722O787J6031J9712k0160J2233L2196L6267
16347h46032K9160R074J3379K7964L5503j2074j480K4596Q73K0444K0404J0504
16335f67685M2505J7053Q101K8298R388J9624K7607M74J4127N642o565K7057L6645
16322d37729J5043o194L4004J1061Q510L6451J1922K7002j0028J7712K3685k311
16310b70872K1331J8415N232J8096j339L1325L0726j7357M2006J6731J4054J6158
16298g5494p575J3236j0086M357L8395J4723M9869L4743J0181l63J4496r096j5215
$$ plain form
16285 62171 82299 96409 121790 119923 128379 155182 157054 160796 195328 221074 229303 237396 239039
16272 239039 255379 256491 280051 274984 273329 284948 298402 322392 317858 352336 382673 388241
16260 388241 382757 395166 445171 458977 443854 437555 462810 447922 468889 511715 489390 494898
16248 494898 525153 508541 513699 540328 542382 534123 560596 578454 590850 594260 592516 584602 577971
16235 577971 600751 632251 639236 625083 636974 662198 665967 685259 663657 695460 741687 736109
16223 736109 731736 732867 737480 745614 760469 745935 777940 774269 751220 768511 812348 798015
16211 798015 808404 838728 833647 855801 862752 883155 872782 862240 887384 898886 913705 893964
16199 893964 924988 923809 924947 945261 931996 905758 946494 964962 930080 910458 920189 907750
$$ packed form
16285F2171K0128J4110K5381j867Q456K6803J872L742L4532K5746Q229Q093J643
16272B39039J6340J112K3560n067j655J1619J3454K3990m534L4478L0337N568
16260C88241n484J2409N0005J3806j5123o299K5255j4888K0967M2826k2325N508
16248D94898L0255j6612N158K6629K054q259K6473J7858J2396L410j744p914o631
16235E77971K2780L1500O985j4153J1891K5224L769J9292k1602L1803M6227n578
16223G36109m373J131M613Q134J4855j4534L2005l671k3049J7291M3837j4333
16211G98015J0389L0324n081K2154O951K0403j0373j0542K5144J1502J4819j9741
16199H93964L1024j179J138K0314j3265k6238M0736J8468l4882j9622R731j2439
$$ plain form
16187 907750 936774 952021 950559 950673 985133 997819 1018037 1013599 1009259 1033649 1003887 1023375
16175 1023375 1022960 1003099 1003910 1013598 1015390 1024938 994485 1038465 1039810 1019724 1037871 1061743 1046624
16162 1046624 1031284 1043266 1049078 1071330 1084874 1099752 1100415 1135659 1153756 1127664 1080902 1108288
16150 1108288 1115555 1122022 1158900 1159596 1173761 1151241 1153567 1132501 1135024 1128923 1106782 1112778 1146130
16137 1146130 1156830 1153452 1131169 1162342 1151432 1153978 1182593 1199301 1191255 1131410 1166749 1184268
16125 1184268 1193330 1199381 1220997 1196132 1199540 1214109 1230726 1190987 1194095 1218311 1190914 1196058
16113 1196058 1178343 1167955 1156553 1188450 1208565 1204855 1207702 1194904 1187829 1161821 1171047 1189915
16101 1189915 1198767 1166616 1192145 1220296 1215082 1210411 1214161 1235249 1229206 1230641 1206705 1185117
$$ packed form
16187I07750K9024J5247j462J14L4460J2686K0218m438m340K4390k9762J9488
16175A023375m15j9861Q11R688J792R548l0453M3980J345k0086J8147K3872j5119
16162A046624j5340J1982N812K2252J3544J4878O63L5244J8097k6092m6762K7386
16150A108288P267O467L6878O96J4165k2520K326k1066K523o101k2141N996L3352
16137A146130J0700l378k2283L1173j0910K546K8615J6708q046n9845L5339J7519
16125A184268R062O051K1616k4865L408J4569J6617l9739L108K4216k7397N144
16113A196058j7715j0388j1402L1897K0115l710K847j2798p075k6008R226J8868
16101A189915Q852l2151K5529K8151n214m671L750K1088o043J435k3936k1588
$$ plain form
16089 1185117 1213712 1206424 1214540 1225908 1214185 1248511 1267489 1245811 1239597 1252773 1253616 1230997
16077 1230997 1205082 1202824 1233385 1239816 1229603 1265902 1263692 1269529 1254366 1235869 1255230 1228130
16065 1228130 1211025 1218404 1241590 1272547 1270219 1270667 1261750 1229491 1217994 1248016 1254055 1271719
16053 1271719 1274463 1247029 1218196 1229864 1217254 1261233 1256725 1254617 1278617 1242608 1230095 1254143
16041 1254143 1263347 1282375 1271832 1294279 1281231 1266973 1278107 1283443 1256836 1240072 1262732 1292866
16029 1292866 1274140 1250988 1289131 1311512 1293825 1262053 1260664 1267145 1286834 1244427 1249307 1252093
16017 1252093 1243899 1256127 1268491 1266412 1268332 1239941 1271895 1277542 1270044 1291801 1296187 1278413
16005 1278413 1276662 1291485 1261629 1236148 1250933 1267292 1277243 1288630 1260622 1257806 1257590 1242261
$$ packed form
16089A185117K8595p288Q116J1368j1723L4326J8978k1678o214J3176Q43k2619
16077A230997k5915k258L0561O431j0213L6299k210N837j5163j8497J9361k7100
16065A228130j7105P379K3186L0957k328M48q917l2259j1497L0022O039J7664
16053A271719K744k7434k8833J1668j2610M3979m508k108K4000l6009j2513K4048
16041A254143R204J9028j0543K2447j3048j4258J1134N336k6607j6764K2660L0134
16029A292866j8726k3152L8143K2381j7687l1772j389O481J9689m2407M880K786
16017A252093q194J2228J2364k079J920k8391L1954N647p498K1757M386j7774
16005A278413j751J4823k9856k5481J4785J6359R951J1387k8008k816k16j5329
$$ plain form
15993 1242261 1259494 1279831 1257343 1266540 1276596 1250619 1237352 1216626 1225660 1227233 1271190 1279270
15981 1279270 1282302 1295999 1286361 1288443 1276219 1269572 1255643 1248167 1268427 1259309 1256862 1304775 1288195
15968 1288195 1262015 1251246 1301282 1289310 1251172 1267182 1284464 1306329 1279875 1234681 1260419
15957 1260419 1278836 1281219 1302288 1306384 1285777 1264895 1271747 1292528 1298979 1285303 1266255 1257476
15945 1257476 1230752 1248252 1267307 1271144 1293299 1270311 1260670 1287730 1268701 1267788 1241571 1227477
15933 1227477 1242486 1238388 1273103 1272994 1262412 1253642 1228713 1278179 1308390 1306473 1287380 1229344
15921 1229344 1257069 1284941 1252632 1215985 1279974 1277664 1282903 1297974 1264293 1259639 1284891 1294382
$$ packed form
15993A242261J7233K0337k2488R197J0056k5977j3267k0726R034J573M3957Q080
15981A279270L032J3697r638K082j2224o647j3929p476K0260r118k447M7913j6580
15968A288195k6180j0769N0036j1972l8138J6010J7282K1865k6454m5194K5738
15957A260419J8417K383K1069M096k0607k0882O852K0781O451j3676j9048q779
15945A257476k6724J7500J9055L837K2155k2988r641K7060j9029r13k6217j4094
15933A227477J5009m098L4715j09j0582q770k4929M9466L0211j917j9093n8036
15921A229344K7725K7872l2309l6647O3989k310N239J5071l3681m654K5252R491
$$ [...]
##END NTUPLES=NMR SPECTRUM
##END=
