##TITLE=1H_DE-80H_X3
 200.13MHz, d2o
 8 sc
 
 19ns.26.2.2025
##JCAMPDX= 6.0         $$ Bruker NMR JCAMP-DX V2.0
##DATA TYPE= NMR SPECTRUM
##DATA CLASS= NTUPLES
##ORIGIN= UXNMR, Bruker Analytische Messtechnik GmbH
##OWNER= pz
$$ XWIN-NMR		Version 3.5
$$ Thu Jul 24 14:34:32 2025 Russian Standard Time (UT+4h)  Yarkov@DPX200
##.OBSERVE FREQUENCY= 200.1313
##.OBSERVE NUCLEUS= ^1H
##.ACQUISITION MODE= SIMULTANEOUS
##.ACQUISITION SCHEME= undefined
##.AVERAGES= 8
##.DIGITISER RES= 18
##SPECTROMETER/DATA SYSTEM= spect
##.PULSE SEQUENCE= zg30
##.SOLVENT NAME= CDCl3
##.SHIFT REFERENCE= (INTERNAL, CDCl3, 0, 15.4913)
##AUDIT TRAIL= $$ (NUMBER, WHEN, WHO, WHERE, WHAT)
$$ ##TITLE= Audit trail, XWIN-NMR		Version 3.5
$$ ##JCAMPDX= 5.01
$$ ##ORIGIN= Bruker BioSpin GmbH
$$ ##OWNER= Yarkov
$$ C:/Bruker/XWIN-NMR/data/yarkov2/nmr/H-C/1/pdata/1/auditp.txt
$$ ##AUDIT TRAIL=  $$ (NUMBER, WHEN, WHO, WHERE, WHAT)
(   1,<2025-07-24 14:33:17.89 +0400>,<Yarkov>,<DPX200>,
      <created by zg, POWCHK disabled, PULCHK disabled
       configuration hash MD5:
       00 E9 B6 7A A2 85 ED C7 34 08 36 98 17 FE 4E 26
       data hash MD5: 16K
       59 A6 A4 B8 AB 83 97 E9 23 A5 29 0E 27 FC DC 37>)
(   2,<2025-07-24 14:33:49.43 +0400>,<Yarkov>,<DPX200>,
      <Start of raw data processing
       efp BC_mod = 2 LB = 0.25 FT_mod = 6 PKNL = 1 PHC0 = -1359.556 PHC1 = 13.59091 SI = 16K 
       data hash MD5: 16K
       95 16 36 AF 90 BD EE 99 E3 36 7E 00 69 6B 00 BD>)
(   3,<2025-07-24 14:33:55.67 +0400>,<Yarkov>,<DPX200>,
      <abs ABSG = 5 
       data hash MD5: 16K
       CD 69 1C 2C 6D 64 57 35 D9 03 A7 9D 4F D7 90 16>)
$$ ##END=
$$ 
$$ hash MD5
$$ DF 26 A2 C0 F8 18 23 1C BC D2 FA D4 D7 A1 8A 17
##$RELAX= 
##$RELAX= 
##$RELAX= 
##$RELAX= 
##$RELAX= 
##$RELAX= 
$$ Bruker specific parameters
$$ --------------------------
##$DU= <C:/Bruker/XWIN-NMR>
##$EXPNO= 1
##$NAME= <H-C>
##$PROCNO= 1
##$TYPE= <nmr>
##$USER= <yarkov2>
##$AMP= (0..31)
100 100 100 100 100 100 100 100 100 100 100 100 100 100 100 100 100 100 
100 100 100 100 100 100 100 100 100 100 100 100 100 100 
##$AQSEQ= 0
##$AQ_mod= 1
##$AUNM= <au_zg>
##$AUTOPOS= <>
##$BF1= 200.13
##$BF2= 200.13
##$BF3= 200.13
##$BF4= 200.13
##$BF5= 200.13
##$BF6= 200.13
##$BF7= 200.13
##$BF8= 200.13
##$BYTORDA= 1
##$CFDGTYP= 0
##$CFRGTYP= 5
##$CHEMSTR= <none>
##$CNST= (0..31)
1 1 145 1 1 1 1 1 1 1 1 1 1 1 1 1 1 1 1 1 1 1 1 1 1 1 1 1 1 1 1 1 
##$CPDPRG= <>
##$CPDPRG1= <>
##$CPDPRG2= <>
##$CPDPRG3= <>
##$CPDPRG4= <mlev>
##$CPDPRG5= <mlev>
##$CPDPRG6= <mlev>
##$CPDPRG7= <mlev>
##$CPDPRG8= <mlev>
##$CPDPRGB= <>
##$CPDPRGT= <>
##$D= (0..31)
0 0.7 0 0 0 0 0 0 0 0 0 0.03 0 0 0 0 0 0 0 0 0 0 0 0 0 0 0 0 0 0 0 0 
##$DATE= 1753353197
##$DBL= (0..7)
120 120 120 120 120 120 120 120 
##$DBP= (0..7)
150 150 150 150 150 150 150 150 
##$DBP07= 0
##$DBPNAM0= <>
##$DBPNAM1= <>
##$DBPNAM2= <>
##$DBPNAM3= <>
##$DBPNAM4= <>
##$DBPNAM5= <>
##$DBPNAM6= <>
##$DBPNAM7= <>
##$DBPOAL= (0..7)
0.5 0.5 0.5 0.5 0.5 0.5 0.5 0.5 
##$DBPOFFS= (0..7)
0 0 0 0 0 0 0 0 
##$DE= 6
$$ [...]
##$SUBNAM3= <"">
##$SUBNAM4= <"">
##$SUBNAM5= <"">
##$SUBNAM6= <"">
##$SUBNAM7= <"">
##$SUBNAM8= <"">
##$SUBNAM9= <"">
##$SW= 18.0517328524113
##$SWIBOX= (0..15)
0 0 2 0 0 0 0 0 0 0 0 0 0 0 0 0 
##$SW_h= 3612.71676300578
##$TD= 16384
##$TD0= 1
##$TE= 0
##$TE2= 300
##$TE3= 300
##$TEG= 300
##$TL= (0..7)
0 120 120 120 120 120 120 120 
##$TP= (0..7)
150 150 150 150 150 150 150 150 
##$TP07= 0
##$TPNAME0= <>
##$TPNAME1= <>
##$TPNAME2= <>
##$TPNAME3= <>
##$TPNAME4= <>
##$TPNAME5= <>
##$TPNAME6= <>
##$TPNAME7= <>
##$TPOAL= (0..7)
0.5 0.5 0.5 0.5 0.5 0.5 0.5 0.5 
##$TPOFFS= (0..7)
0 0 0 0 0 0 0 0 
##$TUNHIN= 0
##$TUNHOUT= 0
##$TUNXOUT= 0
##$USERA1= <user>
##$USERA2= <user>
##$USERA3= <user>
##$USERA4= <user>
##$USERA5= <user>
##$V9= 5
##$VALIST= <valist>
##$VCLIST= <CCCCCCCCCCCCCCC>
##$VD= 0
##$VDLIST= <DDDDDDDDDDDDDDD>
##$VPLIST= <PPPPPPPPPPPPPPP>
##$VTLIST= <TTTTTTTTTTTTTTT>
##$WBST= 1024
##$WBSW= 4
##$XGAIN= (0..3)
0 0 0 0 
##$XL= 0
##$YL= 0
##$YMAX_a= 258289
##$YMIN_a= -225847
##$ZGOPTNS= <>
##$ZL1= 120
##$ZL2= 120
##$ZL3= 120
##$ZL4= 120
##$ABSF1= 15.54416
##$ABSF2= -2.507691
##$ABSG= 5
##$ABSL= 3
##$ALPHA= 0
##$AQORDER= 0
##$ASSFAC= 0
##$ASSFACI= 0
##$ASSFACX= 0
##$ASSWID= 0
##$AUNMP= <proc_1d>
##$AZFE= 0.1
##$AZFW= 0.1
##$BCFW= 0
##$BC_mod= 2
##$BYTORDP= 0
##$COROFFS= 0
##$CY= -3
##$DATMOD= 1
##$DC= 0
##$DFILT= <>
##$DTYPP= 0
##$F1P= 0
##$F2P= 0
##$FCOR= 1
##$FTSIZE= 16384
##$FT_mod= 6
##$GAMMA= 0
##$GB= 0
##$INTBC= 1
##$INTSCL= 3.241238e-09
##$ISEN= 128
##$LB= 0.25
##$LEV0= 0
##$LPBIN= 0
##$MAXI= 10000
##$MC2= 0
##$MEAN= 0
##$ME_mod= 0
##$MI= 1.114404
##$NCOEF= 0
##$NC_proc= -6
##$NLEV= 6
##$NOISF1= 3.799351
##$NOISF2= 2.8
##$NSP= 0
##$NTH_PI= 0
##$NZP= 0
##$OFFSET= 15.49127
##$PC= 1
##$PHC0= -1359.556
##$PHC1= 13.59091
##$PH_mod= 1
##$PKNL= yes
##$PPARMOD= 0
##$PSCAL= 0
##$PSIGN= 0
##$REVERSE= no
##$SF= 200.130006090559
##$SI= 16384
##$SIGF1= 3
##$SIGF2= 2
##$SINO= 0.751879
##$SIOLD= 32768
##$SREGLST= <19F.Aceton>
##$SSB= 0
##$STSI= 16384
##$STSR= 0
##$SW_p= 3612.71676300578
##$SYMM= 0
##$S_DEV= 0
##$TDeff= 16384
##$TDoff= 0
##$TI= <>
##$TILT= no
##$TM1= 0
##$TM2= 0
##$TOPLEV= 0
##$USERP1= <user>
##$USERP2= <user>
##$USERP3= <user>
##$USERP4= <user>
##$USERP5= <user>
##$WDW= 1
##$XDIM= 16384
##$YMAX_p= 315924204
##$YMIN_p= -195663
$$ End of Bruker specific parameters
$$ ---------------------------------
##NTUPLES= NMR SPECTRUM
##VAR_NAME=  FREQUENCY,     SPECTRUM/REAL,   SPECTRUM/IMAG
##SYMBOL=    X,             R,               I
##VAR_TYPE=  INDEPENDENT,   DEPENDENT,       DEPENDENT
##VAR_FORM=  AFFN,          ASDF,            ASDF
##VAR_DIM=   16384,         16384,           16384
##UNITS=     HZ,            ARBITRARY UNITS, ARBITRARY UNITS
##FACTOR=    0.220516191357247, 1,           1
##FIRST=     3100.26797252051, 0,            0
##LAST=      -512.448790485273, 0,           0
##MIN=       -512.448790485273, -195663,     0
##MAX=       3100.26797252051, 315924204,    0
$$ Real data points
##PAGE= N=1
##DATA TABLE= (X++(R..R)), XYDATA
$$ [...]
11917 -1177 -36912 -49908 -30506 -64689 -23889 -18877 -29927 10740 -21080 -16618 -23314 -41400
11905 -41400 -48620 -12981 -14424 39395 51365 46324 -28919 -99158 -59387 -36641 20914 -16207
11893 -16207 -27528 -22575 25760 -5946 -6501 29491 -948 -9065 20441 -17375 -35032 -7653
11881 -7653 -1843 -14159 -531 18024 -49237 -7793 53049 -24508 -32003 5428 77400 57159
11869 57159 45749 -8148 -37979 -6232 7186 24744 -18562 15729 62706 68442 49784 -9221
11857 -9221 -11526 27230 23250 38759 45827 53130 38778 60030 100755 24667 50414 -9914 30224
11844 30224 43914 -37836 10621 -30926 -6196 -15541 28655 8126 45965 17764 14055 19606
11832 19606 19619 31028 10201 -33365 -60585 -27869 7547 54499 56748 -4192 -51399 -5846
11820 -5846 5815 44857 48441 -9876 32115 35579 -10588 -51635 -85053 -18836 -52973 -16680
11808 -16680 6783 12053 21158 39863 6291 39783 17041 -28049 8278 28350 43790 41689
11796 41689 15691 -28672 -8678 17202 35818 80948 42489 -11979 -18046 -10683 -4050 -2692
11784 -2692 -10141 48173 -15893 -1878 53044 38828 40429 14410 22361 37789 56278 21479
11772 21479 54438 48385 46204 -8663 -105636 -88323 -33648 -55682 -55585 -20182 34384 -20721 -43342
11759 -43342 -39429 -11302 13154 78755 99890 39410 66248 -10338 -21114 -26832 -39349 -8629
11747 -8629 47130 27248 -22575 -46937 -90141 -52147 -38019 -29279 -15942 59735 117364 45204
11735 45204 41736 -16569 -22491 -60794 -42324 13604 -10140 29881 18882 -24016 19178 6784
11723 6784 -2269 48660 -768 13671 -41494 -766 -45144 -8802 -20091 -43472 19176 4996
11711 4996 -72382 -51052 -64533 -43585 -16151 9004 -62352 -36612 7203 -14787 -57584 -26995
11699 -26995 -41028 -62040 -40963 -37042 -58050 -63070 -24102 -6702 -25585 10307 -24733 8129
11687 8129 13800 -62837 38812 30703 62808 21191 -22517 4033 46287 -6703 -10351 1270
11675 1270 -13272 -70034 -15413 -44925 -26315 -3070 -924 -53874 -56071 17297 65164 52391
11663 52391 1241 -80183 -74723 -2076 -31255 31993 60834 49736 -2568 -21477 -51548 -67716
11651 -67716 -93058 -52570 20468 1576 45456 4204 -132891 -93972 15312 -34598 8233
11640 8233 -25805 -21495 15205 81825 76640 -49302 -41264 6509 -8024 3727 67647 46832
11628 46832 12866 14584 -119166 -40968 -21688 -28993 27550 35596 19195 -11492 -52432 -41573
11616 -41573 26704 20312 17198 -28233 -41379 32290 31475 -24491 57382 7882 14817 65802 35896
11603 35896 47309 16514 -30742 -12105 10109 -75668 -60016 -31452 -44959 -38285 -27387 -36898
11591 -36898 -60545 -64022 -19007 -34613 -44896 29764 93908 10735 -19031 18259 -31908 -101128
11579 -101128 -68668 -42071 -70558 -26404 -56886 -81385 -69472 -50324 -64070 -55173 -87437 -105113
11567 -105113 -98834 -139847 -121851 -66623 -97451 -82937 -72188 11989 -16502 -70454 -11107 -22767
11555 -22767 -27143 -26258 -16756 28122 48920 12906 30816 77955 35641 21564 1483 -5714 -95888
11542 -95888 -110694 -4099 20045 -34663 -14399 -54021 6209 25397 -8119 4496 42894
11531 42894 40540 33066 19425 67508 60639 37110 7763 -29816 -37423 -58557 -5756 27322
11519 27322 25309 12120 4263 69875 70642 22650 29110 43909 53936 -11630 10427 59948 -18747
11506 -18747 -28109 49776 40430 -5549 -51942 -697 379 367 -19774 45134 5061 -46096 -26873
11493 -26873 13913 -3988 12582 -43310 -110687 -66881 37988 53105 -9732 -43097 -31040
11482 -31040 -41983 -9717 60584 -50198 -63820 -23473 -39962 -25069 -24000 -34704 -43012 1703
11470 1703 37601 -6996 -30858 -29784 53758 42418 61366 39291 6194 -21839 -39404 -30637
11458 -30637 2433 68438 101997 25388 74283 34485 6995 -16076 -49310 -7398 -8302 -2740
11446 -2740 -74075 -31817 -38625 -20335 -5106 -20018 -62882 -94269 -143552 -118043 -48254 -63905
11434 -63905 5281 46342 88537 76539 23721 -29372 30437 14173 -17030 880 -10970 -4264
11422 -4264 -28034 28387 51724 -5621 -63002 -48554 -14996 -55328 -83342 -2955 75444 89051
11410 89051 -30931 10453 6766 11315 -17357 -20169 13565 -15079 -18852 13772 -26712 -3619
11398 -3619 -34124 -53893 -24475 9461 -441 -38004 -52722 -48837 -26633 1460 10403 -29720
11386 -29720 -13174 -7083 -47450 -69084 -51151 -113283 -152875 -130729 -71847 5101 -23121 -9279
11374 -9279 -455 8787 4436 60857 40145 -15398 -30451 -78593 -61903 -32514 -51033 -45548 -60979
11361 -60979 -60364 -36468 39333 27410 10854 41335 35395 28417 32428 18032 2957 9582 -43037
11348 -43037 -2850 -30615 -12957 48017 109215 98914 79639 81493 41171 3954 12945 31958
11336 31958 -9783 -8095 16647 1249 24329 10831 8454 -54095 -49704 -13719 3061 -38335
11324 -38335 -15630 20221 61396 81498 -103 -21863 38184 24020 67235 46660 -20633 -28632
11312 -28632 -21080 16931 74294 49101 7388 7598 42973 -12500 47700 -11174 -30413 -13784
11300 -13784 32340 -7402 -41194 1917 -2826 7670 12902 16161 56667 52366 33488 44749
11288 44749 -8928 6408 50991 -25804 -121578 -56163 23462 39602 26750 -14867 2499 -26861
11276 -26861 -17940 18544 32920 33768 -29758 -60907 -78884 -23320 -20874 -1311 6612 -46153 -59483
11263 -59483 -36029 14324 36129 -23303 -8796 -24900 -26799 9271 -5403 -15154 71269 -40030
11251 -40030 27440 73664 -8033 3967 -18800 1918 41754 26659 19988 -15631 36325 20006
11239 20006 13756 43232 66619 38034 18639 -43797 -11288 -8107 -63668 -29528 6920 24986
11227 24986 -12110 -34884 13200 41859 23766 -29129 -24600 -8201 -30724 47933 88706 -21785
11215 -21785 -103692 -68178 -39810 -33324 -81926 -58052 -20984 -71802 -75311 -9290 -12816 -56608
11203 -56608 -67863 -49887 -33832 11378 22208 59423 18312 8438 36763 -89964 -57317 -12779
11191 -12779 -2974 -12983 -29453 -16649 -60431 -41900 -32968 2020 -62251 -56539 7646 21602
11179 21602 21538 -10379 -15262 -45215 -11322 -20181 -20707 -28448 -38235 6261 -7240 21125 27669 -20154
11165 -20154 -56116 -24794 25338 -8398 19462 -26935 -1292 26257 -37268 -32407 41226 9432
11153 9432 -14681 -82077 -94234 30338 44892 -7539 -41842 -37029 -37777 -24419 -49106 -42598
11141 -42598 -16124 -5685 -52662 -12547 -3266 -76240 -32616 31308 39407 40525 -25297 -32532
11129 -32532 2508 36420 109988 50407 55947 80100 55828 57683 -24534 -13756 -14458 5139
11117 5139 -11593 5132 -2944 -42256 -110841 -120854 -85083 -35320 31765 29915 -9417 11851
11105 11851 8649 13769 -59173 -51719 -43086 -78263 -72481 -73397 -95153 -80438 -28226 1411 -40630
11092 -40630 -38191 -33233 -35826 -76872 -73435 149 -24552 -51625 -50251 -38685 -36267 -90827 -39168
11079 -39168 62927 150508 117021 75615 35530 27362 15211 -20437 -9381 -33478 -20937 -83379
11067 -83379 -59844 -56630 -4886 -15457 -18179 24595 47833 -8682 13755 29480 -27143 42302
11055 42302 28631 -3171 -27784 -85487 -195663 -167310 -23820 -3658 59362 66727 5261
11044 5261 -6707 48761 63512 66696 48489 26722 49270 44419 68029 118435 110756 166623
11032 166623 99278 76011 -4990 11642 63121 60383 11778 27639 24417 27724 -13587 -19535
11020 -19535 -30220 -36466 -67291 -102206 -23560 -51141 -36754 -32316 -45115 -41014 -87272 -107271
11008 -107271 -76312 -31977 9911 29322 65503 29885 -9464 -11754 1178 6774 -3834 -64566
10996 -64566 -75675 -15412 50430 34197 -20394 -54295 -12601 34082 -3705 14729 73603 60560
10984 60560 21213 -36860 -57349 -54965 -7805 -44387 -28459 17498 -49384 -122300 -19354 53467
10972 53467 15267 -5319 8319 19691 -39066 -4882 -13056 -30418 10946 8916 -31714 -81378
10960 -81378 -42302 -24505 -43309 -32193 76118 69080 15954 622 40616 17622 -44265 -56387
10948 -56387 -79540 -81997 -129122 -77772 -564 9940 -33938 -39471 -3443 -30538 -8630 22645
10936 22645 -9899 -34635 -62349 -50575 -33048 -57330 -81086 -45644 40021 -43111 -86036 -58620
10924 -58620 -38178 -52957 -76190 -16082 -10905 17231 44964 16341 -26013 -8579 -43114 -20842
10912 -20842 407 11423 -10805 53569 65184 38802 82025 86090 47486 9249 19555 -103
10900 -103 -49707 -69785 -61611 -78974 -40987 -35985 21165 26773 -32419 -11201 14680 8117 60675
10887 60675 -7238 3301 39180 -29671 11412 24166 -49346 -8828 25836 10552 -42788 -141247
10875 -141247 -54512 60479 64336 -22242 -36229 3832 14598 34497 51528 43584 -32905 -62349
10863 -62349 -81266 -47866 -92391 -57367 28956 -3230 47174 29484 -5776 -47083 -124899 -171396
10851 -171396 -174166 -147015 -59553 -75584 1228 13022 49429 74441 13686 17697 46443 46765
10839 46765 23677 -3816 19955 29792 61356 82720 -10937 -4436 54603 -27884 -69751 20328
10827 20328 -15461 -49953 -65667 -36644 -34144 10015 23931 291 -4739 26248 -37782 -62343
10815 -62343 -74082 -97539 -63823 27606 -49824 -69162 -16982 -15409 -28359 -58399 -73855 -27466
10803 -27466 -49435 -45339 14813 -20252 -66394 -54154 -40540 -77163 -86170 -78435 -66309 -39360
10791 -39360 19320 -24105 -9464 -41015 4212 14709 46824 117960 75790 62271 57988 37967
10779 37967 64355 42412 -39044 -50131 30413 21166 25714 -10048 18669 -9906 2750 21568
10767 21568 14014 -36760 -15809 32272 30885 67424 65965 17693 56841 45047 -17945 -39322
10755 -39322 -61361 -93537 -43411 -55119 -56194 -23211 -51348 -33187 -14550 -30238 -24497 47271
10743 47271 33062 60663 22571 9362 17156 29529 6750 43019 -9771 -19633 -28510 -37674
10731 -37674 -38327 -38489 -84562 -22711 25704 21408 -17799 -6792 -41115 -51401 -22223 -4022 36710
10718 36710 42633 95931 49822 23593 4370 -33348 -34470 -41752 -46885 10167 -11156 -34192
10706 -34192 -71885 -83962 -16498 15665 -46479 -78675 -67476 -73559 -53442 16873 21826 -61594
10694 -61594 -106712 -75130 -11652 -20253 -49887 6063 16297 5408 -34106 -32386 -47546 -106762
10682 -106762 -81212 -33689 -17648 -49159 16799 99201 460 -7193 37945 4240 5685 -25201
10670 -25201 -77970 -106421 6180 -29493 -59255 -22536 -34624 -36716 -72027 -28926 -43832 -64771
10658 -64771 -106380 -54926 -6003 -39096 -68920 -31739 20236 -1288 -16095 -10064 -39480 -82028
10646 -82028 -101862 -134982 -81474 -43158 -15130 -8645 -55090 -100766 -33672 -48991 -122571 -107617
10634 -107617 -52788 -27711 -16179 -40986 -81043 -48455 23606 -18091 15254 42078 3831
10623 3831 49713 -11618 -49386 -59200 -30319 -11592 26441 10776 36809 72907 49141 46834
10611 46834 -14276 -73819 -46688 -56078 14771 24466 42915 98446 -3141 87617 71059 -11011
10599 -11011 -33179 -37283 -27829 21493 47146 -64443 -40339 20088 -14900 -59445 12901 -32077
10587 -32077 -27613 -10124 -18294 -4238 49958 3535 -19569 -49790 -67694 -54774 -34341 -971
10575 -971 16781 10103 37731 -572 -100774 -160045 -119134 -94742 -75058 3586 -7566 70213
10563 70213 3640 -4517 -9380 -29812 -15039 -15792 3584 -35332 -16209 -28122 -126164 -95716
10551 -95716 -57524 -43801 -88655 -60371 -69563 -35216 11166 2395 1684 -10594 11600 40859
10539 40859 19916 460 -16959 -47598 -57825 10075 -21048 39125 13672 -3064 -24100 -65415
10527 -65415 -89736 -93073 -52829 -60310 -60616 -2141 4927 31044 39907 19873 48573 79787 15688
10514 15688 -46170 -9724 70941 58184 11855 43001 -13606 -37011 -26651 -1646 -35310 -35371
10502 -35371 6679 -21690 -106424 -77730 -49110 -77796 -18201 44428 8808 40168 20216 4296
10490 4296 -10016 6625 24792 40217 18131 21417 319 -13390 -34875 -37316 -63273 23011
10478 23011 56474 90986 63754 -32977 -54437 -28303 -5964 11445 -33177 -1545 9168 -34812
10466 -34812 -20839 -8159 -43687 -64010 -65434 -36900 31016 58961 29701 -33123 -76303 -59452
10454 -59452 -156632 -117337 -139506 -48728 46921 -62949 -84331 -45989 -20277 -38617 -72278
10443 -72278 -94878 -88978 -41911 6038 -40445 20320 36446 33280 6170 -46828 -71154 -36137
10431 -36137 -39302 -54426 -45707 -8030 -46641 -51908 -40847 -4834 12366 -25337 -33522 43242
10419 43242 -17294 -21850 5553 -37826 -79808 -15523 42379 -25488 -31630 25501 17184 68992
10407 68992 -8678 -34379 41457 37761 -3521 29888 52187 71428 49534 15438 -7688 33961
10395 33961 51253 29881 255 -17048 -16138 -92517 -44392 15384 -37241 27742 84879 20100
10383 20100 -60999 -49369 -22800 164 21240 34360 17071 -12191 -23814 56571 28525 7575
10371 7575 70172 33897 42577 21760 -1195 8699 11008 -49532 -27504 -5041 -37146 -55178
10359 -55178 156 59780 -1557 -61114 -26233 10559 58008 -23845 -55545 14192 -203 -40409
10347 -40409 -14594 16775 -24431 -72770 -3760 -34597 -47417 -50244 -59601 -51649 -20869 2181
10335 2181 -12845 -36725 7597 24302 -11707 -94917 -85390 -101903 -142949 -147603 -84163 -37867
10323 -37867 -25974 -12380 -33624 -13124 -18111 -64320 -23097 43650 71383 83131 1175 -57027
10311 -57027 -33026 8717 22958 -1351 -65890 -41776 -51699 -20488 -30452 -116389 3915 91936
10299 91936 -16497 -8391 -19228 -117961 -62293 -16371 -21372 33307 36094 7208 12902 -31294
10287 -31294 -47593 -27823 62273 74687 25984 24667 -28769 -30222 -33741 -32414 19316 26625 16855
10274 16855 -1470 -67240 -72955 -36250 -19044 -16938 15759 -11981 -7761 33914 -8700 -37026
10262 -37026 -65777 -82904 -44440 -31639 -40133 -2156 -31193 -44183 -90081 -2320 -41285 -98049
10250 -98049 -37350 -55902 -19012 -50032 -51938 -90211 -74147 -17625 -4411 -32977 -25772 1734
10238 1734 -63317 -52208 -67693 -118553 -50380 -82411 -86412 -51155 -759 -56647 -30859 -3408
10226 -3408 -48952 -75074 -15589 -20419 -93868 -73170 396 -12603 -57475 -62601 -10509 -26404
10214 -26404 12281 16843 -110042 -169184 -182064 -43899 -46461 -87289 -83856 -55999 -33714 -74325
10202 -74325 -124693 -85436 -36189 -38030 -14445 8258 -25881 -47096 -44937 60652 30767 -30508
10190 -30508 -90590 -95939 -50714 -19601 7918 -51925 -18961 -49126 -53134 -66093 -146530 -118939
10178 -118939 -35065 14814 -39954 -23589 -26090 -6322 64637 77878 52736 30835 44996 -5634
10166 -5634 -48213 -3210 -25393 16279 27079 -2257 7169 -56662 -39036 -221 -11906 -92140
10154 -92140 -62566 -62708 3438 -1119 3846 -51766 -28379 43152 63954 30495 -19564 -22123 27963
10141 27963 28703 -39652 20100 20892 8133 -45742 -42833 26522 -21138 -49136 9533 -12393 -45477
10128 -45477 -2701 20576 -41386 -32782 4426 -46099 -81521 -23858 -7882 25864 54385 49206
10116 49206 -7073 -18959 -100862 -108354 -60642 -29754 3904 -54099 -76659 -21850 -31926 -20601
10104 -20601 34841 29762 -47983 -62951 15023 1002 15202 23607 -10345 -7376 -19720 -58664
10092 -58664 -56219 -69504 -86420 -40290 -55328 -2647 -107611 -131054 -10245 2669 7390 73125
10080 73125 90984 1253 33767 50873 66151 68547 161125 119172 60068 48650 65629 30932
10068 30932 -14879 -31582 -76227 -37543 35422 32226 10678 -4973 -42055 -76283 -10498 -30515
10056 -30515 -49217 -23127 -79733 -64067 -61868 -93421 -86271 -25155 -8654 -19964 -88329 -66800
10044 -66800 -59533 -20014 -84678 -87531 -81685 -26034 -65042 -107009 -128453 -104771 -94246 -112118
10032 -112118 -63951 -28983 13425 75816 67644 34113 31923 -38560 -47742 -72531 -88200 -120463
10020 -120463 -28617 -88452 -78545 -88294 -37489 -94877 -119836 -35846 -93362 -66932 -34800 -41592
10008 -41592 -26641 -28211 -29144 -34120 -81254 -43737 -77523 -71982 -83127 -64121 1498 -26920 -41489
9995 -41489 -56852 -41203 -48510 -53965 -58653 -72002 -44939 -23600 -11126 17164 -14023 24603
9983 24603 51789 7518 -18195 6767 -26244 31387 8900 11020 24846 5400 35712 28624
9971 28624 51105 25992 -30721 -29518 60688 50592 26909 -40734 2844 -24376 -50165 -47590
9959 -47590 -93969 -86209 -16178 33384 58844 47844 19654 -10961 -6875 46479 40999 -40074
9947 -40074 28179 50992 17195 -10986 -44010 -52909 -93026 -32050 -44826 25855 35047 -5406
9935 -5406 -21705 -24224 -101033 -125548 -73137 -2439 5632 -35212 -64651 -92950 -59490 -41990
9923 -41990 -55990 -32440 19503 70427 93792 8587 -30333 -39028 -58074 -87186 -94079 -128334
9911 -128334 -116428 -124987 -68846 -7135 -12145 -66034 -91926 -148711 -188867 -100035 -63548 -84489
9899 -84489 -52543 -18502 -49596 -22666 24991 -3232 -6994 6742 27884 29289 -24659 -45893
9887 -45893 -98619 -31971 -18873 -53651 -12779 -18119 -9873 -69751 -79776 -71771 -92994 -42437
9875 -42437 -49770 -32458 -5243 -88868 -54491 -29253 1198 28390 27865 9246 12038 -14931 -32352
9862 -32352 -37023 -51540 -21429 -79696 -72201 -64712 -38262 -11453 -11094 -40861 -57191 25324 43893
9849 43893 12340 -30969 -47648 -22508 -16731 -32428 -60551 -42661 -71139 -60945 11973 -9780
9837 -9780 -29160 32550 -6193 188 -35895 -47497 -22770 -53274 -96527 -25883 6062 14107
9825 14107 -6505 -13953 -20367 628 56653 3123 -42000 18031 65520 53055 42034 -24513
9813 -24513 -29543 -5420 -10438 17108 67298 42766 14894 -6165 -33344 -45372 2066 48881
9801 48881 64554 45762 -1516 15932 -21224 -28657 -43042 -62537 -31731 -25700 -54601 10124
9789 10124 13679 28563 94018 69504 36858 70007 100415 131045 186916 121742 69954 -9402
9777 -9402 23287 14842 34197 20529 51386 35032 -40312 -97980 -73734 -24410 -64965 -53894
9765 -53894 -49092 -26972 13020 -66963 -114565 -74640 -23209 -11156 27176 -30641 -39301 36758
9753 36758 -13581 -41923 -29099 -19654 -16533 -56190 -35172 1455 49990 34515 -15413 16058
9741 16058 50821 1790 -24744 -41469 -77572 47932 -8854 -87091 -56588 -18593 -51034 -38134
9729 -38134 -26020 -76214 -63909 -75525 -81548 -99618 -27100 -23738 -92330 -37264 -7019 -56848
9717 -56848 12247 27317 -87021 -87935 -99302 -49050 -67941 -135886 -41794 -35772 -59175 -46369
9705 -46369 52757 50170 -23168 -32331 -50289 -43078 -27872 27289 18252 -64166 -66393 -4115 -16077
9692 -16077 -8382 -63456 -49793 -18740 -25243 3810 11731 -46862 -92326 -28839 33744 50424
9680 50424 114607 61593 59713 14043 10689 26003 -11434 -7453 -61292 -45407 -21379 26554
9668 26554 60968 -22806 -72892 -54720 -45481 -8799 9365 -86776 -33854 -29736 -18083 -54924
9656 -54924 -65212 60915 42151 -413 -31285 -19702 -17138 -49616 -46169 -8425 -21282 34813
9644 34813 -17723 -67005 -13510 -1476 -7363 7572 29158 23730 51889 -10160 -11037 20351 -20944
9631 -20944 -21491 -84897 -96257 -59974 -2516 -46843 -62330 16612 52602 32884 15326 -62597
9619 -62597 -97183 -83483 -18732 -26213 -85666 -57177 -67252 -21903 20502 20194 -12697 -15688 5216
9606 5216 -10058 -33875 -21932 86225 147946 126980 97552 60895 40837 552 45117 12916
9594 12916 -53826 -19577 60578 55624 -19911 18286 8707 29174 50632 5278 67572 100246
9582 100246 40354 -41625 -70104 -101470 -93205 -31879 -4866 -41859 -37309 -1595 7952 -6013
9570 -6013 -15859 16846 -7938 -30619 -30429 -9826 -18029 -28279 -24119 21171 58897 68641 38117
9557 38117 -39802 16815 -3656 -92630 -74649 7473 42999 3732 23101 8793 11414 -20962
9545 -20962 -19179 -68433 -57755 1595 62803 69167 20339 4578 50832 169 -31793 -24323
9533 -24323 -41291 -54919 6902 -5425 -59414 -20215 -20784 -3338 -5402 -39243 -40143 -50395 -58695
9520 -58695 -42030 -9317 -83076 -85133 3425 14879 10756 4726 31711 30304 -4372 -69457 -76885
9507 -76885 -69745 -14593 34990 10440 -18454 -16067 -25488 -87142 -47963 7335 -69426 -68919 -5066
9494 -5066 10655 -40286 -67158 27200 -5091 -34817 19563 -3229 72145 95399 79392 45887
9482 45887 -11011 -7024 -33061 -30192 13590 -51403 -53989 -89371 -55327 8920 5155 37551 70188
9469 70188 20291 -8084 -13575 3855 -88331 -28913 -669 -34523 -18283 -770 -17540 -24339
9457 -24339 -10173 5270 -17069 -46427 -34349 -33281 665 38303 12921 53200 45866 21909
9445 21909 57739 15854 48443 85444 25005 -45291 -81639 -43447 -22021 -24611 43639 3877
9433 3877 -38765 -25373 13625 14546 -49207 29169 40194 11302 -3941 9949 10455 544 20407
9420 20407 -21656 -72511 -118850 33126 20862 48428 54215 64461 40079 459 -18688 -19615
9408 -19615 12064 38602 79693 85894 47019 66803 126852 90286 60896 158281 125562 55027
9396 55027 71724 33274 46717 29734 17910 -2285 68368 5302 -28495 46905 15561 20945
9384 20945 75368 111070 93844 16449 23108 10484 -8478 33189 -40381 4029 56280 59620
9372 59620 10162 12966 47484 8145 -66719 -34772 -1418 -4426 -22041 -4846 -55394 -78632
9360 -78632 -61298 -23297 -41382 -64180 -103311 -129831 -132691 -119069 -27627 -59545 -84875 -45233
9348 -45233 -21739 -71444 -96910 -80697 -44700 -114899 -126110 -83462 -53818 -50281 23524 40726
9336 40726 -12423 -24387 12566 32826 40340 26387 -12795 37856 52874 29118 20665 18521
9324 18521 19535 61614 32616 2671 31133 46150 36789 -32381 -72281 8340 78134 39729
9312 39729 20159 9092 -45422 -79928 -73748 -60929 -37884 -9701 -16274 -8730 2755 -16389
9300 -16389 36967 29982 -13474 -24675 -61071 -78394 -29742 5161 -24904 -8282 -20626 -15570
9288 -15570 -28321 -2155 35378 11792 17063 3231 -14052 -73465 -45540 49803 44367 62652
9276 62652 40304 43914 42206 -17333 -38463 -13164 57803 2188 -54649 -18158 23442 -4806
9264 -4806 9115 10285 -63819 -29144 -55439 -35210 19852 -29240 -44409 -104861 -150700 -96372
9252 -96372 -49829 26348 55969 -14358 -14556 -24584 38528 34518 -12217 -56848 -1702 21497
9240 21497 -39365 20753 30006 -7579 13368 20523 64902 47836 39772 80445 102509 12674
9228 12674 47256 99316 76068 77902 42640 41729 -24760 -20668 -4578 -19362 894 49463 79286
9215 79286 45630 37108 88646 57513 61039 53605 32731 110999 77473 47841 20258 50496
9203 50496 112670 40235 -10181 92825 55620 82466 76422 65477 138170 46397 8364 18931
9191 18931 18804 199 -46428 -80384 -78296 -7623 -3675 -4737 -1859 905 -5878 -29155 36065
9178 36065 -12558 27034 -9287 -10094 -5374 16950 79329 14044 -43591 -69113 -35878 -12717
9166 -12717 39641 1616 -16275 37024 4122 32422 42444 62569 -14458 -16763 -33925 -50966
9154 -50966 -4311 68457 13991 -70932 -66183 -92042 -48625 -25775 -19715 4469 48235 44296
9142 44296 29862 43683 50104 59133 42985 77001 4429 -81276 -39463 4593 73689 144108
9130 144108 62589 69285 132273 42699 -50317 -27721 -11592 7063 101642 70373 -50160 -50414
9118 -50414 -47838 -80364 -61918 -3644 -59119 -72927 -52923 -13856 14129 49354 91427 35870
9106 35870 20926 97414 106721 119547 89043 50670 24423 5792 79523 122375 89060 57087
9094 57087 80396 57946 51821 41121 10823 20382 15223 62446 112187 71189 42895 -7136
9082 -7136 24590 54640 75081 90148 53774 61494 106949 79497 47624 -8646 32023 7454
9070 7454 -32502 67213 110934 126977 42483 38253 90666 63666 69986 63853 102901 14652 86605
9057 86605 173452 191724 101616 67892 101668 87121 89512 115124 61882 47100 1089 44443
9045 44443 121332 131201 103956 38069 24216 28617 69427 79656 108211 126091 81779 93988
9033 93988 76179 16063 24081 43368 66443 91264 75272 98126 97343 68777 76201 6756 275
9020 275 65049 109976 81891 65374 118199 73919 105238 193412 160162 65353 85470 74600
9008 74600 59425 68383 94484 126842 113801 138852 99746 142724 88581 137694 231793 208223
8996 208223 191531 185203 151739 153258 204669 281787 269008 248357 227956 149048 153629 182179
8984 182179 158485 135434 162281 217593 179168 195975 266792 298479 300105 304246 286727 297694
8972 297694 312529 342815 345469 323080 368712 386083 380106 386045 440169 511446 458047 486365
8960 486365 583613 576772 606639 748705 726600 713460 761089 794705 915284 972675 990719
8949 990719 1052800 1133337 1206818 1329310 1466781 1573543 1749482 1930907 2088421 2270174
8939 2270174 2451564 2662159 2911277 3193200 3511743 3995163 4496363 4930712 5526722 6319388
8929 6319388 7240706 8309703 9619233 11215038 13098127 14809345 14632700 11884377 9174200
8920 9174200 7343621 5909262 4936286 4254554 3781245 3420589 3125477 2822773 2619175
8911 2619175 2418808 2303381 2141128 2081804 1935405 1717717 1669188 1526147 1423424 1383975
8901 1383975 1341070 1262576 1111386 1110632 1078931 991889 966033 963884 885892 833923 838770 795787
8889 795787 801361 768733 702686 608688 540709 574020 565599 557055 571248 509657 456622 548766
8877 548766 526106 456937 515686 540796 504315 472276 452745 437387 422480 339956 392964 429576
8865 429576 455377 373911 416204 431344 387920 507096 468413 490303 554471 628309 558271
8854 558271 554384 491399 415988 440896 465083 431952 404468 463223 451434 435126 392590 379295
8842 379295 339751 312732 373032 463278 437420 312176 311230 361832 435378 366679 377337 436628
8830 436628 417435 356747 365759 374245 311626 254167 317931 314876 351886 280688 312976 417724
8818 417724 359050 285554 276661 286388 262258 321555 392266 403087 342633 281556 268468 319292
8806 319292 291194 263564 348449 393937 317681 328466 386229 401278 362181 379854 366357 367452
8794 367452 334051 246743 251978 294121 307311 279848 188988 212439 252731 238639 273294 213825
8782 213825 235008 241140 157271 221310 255279 323164 298817 348272 338941 258850 258115 312517
8770 312517 306389 380843 443809 493568 463502 426597 470527 508839 464606 419555 419429 333247
8758 333247 286892 272159 279860 265984 225924 193929 144638 153124 193715 139832 113357 111875
8746 111875 87814 114027 74142 67689 132550 169156 169779 112242 135604 71939 49108 46663
8734 46663 119406 102526 91532 113251 62903 72768 172634 104688 108039 83891 32728 153611
8722 153611 256725 212614 156290 153926 119429 121131 144445 124060 182308 177360 199301 220867
8710 220867 163017 159667 90698 93629 54263 115254 115595 143295 137012 171673 174990 227701 205451
8697 205451 198738 244189 288574 239544 210633 206468 202290 165328 162915 229773 199984 209336 139789
8684 139789 111128 136090 113397 116591 194911 275271 242229 258692 234517 206565 131267 66644
8672 66644 54535 94074 203501 161354 157619 105160 146789 90296 64986 81333 83475 149986
8660 149986 186118 124599 56484 66958 171120 181886 77580 131763 199865 220621 218526
8649 218526 175127 205267 207690 192231 182522 120181 77801 64513 30551 59758 29489 65758
8637 65758 74440 149965 147643 65699 80956 25673 51537 140872 133469 137149 72822 67804 30964
8624 30964 25359 107242 80919 100477 189630 181460 146600 130232 45269 -18674 56408 61765
8612 61765 1463 -21377 -63070 61667 65043 148635 117077 33727 30858 48414 75565 46027
8600 46027 68688 93388 86112 37950 66687 105325 119670 65025 68243 45303 63088 58060
8588 58060 -11649 -17806 -21003 75515 36826 37066 13895 -22999 -134947 -75179 135767 102428
8576 102428 138725 123658 101905 125210 169471 151005 87817 89706 77030 149593 147471 118567
8564 118567 7377 10656 63081 10828 73575 80767 38525 31611 -637 6934 85065 44638
8552 44638 38847 59742 69866 31639 12481 45623 90749 89475 30960 7124 23572 61841
8540 61841 51064 55537 79809 101158 74705 61427 58258 110050 96711 105654 109720 130009 96152
8527 96152 130672 108213 49057 89575 35015 -11592 23371 37551 108767 55559 73130 97374
8515 97374 53802 118100 133474 104152 23881 -9096 31905 43779 102948 111912 45102 32504
8503 32504 35255 63185 67014 48974 38290 109328 62931 95962 90934 79054 74792 51704 48893
8490 48893 70725 115833 81588 -5442 25762 89930 94216 93015 97402 61252 66920 40788 59689
8477 59689 63029 114247 32570 59453 71012 3488 12229 -500 -3387 46351 76040 17156
8465 17156 -14814 -27824 13071 -3759 23532 53007 98007 84882 67704 14602 27058 36438
8453 36438 13511 -21385 -25068 3038 87341 106169 12387 33508 65724 89839 75220 53454
8441 53454 48941 78592 58916 44536 -18424 -37914 -5383 31580 19449 -37901 58419 72263
8429 72263 64524 47918 23608 56643 112051 116923 124373 82756 86615 71129 10395 41364 1686
8416 1686 -50071 -11 6574 702 43222 85272 52217 90546 76230 19935 11246 1444 49672
8403 49672 40918 60949 96619 7458 18654 70024 78703 55237 22041 -32881 7381 45951
8391 45951 -9393 -53031 37207 -19056 -75789 -49741 5870 7972 -20709 46778 58860 74894
8379 74894 82557 61469 21325 69123 97139 78914 112762 143819 104773 106636 37904 67313
8367 67313 47871 58973 44292 77202 86490 -999 -29427 -11636 39820 249 47770 39788
8355 39788 34389 76800 109073 105595 -17929 5284 31753 19413 8140 56789 37915 45930
8343 45930 9533 32111 81116 129794 170562 60632 68548 89809 66185 729 -17075 -5667
8331 -5667 28331 67363 77231 -1029 -13755 66021 85127 47897 45198 368 -20906 36240
8319 36240 55617 88751 34244 5324 45930 21782 4781 78829 76471 88077 96612 52824
8307 52824 80550 83197 20542 -18452 27694 81554 125781 103389 71763 54330 84451 89015
8295 89015 13923 64636 77469 51463 27740 67243 106908 92724 57970 39257 21457 -42583
8283 -42583 -5502 25603 52169 87075 103151 61240 81057 140169 100711 148050 127074 85439
8271 85439 69504 44198 67282 18451 58766 103046 114353 127758 136926 130878 111472 135333
8259 135333 145566 142704 33723 82521 85249 103544 124827 142828 112018 87774 110690 181313
8247 181313 183615 103462 99950 108066 211668 220781 197971 110603 231653 168127 148862 226175
8235 226175 176926 82040 122205 115931 142914 207933 187695 172085 141460 107608 82110 89380
8223 89380 137781 160060 227611 157862 187962 247337 199894 223667 172846 158952 143543 232258
8211 232258 309498 269681 318499 328853 290122 337162 362880 392156 515144 523268 664796
8200 664796 689582 716520 784528 852447 794193 783154 780953 898653 1100979 540370 384962
8189 384962 440080 389006 273212 271699 264228 327061 283633 252806 300778 217326 235215 289992
8177 289992 330615 340943 313971 257914 199994 248819 253088 255055 310218 278346 256901 221243
8165 221243 217814 192747 257697 361369 389217 411226 413332 317774 308878 331785 353908 309573
8153 309573 346740 299654 296737 384606 446561 530878 493945 531681 578737 675509 781458 875182
8141 875182 937453 1001088 1113698 1249440 1299152 1324529 1267520 1183701 1039908 861051 811052
8130 811052 774257 689700 658013 680779 628243 627573 564071 545498 619133 636110 651809 628374
8118 628374 654274 669768 651504 708998 730055 808606 853137 843114 844587 856982 896570 894342
8106 894342 941004 908728 946416 1011550 997043 1100387 1181689 1251817 1329185 1398701 1454010
8095 1454010 1567032 1738011 1930751 2159403 2371484 2602412 2802322 2806538 2710024 2606582
8085 2606582 2508553 2290788 2049985 1861173 1619470 1576214 1498243 1458336 1427422 1432721 1438634
8074 1438634 1510190 1444477 1441411 1446430 1437841 1427560 1479021 1600564 1640102 1751642 1818415 1893265
8062 1893265 2018672 2235609 2541462 2807520 3070330 3326595 3367359 3326784 3256438 3193853
8052 3193853 2987365 2611515 2247134 1979106 1850507 1743694 1584199 1533724 1478439 1439224
8042 1439224 1384127 1365639 1349661 1348113 1312790 1212182 1084595 1108075 1152503 1098181 1063072
8031 1063072 1070397 1032827 1030108 1011016 1005858 1016715 1055809 1006018 974196 955288 1001070 1012174
8019 1012174 995744 963672 922180 868229 944452 964366 900788 872752 819953 873586 934516
8008 934516 943054 918239 882429 802795 799349 800336 752516 800079 776687 712031 709996 698723 665383
7995 665383 677598 667241 713461 686985 675446 697827 705617 729406 737204 814427 804832 840426
7983 840426 858002 839849 809757 745430 726870 827117 871757 874644 832043 880565 917332 889236
7971 889236 863776 767690 770664 778516 766799 778547 764192 744317 649942 669172 596133 536179
7959 536179 559875 637575 632945 630276 631858 717599 751107 692419 728695 784058 800058 740733
7947 740733 747470 865436 849272 839783 862208 872951 846205 857765 856302 840966 812037 873855
7935 873855 901991 885892 835078 836280 805971 798980 777572 770352 792428 745541 775610 788509
7923 788509 844100 796984 780318 767500 814666 832389 829009 781464 789539 835037 830992 846706
7911 846706 843410 846029 859781 851820 920653 929075 904197 865094 869436 885505 857332 879157 954217
7898 954217 937647 929003 980088 931277 980228 965179 994097 1047188 1028165 988015 1001089 1017899
7886 1017899 1007049 1066143 1074642 1043020 1087756 1110279 1086129 1087875 1077488 1104308 1174152 1188137
7874 1188137 1232764 1271960 1237328 1269217 1285945 1326521 1342625 1305223 1286702 1302357 1332150
7863 1332150 1364355 1370626 1367976 1410843 1395258 1401449 1486365 1537260 1606629 1537505 1548496 1560273
7851 1560273 1666267 1770081 1724964 1822879 1817365 1808584 1844849 1893548 1975136 1986030 1990333 2012798
7839 2012798 2013422 2021754 2096133 2111511 2163456 2240716 2349882 2481999 2571959 2625476 2693082 2637338
7827 2637338 2594962 2534653 2481338 2480558 2585965 2670013 2695399 2720886 2723660 2781903 2850894 2986093
7815 2986093 3056841 3125482 3300269 3390377 3532164 3624326 3739772 3961771 4110713 4274892
7805 4274892 4639321 5148746 5409578 5545429 5707379 5943952 6228998 6583069 7011091 7363969
7795 7363969 7322576 7237716 7174106 7122616 7156024 7021423 6774465 6517647 6247833 6178242 6190077
7784 6190077 6113767 6240220 6417547 6530408 6702170 6898219 7075900 7306399 7483163 7651175
7774 7651175 7848680 8149810 8494587 8877571 9083810 9113637 9087052 9272783 9532415 9820158
7764 9820158 10086155 10331737 10605328 10959153 11370063 11816612 12421120 13029222 13767066 14618353
7754 14618353 15501623 16470216 17473775 18280693 19085721 20063983 21217924 22498748 24003213
7745 24003213 25723787 27684360 29993835 32677989 35754955 39299711 43319227 48031081
7737 48031081 53192851 58088010 61032649 62283540 64191687 67454947 71851918 77491573
7729 77491573 83950723 88985231 89328730 86121383 83579126 83345769 85276701 88949197
7721 88949197 93903808 99687715 105249668 108123915 106944283 104757453 104057281 105470853
7713 105470853 109886701 116721631 123201327 123234316 115209312 107867710 104497869 103847727
7705 103847727 105116075 106800226 107509124 104928415 99588179 94873512 91789214 89873297
7697 89873297 89356467 90474485 92770497 93853219 90468032 82602340 74989171 69595932
7689 69595932 65800596 63384502 62271995 61142779 57798391 52468473 47526959 43783178
7681 43783178 41046504 39072886 37574721 36507156 35882251 35195313 34390405 33701245 33366201
7672 33366201 33330961 33518114 33775906 34095249 34582325 35180108 35814317 36724838 38014121
7663 38014121 39651292 41882071 44713799 47889218 50765350 52005889 52013880 52674770 54377871
7654 54377871 57154213 60877747 64517689 66280480 63919641 58803415 54226126 50992057
7646 50992057 49126020 48408435 48585260 49467619 50969626 53192238 56069778 59648483 64028497
7637 64028497 69075758 73734395 76172552 76162311 76667630 79128873 82889945 87834583 93158325
7628 93158325 97066086 95715671 87965949 79920629 73971172 70046707 68449233 68284623
7620 68284623 67738862 64690678 59224294 54068181 50473711 48132727 46814309 46293322
7612 46293322 46576751 47408819 48889237 51068784 53668118 57098646 60977522 63774585
7604 63774585 62963047 57674664 51892426 47485142 44541163 43087385 42598711 42085677 39772033
7595 39772033 35706623 32174762 29387149 27132253 25477626 24067188 22899369 21895603
7587 21895603 20846366 19719367 18534002 17402648 16417994 15654395 14939657 14276806 13627856
7578 13627856 13124387 12666037 12265245 11914156 11594150 11326127 11206441 11053743 10902954
7569 10902954 10796112 10764422 10802881 10833899 10897578 11126930 11367093 11715955 12107056 12639598
7559 12639598 13174313 13518074 13593426 13228681 12352810 11349645 10411913 9392512 8625559
7550 8625559 8014154 7626249 7199279 6777113 6530674 6280262 6019010 5745618 5630403 5482774
7540 5482774 5371298 5184510 4957153 4747413 4703607 4639898 4530433 4460420 4330504 4207663
7530 4207663 4099341 4006184 3928418 3887411 3744730 3686025 3660284 3542202 3414888 3355668 3259085
7519 3259085 3175421 3125390 3122080 3014855 2954927 2882287 2804595 2828052 2788111 2746972 2681835
7508 2681835 2643364 2604565 2510239 2542801 2479864 2454881 2386324 2364809 2392261 2396076 2396913 2309129
7496 2309129 2206600 2256215 2228893 2195025 2224767 2199054 2172340 2180524 2187342 2173732 2053304
7485 2053304 2074090 2059629 2031739 2022955 1966683 1891475 1869821 1892676 1909170 1907940 1783849 1815665
7473 1815665 1846926 1835527 1822075 1803356 1818614 1757044 1743771 1728805 1794222 1823031 1863544
7462 1863544 1872896 1899776 2083674 2160960 2190777 2229945 2256233 2186880 2104908 2039547 1989847
7451 1989847 1993633 2043126 2127333 2157504 2118197 1992764 1719225 1569956 1520308 1484043 1426794
7440 1426794 1332145 1249903 1221660 1253113 1170056 1145944 1151545 1088757 1055892 1125624 1115824 1151043
7428 1151043 1133131 1136374 1125430 1050011 1077943 1023351 1034222 1084527 1135819 1092793 1089139 1118506
7416 1118506 990069 953669 1008488 1023885 1043875 999689 953395 916220 970731 991189 969289
7405 969289 1027313 1031085 962384 853560 822191 838805 875226 858629 874256 898457 862875 853127
7393 853127 855976 851587 882175 912835 936711 987791 932053 939250 995845 1050232 1030034 1012216
7381 1012216 994361 975921 1065395 1116893 1074735 1091991 1021713 1071018 1119761 1067108 1026171
7370 1026171 1001119 974623 982252 1070387 1132241 1103680 1128990 1202232 1259291 1305085 1383278 1508007
7358 1508007 1648268 1708387 1744892 1647584 1533944 1472326 1452138 1464902 1601243 1671465 1672651
7347 1672651 1613903 1437374 1342363 1213200 1087924 1081741 998629 953688 935901 935403 910008
7336 910008 867250 824724 743944 767552 743862 695374 633008 679796 707130 708957 744332 780854
7324 780854 806467 826018 846029 853136 856391 848452 890543 867126 877792 963033 971798 922864
7312 922864 981529 1077084 1079692 1165160 1155394 1114243 1167630 1175786 1165966 1205582 1250524 1386212
7300 1386212 1459375 1597005 1670763 1830741 2023333 2173304 2191779 2241260 2369580 2376804 2253341
7289 2253341 2150126 2101726 1953865 1755691 1600797 1491782 1433666 1374645 1291436 1296711 1167365
7278 1167365 1066854 1012283 996946 918823 908099 945213 913493 980194 928879 818566 758547
7267 758547 728808 673585 709873 755331 689716 607885 588532 576296 580754 545315 540145 566305
7255 566305 509697 488560 582387 614922 638311 600119 648678 574611 602064 651343 598851 601042
7243 601042 604207 555422 539838 581046 654063 712679 674476 637554 702022 753174 762213 820667
7231 820667 777478 786966 803361 796554 840851 891482 935401 1017701 1031802 1102062 1241887 1383493
7219 1383493 1464351 1516066 1574667 1661783 1734227 1692236 1580688 1446565 1373928 1306487 1145831
7208 1145831 1052946 907622 896003 859131 827938 808005 808641 811987 852135 978675 1016016 1043897
7196 1043897 1120486 1204478 1302172 1401641 1456057 1645493 1850568 2011493 2087084 2027392 2066355
7185 2066355 2056929 1876840 1644135 1537797 1360693 1143454 1005844 937144 852440 827303
7175 827303 731183 695077 656157 610302 581744 619703 580635 517138 568275 519959 454107 518481
7163 518481 531770 470786 435217 460288 485652 485201 460772 500134 592507 581515 610322 627018
7151 627018 685740 769838 815206 903046 1049981 1149775 1260837 1373474 1427232 1510466 1574500
7140 1574500 1592495 1546081 1411241 1245390 1093105 1000393 889849 761169 658874 546277
7130 546277 546464 496375 369055 463768 507581 475308 479778 459427 409688 338640 304941 322287
7118 322287 340875 347154 278464 257776 227947 175356 200306 231647 155460 208747 247108 265878
7106 265878 223680 156434 137703 227772 151385 139396 122964 122736 162878 171321 223577 171848
7094 171848 150168 165718 169857 144126 83856 94939 175995 169376 147853 117991 156366 207015
7082 207015 99736 93111 82513 106209 188495 208667 187295 105328 101990 115597 108106 50316
7070 50316 47726 55396 69556 120607 84681 65463 75560 52535 93108 73761 111134 102811
7058 102811 140970 217058 141554 81416 106203 136075 128128 133932 98234 115273 139315 147371
7046 147371 121810 61572 94588 152558 145443 126547 180527 140792 127199 195986 273338 291582
7034 291582 269002 244890 214837 214231 190393 232033 210860 225560 277588 270769 249794 219533
7022 219533 313981 367830 342897 382757 375901 390695 509002 589072 659306 622334 625729 605613
7010 605613 631816 607271 546925 561251 580321 651125 671614 755990 828158 849558 899152 939456
6998 939456 942928 900025 821491 720806 658528 582597 576810 536499 522866 486334 547624 582856
6986 582856 555548 616107 677601 694449 741798 812143 801576 845884 938337 1049147 1091514
6975 1091514 1098964 1166087 1188358 1169703 1104918 1075708 1136309 1188975 1240341 1268535 1346474 1398036
6963 1398036 1352788 1345452 1309818 1301577 1291633 1269505 1242203 1169150 1209733 1149547 1112981 1063812
6951 1063812 1044953 968681 1030299 1016785 960661 1062796 1139490 1165250 1224605 1342790 1419994
6940 1419994 1445886 1440310 1403227 1333165 1306733 1319719 1355646 1346199 1259622 1292195 1246313 1180941
6928 1180941 1141890 1112796 1105114 1050299 1107553 1158200 1162387 1026759 949042 951020 874044 760922
6916 760922 709546 650219 604038 476495 500784 547695 550431 507275 528172 547339 555821 590834
6904 590834 590346 669963 691090 713820 846394 890717 921156 909093 849245 791358 726257 655818
6892 655818 573438 495311 486277 398439 373007 347826 371944 408794 321479 367991 339017 303747
6880 303747 223226 287214 280039 302982 243297 206459 247929 252183 273827 245038 180209 163839
6868 163839 148435 195197 214280 171326 217573 261991 261539 201207 174154 200614 198237 217912
6856 217912 187026 116394 123475 95155 70968 121996 74884 120665 160872 168790 151468 111088
6844 111088 147495 127338 173573 197096 157661 166334 166030 96971 71900 108607 205819 195726
6832 195726 171262 158676 185174 206188 152828 171361 177330 155789 176238 143413 117176 119834
6820 119834 122834 87680 74910 116116 83345 68016 105245 133077 133724 183627 179954 111195
6808 111195 100143 36701 -218 -13836 43817 45822 11582 9751 43399 7153 7116 33995 20724
6795 20724 18886 37882 52184 1110 15466 40488 63185 -17298 54987 50064 74283 127093
6783 127093 98562 78693 52676 44750 5957 33153 3428 -33831 49870 73651 64578 96443
6771 96443 97796 76547 19941 -20869 40535 29700 61303 107262 42972 52828 24836 -29172
6759 -29172 -32823 -54506 -73774 -26569 25388 82557 51532 49002 33237 3332 -19501 -4886
6747 -4886 -40690 -23158 42672 72924 67747 13032 550 32881 32861 34615 -29519 -91267 -63438
6734 -63438 -52227 -43612 31612 15612 71309 113543 40582 34519 2125 973 -2037 -68620 -96490
6721 -96490 -27277 2878 2870 11384 22432 -8812 -25046 -14983 -32250 -61474 -90167 -74098 6783
6708 6783 -8897 -79829 -4616 30861 92769 95586 40698 45838 11011 19070 -19099 -33700 -52238
6695 -52238 21111 15962 28688 26472 -28386 2140 27054 40892 52939 69163 7812 19515
6683 19515 75763 20266 -36523 -29471 -94978 -31188 37856 40801 51031 58192 -39 43838
6671 43838 100331 102443 56501 65203 58673 29326 62603 58331 14852 14745 63632 93322 116936
6658 116936 59206 15053 50447 35146 -28608 1463 14950 132587 159596 102660 62355
6647 62355 86933 20807 52408 135516 98646 76516 148574 179792 166028 88084 78444 90569
6635 90569 94996 -2794 -18002 19889 41825 62316 55848 77411 93573 103835 40733 -6027
6623 -6027 27011 110472 84437 52713 125813 173377 61768 78437 123641 96737 124017 89010
6611 89010 113230 141984 137134 101630 43221 54901 141203 228923 222459 199789 134112 117391
6599 117391 162571 141322 98445 149068 175403 210811 239038 196302 235979 276238 311755 299873
6587 299873 328705 397890 408992 388966 379161 526797 516689 495074 467491 423257 399189 386907
6575 386907 334584 312598 271432 291526 343706 358842 316006 378172 409339 292245 289117 291352
6563 291352 364913 412803 344339 365385 409405 523768 594455 638434 593225 505401 517227
6552 517227 440658 424470 422527 445865 454761 444444 497571 508889 592669 599925 617146 607311
6540 607311 578582 449927 346145 401544 418640 469139 397710 383103 400250 503714 436660
6529 436660 383546 426187 422088 378602 391950 418121 418658 482156 538318 574060 557839 589968
6517 589968 650592 660685 670912 578425 443967 375618 356391 382026 397406 370147 353362
6506 353362 399761 411790 369392 377775 397403 362013 386172 350277 407391 374374 322261 356473
6494 356473 394092 379195 365027 420699 430805 471938 451625 501069 443276 492949 543534 574380
6482 574380 611158 505882 451661 468278 493666 544926 515849 453224 531246 498217 489194 559368
6470 559368 602407 577569 616773 666950 701979 822381 805911 812495 947339 966135 985216
6459 985216 991627 994996 1003461 1030099 1021177 956839 992770 998316 1005686 967781 968828 1075560 1153532
6446 1153532 1167146 1181473 1198770 1214562 1168146 1122143 1147110 1231665 1334173 1301538 1275577
6435 1275577 1381601 1528155 1690013 1787987 1825049 1938313 2099081 2275039 2357377 2522647
6425 2522647 2683361 2755452 2826906 2729512 2621244 2529614 2399892 2275238 2131722 1999262
6415 1999262 1861951 1811204 1790103 1815386 1846443 1860732 1903084 1966252 1941377 1940725 1949610 1936965
6403 1936965 1954057 1987400 2121891 2159448 2311827 2444812 2563197 2697904 2837953 2898257
6393 2898257 2876455 2741303 2576073 2437917 2348080 2202432 2186323 2222623 2175433 2142103 2118152
6382 2118152 2147741 2145832 2175954 2252541 2337777 2380279 2449154 2416455 2456832 2426992 2383438 2452286
6370 2452286 2451007 2367378 2312791 2371827 2342887 2296573 2366991 2385476 2386417 2448931 2506619 2560481
6358 2560481 2544218 2496039 2549019 2580360 2438945 2293677 2265684 2234092 2216637 2177323 2155149
6347 2155149 1979929 1896881 1796685 1639162 1469957 1396888 1394112 1309321 1277907 1259027 1204874
6336 1204874 1172328 1132665 1140824 1150778 1142740 1119000 1060896 1102990 1123819 1136636 1164147 1142721
6324 1142721 1123675 1135210 1102308 1080102 1073933 1081491 1071815 1024944 1026871 1033560 1045188 1041928 1046360
6311 1046360 1018374 1044402 1074829 1075583 1164831 1161945 1149720 1187804 1209284 1216123 1224488 1235369
6299 1235369 1229716 1203540 1239128 1212135 1238250 1307868 1268176 1235273 1259157 1252351 1234943 1258327
6287 1258327 1337617 1293454 1271849 1274039 1316880 1317862 1383037 1379710 1388116 1325055 1359497 1446570
6275 1446570 1447349 1518322 1537762 1498869 1476344 1498582 1487276 1503146 1522405 1588127 1545329 1543146
6263 1543146 1502549 1511533 1510356 1554318 1585550 1597481 1670012 1669188 1618702 1646851 1708135 1781605
6251 1781605 1730097 1766158 1752687 1792581 1861031 1853555 1862443 1869755 1906619 1972806 1993811 2036885
6239 2036885 2060540 1987179 2000404 1935764 2029859 2113577 2201993 2221593 2226532 2255343 2278593 2239672
6227 2239672 2289007 2370475 2397568 2420435 2463330 2502023 2492893 2495481 2504321 2543682 2546146 2582139
6215 2582139 2628174 2643795 2667497 2672813 2713006 2767641 2826874 2870085 2899302 2929651 3014775 3066442
6203 3066442 3093270 3144242 3155892 3229081 3260145 3207992 3276065 3318122 3316968 3403319 3426841 3467433
6191 3467433 3523770 3639927 3728553 3781713 3750372 3777641 3817722 3858237 3968022 4038121 4057257
6180 4057257 4078653 4146061 4183507 4171974 4276713 4316075 4362543 4440699 4527925 4638566 4784286
6169 4784286 4921222 4952104 4989764 5077420 5286312 5462818 5580144 5629976 5776409 5886716
6159 5886716 6022825 6216433 6314349 6541684 6764082 6975437 7178352 7356224 7676960 7912742
6149 7912742 8176947 8452749 8698757 8926123 9095409 9268155 9418187 9636988 9812457 10136626
6139 10136626 10520095 10938170 11391671 11902922 12429718 13115904 13791579 14601387 15502412
6130 15502412 16471537 17667126 19009155 20484118 21933640 23151575 23916085 24032267 23534076
6121 23534076 22800797 22078174 21603616 21546004 21720780 22172213 22655800 23236742 24036542 25072148
6111 25072148 26133962 27237222 28485218 29947432 31640041 33551213 35793510 38236625
6103 38236625 40963110 43982231 47149710 50566445 54346080 58482184 63140473 68524337
6095 68524337 74606634 81236136 88259500 95910773 105207612 116856945 130675748 146636350
6087 146636350 164381596 184938832 206826489 222739058 218365585 197650115 180585102
6080 180585102 169869457 165061506 165467604 168556623 169400068 162760467 149985287 138314618
6072 138314618 130238367 125439132 123488968 123967373 126417540 130791982 136894592 144952933
6064 144952933 154874780 166923012 179624082 189550113 193301808 191918877 191043021 194216898
6056 194216898 201805924 214372226 229460092 239526616 230991308 205366254 182515092
6049 182515092 166259872 154936204 148461863 145590131 145415869 147357894 151284039 156775291
6041 156775291 164173118 174041413 186350445 200910455 218330189 239027029 264812120
6034 264812120 293710803 315924204 313437795 290893275 272814687 262484929 259323948
6027 259323948 262550658 268618568 271105588 265329961 255267946 247384142 242732062 243173893
6019 243173893 248337606 257047807 265794376 272036943 272447636 266516329 260555506 258857108
6011 258857108 261789494 269940507 280269491 282956762 260864995 220538420 186435279
6004 186435279 160913506 141934549 127828703 116804930 107404868 99246665 92217531
5997 92217531 86132754 80752041 76156085 72020370 68368607 64881095 61552118 58285833
5989 58285833 55335423 52665225 50181974 47809560 45596528 43547061 41739148 40024741
5981 40024741 38477066 37028050 35681129 34395517 33189097 32115005 31116549 30051447
5973 30051447 29084849 28113492 27301541 26439237 25714046 25002250 24333652 23716165 23247076
5964 23247076 22749339 22253723 21895562 21597543 21367346 21067553 20888318 20789315 20704139 20693793
5954 20693793 20661158 20505130 20377274 20231186 20000931 19804556 19693541 19467641 18704512 17910705
5944 17910705 17136374 16568021 16183428 15781527 15368816 14862509 14408012 13899419 13492204
5935 13492204 13178404 12894543 12660559 12368677 12124880 11885870 11676556 11340416 10957645
5926 10957645 10687594 10452362 10259638 9997829 9781879 9558673 9368941 9148996 8939422
5917 8939422 8793130 8715893 8520551 8351236 8243034 8099877 7908315 7807664 7725236 7602040
5907 7602040 7545257 7462258 7304592 7201048 7089638 6984615 6895712 6773362 6679583 6584970
5897 6584970 6570910 6526915 6439361 6324286 6169657 6050903 5955900 5907868 5775983 5726539 5581630
5886 5581630 5479014 5400658 5413325 5393576 5301884 5280202 5300862 5204102 5186166 5177060 5183530 5186374
5874 5186374 5187838 5167698 5121621 4957520 4945636 4905647 4812186 4781459 4709303 4669608 4593549
5863 4593549 4532988 4497337 4360292 4330891 4294818 4323507 4282085 4229635 4299314 4293871 4283160
5852 4283160 4283954 4302798 4319268 4347583 4434573 4464386 4476060 4525175 4574348 4616372 4537645 4398352
5840 4398352 4325744 4328976 4393253 4424834 4412039 4235597 4161256 4049327 3949272 3930699 3871776
5829 3871776 3901935 3897171 3934001 3991074 4067640 4102999 4196168 4186700 4392484 4530216 4517610
5818 4517610 4499567 4465662 4518563 4567426 4645543 4792906 4794084 4724230 4600604 4481621 4380739
5807 4380739 4424410 4337019 4330688 4325271 4212847 4085996 3982619 3882977 3889881 3917330 3963482
5796 3963482 4025206 4113219 4281382 4493443 4751385 5053129 5466067 5781148 5955366 6321388
5786 6321388 6689919 6901695 6707059 6278769 5803982 5197967 4781100 4460706 4247203 4108122
5776 4108122 3988640 3999302 4032192 4007328 4021055 4038725 4105967 4318024 4561127 4760596 5011806
5765 5011806 5371946 5735335 6134421 6562147 6637069 6467075 6121577 5871734 5614905 5331079
5755 5331079 4864216 4407085 4178387 4040616 3929255 3860627 3805511 3881939 3888546 3968821 4075533
5744 4075533 4241469 4459183 4660879 4920231 5189693 5515201 5649043 5587358 5633483 5736721
5734 5736721 5849236 6138887 6483669 6628214 6504955 6143712 5537567 4990808 4634541 4323255
5724 4323255 4137417 3974273 3772536 3733253 3609223 3527070 3437764 3490829 3516240 3601899 3716293
5713 3716293 3827130 3918741 4024427 4164420 4264552 4282975 4322849 4403731 4474742 4680000
5703 4680000 4891223 4995379 4933250 4811300 4804760 4873696 5025638 5276106 5406575 5270946
5693 5270946 5006272 4800018 4759114 4690486 4696658 4614564 4442202 4292046 4203739 4183627 4155947
5682 4155947 4128695 4154756 4255682 4354037 4325387 4106019 3963517 3904471 3792975 3760628 3876393
5671 3876393 3959378 4026642 4218392 4470683 4550473 4520624 4234675 3925322 3790296 3627846
5661 3627846 3442977 3263606 3247054 3198867 3074577 3061625 3051667 3077944 3208393 3281844 3125505
5650 3125505 2987216 2800688 2699230 2687326 2682233 2660964 2691112 2553966 2368599 2226835
5640 2226835 2138926 2004280 1899315 1843313 1763328 1632917 1542206 1478578 1513916 1452045 1330639
5629 1330639 1358415 1365775 1343543 1297939 1255559 1286858 1322768 1304816 1297320 1309629 1373636 1423129
5617 1423129 1454493 1504448 1459502 1338486 1281645 1161100 1154419 1167491 1162804 1163181 1140766 1105786
5605 1105786 1117741 1132027 1159774 1145138 1111643 1073319 1064718 1020696 921094 888803 811972 766052
5593 766052 726747 710176 753539 728262 664497 755539 756723 784250 766083 737000 747346 684608
5581 684608 614172 645329 660174 634823 668911 627200 615289 599657 606007 607575 600886 610207
5569 610207 664574 625237 646765 634344 577200 533381 485140 402026 403783 493973 493149 460834
5557 460834 517477 509176 478511 482706 456325 424558 421240 440660 435445 448628 501247 481169
5545 481169 428662 433444 443569 451408 371303 387451 354279 318676 361608 311349 355060 363322
5533 363322 410449 401291 367317 403285 354435 358104 326093 324790 332436 329251 362544 370170 379643
5520 379643 381763 421061 372535 336398 315479 301880 288689 312870 294357 296748 303208 287300
5508 287300 294323 296530 322138 369690 424166 326892 334586 372930 314287 318840 310735 337852 311445
5495 311445 320451 257790 244032 199960 218003 246297 270053 295507 248056 239130 219451 232683
5483 232683 200804 231043 233106 161431 183620 280227 301187 240034 187645 180893 142148 200382
5471 200382 223519 245970 275258 213689 202356 214059 198913 120689 162853 182236 155238 224491
5459 224491 202635 231157 220770 213834 201434 176790 138427 186375 157450 152296 136361 157200
5447 157200 125468 169974 175773 161339 200997 242839 243697 179960 132574 152639 157501 151998 148652
5434 148652 146769 179508 225902 185049 105568 130312 232020 243899 213253 249371 246303 201026
5422 201026 184223 191854 124086 177622 221933 217306 199832 293496 216193 221124 129785 166303
5410 166303 198984 126700 118349 83998 92397 33069 61767 145732 160163 177913 188152 82393
5398 82393 87547 109536 161001 195163 227828 227218 197459 151311 184520 185328 136125 139535 109328
5385 109328 119160 98491 109833 143536 168298 208737 178688 171668 91345 74277 113859 102885
5373 102885 118393 94494 110494 123317 132321 150864 165194 176400 81618 104462 117613 2193
5361 2193 67982 156672 109728 112236 143781 195128 149113 126009 140608 97784 86534 126462
5349 126462 191330 101142 99304 111304 147001 121015 103278 66601 24151 118317 170983 182858
5337 182858 149610 146229 189888 172701 188651 186811 152017 167710 103878 70495 81739 59119
5325 59119 53432 72894 82088 78119 103277 104749 74579 49928 133650 108116 34118 4491 17541
5312 17541 15917 83133 103257 77468 125329 106985 66611 94774 99685 93418 150045 88420
5300 88420 54696 26898 15018 65264 68170 70797 107015 81183 12201 8410 14045 35370 36303
5287 36303 27369 60385 82076 47559 68115 73614 16347 32646 54054 -6992 15326 51487
5275 51487 14667 34338 2177 25486 36659 -47850 10669 129812 90441 -9881 1254
5264 1254 -30226 -88367 -71828 -48436 -13981 -30825 32906 68524 50091 31415 -4096 40886
5252 40886 66945 60691 5442 -17900 -66642 -2190 -37123 -97254 27485 37962 16796 13983
5240 13983 -10460 -25147 -24246 -10082 1873 -2973 -21706 -31343 9829 19577 5819 -35366 38171
5227 38171 -9290 12740 -2375 -59545 -25301 -53979 -17061 43754 31894 34365 -39886 -10934
5215 -10934 49379 64959 113095 97261 81022 69664 67996 60438 50356 16166 -7970 -13861
5203 -13861 -46774 -48735 -124248 -190314 -59928 -1738 -24948 -30079 -62908 -68761 -4693 5026
5191 5026 -34363 -25347 -39479 -45464 -60517 -4428 30351 -79514 -45745 1322 -13590 44819
5179 44819 31353 35494 -23004 -23508 -36242 43314 34376 25801 68622 60473 10625 4815 -31441
5166 -31441 -70216 -41987 -81111 -50364 -16316 37098 -14350 35569 11014 11019 -25211 -14944 -2551
5153 -2551 -13976 2881 45498 49263 56825 90095 39049 803 54841 26893 -15467 -9007 -5499
5140 -5499 -21984 -28625 -5064 -9677 22178 8818 8387 -15060 -52444 -50421 -19796 17555 -6435
5127 -6435 37815 -27127 -88882 -92122 -26751 -26834 -28522 13987 54467 -4737 -12093 13206 -5135
5114 -5135 29677 45475 38792 6849 -1188 -5558 -58057 -100078 -55017 -17657 -68575 -88660 -54278
5101 -54278 -38203 -61180 -68090 -51097 -100577 -20711 31613 17489 14580 -5716 -12550 -17586 -14035
5088 -14035 -11459 -52514 -4001 -10390 -45092 -27046 35577 -88814 -87246 -3394 28585 -9762
5076 -9762 -20106 -18712 -70083 -26476 4089 40244 33684 1585 -1187 21473 17564 6378 -7716
5063 -7716 23716 31411 33178 -13052 -12429 -43444 -53130 -37531 -41005 -86461 -71884 -15378 16968
5050 16968 498 -55284 -42188 -50281 36211 10598 -33000 -45564 -32057 -6549 -10980 -37781
5038 -37781 20106 94767 80126 49498 1993 13605 20318 -49330 -50672 -7898 31901 -19525
5026 -19525 -67153 -25346 4042 30936 -7408 -26700 -8590 -10836 -4605 -21240 -42396 -28901
5014 -28901 24847 8235 -66358 -69314 -77384 -49263 -24547 -1215 483 -19734 40225 37992 31958
5001 31958 -27808 -79793 -21755 -55079 -47903 -55491 -42989 51655 16530 -89936 -1023 15819
4989 15819 -6503 26252 17218 -13924 -32613 -36974 -53294 -55694 -61013 -33946 -65292 -105492 -64910
4976 -64910 35751 19192 -18594 -19670 28708 48636 41353 -35472 -66972 -30361 -39461 11180
4964 11180 37661 -37399 3261 -20577 -21714 -29993 -22192 20166 -16284 -20057 -37015 3289 39484
4951 39484 40828 37397 -38365 -77308 39853 47574 1050 -16751 -7983 -6735 -1605 -16783 3701
4938 3701 25656 93745 55469 91952 54796 48413 99069 -21067 -59005 19318 69439 34874
4926 34874 -27663 28692 11641 -13119 -22674 25970 -16901 -35768 5061 -12978 40330 23876
4914 23876 36774 11163 -22963 -24883 -23742 -46609 8998 24662 22933 11505 12976 15128 -16401
4901 -16401 31079 17724 14392 33480 16180 8739 -11787 24673 6691 59885 17448 18013 55360
4888 55360 7795 28142 -21147 8302 40665 43677 -38182 -36505 -12120 -22672 8221 18953
4876 18953 93617 75007 38232 26602 -633 13548 71003 65335 35142 25702 -24409 -119343
4864 -119343 -67703 -37407 2555 -14163 2731 -32673 -32319 -32440 -14993 -22865 -62236 7187 -25990
4851 -25990 -36880 -17030 -1462 42500 -9355 -44654 41372 12874 -18237 -29874 20764 -9370
4839 -9370 -10820 -64573 -17795 -17272 -90519 -75424 -19710 -67325 -84368 -6159 81770 41985 -16960
4826 -16960 30026 44283 42022 -42920 -87554 8030 70983 58468 -4500 -34511 -52094 -26190
4814 -26190 -14523 -93288 16429 3695 -50933 -66955 15228 -247 -31292 -6947 71797 39597
4802 39597 -18948 -75668 -69197 -4389 80710 44600 57087 -13091 -55626 -11058 5009 -13901
4790 -13901 -55112 -66666 -78763 -39542 -55578 -62303 -60124 29508 6822 -11495 -14495 -4614 -13718
4777 -13718 -26293 3146 99369 59109 27415 98253 61141 -7159 27387 54946 46691 64116
4765 64116 34486 55863 82066 89381 105760 94031 145796 204653 161825 92717 72908 53688
4753 53688 24335 8288 74063 57297 945 -34152 -27141 26971 85583 33985 46923 66341
4741 66341 93369 40276 59393 94933 44830 96355 76419 52600 80677 86892 122103 140783
4729 140783 140201 154272 227529 182101 217557 150440 196409 219223 191622 195932 158098 202962
4717 202962 183148 119141 117565 185598 229916 265604 180778 228411 221247 226632 183278 207773
4705 207773 165658 174974 169689 97735 122933 150204 199719 211783 249599 244763 270601 243237
4693 243237 191150 215334 234140 172139 139658 147471 179274 209899 204900 208785 222938 280575
4681 280575 262310 296040 285259 243414 227897 275957 296617 223922 269346 310262 292181 244722
4669 244722 249223 237358 190691 192718 137865 156287 206327 233318 242523 236993 209778 158986
4657 158986 199775 222282 148232 118153 160609 206253 204282 196104 159070 142449 132409 189416
4645 189416 186470 175463 129626 207900 193741 108558 115476 158424 162674 201482 174969 132138
4633 132138 79360 -7441 64457 109979 102153 45145 100054 146947 65407 49208 73989 146573
4621 146573 149374 126508 105421 108101 119433 66785 55206 56089 25027 -3639 -9639 25918 24645
4608 24645 61616 84998 97671 119215 145779 147707 119173 164277 75976 69224 105425 103827
4596 103827 91747 76418 46784 71919 61037 71630 41732 72073 128173 109499 148203 158450
4584 158450 82423 138957 103736 102434 131313 129278 92596 56980 100092 88325 50594 136518
4572 136518 111993 109911 77579 36717 56120 70106 109368 213139 200033 167010 129708 108180
4560 108180 101660 47506 119695 79590 35759 87700 31363 27694 49432 114165 107070 60110
4548 60110 29786 97671 143683 65826 75500 67688 55194 95801 100696 86801 173690 105043
4536 105043 119246 111983 156474 150016 108552 116657 106266 113177 103401 175866 220631 138666 101322
4523 101322 28137 23134 74469 98586 142239 215029 158113 132150 116717 125126 110284 23618
4511 23618 15894 19142 32931 73586 72756 60562 147197 222887 230875 136289 69042 102554 115572
4498 115572 81250 34225 53536 146361 217336 125176 149500 167755 135530 176948 214548 207963
4486 207963 280991 297137 198361 181486 194956 232071 241287 198285 233370 241868 248658 211458
4474 211458 202021 143850 106236 206526 218285 252838 219765 275896 217276 157562 208563 313135
4462 313135 313675 244472 274097 262845 207929 204225 242180 231318 265890 272433 285402 289836 261555
4449 261555 285665 349278 411984 412754 409802 440336 511932 534716 528896 539470 529436 525137 528954
4436 528954 484347 475076 478311 472211 506376 568687 581963 616007 590407 564139 589382 634280
4424 634280 587042 528867 544975 513557 605681 589171 587650 567610 529175 522853 443469 371535
4412 371535 338445 296588 237821 272056 279725 283826 308606 338637 321580 346103 407013 339160
4400 339160 300842 333993 316822 368314 454045 487072 436137 467814 401587 341143 327477 268445
4388 268445 306553 279781 225723 237923 238043 230702 255589 313111 301915 344000 313172 325575
4376 325575 286688 193968 227406 233654 195281 221822 285357 223414 124666 77308 100715 69982
4364 69982 84073 143018 203885 189966 192444 177861 184615 134979 173008 191022 272697 302771
4352 302771 266532 256374 287775 301875 333241 374896 388798 466716 462374 421269 412649 379162
4340 379162 425021 381941 350912 364892 379297 430205 307101 312787 369645 301233 270859 278988
4328 278988 292039 301954 283706 301306 342332 376011 298923 242044 259150 282092 310093 363044
4316 363044 349951 285661 295923 333272 326155 338924 371277 403570 366328 416923 397614 425029
4304 425029 505751 570354 706490 710064 732700 830602 978661 1024307 1062464 1198709 1090999
4293 1090999 959225 827098 730511 625497 549148 504007 406572 354761 355682 357251 316177
4282 316177 353294 381470 343835 336911 300136 277599 234963 239138 259689 232490 229836 253639
4270 253639 225868 302021 256251 166272 226213 274320 235502 167340 197248 238447 247558 235962
4258 235962 251894 244171 245242 217247 269728 248995 191296 155420 147890 162123 201559 256979
4246 256979 281412 198425 185548 274809 294575 296714 232742 182386 238439 278456 240504 208797
4234 208797 205420 214961 223594 241195 221936 230950 234427 248535 189785 147014 165212 144282 183249
4221 183249 170528 153715 88231 185041 208503 192447 183259 150885 160073 165995 167277 199388
4209 199388 153117 153795 157556 190856 169884 150013 137458 56365 23147 49083 107873 100936
4197 100936 140811 105056 36161 70346 70259 77313 136180 187920 150269 129756 74097 89085
4185 89085 183856 240074 137931 128465 162352 109948 96614 58437 127366 112580 83115 109949
4173 109949 128475 108660 40726 44832 111242 190982 206871 207304 172108 202828 173443 129611
4161 129611 186058 135005 137489 131296 153782 149491 90623 46376 170746 91143 47200 128476
4149 128476 162039 135562 129268 158759 164304 150022 156479 136513 174359 195041 193685 161310
4137 161310 219905 247461 142056 130280 219285 198586 99420 114744 175691 208424 294206
4126 294206 221486 159386 150890 175399 233381 206583 195444 206928 235927 199240 133503 162960
4114 162960 145264 185730 174901 181871 232364 272851 283198 164129 151243 153427 129578 181648
4102 181648 164139 119626 151422 77176 82638 169278 247773 184767 157947 140016 236381 223445
4090 223445 99510 138029 169055 200160 170315 186088 198319 195238 248512 204536 228161 234511
4078 234511 178157 172410 178053 209770 234783 261065 303287 287655 228699 244443 256938 314378
4066 314378 320283 263617 266933 250302 276019 218390 255967 259350 267549 246983 238352 274590 313012
4053 313012 295249 287976 297360 210450 250091 317078 258886 206522 258289 225928 248858 286106
4041 286106 283768 316409 312379 288323 286235 330770 312290 237186 193798 294028 334506 266227
4029 266227 240252 259085 329592 362954 358191 368834 260682 257720 287645 290971 311383 312809
4017 312809 259786 285832 307784 310434 329735 341888 286551 309474 316570 289981 346977 305790
4005 305790 356823 363963 310432 318313 345675 384617 458057 452706 364902 326510 351346 353464
3993 353464 333614 360943 359489 371648 384900 400120 433400 339853 339130 333257 317433 368893
3981 368893 402039 380464 335096 361645 428428 391156 383462 399678 450109 397966 403957 380324
3969 380324 397913 423175 413107 385555 350435 471450 454898 511355 540078 509641 492843
3958 492843 466236 452312 466330 504702 430853 443660 494273 541110 510537 466931 503110 525323
3946 525323 425265 508144 570392 524208 488151 540252 584551 669625 691541 597279 616556
3935 616556 622611 619757 666259 688252 657036 720073 710541 749530 731955 747527 773493 765485
3923 765485 807416 824326 803655 878370 924581 946352 1036685 992673 1024909 1067301 1067099 1102520
3911 1102520 1234721 1368443 1419994 1437468 1483872 1571048 1593196 1736912 1920372 2089900
3901 2089900 2264614 2529000 2737641 2940824 3007831 2926356 2706132 2378271 2110381 2024997
3891 2024997 1968863 1847351 1747915 1748310 1783135 1731202 1618360 1644429 1748725 1824547 1876825
3880 1876825 1856816 1753260 1722044 1847159 1886061 1851815 1831306 1899105 2019021 2075695 2068861
3869 2068861 2101472 2164204 2189747 2241221 2339461 2353700 2402651 2476431 2561988 2609161 2708636
3858 2708636 2763467 2830954 2878906 3022019 3099495 3256351 3335131 3405105 3568800 3704969 3799676
3847 3799676 4016697 4228300 4365943 4389393 4372562 4389306 4501856 4588687 4544010 4741360
3837 4741360 4913464 5063363 5160656 5323313 5469538 5662867 5853540 6064430 6162986 6339662
3827 6339662 6610150 6747704 6808607 6819227 6845324 6942888 6987278 7137192 7258338 7419868
3817 7419868 7517312 7459681 7422758 7317652 7185538 7087066 7073110 6942089 6801431 6808927 6727817
3806 6727817 6542224 6473271 6468183 6384147 6211324 6037119 5967415 5908792 5793699 5737531 5696218
3795 5696218 5484282 5256887 5088581 4955110 4799467 4601995 4556132 4405189 4214372 4071443
3785 4071443 3994188 3902505 3738230 3718210 3574279 3425864 3344087 3333314 3296230 3164285 3070935
3774 3070935 3002439 2948268 2971715 2893032 2749276 2702423 2583427 2563592 2532937 2486622 2418598
3763 2418598 2357800 2340297 2301545 2198533 2175645 2196808 2175511 2064395 1999158 1966735 1946190
3752 1946190 1935197 1908633 1895889 1829051 1801564 1707745 1684988 1670340 1654728 1629212 1630776 1560338
3740 1560338 1546455 1558281 1494313 1533086 1542005 1495712 1459017 1420135 1400070 1354715 1361394 1407325
3728 1407325 1409361 1401377 1360156 1288421 1317803 1345041 1260582 1204789 1198593 1198475 1194454 1223504 1197103
3715 1197103 1181422 1180963 1170766 1175891 1138210 1101733 1095468 1156355 1141954 1072631 1039819 1015070
3703 1015070 1068013 1044272 1004027 1016165 1004142 1006537 1010414 975964 1007779 1016329 973287 931173
3691 931173 938624 916594 985319 957075 867116 921417 870488 923418 953396 952382 941163 860577
3679 860577 870037 869779 869912 793930 749350 816593 803421 792792 791011 737443 774368 755224 836799
3666 836799 793940 770554 742715 766435 767554 718061 740255 745990 782733 761670 697653 682206
3654 682206 668659 651775 718588 768559 697803 735550 791688 763962 753656 727783 681914 666373
3642 666373 708928 664560 668531 712629 743476 743311 679130 648858 662099 692824 705678 680943
3630 680943 622815 570722 596893 652186 730649 665590 699772 631097 593081 604213 623430 649594
3618 649594 640755 662913 672817 702817 737368 747583 686360 646621 663086 659491 627848 672854
3606 672854 697222 708229 726748 711157 738235 714365 658995 687802 639284 674982 733866 703490
3594 703490 671107 625384 595747 679559 674214 671195 761436 717106 732093 690951 764317 780875
3582 780875 774062 717858 728603 722423 724820 765579 823738 869525 860632 838567 833225 863424 843668
3569 843668 920496 968784 900451 819271 800526 826742 853007 913450 930356 958772 979922 976809
3557 976809 947656 977198 1006410 993582 1000417 1043109 1072023 1095240 1096481 1107874 1177290 1207175
3545 1207175 1222941 1175017 1164498 1160902 1209160 1201137 1180390 1210633 1260835 1270030 1288790 1353986
3533 1353986 1395841 1482088 1486078 1472289 1520791 1572411 1640099 1676197 1633049 1569852 1625683 1716470
3521 1716470 1759950 1761906 1838641 1839270 1877671 1981445 2021585 2028970 2098140 2166620 2196673 2204818
3509 2204818 2244672 2290178 2373220 2425579 2452855 2519746 2550231 2600046 2672965 2753229 2783192
3498 2783192 2832348 2960811 3076613 3183587 3260206 3406757 3589541 3659224 3720172 3881948
3488 3881948 4017231 4206079 4382685 4637162 4843511 5029226 5278521 5577527 5898077 6242674
3478 6242674 6606224 6972537 7416337 7893711 8356419 8852137 9395292 10071837 10609055 11111904
3468 11111904 11673153 12097557 12242730 12061216 11682739 11121628 10458417 9787611 9057634
3459 9057634 8461139 7989193 7584483 7117275 6694185 6436178 6157063 5896531 5550346 5252491
3449 5252491 5090941 4899075 4665735 4532070 4341444 4124953 4011349 3935672 3764658 3700096
3439 3700096 3611447 3488937 3484429 3479006 3360374 3275704 3179318 3139571 3029302 2919188 2961047
3428 2961047 2955660 2863548 2782394 2658304 2542085 2449395 2422057 2331796 2323952 2321339 2226652 2148404
3416 2148404 2026906 1994227 1932873 1957981 1964113 1914986 1824547 1838146 1880983 1853889 1891107
3405 1891107 1835454 1820335 1768440 1797793 1769875 1733157 1687829 1670474 1674338 1589706 1511960 1520535
3393 1520535 1515919 1511378 1514928 1515927 1506722 1517318 1469883 1466860 1471703 1464553 1416005 1358727 1363725
3380 1363725 1287866 1277417 1347050 1312133 1316983 1282072 1212292 1243940 1178107 1219315 1260083 1220559
3368 1220559 1211714 1220645 1222920 1234270 1172993 1158137 1157832 1203062 1115827 1138572 1155521 1105248
3356 1105248 1084637 1081272 1056047 1051489 1054696 995832 1115139 1128468 1049431 1001006 1005081 923232
3344 923232 907279 957011 947405 966944 970609 934830 906694 859507 849607 882590 912680 960426
3332 960426 956286 879677 788701 768707 767137 785348 761898 748651 763535 726677 697895 747394
3320 747394 804227 784546 778999 777004 743227 804698 784740 728664 721730 740594 739986 740209 704506
3307 704506 761857 801004 777072 744229 708157 694724 716437 691150 705283 800218 782946 771930
3295 771930 772352 774794 701135 695384 734998 690355 613466 642594 668751 659314 682732 722204 672580
3282 672580 638529 595284 574917 644705 672295 698322 654833 579078 583917 587346 601717 672996
3270 672996 678522 700611 721272 648174 561965 588276 669616 655555 630852 621954 598051 603132
3258 603132 539158 524549 489872 525743 500945 477939 559883 582907 548154 560869 571082 559446
3246 559446 547809 550446 523536 526475 457317 495027 563769 554754 539377 534285 560264 562538 602268
3233 602268 649736 568791 566784 601065 539953 563863 583245 573679 556699 603276 642359 651197
3221 651197 733677 812240 788855 726534 720111 779989 706586 783097 806213 800418 780476 800571
3209 800571 808728 798860 808780 851189 808886 782834 824021 957996 907810 883380 854252 851366
3197 851366 896186 840253 861898 925197 957031 990176 967175 928281 970668 1014190 1120371
3186 1120371 1122284 1104122 1061547 1061682 1148382 1205312 1185876 1210116 1288765 1339468 1354021 1339521
3174 1339521 1362410 1414416 1368422 1429287 1479542 1538176 1572910 1609564 1592221 1656853 1733753
3163 1733753 1820914 1875403 1981611 2060088 2111378 2275284 2388730 2468147 2567490 2597446 2610305
3152 2610305 2740707 2866794 2932389 3002094 3068718 3112476 3111441 3174201 3276408 3229548 3233540
3141 3233540 3260541 3286695 3334438 3407708 3464669 3569530 3652249 3839070 3960222 4118471 4242427
3130 4242427 4435409 4650284 4824920 5035791 5222392 5441516 5650572 5797501 5900081 5869712
3120 5869712 5782214 5539782 5300270 5114317 4858309 4624762 4494872 4374576 4289875 4192276
3110 4192276 4021861 4064808 4083517 4102755 4137596 4185052 4147880 4264209 4358420 4337861 4389045
3099 4389045 4471832 4561228 4647295 4668599 4766620 4835722 4746413 4728083 4709039 4566347 4397484
3088 4397484 4204366 3975769 3794352 3619297 3453240 3268940 3170606 3137591 3078908 3132934
3078 3132934 3075347 2961189 2862361 2825936 2789100 2809897 2780283 2751918 2742518 2707546 2637327
3067 2637327 2543527 2462003 2320456 2220673 2094060 2074760 1964515 1906452 1815649 1689323 1638980
3056 1638980 1621882 1593938 1470367 1463643 1468093 1412098 1311464 1304898 1273216 1236077 1172006 1170167
3044 1170167 1196379 1207708 1179456 1178350 1094865 1086646 1003557 959225 969352 924890 896334 932249
3032 932249 1005099 919607 838146 822020 867183 854816 833379 796550 782760 734136 756763 767707
3020 767707 808990 754795 765118 672867 642064 657748 641647 630425 581662 513432 563743 515071
3008 515071 528667 575137 539293 548471 512225 559231 546845 516197 451271 433938 453352 450969
2996 450969 511348 522364 421232 430811 466366 435894 461603 470692 473715 424251 391512 414360
2984 414360 389848 414131 377635 413604 422039 334090 361395 373448 295572 331160 333054 342774
2972 342774 322112 282705 266561 277073 257201 202593 170049 156361 188991 206673 232498 211759
2960 211759 196310 247975 185555 104810 146574 165128 166537 175604 163801 191960 168509 216704
2948 216704 177708 169000 203575 233674 274861 231650 220558 169148 149392 138288 215025 230966
2936 230966 240771 209788 197226 123097 160708 102434 173586 230378 174598 153446 114235 135209
2924 135209 201987 227602 161747 144234 60987 81703 152379 91746 66537 16755 1518 61265
2912 61265 82960 133167 137013 111395 102628 103341 105945 75957 78726 72109 31169 17561 16715 3030
2898 3030 83392 112924 44805 -221 77614 178627 109639 82820 60495 69763 100995 76052
2886 76052 14152 30408 11961 -6722 35691 80293 1250 39495 108617 102474 58960 61710
2874 61710 82694 132338 86491 22016 91325 106465 98510 156395 102829 79429 28348 27744
2862 27744 2813 14643 81003 77153 77621 62493 45306 118789 154888 115323 82391 46384
2850 46384 -11805 -10206 89897 138442 121396 58555 78040 95853 106926 124667 59773 14248
2838 14248 15397 -24689 52477 26035 17767 32302 52501 32519 -7774 27609 4118 -34514
2826 -34514 -8381 67333 60858 2360 44159 -30202 -99508 -61323 75285 91367 89405 36609
2814 36609 5024 59214 61396 27034 -34404 11658 29233 76221 75983 66354 -24797 -59679 -70902
2801 -70902 4930 65737 70339 128077 56392 30948 3270 41442 57010 59508 23885 60571
2789 60571 50203 31263 14053 17823 23693 27473 75402 53663 58825 56676 48938 13100 7212
2776 7212 102947 113252 26209 32105 57255 30186 -16211 -3821 36173 8395 -54115 -44673
2764 -44673 3625 16353 7399 28500 10022 56539 -1660 -36854 -90797 -109050 -85310 -38381
2752 -38381 -38924 -71425 -4507 17600 -11442 40574 8758 -87245 -63343 -44544 -66900 -77780
2740 -77780 -72247 -5747 -12481 -17978 -59946 -46843 -34407 -23647 -50259 -43208 -44777 -89637 -64240
2727 -64240 -44080 -10852 -24395 54048 33976 -10011 17024 15496 -48310 -1033 11250 35860
2715 35860 -12374 13373 -8636 -37664 -57669 9803 -9709 -105015 -63324 40848 27383 16559
2703 16559 -32997 -68778 -10665 6715 -27122 -50182 26749 41328 15562 -5239 -14552 -9999
2691 -9999 9939 6895 -37545 -18593 -68114 -7997 59006 -24380 25812 19170 -8321 -29261
2679 -29261 -19564 -12001 32137 12847 36917 48061 23150 -25855 -16157 28764 -10074 33728
2667 33728 82927 57353 9789 -4909 -20025 -105665 -94796 -82099 -51744 -9091 -53132 -88266
2655 -88266 -109277 -74482 -4948 -20570 8821 -57430 -57001 -13686 -79121 -21799 36002 -43931
2643 -43931 32844 -60924 -36937 54382 -8461 16391 9502 -32921 -1960 -2047 -84660 -45154 -73014
2630 -73014 -77508 -138215 -90856 -69463 -89411 -85506 -12550 7963 5870 49231 -22337 -109800
2618 -109800 -19907 -59003 -76635 -21061 -2337 66026 16104 -59339 -126255 -68200 -19935 -57316
2606 -57316 -86675 -31382 -4051 -78003 -80470 -27143 -32316 5816 35609 5387 -54260 -18516
2594 -18516 31568 81761 118027 68686 72531 83013 29859 18086 -1833 2196 41360 61985
2582 61985 45904 -10253 -29555 -18554 -11470 -36832 -38397 -68223 -22415 3135 2568 32207 13713
2569 13713 -8851 -13358 -62925 -22967 138 -85121 -73153 -38882 -12857 -39810 -79287 -21451
2557 -21451 35342 -41510 -40351 18297 -10107 40906 60459 -6061 -43469 -95862 -105870 -86310
2545 -86310 -34961 -30383 -47364 -50066 -45820 -16336 10803 -3152 18800 28452 -17399 -37239 -24624
2532 -24624 -26359 -7631 7869 3204 -4344 -43056 -66972 -52058 -51341 -71596 -53947 -30936 -19099
2519 -19099 -36780 -11160 -22306 1072 46785 81570 80407 -18575 -27937 -17284 -46767 -51708
2507 -51708 -25270 9737 -16445 4143 23874 10202 4814 40092 27227 44819 16921 85240
2495 85240 89930 10628 34062 -1233 -3660 4901 -27389 -29110 -27899 7032 2284 -13416 -32095
2482 -32095 -46980 -41812 -8631 -7979 -27215 -41264 1198 -13979 -47504 -2498 -80141 -65341
2470 -65341 -42589 11134 46072 12529 -25331 37739 5016 40181 76610 -47222 -33578 24558
2458 24558 20086 -55100 -13963 -55680 -16451 -47679 -50492 -12690 -8556 596 -79332 -91367 -107114
2445 -107114 -87925 -38987 -42044 -38179 5746 -7894 -82852 -1004 35790 -80144 -42797 -27489
2433 -27489 -20489 -22999 -25469 -31130 4447 -1575 32922 12013 3756 -14496 31350 -18638 -44022
2420 -44022 6552 10027 -656 38005 42129 24444 105529 32708 35022 25634 -19326 -2655 35888
2407 35888 35128 -7850 83841 127398 76502 55912 98616 41583 -3676 8245 81218 109079
2395 109079 96960 72986 75963 104288 101484 94283 54859 42953 86842 84192 8596 59389
2383 59389 56560 112971 141809 130275 163848 102583 49256 26669 76409 125068 155967 154003
2371 154003 100579 89273 105534 102117 73412 125035 176646 159869 167231 148852 194810 204033
2359 204033 219620 314933 337185 302291 279955 341484 371334 420216 440023 470182 590693
2348 590693 554680 514836 612973 745062 888057 948608 1029250 1118543 1274725 1351868 1423866
2337 1423866 1558611 1729767 1890547 2122814 2337045 2658770 3003096 3376002 3915422 4499273
2327 4499273 5119552 5982341 6958505 8025715 8155145 6867360 5370562 4364986 3596327
2318 3596327 3027007 2645419 2303888 2102623 1934366 1782883 1650390 1530887 1456231 1430151
2308 1430151 1345850 1261239 1081577 971523 866674 834366 845470 774814 741089 698237 600936
2297 600936 591907 585267 498814 497132 531900 437969 425380 512105 510178 449177 431091 446309
2285 446309 400185 356953 308387 277287 287387 328364 349459 352921 321911 256004 217851 194090
2273 194090 282297 284727 242261 202237 210560 207292 131556 146112 210485 226141 206808 188900
2261 188900 116119 158283 211218 142491 112130 92242 102599 111773 163518 168494 114476 153598
2249 153598 116137 99101 124298 153644 145326 47789 88139 71572 47858 10644 30247 83214
2237 83214 160161 91405 44431 61127 49616 79514 67500 76990 62733 44828 -85 -29311
2225 -29311 -4977 -27507 27517 17164 -2757 64219 81538 140897 87782 35608 -1596 48115
2213 48115 30660 -8987 29315 133 14652 155977 110790 62362 43936 45896 22841 61676
2201 61676 71952 117427 90448 99427 75389 31178 88463 87585 67166 -15996 5689 -30852
2189 -30852 -40964 -62452 35555 57024 25785 -33940 -40640 -31278 -65374 -13408 60200 67692
2177 67692 39130 -30277 -27380 -16616 -34717 3738 46323 48861 21496 -3335 63247 90681
2165 90681 51216 13827 55564 91966 42777 95046 53807 15439 6216 -52782 -55485 -17165
2153 -17165 -47032 -45716 69135 23305 -60274 -38733 2220 -61817 -51945 -29570 -17871 -25511
2141 -25511 -31686 79432 37574 -4293 -21710 -9509 8394 -16105 -24288 -29702 -14203 10119
2129 10119 -31024 -68420 -50901 -79219 -101722 -1279 42149 16877 40273 90228 19869 22132
2117 22132 -34342 -64004 -113968 -60878 -35080 12912 -26444 -33072 -45004 -2433 -8493 -36815
2105 -36815 -22857 -70863 -25641 49368 73970 105355 20963 20104 -684 24455 50693 -33157
2093 -33157 10932 -33109 21075 -41015 -30245 -17365 1863 -87882 -75884 -88767 -92677 -65498
2081 -65498 -85328 -88310 -74945 -48785 38099 64405 -448 -50185 32937 88238 77432 114248
2069 114248 56887 -8481 63995 83313 40113 -25248 -14840 16545 63902 9489 4615 68609
2057 68609 20970 23881 26046 14759 32954 -5018 -1829 -27413 -85760 -7522 36898 42615 50691
2044 50691 57412 39853 18629 1510 -54417 -83454 -63860 -7247 8925 37987 79391 71073
2032 71073 2317 -36984 -30363 -48760 -82457 -85387 -27549 -19677 -8700 20585 81874 14105
2020 14105 -51216 -72728 -55723 -30319 5246 10811 45657 41248 8972 27593 -604 43437
2008 43437 63906 -8229 48438 55085 7589 34710 14514 24669 7592 -38035 -10420 -29898
1996 -29898 -63582 -84386 -50400 -9631 -23977 -75815 -77690 -56007 -17037 40525 54042 62599
1984 62599 11526 -60375 -47455 -22542 -9066 -39758 -61985 -65907 -52728 25814 -51030 -97481
1972 -97481 -13494 -76933 -93486 -38811 22378 78784 40207 68668 17406 -18540 -53615 -16981
1960 -16981 18539 52019 30429 -10295 -68083 -8305 6421 -79782 -77736 -53762 -60625 -76864
1948 -76864 -8484 -25932 -9986 30821 39282 -20723 -17651 25736 18064 -40414 -56566 -40035
1936 -40035 -19363 -60031 2854 -18587 -5153 -9504 -58376 -24531 -23795 4903 2832 -9418 -48605
1923 -48605 -32339 14234 -22478 -49766 -8272 -37097 -18159 -26635 34852 20108 30309 41922
1911 41922 -8358 -35044 -26501 23643 -6008 14432 -14225 41276 45163 50112 49239 47423 -7987
1898 -7987 -52584 -33807 -23760 35323 36414 -12479 14331 -34389 11627 24697 46186 22851
1886 22851 -33402 -38704 26067 38642 32707 26802 -31954 -156 29520 17353 9208 19272 -21582
1873 -21582 -57811 -23803 852 -47278 -34425 -71308 -82229 -44091 18002 -31410 -2691 19596
1861 19596 81058 38232 16911 -15369 -25260 -65322 -89122 -105613 -114483 -75450 12074 -12867
1849 -12867 -37277 11813 -14023 -49025 -57935 -79766 27016 32962 -31752 -31310 -68451 -54865
1837 -54865 -74999 -114974 -74975 -62755 -55688 7427 32320 12194 48893 64359 54779 -46948
1825 -46948 -125073 -90008 -49341 4768 9859 34605 -71185 -90932 -52876 -31702 -66761 -54619
1813 -54619 21721 -20807 -78360 -47418 -49825 -76536 -67050 -42861 11324 -14208 -81902 -56165
1801 -56165 -88146 -98856 -60257 -43016 -79965 -46581 -65219 -83404 12844 11304 -45600 -80353
1789 -80353 -108456 -63690 -97855 -62728 -76110 -36604 -42518 -46116 25388 19839 -211 34422
1777 34422 4195 -40786 -45455 -40633 -9900 -12434 -83792 -103914 -93120 -10766 35428 -22900
1765 -22900 -18163 -28909 -48386 -60928 -47609 3750 22548 8023 4414 3947 -24717 -71888 -5780
1752 -5780 33161 -2729 5801 -32544 -15632 71102 8683 -61905 -9360 15316 -23420 -31223
1740 -31223 -15541 11977 -57804 -14716 -26991 -62216 1360 4665 -51098 -85994 -49396 -72069
1728 -72069 -50385 -25313 -35234 -9354 -30165 -63383 -58107 -58835 -11368 46897 -1045 -27098 -2595
1715 -2595 2168 -36385 -4284 -54739 -78137 -23463 5607 -4571 3670 -4774 14254 51609 47814
1702 47814 4669 -62701 -47188 -77626 -69753 -15346 39505 96355 68763 -25086 -59267 -5325
1690 -5325 16046 16067 9372 -742 -24850 25944 -9940 -92565 -34370 -11100 -35551 -33202 -9411
1677 -9411 -3733 21332 40979 -1968 -10770 -29880 -2036 -35788 -29377 -31658 -74676 -32372 -12378
1664 -12378 -51581 -77861 -79811 -65783 -52210 -71158 -27609 -31813 -33043 -5317 -30759 -29410 -68040
1651 -68040 -99128 -45360 -22842 -27132 -43425 -32243 -79794 -94458 -83635 -6426 9964 -8765
1639 -8765 -14519 -30565 18245 45394 43811 -19325 -26754 52320 18439 11554 31500 39806 57495
1626 57495 35157 -18641 -42267 -10198 21274 11455 -19847 17349 -36936 980 1897 21755
1614 21755 -7841 -25927 -22365 -53236 -45100 -9682 -4179 -40006 -37074 21351 3940 -56637 -58420
1601 -58420 -52539 -45090 -118521 -70303 -31665 -46060 -21891 21294 72894 102551 63745 62430
1589 62430 -8402 -103415 -113358 -8331 -32625 -19300 -13326 -75556 -94420 -79123 -75906 -59700
1577 -59700 -35577 2385 28064 -10330 -44726 -35938 -45910 -48909 -24957 -13153 30242 24127 8029
1564 8029 -13611 -55679 35073 42967 24396 1840 -1073 81290 109324 82045 60563 49818
1552 49818 -21455 -21083 23999 -33787 -45374 -3892 6037 -2064 -32159 -118715 -150519 -72159 9518
1539 9518 55192 13986 9547 11854 -32292 -40878 -39136 -40109 -24206 -48677 -1975 25977 8514
1526 8514 92845 100978 28712 10465 -29596 1309 -382 50044 32807 67702 43292 29439
1514 29439 16158 -9977 -56292 -45198 -17417 13662 -54391 -7559 2963 -55101 -42506 -71184
1502 -71184 -66022 -86683 -2162 20087 31373 35941 14243 -46569 -80030 -46631 9678 -18201
1490 -18201 -16050 -23399 -38837 25135 1996 -1314 -74597 -95254 -37474 -24348 2390 -58876
1478 -58876 -24749 -12025 -97104 -79833 -72909 -61798 -42319 -70374 -46026 -24515 -17818 -33556
1466 -33556 -52686 -93209 -45928 -28880 1911 -25587 49942 46534 -10294 -7365 6263 9553
1454 9553 -21216 -23414 -26143 24657 69240 73925 -4082 -24366 -22174 -77638 -67659 -35517 -55302
1441 -55302 30450 50413 -22965 -27460 -3524 -59993 -45568 -4746 10544 -26938 5350 60244
1429 60244 36048 14216 516 4126 569 67820 57592 -2400 -67644 -66806 -28528 53507 76437
1416 76437 20894 64852 39431 -8008 -55837 -31990 2448 4796 -13651 -6342 7109 -47106
1404 -47106 -9618 1939 -40380 -62558 5289 -18103 40588 84416 57328 50788 -22811 -3028
1392 -3028 -10744 -90163 -68492 -52887 -70604 -59812 -70014 -108436 -58058 -4012 -55638 -75314
1380 -75314 -51782 50768 79721 22423 -5454 -44995 -88446 -11043 2038 -91235 -66862 14383
1368 14383 -102625 -149000 -81786 -30250 -13242 14644 -32645 -5875 54972 50717 -14559 1703
1356 1703 12000 -37980 -43261 -40973 29513 27443 9451 -32029 11128 17254 23951 23988 -52316 -61379
1342 -61379 -84524 -38804 -82607 -81184 -29659 -51918 -25498 31148 51588 -16195 71652 7112
1330 7112 -30128 -28463 -6769 1605 -21335 6680 -10304 1438 -28210 -113238 -81073 -53331
1318 -53331 -34027 -20199 37446 116434 102410 769 -41303 -59410 -37115 -21896 -18449 -33218
1306 -33218 -54196 -3091 -36756 -42923 3251 20404 41960 26223 12616 12736 -12842 -73648
1294 -73648 -21874 -16396 13315 -6168 -87548 -44551 -9370 -5449 -9152 -52499 -30094 -526
1282 -526 33496 49946 -26488 -25838 -79547 -67992 -82575 -30946 -62221 -50470 -33600 -48446 -23873
1269 -23873 18894 11865 -13860 56970 85560 26942 75447 22030 -38905 -39841 -30730 -52050 -42575
1256 -42575 -103792 -43199 -31946 -35475 -25999 -44512 -83710 -123420 -97237 -62864 37261 27673
1244 27673 14817 17219 -34792 -29150 47761 21408 -24287 -23265 -25763 -54756 -31284 29091 29445
1231 29445 15436 9591 -6158 -29929 -35726 52138 81760 41633 -1074 -24380 11397 7442
1219 7442 -844 6544 -55873 -35931 15558 19190 -26840 -28801 -9172 6347 2428 37224 32171
1206 32171 -14847 -103833 -30899 31660 -13092 20864 -18101 -11834 35008 -15343 17008 48000
1194 48000 54948 80582 27077 46414 108518 89197 30854 -5185 -26868 -11698 34603 33367
1182 33367 16786 53089 -703 -55093 -8356 3311 -23037 -13859 54281 69292 43037 -8064
1170 -8064 5468 -56987 -45601 -21612 41624 46377 -22144 -87218 -62273 35823 55783 38002
1158 38002 3913 -7052 -42973 -35976 36719 19763 8534 36957 64618 19014 -22944 -10929
1146 -10929 6955 29816 -25175 32830 3945 -39355 -3617 -34222 -7111 19077 65590 71990
1134 71990 46403 52915 61492 17098 16654 60101 49606 2544 -30445 -61216 -121828 -65350 -30370
1121 -30370 3883 7435 -40770 -26166 -5260 -34039 -24890 -22313 19187 91016 31156 4004
1109 4004 9237 15692 33253 -42868 -61059 -82166 -9462 75254 85224 42739 40654 59924 96614
1096 96614 31727 28442 14139 27032 87559 70720 45005 36211 61749 10011 29988 85331
1084 85331 161272 129209 20519 -36269 -71180 -36802 -37149 -46980 -69862 2500 48995 5461
1072 5461 32779 54080 -254 -12755 27001 12951 -7835 -22970 -46862 -7419 20715 7231
1060 7231 24963 26907 -31202 -76917 -79267 -61199 -71357 -11783 21257 6300 9387 21391 20326
1047 20326 -4293 -14546 46403 48297 39563 9277 14464 -6571 -668 78353 65961 -6139 -1712
1034 -1712 10868 -2973 38324 -43238 -105295 -105346 -68752 -443 14019 -52990 -24408 60518 34370
1021 34370 -59892 -54253 -8414 43044 -2427 35634 -1318 -43639 21999 60511 29569 11244
1009 11244 69769 -21074 -38383 33681 8932 -58952 -16454 11207 -20288 26664 -47886 -18245
997 -18245 -28015 38379 45091 25883 -6533 -34594 -20450 -37078 -27434 -37625 -37026 -46290 -62238
984 -62238 -38587 -28603 -66010 -40603 -24504 -35923 -26961 -44436 -43396 21146 52499 316 -22743
971 -22743 -14564 -13526 11660 33259 22277 38946 21594 38326 -17461 7618 41308 15262
959 15262 -52167 -83185 -37398 1924 22238 -15558 -18586 -22710 20553 11220 45868 23754 40627
946 40627 38215 50217 52191 39416 -493 -31794 -44502 -60968 -34458 -26373 -2487 41883 -38932
933 -38932 24404 27597 -30428 16002 -53760 -71673 1596 -30664 -47592 22776 40304 -3807
921 -3807 12196 13150 22511 -11923 -36850 996 -7839 51406 32631 13009 27141 44529 -19704
908 -19704 -75255 -14951 -22516 -2484 -29553 44563 9051 -15086 -33623 17157 -24794 -69860
896 -69860 -31964 56326 58642 -34061 13357 13145 3556 21458 57918 -37565 -5180 -2212 -27639
883 -27639 25970 33688 38904 65462 33371 16546 -61779 -46728 -674 13907 16487 29871 -834
870 -834 -26290 10715 20900 12375 23242 58874 110628 105131 -37260 -32069 31086 43952 34217
857 34217 19919 -28472 -34383 38440 2944 57591 26405 10953 25437 31711 20534 27155 46712
844 46712 29310 72807 43978 37211 -22799 -13123 -7329 -2974 33901 27953 30703 -41639 -60970
831 -60970 -17706 -10513 39406 78910 74511 100000 56277 21021 46238 85073 53218 107283
819 107283 64858 2759 67468 54477 57939 66916 61496 63087 45808 23949 34106 -49600 -28825
806 -28825 -7570 -31853 2248 37254 58562 89013 -10848 -108984 -3634 50781 89123 10074
794 10074 10048 55410 28527 43002 58679 60695 27553 73229 31553 -10177 -40555 -2105 27612
781 27612 75698 32334 10247 59219 33648 2424 -57893 -54026 8759 -20858 -32402 73428
769 73428 87191 59573 13533 -21151 -11995 -17463 -21003 -27168 -34735 -3404 -33918 -33163 61042
756 61042 115980 28272 26161 -7806 -19627 -11512 -88617 -47812 -9368 19387 23261 57372 92583
743 92583 51524 -15944 -57685 -74446 -56949 -33641 -33095 14760 -30055 -52627 1836 58584
731 58584 98404 123319 107930 49387 27833 9985 33247 74526 60075 53099 9397 -8045
719 -8045 10541 32023 13514 47707 59892 42425 -911 -23337 -48497 -55136 -114382 -23129
707 -23129 65080 6445 18584 31260 -1683 53168 38583 -4039 74833 27556 2493 -4994
695 -4994 51687 26995 -13625 -8467 35390 22444 58404 73789 136832 104271 21346 17100 -38016
682 -38016 27995 27335 -3842 30479 93228 69024 12400 -13838 2624 -8073 -3367 -6422 4279
669 4279 18269 -42240 -80324 -49387 -3841 -40623 -8764 -24 38250 31198 78865 131329 106490
656 106490 52726 -4905 -11888 30023 55100 42444 5011 24880 56848 67187 14162 -19797
644 -19797 -67968 -28128 -2767 -20749 -70263 -12298 -46379 63672 55243 9254 60468 27627
632 27627 16138 -20448 9736 -3142 49028 55043 -831 -39558 -673 -5189 45734 13261
620 13261 100 52932 89758 68515 57266 9680 17650 27938 38855 -13434 -23988 -40191
608 -40191 14465 55885 72562 39062 -676 -24003 -56848 -1135 37481 23950 53835 34300
596 34300 -13700 -12610 -2720 1551 10312 50309 46778 31895 65657 61715 55095 40930 34846 3360
582 3360 677 19115 28722 49403 16678 15917 49769 104269 92898 61484 69248 757 66021
569 66021 80903 25222 73860 89160 67948 80047 25677 -41947 -59524 -64776 31560 -21442
557 -21442 -18867 -24651 -2945 10825 26145 53596 150457 147650 73196 -6859 8899 -11720 3203
544 3203 24350 3587 8698 10311 39708 -13657 -57848 -62947 -33104 652 23772 -15634 -19542
531 -19542 -28594 -17007 23293 54695 59783 19888 34643 35843 20172 -20104 -59520 -7558 -59417
518 -59417 37639 26696 -5410 -27054 12055 -16339 -12117 2958 -48516 -73500 -56324 -13921
506 -13921 54499 71625 95892 77766 20846 19025 -7271 47313 46177 -8454 6213 -30920
494 -30920 13091 17820 -49721 3375 -35911 -55527 -60599 -19796 9773 41532 25650 21375 25032
481 25032 33299 91643 41558 -5860 33814 48242 56308 -25669 -2475 -48108 -14993 -59141
469 -59141 -21302 -18845 -592 35312 20088 33406 -4170 6509 40502 24228 31663 5328
457 5328 -32855 -27069 -59028 -77214 -61343 -50375 -32497 -22242 -59835 -33459 -20409 -47761
445 -47761 -20461 60492 -18 -64502 -16629 4246 54529 58427 58771 52187 -7935 -26523 -69034
432 -69034 -14735 -7891 29401 21480 49656 53947 41465 6831 -79913 -95198 -72310 427 17466
419 17466 47651 21410 24777 -38007 -4806 56288 82248 83271 42565 29881 -25071 -51601
407 -51601 -49417 5350 -42337 -100207 -106886 4305 -3233 -592 -19810 -34280 31598 49751 33795
394 33795 20133 4981 18333 -3166 -28575 8945 41792 17245 21048 45159 21732 -3349
382 -3349 23652 76349 24922 13863 62945 16166 101535 74201 25183 -29652 -46379 -20511
370 -20511 -5092 31116 -8460 -55586 -45820 60505 -6149 -127953 -119115 -60269 -43789 -35368
358 -35368 -36266 -9553 8667 -12751 6554 -3401 -36627 -6832 -9245 3036 -18246 457 -53937
345 -53937 -49083 -55542 -49626 13253 -61026 -75411 -24633 -39412 53739 46958 -11317 -29549 20269
332 20269 13798 -2268 42513 26594 25837 37929 30976 -26812 -59206 28848 -39384 -69456 -35661
319 -35661 -35861 -39396 -78529 -47361 -24616 -34650 -122904 -94290 -104263 -2145 46573 65783 66168
306 66168 74235 45149 70852 45197 34082 2073 -4790 -5488 5896 29170 -5662 -10221 -5355
293 -5355 29794 26123 -19892 -43387 -90394 -135471 -61075 -60627 -34770 -257 3685 -33170 -37848
280 -37848 -6295 10558 -55780 -31495 26937 58315 39829 86853 109902 72618 5870 -37011
268 -37011 -59429 -22410 -19357 -36778 -49722 8536 37428 108 -18554 -71001 -102241 -87599
256 -87599 -26382 -27112 32885 19419 -11536 -16907 -5660 -6639 47872 78103 60023 61194 2472
243 2472 -83649 -24304 17075 -19770 2103 -11469 12549 -26740 -16528 -3115 -54707 -32437
231 -32437 8976 67251 20489 22190 33384 2949 -3389 -41221 -54943 -51788 -22020 -13838 -39532
218 -39532 -27472 -962 -19556 46554 -205 -57540 -53797 -17608 -31125 -57538 -29078 47653
206 47653 36588 65554 1537 -31059 -21810 -27272 11516 45202 1833 12239 -27439 -32150 4227
193 4227 -28417 -13706 12483 -34241 5815 106643 70482 69189 -27896 -41326 -95170 -102735
181 -102735 -70794 -6296 -12492 -23380 -29246 32648 18824 8528 -45211 -6379 521 -20187
169 -20187 -59174 -64893 -4770 7609 -28846 -61507 -53039 -8494 -68107 -29736 -6179 -41282
157 -41282 -26056 -16065 -26596 -60346 -20970 -27862 -5426 -9443 -44241 -50556 -9429 -1955 16461
144 16461 17742 -35225 -52215 -73996 -91854 -21339 30713 27829 31457 62671 32210 62879 -25517
131 -25517 11346 -19103 -53787 -53956 -63704 4425 -6897 1101 -24794 -45002 -70602 -20100 -9591
118 -9591 9197 34025 55096 50734 9834 -17851 -32250 -35529 -57025 -32395 -2059 -1939 13450
105 13450 54780 -4919 -78999 -57773 32092 49483 31219 73523 22664 -28408 15351 -3458
93 -3458 46255 44268 18985 71079 3770 -51759 -67030 -66186 -47751 -34319 5384 23190 13242
80 13242 24944 15096 5582 -24855 -48722 -31466 -45983 -33662 19631 14811 -16770 -52669 -73679
67 -73679 -24010 -6551 14678 -17638 -50561 -40806 -80720 -79475 -66436 -45721 -45759 -19308 15488
54 15488 -40906 -43449 -68951 -43607 14636 47869 13483 10715 23958 11081 17966 10734 7566
41 7566 -3413 -50321 -24406 -57130 -60267 -13353 7337 6266 -66831 -34084 3827 621 -20185
28 -20185 -20141 -21168 -44863 -13915 -18662 -45630 -65087 -36109 -21247 3932 38258 25299 28815
15 28815 -15426 4038 -8793 -3832 6488 23099 -5346 -27150 -61605 -16416 33842 -19872
3 -19872 -39191 -40674 -25105
$$ [...]
##END NTUPLES=NMR SPECTRUM
##END=
