##TITLE=1H_DE-80H_X3
 200.13MHz, d2o
 8 sc
 
 19ns.26.2.2025
##JCAMPDX= 6.0         $$ Bruker NMR JCAMP-DX V2.0
##DATA TYPE= NMR SPECTRUM
##DATA CLASS= NTUPLES
##ORIGIN= UXNMR, Bruker Analytische Messtechnik GmbH
##OWNER= pz
$$ XWIN-NMR		Version 3.5
$$ Fri Jun 27 12:06:36 2025 Russian Standard Time (UT+4h)  Yarkov@DPX200
##.OBSERVE FREQUENCY= 200.1313
##.OBSERVE NUCLEUS= ^1H
##.ACQUISITION MODE= SIMULTANEOUS
##.ACQUISITION SCHEME= undefined
##.AVERAGES= 8
##.DIGITISER RES= 18
##SPECTROMETER/DATA SYSTEM= spect
##.PULSE SEQUENCE= zg30
##.SOLVENT NAME= CDCl3
##.SHIFT REFERENCE= (INTERNAL, CDCl3, 0, 15.5386)
##AUDIT TRAIL= $$ (NUMBER, WHEN, WHO, WHERE, WHAT)
$$ ##TITLE= Audit trail, XWIN-NMR		Version 3.5
$$ ##JCAMPDX= 5.01
$$ ##ORIGIN= Bruker BioSpin GmbH
$$ ##OWNER= Yarkov
$$ C:/Bruker/XWIN-NMR/data/yarkov2/nmr/H-C/1/pdata/1/auditp.txt
$$ ##AUDIT TRAIL=  $$ (NUMBER, WHEN, WHO, WHERE, WHAT)
(   1,<2025-06-27 12:05:17.18 +0400>,<Yarkov>,<DPX200>,
      <created by zg, POWCHK disabled, PULCHK disabled
       configuration hash MD5:
       00 E9 B6 7A A2 85 ED C7 34 08 36 98 17 FE 4E 26
       data hash MD5: 16K
       ED 07 31 B9 FA 65 B8 2D 6B E8 5D F4 25 C1 C6 EB>)
(   2,<2025-06-27 12:05:26.95 +0400>,<Yarkov>,<DPX200>,
      <Start of raw data processing
       efp BC_mod = 2 LB = 0.25 FT_mod = 6 PKNL = 1 PHC0 = -1555.879 PHC1 = 3.966602 SI = 16K 
       data hash MD5: 16K
       B1 35 9F A7 43 F5 F8 A2 AE 20 36 DB FE AE 9E 2E>)
(   3,<2025-06-27 12:05:50.65 +0400>,<Yarkov>,<DPX200>,
      <pk PHC0 = 201.0595 PHC1 = 0 
       data hash MD5: 16K
       1F FC AE A2 39 FD 0C 26 57 6E 28 C7 66 A1 F7 CD>)
(   4,<2025-06-27 12:05:55.73 +0400>,<Yarkov>,<DPX200>,
      <abs ABSG = 5 
       data hash MD5: 16K
       00 B9 7A FB 3C AC 9F 53 4A 4C 0D 23 80 34 2F AC>)
$$ ##END=
$$ 
$$ hash MD5
$$ C5 6B 2B C2 AA 0E E1 04 8D 28 B0 98 2D CB 79 87
##$RELAX= 
##$RELAX= 
##$RELAX= 
##$RELAX= 
##$RELAX= 
##$RELAX= 
$$ Bruker specific parameters
$$ --------------------------
##$DU= <C:/Bruker/XWIN-NMR>
##$EXPNO= 1
##$NAME= <H-C>
##$PROCNO= 1
##$TYPE= <nmr>
##$USER= <yarkov2>
##$AMP= (0..31)
100 100 100 100 100 100 100 100 100 100 100 100 100 100 100 100 100 100 
100 100 100 100 100 100 100 100 100 100 100 100 100 100 
##$AQSEQ= 0
##$AQ_mod= 1
##$AUNM= <au_zg>
##$AUTOPOS= <>
##$BF1= 200.13
##$BF2= 200.13
##$BF3= 200.13
##$BF4= 200.13
##$BF5= 200.13
##$BF6= 200.13
##$BF7= 200.13
##$BF8= 200.13
##$BYTORDA= 1
##$CFDGTYP= 0
##$CFRGTYP= 5
##$CHEMSTR= <none>
##$CNST= (0..31)
1 1 145 1 1 1 1 1 1 1 1 1 1 1 1 1 1 1 1 1 1 1 1 1 1 1 1 1 1 1 1 1 
##$CPDPRG= <>
##$CPDPRG1= <>
##$CPDPRG2= <>
##$CPDPRG3= <>
##$CPDPRG4= <mlev>
##$CPDPRG5= <mlev>
##$CPDPRG6= <mlev>
##$CPDPRG7= <mlev>
##$CPDPRG8= <mlev>
##$CPDPRGB= <>
##$CPDPRGT= <>
##$D= (0..31)
0 0.7 0 0 0 0 0 0 0 0 0 0.03 0 0 0 0 0 0 0 0 0 0 0 0 0 0 0 0 0 0 0 0 
##$DATE= 1751011516
##$DBL= (0..7)
120 120 120 120 120 120 120 120 
##$DBP= (0..7)
150 150 150 150 150 150 150 150 
##$DBP07= 0
##$DBPNAM0= <>
##$DBPNAM1= <>
##$DBPNAM2= <>
$$ [...]
##$SUBNAM3= <"">
##$SUBNAM4= <"">
##$SUBNAM5= <"">
##$SUBNAM6= <"">
##$SUBNAM7= <"">
##$SUBNAM8= <"">
##$SUBNAM9= <"">
##$SW= 18.0517328524113
##$SWIBOX= (0..15)
0 0 2 0 0 0 0 0 0 0 0 0 0 0 0 0 
##$SW_h= 3612.71676300578
##$TD= 16384
##$TD0= 1
##$TE= 0
##$TE2= 300
##$TE3= 300
##$TEG= 300
##$TL= (0..7)
0 120 120 120 120 120 120 120 
##$TP= (0..7)
150 150 150 150 150 150 150 150 
##$TP07= 0
##$TPNAME0= <>
##$TPNAME1= <>
##$TPNAME2= <>
##$TPNAME3= <>
##$TPNAME4= <>
##$TPNAME5= <>
##$TPNAME6= <>
##$TPNAME7= <>
##$TPOAL= (0..7)
0.5 0.5 0.5 0.5 0.5 0.5 0.5 0.5 
##$TPOFFS= (0..7)
0 0 0 0 0 0 0 0 
##$TUNHIN= 0
##$TUNHOUT= 0
##$TUNXOUT= 0
##$USERA1= <user>
##$USERA2= <user>
##$USERA3= <user>
##$USERA4= <user>
##$USERA5= <user>
##$V9= 5
##$VALIST= <valist>
##$VCLIST= <CCCCCCCCCCCCCCC>
##$VD= 0
##$VDLIST= <DDDDDDDDDDDDDDD>
##$VPLIST= <PPPPPPPPPPPPPPP>
##$VTLIST= <TTTTTTTTTTTTTTT>
##$WBST= 1024
##$WBSW= 4
##$XGAIN= (0..3)
0 0 0 0 
##$XL= 0
##$YL= 0
##$YMAX_a= 804531
##$YMIN_a= -796618
##$ZGOPTNS= <>
##$ZL1= 120
##$ZL2= 120
##$ZL3= 120
##$ZL4= 120
##$ABSF1= 15.51882
##$ABSF2= -2.53303
##$ABSG= 5
##$ABSL= 3
##$ALPHA= 0
##$AQORDER= 0
##$ASSFAC= 0
##$ASSFACI= 0
##$ASSFACX= 0
##$ASSWID= 0
##$AUNMP= <proc_1d>
##$AZFE= 0.1
##$AZFW= 0.1
##$BCFW= 0
##$BC_mod= 2
##$BYTORDP= 0
##$COROFFS= 0
##$CY= -3
##$DATMOD= 1
##$DC= 0
##$DFILT= <>
##$DTYPP= 0
##$F1P= 0
##$F2P= 0
##$FCOR= 1
##$FTSIZE= 16384
##$FT_mod= 6
##$GAMMA= 0
##$GB= 0
##$INTBC= 1
##$INTSCL= 3.241238e-09
##$ISEN= 128
##$LB= 0.25
##$LEV0= 0
##$LPBIN= 0
##$MAXI= 10000
##$MC2= 0
##$MEAN= 0
##$ME_mod= 0
##$MI= 1.114404
##$NCOEF= 0
##$NC_proc= -6
##$NLEV= 6
##$NOISF1= 3.799351
##$NOISF2= 2.8
##$NSP= 0
##$NTH_PI= 0
##$NZP= 0
##$OFFSET= 15.53865
##$PC= 1
##$PHC0= -1354.82
##$PHC1= 3.966602
##$PH_mod= 1
##$PKNL= yes
##$PPARMOD= 0
##$PSCAL= 0
##$PSIGN= 0
##$REVERSE= no
##$SF= 200.129996608786
##$SI= 16384
##$SIGF1= 3
##$SIGF2= 2
##$SINO= 0.751879
##$SIOLD= 32768
##$SREGLST= <19F.Aceton>
##$SSB= 0
##$STSI= 16384
##$STSR= 0
##$SW_p= 3612.71676300578
##$SYMM= 0
##$S_DEV= 0
##$TDeff= 16384
##$TDoff= 0
##$TI= <>
##$TILT= no
##$TM1= 0
##$TM2= 0
##$TOPLEV= 0
##$USERP1= <user>
##$USERP2= <user>
##$USERP3= <user>
##$USERP4= <user>
##$USERP5= <user>
##$WDW= 1
##$XDIM= 16384
##$YMAX_p= 266455883
##$YMIN_p= -953385
$$ End of Bruker specific parameters
$$ ---------------------------------
##NTUPLES= NMR SPECTRUM
##VAR_NAME=  FREQUENCY,     SPECTRUM/REAL,   SPECTRUM/IMAG
##SYMBOL=    X,             R,               I
##VAR_TYPE=  INDEPENDENT,   DEPENDENT,       DEPENDENT
##VAR_FORM=  AFFN,          ASDF,            ASDF
##VAR_DIM=   16384,         16384,           16384
##UNITS=     HZ,            ARBITRARY UNITS, ARBITRARY UNITS
##FACTOR=    0.220516191357247, 1,           1
##FIRST=     3109.74988355199, 0,            0
##LAST=      -502.966879453794, 0,           0
##MIN=       -502.966879453794, -953385,     0
##MAX=       3109.74988355199, 266455883,    0
$$ Real data points
##PAGE= N=1
##DATA TABLE= (X++(R..R)), XYDATA
$$ [...]
$$ plain form
7521 53340868 53338284 51455658 48871000 46893391 45898692 45766021 46005121 45844245 44791515
7512 44791515 43058293 40863812 38764845 37080812 35922221 35242884 34547396 33485486
7504 33485486 31905946 29773717 27588365 25765036 24493645 23565112 22724783 21539090
7496 21539090 20021805 18325788 16761896 15551804 14596681 13778706 12980980 12066273 11147154
7487 11147154 10300708 9529000 8873332 8319904 7836938 7277860 6879231 6533151 6206395
7478 6206395 5880353 5559052 5244427 5065927 4868075 4663641 4431352 4247592 4056100 3885737
7468 3885737 3832720 3725109 3579128 3432189 3260278 3181972 3024371 2941244 2844317 2775968
7458 2775968 2658299 2597023 2495401 2421785 2320970 2301113 2304688 2205132 2138062 2080956 2089118
$$ packed form
7521E3340868k584j882626k584658j977609r94699j32671K39100j60876j052730
7512D4791515j733222k194481k098967j684033j158591o79337o95488j061910
7504C3485486j579540k132229k185352j823329j271391r28533q40329j185693
7496B1539090j517285j696017j563892j210092r55123q17975p97726r14707r19119
7487A1147154q46446p71708o55668n53428m82966n59078l98629l46080l26756
7478F206395l26042l21301l14625j78500j97852k04434k32289j83760j91492j70363
7468C885737n3017j07611j45981j46939j71911p8306j57601q3127r6927o8349
7458B775968j17669o1276j01622p3616j00815j9857L575r9556o7070n7106Q162
$$ plain form
7447 2089118 2023055 2001390 1892979 1849648 1785014 1767344 1730528 1707383 1672217 1685471 1641355
7436 1641355 1592390 1489884 1453760 1505695 1456211 1412165 1434366 1401336 1341335 1374884 1393411
7425 1393411 1404385 1349259 1296662 1255873 1238057 1216457 1193301 1207586 1180885 1121083 1098245
7414 1098245 1095916 1114645 1077875 1056073 1056719 1058614 1106455 1092069 1092125 1058670 1028475 1027922 1023801
7401 1023801 974812 990760 989567 891759 890967 890510 870124 864854 857513 891529 924260 945477 940233
7388 940233 877513 845143 802962 781275 803008 798920 792831 842840 788002 768473 797877 830912
7376 830912 774481 718870 684759 692304 791278 728799 707546 634810 629223 681560 689557 687529
7364 687529 647667 631684 676901 649553 636439 675047 672107 608351 597198 622213 651999 739139
$$ packed form
7447B089118o6063k1665j08411m3331o4634j7670l6816k3145l5166J3254m4116
7436A641355m8965j02506l6124N1935m9484m4046K2201l3030o0001L3549J8527
7425A393411J0974n5126n2597m0789j7816k1600k3156J4285k6701n9802k2838
7414A098245k329J8729l6770k1802O46J895M7841j4386N6l3455l0195n53m121
7401A023801m8989J5948j193r7808p92m57k0386n270p341L4016L2731K1217n244
7388I40233o2720l2370m2181k1687K1733m088o089N0009n4838j9529K9404L3035
7376H30912n6431n5611l4111P545R8974o2479k1253p2736n587N2337P997k028
7364F87529l9862j5983M5217k7348j3114L8608k940o3756j1153K5015K9786Q7140
$$ plain form
7352 739139 735994 738334 707167 702761 763850 745463 748190 744214 727678 766195 744451 719716 685359
7339 685359 688815 754756 789417 786157 805635 800057 815329 775912 805736 784828 699112 643815
7327 643815 677333 729053 733917 722814 618271 644451 646802 738304 741443 692242 683814 674240
7315 674240 685550 699975 632357 626987 603592 581579 664708 647347 719661 654888 592111 561016
7303 561016 585463 610603 697134 593359 621298 688647 669107 663052 668356 718529 730525 693127
7291 693127 724252 782803 762910 767835 778569 745534 730867 752864 781341 820221 832501 862397
7279 862397 905252 978680 978052 964176 966124 1011580 1004108 1055517 1074814 1021697 1044637 1020621
7267 1020621 1048119 1134282 1138421 1156943 1164978 1220724 1245714 1284078 1407233 1471061 1491365 1505534
$$ packed form
7352G39139l145K340l1167m406O1089j8387K727l976j6536L8517k1744k4735l4357
7339F85359L456O5941L4661l260J9478n578J5272l9417K9824k0908q5716n5297
7327F43815L3518N1720M864j1103j04543K6180K351R1502L139m9201q428r574
7315F74240J1310J4425o7618n370k3395k2013Q3129j7361P2314o4773o2777l1095
7303E61016K4447K5140Q6531j03775K7939O7349j9540o055N304N0173J1996l7398
7291F93127L1125N8551j9893M925J0734l3035j4667K1997K8477L8880J2280K9896
7279H62397M2855P3428o28j3876J948M5456p472N1409J9297n3117K2940k4016
7267A020621K7498Q6163M139J8522Q035N5746K4990L8364J23155O3828K0304J4169
$$ plain form
7255 1505534 1541477 1624808 1739212 1822287 1920579 2059180 2122455 2248269 2380438 2537120
7245 2537120 2655768 2863115 2993278 3191044 3345489 3623460 3876206 4165697 4588669 4973625
7235 4973625 5436988 5922360 6442563 7075554 7700861 8275596 8862434 9456100 10076877 10792674
7225 10792674 11470783 12052267 12552524 12943650 13382876 13927130 14400067 14866960 15379370
7216 15379370 15911962 16416594 16880306 17277955 17745578 18273227 18827297 19312287 19733307
7207 19733307 20071591 20057256 19874332 19816610 19875574 19757616 19402766 18844700 18235231 17623543
7197 17623543 17126616 16634434 16334133 15897349 15362234 14850210 14345077 13883013 13412670
7188 13412670 12921390 12507407 12156806 11770622 11114283 10415938 9711811 9116233 8582137
$$ packed form
7255A505534L5943Q3331J14404Q3075R8292J38601O3275J25814J32169J56682
7245B537120J18648K07347J30163J97766J54445K77971K52746K89491M22972L84956
7235D973625M63363M85372N20203O32991O25307N74735N86838N93666O20777P15797
7225A0792674O78109N81484N00257L91126M39226N44254M72937M66893N12410
7216A5379370N32592N04632M63712L97649M67623N27649N54070M84990M21020
7207A9733307L38284j4335j82924n7722N8964j17958l54850n58066o09469o11688
7197A7623543m96927m92182l00301m36784n35115n12024n05133m62064m70343
7188A3412670m91280m13983l50601l86184o56339o98345p04127n95578n34096
$$ plain form
7179 8582137 8051839 7513459 6967556 6450462 5875599 5320498 4995639 4663702 4338755 4129389
7169 4129389 3906008 3716397 3442296 3214404 2992357 2899382 2795798 2625199 2473041 2368421
7159 2368421 2248500 2073038 2019048 2037642 1955472 1836087 1709714 1630102 1558289 1469170 1375618
7148 1375618 1368518 1329779 1296459 1277493 1204290 1179942 1103290 1031429 990695 1039255 1032921 925803
7136 925803 885488 853886 777121 683006 659984 728793 720801 717150 723903 671323 631173 675596
7124 675596 710453 684710 594563 667253 625665 504465 439304 485550 488117 430114 403191 408759
7112 408759 453343 411324 381335 419689 449435 408176 348807 390805 430380 389726 404306 340144
7100 340144 374880 388986 344294 323242 265997 233996 268392 287408 281033 259638 323287 267864
$$ packed form
7179H582137n30298n38380n45903n17094n74863n55101l24859l31937l24947k09366
7169D129389k23381j89611k74101k27892k22047r2975j03584j70599j52158j04620
7159B368421j19921j75462n3990J8594q2170j19385j26373p9612p1813q9119r3552
7148A375618p100l8739l3320j8966p3203k4348p6652p1861m0734M8560o334j07118
7136I25803m0315l1602p6765r4115k3022O8809p992l651O753n2580m0150M4423
7124F75596L4857k5743r0147P2690m1588j21200o5161M6246K567n8003k6923N568
7112D08759M4584m2019k9989L8354K9746m1259n9369M1998L9575m0654J4580o4162
7100C40144L4736J4106m4692k1052n7245l2001L4396J9016o375k1395O3649n5423
$$ plain form
7088 267864 225572 237696 237307 219736 234507 199994 176902 181914 184650 229894 200644 198833 185907
7075 185907 194688 229618 234095 275961 231082 175716 176582 218863 249929 231279 212543 191542
7063 191542 140312 106626 54465 67023 81498 105706 110339 96393 107223 184856 166628 136893
7051 136893 195112 179772 126655 189727 193950 172569 151661 159582 179007 63885 56894 64539
7039 64539 39389 109502 136123 36729 44601 101083 72705 2995 88278 89286 57656 41069
7027 41069 33393 57688 103051 108004 69964 11334 32564 66346 86100 56022 92388 78376
7015 78376 71200 120827 110481 102961 90596 89386 99331 149187 80146 69178 110569 156042 138975
7002 138975 94656 81671 83058 47926 26408 47293 134659 165747 153664 122771 95210 98567
$$ packed form
7088B67864m2292J2124l89j7571J4771l4513k3092N012K736M5244k9250j811j2926
7075A85907Q781L4930M477M1866m4879n5366Q66M2281L1066j8650j8736k1001
7063A91542n1230l3686n2161J2558J4475K4208M633j3946J0830P7633j8228k9735
7051A36893N8219j5340n3117O3072M223k1381k0908P921J9425j15122o991P645
7039F4539k5150P0113K6621r9394P872N6482k8378o9710Q5283J008l1630j6587
7027D1069p676K4295M5363M953l8040n8630K1230L3782J9754l0078L6366j4012
7015G8376p176M9627j0346p520j2365j210R945M9856o9041j0968M1391M5473j7067
7002A38975m4319j2985J387l5132k1518K0885Q7366L1088j2083l0893k7561L357
$$ plain form
6990 98567 70169 83310 62487 63692 79305 94981 135532 137615 139212 156498 103881 74977
6978 74977 94878 178121 229472 218895 243245 244331 189303 123416 78434 79160 95241 65503
6966 65503 62653 95644 98690 183691 86026 7614 77272 62308 58546 55288 90497 88576 53210
6953 53210 35923 36552 -6877 -14523 -16929 86325 149825 162074 132141 98808 91106 136326 105837
6940 105837 102084 106792 115719 110231 41057 43285 15358 12866 30063 4532 72396 128793 58074
6927 58074 137814 161830 112455 120829 122499 104026 132442 140465 112383 116447 147844 178699 236401
6914 236401 235738 218259 226516 293848 221330 242998 248835 289161 323194 348284 386130 373537
6902 373537 392911 461243 472084 508303 564881 594358 693672 714662 734282 757771 885956
$$ packed form
6990I8567k8398J3141k0823J205J5613J5676M0551K083J597J7286n2617k8904
6978G4977J9901Q3243N1351j0577K4350J086n5028o5887m4982P26J6081k9738
6966F5503k850L2991L046Q5001r7665p8412O9658j4964l762l258L5209j921l5366
6953E3210j7287O29m3429p646k406J03254O3500J2249k9933l3333p702M5220l0489
6940A05837l753M708Q927n488o9174K228k7927k492J7197k5531O7864N6397p0719
6927E8074P9740K4016m9375Q374J670j8473K8416Q023k8082M064L1397L0855N7702
6914B36401o63j7479Q257O7332p2518K1668N837M0326L4033K5090L7846j2593
6902C73537J9374O8332J0841L6219N6578K9477R9314K0990J9620K3489J28185
$$ plain form
6891 885956 932952 1020759 1113581 1249085 1377218 1436685 1539711 1622031 1845649 2042031 2214900
6880 2214900 2473944 2712023 2916948 3311729 3705060 4073522 4553928 5074644 5574046 6032550
6870 6032550 6587840 7213705 7732193 8097812 8273793 8422946 8645375 8644508 8383409 7954081
6860 7954081 7533896 7196075 6785308 6234302 5535587 4882138 4383301 3960171 3530524 3118784
6850 3118784 2782042 2501880 2183274 1999109 1858748 1710348 1594268 1515178 1357954 1227631
6840 1227631 1191327 1127410 1074612 959208 991699 939883 854477 758317 754450 684789 631442
6829 631442 568948 551440 588353 552159 460022 449459 440563 466457 392139 351772 351057 351272 309088
6816 309088 323078 341274 291040 232786 213767 260563 294081 270569 233895 320239 300979 283533
$$ packed form
6891H85956M6996Q7807R2822J35504J28133N9467J03026Q2320K23618J96382J72869
6880B214900K59044K38079K04925L94781L93331L68462M80406N20716M99402M58504
6870F032550N55290O25865N18488L65619J75981J49153K22429q67k61099m29328
6860G954081m20185l37821m10767n51006o98715o53449m98837m23130m29647m11740
6850C118784l36742k80162l18606j84165j40361j48400j16080p9090j57224j30323
6840A227631l6304o3917n2798j15404L2491n1816q5406r6160l867o9661n3347
6829F31442o2494j7508L6913l6194r2137j0563q896K5894p4318m0367p15K15m2184
6816C09088J3990J8196n0234n8254j9019M6796L3518k3512l6674Q6344j9260j7446
$$ plain form
6804 283533 283236 214383 171124 162236 164535 160058 180251 266371 220336 187411 265538 239470 237010
6791 237010 242847 193367 198181 159046 161742 133445 126680 183356 197518 181747 122958 146250
6779 146250 119526 60365 113256 108313 146523 89596 125907 136942 103869 89731 69399 74498
6767 74498 77497 57625 62694 69724 93125 119070 101416 162303 140070 72802 79452 130771 119184
6754 119184 85056 145118 96102 65197 62241 34054 70770 75951 137065 120679 81088 99930
6742 99930 61401 73098 110290 49372 32094 75894 58575 39703 38784 29575 33398 63290 61604
6729 61604 96738 39189 70124 101969 47591 -50697 -23766 43056 82298 111850 81940 108238
6717 108238 134836 80270 142867 154990 66980 8624 43180 148005 174780 174651 136441 91315
$$ packed form
6804B83533k97o8853m3259q888K299m477K0193Q6120m6035l2925P8127k6068k460
6791B37010N837m9480M814l9135K696k8297o765N6676J4162j5771n8789K3292
6779A46250k6724n9161N2891m943L8210n6927L6311J1035l3073j4138k0332N099
6767G4498K999j9872N069P030K3401K5945j7654O0887k2233o7268O650N1319j1587
6754A19184l4128O0062m9016l0905k956k8187L6716N181O1114j6386l9591J8842
6742I9930l8529J1697L7192o0918j7278M3800j7319j8872r19r209L823K9892j686
6729F1604L5134n7549L0935L1845n4378r8288K6931O6822L9242K9552k9910K6298
6717A08238K6598n4566O2597J2123q8010n8356L4556J04825K6775j29l8210m5126
$$ plain form
6705 91315 66273 37500 48669 57416 42664 63171 70607 76979 67621 103959 104270 102991 76433
6692 76433 146795 85970 107176 79354 62142 60578 49790 60795 119745 103884 96954 122054
6680 122054 47448 44830 79979 116553 125708 111274 81361 33584 31015 116695 107498 122189
6668 122189 135947 81670 100730 168734 142417 41953 32296 33325 14110 24316 50777 59606
6656 59606 55857 85864 120402 63583 77298 66958 64554 81405 60772 63900 69352 63707 13641
6643 13641 42880 41770 63683 88321 129184 64547 37317 86427 123749 122745 91529 26820
6631 26820 41822 18112 70253 81780 162157 160312 150539 203654 131027 156427 145780 150786
6619 150786 170307 91470 82251 114162 78470 66829 82742 55193 63484 55223 5740 63324
$$ packed form
6705I1315k5042k8773J1169Q747j4752K0507P436O372r358L6338L11j279k6558
6692G6433P0362o0825K1206k7822j7212j564j0788J1005N8950j5861o930K5100
6680A22054p4606k618L5149L6574R155j4434k9913m7777k569Q5680r197J4691
6668A22189J3758n4277J9060O8004k6317j00464r657J029j9215J0206K6461Q829
6656E9606l749L0007L4538n6819J3715j0340k404J6851k0633L128N452n645n0066
6643A3641K9239j110K1913K4638M0863o4637k7230M9110L7322j004l1216o4709
6631B6820J5002k3710N2141J1527Q0377j845r773N3115p2627K5400j0647N006
6619A50786J9521p8837r219L1911l5692j1641J5913k7549Q291q261m9483N7584
$$ plain form
6607 63324 58378 53216 3090 70597 50822 43152 60418 93041 105655 86947 100013 53302
6595 53302 60785 8181 16507 6813 56738 41064 11779 62740 20317 25022 47167 17686 58946
6582 58946 109224 73827 68785 98233 67191 28536 34714 71357 68511 43705 86998 128523
6570 128523 92174 78812 113571 85523 78143 80366 72583 73550 126969 152536 180179 198688 112491
6557 112491 78057 55642 55333 115158 116329 54814 52754 87478 73108 121212 143046 118574
6545 118574 174018 211312 250857 300752 215409 218807 159651 176379 191851 154697 232754 252003
6533 252003 200211 133318 146561 159708 187343 157352 107383 82515 117916 92404 92651 137108
6521 137108 66978 42638 53935 75763 85493 92184 140706 138660 101341 96902 92852 32208 89868
$$ packed form
6607F3324m946n162n0126O7507j9775p670J7266L2623J2614j8708J3066m6711
6595E3302P483n2604Q326r694M9925j5674k9285N0961m2423M705K2145k9481M1260
6582E8946N0278l5397n042K9448l1042l8655O178L6643k846k4806M3293M1525
6570A28523l6349j3362L4759k8048p380K223p783R67N3419K5567K7643J8509q6197
6557A12491l4434k2415l09N9825J171o1515k060L4724j4370M8104K1834k4472
6545A18574N5444L7294L9545M9895q5343L398n9156J6728J5472l7154P8057J9249
6533B52003n1792o6893J3243J3147K7635k9991m9969k4868L5401k5512K47M4457
6521A37108p0130k4340J1297K1828R730O691M8522k046l7319m439m050o0644N7660
$$ plain form
6508 89868 140803 165698 157371 130449 119821 100633 104222 111183 168958 115630 75028 103944
6496 103944 181137 189436 189960 193272 210601 200676 163814 154967 107310 81752 33462 22013 26926
6483 26926 51493 147367 125025 123264 157713 145894 136958 198368 233630 269251 359718 303339
6471 303339 214132 166856 170846 208751 227323 228219 234384 119847 139390 229036 175658 154839
6459 154839 190344 199937 181209 177746 156270 150201 166345 157638 145449 175782 119173 78962
6447 78962 122667 139737 108087 76398 108180 135251 100656 61501 111354 149918 144786 129160
6435 129160 133268 136794 160648 178988 122074 115287 144356 165185 125662 87841 74435 42046
6423 42046 150916 186091 184841 131375 139586 193704 206661 211065 140022 93257 72146 143090
$$ packed form
6508H9868N0935K4895q327k6922j0628j9188L589O961N7775n3328m0602K8916
6496A03944P7193Q299N24L312J7329r925l6862q847m7657k5558m8290j1449M913
6483B6926K4567R5874k2342j761L4449j1819q936O1410L5262L5621R0467n6379
6471C03339q9207m7276L990L7905J8572Q96O165j14537J9543Q9646n3378k0819
6459A54839L5505R593j8728l463k1476o069J6144q707j2189L0333n6609m0211
6447G8962M3705J7070l1650l1689L1782K7071l4595l9155M9853L8564n132j5626
6435A29160M108L526K3854J8340n6914o787K9069K0829l9523l7821j3406l2389
6423D2046J08870L5175j250n3466Q211N4118J2957M404p1043m6765k1111P0944
$$ plain form
6411 143090 179697 186589 119457 101152 171691 177276 198696 211594 183261 199557 207558 213331
6399 213331 238878 195489 159648 197189 197656 159198 205252 191664 157598 115507 212419 162884
6387 162884 114672 189664 234844 223863 221214 201746 154759 140605 161333 242450 200937 135677
6375 135677 161800 218578 210196 195086 183635 159673 173726 126677 103032 125995 156414 164099
6363 164099 135015 156628 135330 200156 281810 318395 212901 188080 227395 187462 202464
6352 202464 205810 213334 240008 196343 220077 133515 174214 217789 249805 279165 239232 288973
6340 288973 264707 281329 317964 218282 213764 253162 188987 257213 277994 337184 326095 332257
6328 332257 249932 290244 251058 236414 226439 242538 220896 212490 295494 254169 200869 219730
$$ packed form
6411A43090L6607O892o7132j8305P0539N585K1420J2898k8333J6296Q001N773
6399B13331K5547m3389l5841L7541M67l8458M6054j3588l4066m2091R6912m9535
6387A62884m8212P4992M5180j0981k649j9468m6987j4154K0728Q1117m1513o5260
6375A35677K6123N6778q382j5110j1451k3962J4053m7049k3645K2963L0419P685
6363A64099k9084K1613k1298O4826Q1654L6585j05494k4821L9315l9933J5002
6352B02464L346P524K6674m3665K3734q6562M0699M3575L2016K9360l9933M9741
6340B88973k4266J6622L6635r9682m518L9398o4175O8226K0781N9190j1089O162
6328C32257q2325M0312l9186j4644r975J6099k1642q406Q3004m1325n3300J8861
$$ plain form
6316 219730 231566 243478 315730 296240 336170 310665 303380 396794 461423 374225 310458 269587
6304 269587 340328 310168 277837 357945 446789 417103 363697 380249 347645 355133 415751 385324
6292 385324 379782 366210 373330 376043 395911 416934 403611 350121 415990 380275 396778 382259
6280 382259 451972 473933 422060 387711 463244 462645 434981 441185 468039 448657 405366 360306
6268 360306 404128 410658 421577 480762 494139 476391 408250 500159 567330 580202 550468 496314
6256 496314 469171 487175 508752 488494 472369 402304 377137 453085 400850 433781 514854 563279
6244 563279 540850 483958 389600 436304 466941 437221 368834 382851 334794 318154 338866 440977
6232 440977 439722 434042 436557 408294 408996 484362 390983 330215 391828 418247 425478 427097 347032
$$ packed form
6316B19730J1836J1912P2252j9490L9930k5505p285R3414O4629q7198o3767m0871
6304B69587P0741l0160l2331Q0108Q8844k9686n3406J6552l2604P488O0618l0427
6292C85324n542j3572P120K713J9868K1023j3323n3490O5869l5715J6503j4519
6280C82259O9713K1961n1873l4349P5533n99k7664O204K6854j9382m3291m5060
6268C60306M3822O530J0919N9185J3377j7748o8141R1909O7171J2872k9734n4154
6256D96314k7143J8004K1577k0258j6125p0065k5167P5948n2235L2931Q1073M8425
6244E63279k2429n6892r4358M6704L0637k9720o8387J4017m8057j6640K0712J02111
6232D40977j255n680K515k8263P02P5366r3379o0768O1613K6419P231J619q0065
$$ plain form
6219 347032 329824 374339 395879 395828 399273 392304 410710 441061 385788 334164 361813 329562 323183
6206 323183 325626 288515 296752 365295 270010 273960 353643 403616 405936 404556 409053 426000 362152
6193 362152 324548 291994 319954 298199 288686 339182 345026 387668 385215 320453 271388 314704
6181 314704 286178 265042 314687 335672 302518 305041 328919 349089 340600 326891 299762 247077
6169 247077 237428 319944 352260 346329 315931 307189 286941 303407 227973 188094 230116 297456
6157 297456 240560 285772 378679 374539 369367 313404 248909 297094 299406 314323 337859 372635
6145 372635 386643 367812 280589 308268 396764 443952 412513 454586 467204 463392 441812 352324
6133 352324 355793 419091 438750 498398 481392 460188 443689 417821 400564 464720 454920 477512
$$ packed form
6219C47032j7208M4515K1540n1L445o969J8406L0351n5273n1624K7649l2251o379
6206C23183K443l7111Q237O8543r5285L950P9683M9973K320j380M497J6947o3848
6193C62152l7604l2554K7960k1755r513N0496N844M2642k453o4762m9065M3316
6181C14704k8526k1136M9645K0985l3154K523K3878K0170q489j3709k7129n2685
6169B47077r649Q2516L2316n931l0398q742k0248J6466p5434l9879M2022O7340
6157B97456n6896M5212R2907m140n172n5963o4495M8185K312J4917K3536L4776
6145C72635J4008j8831q7223K7679Q8496M7188l1439M2073J2618l812k1580q9488
6133C52324L469O3298J9659N9648j7006k1204j6499k5868j7257O4156r800K2592
$$ plain form
6121 477512 426284 404147 453776 456681 479033 491301 415368 348126 352863 385037 404167 376959
6109 376959 344398 452670 448349 411710 372289 410863 487927 392648 367668 405497 456323 399674
6097 399674 398156 416311 369122 345463 342397 282673 287766 323508 335275 395749 410279 420470
6085 420470 378456 364281 356833 356474 437408 459215 443367 429145 426758 423410 445948 485471 509087
6072 509087 482200 493253 416263 393068 390698 401402 427678 518562 466727 479363 506035 522485
6060 522485 501034 497999 477466 498541 481506 477919 542542 532186 485015 537014 511344 464235
6048 464235 449892 430724 445882 454252 496615 462753 487966 554146 560956 531064 588049 550471
6036 550471 636491 742616 746223 803804 820086 837290 813805 756199 679877 660238 534422
$$ packed form
6121D77512n1228k2137M9629K905K2352J2268p5933o7242M737L2174J9130k7208
6109C76959l2561J08272m321l6639l9421L8574P7064r5279k4980L7829N0826n6649
6097C99674j518J8155m7189k3659l066n9724N093L5742J1767O0474J4530J0191
6085D20470m2014j4175p448l59Q0934K1807j5848j4222k387l348K2538L9523K3616
6072E09087k6887J1053p6990k3195k370J0704K6276R0884n1835J2636K6672J6450
6060E22485k1451l035k0533K1075j7035l587O4623j0356m7171N1999k5670m7109
6048D64235j4343j9168J5158Q370M2363l3862K5213O6180O810k9892N6985l7578
6036E50471Q6020J06125L607N7581J6282J7204k3485n7606p6322j9639j25816
$$ plain form
6025 534422 541237 584534 627865 614835 568603 577030 546827 555387 599416 667236 732355 670049
6013 670049 674209 670656 715310 728378 725271 689139 671034 757006 781172 836535 917093 995290
6001 995290 1067403 1120538 1118944 1145605 1076914 955369 866467 799323 731390 765667 810136 813013
5989 813013 819447 836287 849609 786819 794235 799448 830056 861745 887420 899542 894122 896769 906162
5976 906162 1022427 983061 1021760 1026021 1023666 1022602 1097405 1118606 1153509 1225487 1190041 1240606
5964 1240606 1280537 1302978 1325021 1411324 1444564 1409692 1391486 1431173 1588896 1573139 1657222
5953 1657222 1714399 1745350 1733541 1744258 1750564 1748513 1809653 1802921 1689184 1617678 1672916 1662399
5941 1662399 1610413 1527845 1476109 1449987 1373875 1344883 1338971 1323053 1316110 1252023 1195310 1111352
$$ packed form
6025E34422O815M3297M3331j3030m6232Q427l0203Q560M4029O7820O5119o2306
6013F70049M160l553M4654J3068l107l6132j8105Q5972K4166N5363Q0558P8197
6001I95290P2113N3135j594K6661o8691j21545q8902o7144o7933L4277M4469K877
5989H13013O434J6840J3322o2790P416N213L0608L1689K5675J2122n420K647R393
5976I06162J16265l9366L8699M261k355j064P4803K1201L4903P1978l5446N0565
5964A240606L9931K2441K2043Q6303L3240l4872j8206L9687J57723j5757Q4083
5953A657222N7177L0951j1809J0717O306k051O1140o732j13737p1506N5238j0517
5941A662399n1986q2568n1736k6122p6112k8992n912j5918o943o4087n6713q3958
$$ plain form
5929 1111352 1092401 1082386 993993 965397 976971 932786 917536 939071 923384 895155 875721
5918 875721 810869 801512 814367 795600 712128 669102 640097 652585 715254 697345 617677 629630
5906 629630 658837 664011 622967 602375 616531 635563 638429 604830 657044 659183 692096 689287
5894 689287 653268 654971 675603 721037 704069 692815 650751 608142 665721 632490 653471 607978
5882 607978 633533 701713 673673 649543 626565 601495 586005 597589 588485 626575 562460 565788
5870 565788 611231 602391 551594 509307 527397 516782 592388 575515 531277 568594 636071 589760
5858 589760 491036 482106 492221 546234 599936 587310 623255 654555 613893 615666 538399 568961
5846 568961 593141 601012 572250 568755 605041 639814 600825 601294 587209 627145 621932 579242 620001
$$ packed form
5929A111352j8951j0015q8393k8596J1574m4185j5250K1535j5687k8229j9434
5918H75721o4852r357J2855j8767q3472m3026k9005J2488O2669j7909p9668J1953
5906F29630K9207N174m1044k0592J4156J9032K866l3599N2214K139L2913k809
5894F89287l6019J703K0632M5434j6968j1254m2064m2609N7579l3231K0981m5493
5882F07978K5555O8180k8040k4130k2978k5070j5490J1584r104L8090o4115L328
5870E65788M5443q840n0797m2287J8090j0615P5606j6873m4238L7317O7477m6311
5858E89760r8724q930J0115N4013N3702j2626L5945L1300m0662J773p7267L0562
5846E68961K4180P871k8762l495L6286L4773l8989M69j4085L9936n213m2690M0759
$$ plain form
5833 620001 632092 646852 636070 626082 648678 692074 666411 524733 555808 598068 588267 664446
5821 664446 710393 572249 586312 655910 649265 628858 619158 665805 627268 601647 548087 541008
5809 541008 610683 661077 637336 649598 642111 630395 630891 678211 648634 604463 559882 571506
5797 571506 630802 640962 657596 685932 737211 752900 664705 650989 661752 650760 623316 689216
5785 689216 678357 639349 648950 710323 660764 670646 646090 658844 653652 608414 594125 625026
5773 625026 633273 619954 624275 655112 674471 692379 764146 710792 668146 685398 698011 658444
5761 658444 641063 685951 697347 714746 745769 701588 720631 728298 744369 770252 761482 664763
5749 664763 778998 825130 777489 802873 788390 811454 842185 894454 914067 856141 836546
$$ packed form
5833F20001J2091J4760j0782r988K2596M3396k5663j41678L1075M2260r801P6179
5821F64446M5947j38144J4063O9598o645k0407r700M6647l8537k5621n3560p079
5809E41008O9675N0394k3741J2262p487j1716M96M7320k9577m4171m4581J1624
5797E71506N9296J0160J6634K8336N1279J5689q8195j3716J0763j0992k7444O5900
5785F89216j0859l9008R601O1373m9559R882k4556J2754n192m5238j4289L0901
5773F25026Q247j3319M321L0837J9359J7908P1767n3354m2646J7252J2613l9567
5761F58444j7381M4888J1396J7399L1023m4181J9043P667J6071K5883q770r6719
5749F64763J14235M6132m7641K5384j4483K3064L0731N2269J9613n7926j9595
$$ plain form
5738 836546 775170 789884 782697 793814 811856 901867 958419 970731 973679 975363 869569 868226
5726 868226 899979 892679 965577 1010082 1009169 1070131 1078435 1083785 1114830 1115422 1145132 1141260 1150290
5713 1150290 1169444 1216943 1269500 1352641 1357337 1435538 1482522 1459083 1307898 1165553 1137331
5702 1137331 1126054 1167350 1132534 1053015 1035719 1017802 1007332 999892 951655 910873 900258 908550
5690 908550 933616 958798 919575 945434 940031 916851 929343 883088 874644 880531 906863 882886
5678 882886 902463 858719 880143 912364 945376 900396 906743 924635 954211 947076 944461 965346
5666 965346 969309 975428 919324 973401 920164 926556 942021 911459 955849 926825 886116 955278
5654 955278 1026398 1041742 1015366 982312 935852 937561 925954 893738 947819 921911 925930 1023561
$$ packed form
5738H36546o1376J4714p187J1117J8042R0011N6552J2312K948J684j05794j343
5726H68226L1753p300P2898M4505r13O0962Q304N350L1045N92K9710l872R030
5713A150290J9154M7499N2557Q3141M696P8201M6984k3439j51185j42345k8222
5702A137331j1277M1296l4816p9519j7296j7917j0470p440m8237m0782j0615Q292
5690I08550K5066K5182l9223K5859n403k3180J2492m6255q444N887K6332k3977
5678H82886J9577m3744K1424L2221L3012m4980O347J7892K9576p135k615K0885
5666I65346L963O119n6104N4077n3237O392J5465l0562M4390k9024m0709O9162
5654I55278P1120J5344k6376l3054m6460J709j1607l2216N4081k5908M019R7631
$$ plain form
5642 1023561 1009656 1004249 1014847 1066564 1037516 977307 992014 1004986 998318 1022009 1076369 1009483
5630 1009483 992261 1046898 1110934 1155921 1123940 1068130 1098640 1108594 1070720 1070903 1098914 1070903
5618 1070903 1070147 1116551 1046253 1039093 1103964 1102791 1118338 1059333 1099927 1115994 1083285 1027080
5606 1027080 1054884 1034160 1006684 1016199 1036962 1061956 1051604 1082343 996470 1030018 1100173 1051634
5594 1051634 1017386 1032612 1029129 1027987 1035957 963822 1046443 1007979 977234 954388 1000468 1034630
5582 1034630 1055449 1071431 1083491 1091882 1055940 1030469 1044271 1128888 1112146 1127548 1163950 1172090
5570 1172090 1149469 1120219 1119612 1140209 1109777 1016468 1031867 1105144 1008483 945042 917618 1010027
5558 1010027 1016125 1028976 1006226 1012789 982558 975271 977146 1004629 1022276 974285 942624 1034242
$$ packed form
5642A023561j3905n407J0598N1717k9048o0209J4707J2972o668K3691N4360o6886
5630A009483j7222N4637O4036M4987l1981n5810L0510R954l7874J83K8011k8011
5618A070903p56M6404p0298p160O4871j173J5547n9005M0594J6067l2709n6205
5606A027080K7804k0724k7476R515K0763K4994j0352L0739q5873L3548P0155m8539
5594A051634l4248J5226l483j142P970p2135Q2621l8464l0745k2846M6080L4162
5582A034630K0819J5982J2060Q391l5942k5471J3802Q4617j6742J5402L6402Q140
5570A172090k2621k9250o07K0597l0432r3309J5399P3277r6661o3441k7424R2409
5558A010027O098J2851k2750O563l0231p287J875K7483J7647m7991l1661R1618
$$ plain form
5546 1034242 1071127 1031801 1012210 1046566 1070001 1080320 1031632 1063581 1024404 1096038 1107605
5535 1107605 1077706 1115020 1030829 1027582 1044249 1041966 1047663 1041127 1054537 1061717 1090732 1097489 1070869
5522 1070869 1044854 1058085 1045374 1089319 1050183 1034025 1139390 1153130 1137181 1092008 1087250
5511 1087250 1090189 1103238 1065480 1120638 1130974 1177696 1195709 1181396 1224185 1195715 1152125 1194413
5499 1194413 1210964 1169943 1099922 1066431 1073644 1091721 1119337 1142679 1067448 1056653 1110269 1064044
5487 1064044 1078855 1096798 1129546 1155114 1159443 1053258 1027866 1127513 1157789 1080386 1027726
5476 1027726 1126655 1123857 1111976 1191490 1148163 1108716 1113966 1051478 1104652 1143978 1072956 1107063
5464 1107063 1204131 1119950 1090838 1065013 1069933 1094308 1167906 1116333 1120147 1121706 1136829 1152242
$$ packed form
5546A034242L6885l9326j9591L4356K3435J0319m8688L1949l9177P1634J1567
5535A107605k9899L7314q4191l247J6667k283N697o536J3410P180K9015O757k6620
5522A070869k6015J3231j2711M3945l9136j6158J05365J3740j5949m5173m758
5511A087250K939J3049l7758N5158J0336M6722J8013j4313M2789k8470m3590M2288
5499A194413J6551m1021p0021l3491P213J8077K7616K3342p5231j0795N3616m6225
5487A064044J4811J7943L2748K5568M329j06185k5392R9647L0276p7403n2660
5476A027726R8929k798j1881P9514m3327l9447N250o2488N3174L9326p1022L4107
5464A107063R7068q4181k9112k5825M920K4375P3598n1573L814J559J5123J5413
$$ plain form
5452 1152242 1217332 1153069 1136037 1226928 1237312 1241028 1171138 1164306 1120565 1076149 1010458 1070494
5440 1070494 1075050 1069919 1114376 1113787 1139706 1124824 1151029 1156983 1143488 1135922 1200706 1199494 1161737
5427 1161737 1145469 1158293 1196991 1183633 1224984 1199177 1126558 1120756 1185616 1167800 1138726 1201939
5415 1201939 1166792 1164973 1145696 1207006 1269119 1188502 1160498 1212402 1146924 1215636 1299226 1329959
5403 1329959 1304599 1217127 1276021 1277163 1308148 1251241 1291172 1367741 1384905 1331626 1367651 1326576
5391 1326576 1225039 1286803 1341606 1361000 1325374 1373609 1375007 1317552 1368368 1323767 1291230
5380 1291230 1305899 1311992 1310581 1304745 1350392 1386478 1357341 1348724 1330273 1295938 1221990 1143700
5368 1143700 1185350 1256151 1247577 1252882 1299257 1279319 1259472 1293935 1341081 1389546 1417224 1383534
$$ packed form
5452A152242O5090o4263j7032R0891J0384L716o9890o832m3741m4416o5691O0036
5440A070494M556n131M4457n89K5919j4882K6205N954j3495p566O4784j212l7757
5427A161737j6268J2824L8698j3358M1351k5807p2619n802O4860j7816k9074O3213
5415A201939l5147j819j9277O1310O2113q0617k8004N1904o5478O8712Q3590L0733
5403A329959k5360q7472N8894J142L0985n6907L9931P6569J7164n3279L6025m1075
5391A326576j01537O1764N4803J9394l5626M8235J398n7455N0816m4601l2537
5380A291230J4669O093j411n836M5647L6086k9137q617j8451l4335p3948p8290
5368A143700M1650P0801q574N305M6375j9938j9847L4463M7146M8465K7678l3690
$$ plain form
5356 1383534 1357273 1396891 1447739 1393788 1318232 1400104 1421946 1415843 1411865 1466800 1491640 1471033
5344 1471033 1467986 1450951 1449936 1445027 1473973 1483112 1467748 1448441 1500136 1482759 1453136 1482145
5332 1482145 1492607 1546077 1526864 1499796 1536196 1494452 1528771 1583757 1573220 1550447 1561859
5321 1561859 1568716 1572802 1569373 1576118 1594743 1616063 1635370 1590301 1657229 1748171 1842933 1861967
5309 1861967 1900550 1948494 2012079 2063473 2089640 2076421 2181696 2236208 2332213 2346859 2397714
5298 2397714 2439590 2348760 2414156 2387538 2377369 2349143 2303036 2288226 2267288 2228775 2191470
5287 2191470 2136252 2146001 2108091 2018813 1983688 1916575 1901820 1825163 1755302 1698148 1746884 1790547
5275 1790547 1745379 1757503 1731104 1759667 1732545 1715624 1681411 1659371 1644398 1647686 1603346 1580389
$$ packed form
5356A383534k6261L9618N0848n3951p5556Q1872K1842o103l978N4935K4840k0607
5344A471033l047j7035j015m909K8946R139j5364j9307N1695j7377k9623K9009
5332A482145J0462N3470j9213k7068L6400m1744L4319N4986j0537k2773J1412
5321A561859O857M086l429O745J8625K1320J9307m5069O6928R0942R4762J9034
5309A861967L8583M7944O3585N1394K6167j3219J05275N4512R6005J4646N0855
5298B397714M1876r0830O5396k6618j0169k8226m6107j4810k0938l8513l7305
5287B191470n5218R749l7910q9278l5125o7113j4755p6657o9861n7154M8736M3663
5275A790547m5168J2124k6399K8563k7122j6921l4213k2040j4973L288m4340k2957
$$ plain form
5263 1580389 1688445 1652101 1649528 1644963 1634167 1653842 1644267 1689894 1734870 1707757 1687605 1757655
5251 1757655 1703035 1695881 1676057 1681454 1719890 1721365 1686210 1651723 1649686 1765489 1727275 1625079
5239 1625079 1658357 1687954 1713467 1783038 1820926 1817883 1822007 1800273 1812646 1811090 1827211 1829641
5227 1829641 1795761 1849959 1870465 1842012 1875536 1883583 1890310 1879498 1885146 1860529 1929373 1974684
5215 1974684 1992360 2050636 1996394 2027918 2014526 1911478 1905885 1976440 1999509 2037045 2059928
5204 2059928 2059111 2033238 2011277 2025486 2012800 2065067 2111957 2073598 2081832 2084324 2087610 2148770
5192 2148770 2186995 2128109 2130506 2181148 2155333 2137054 2218871 2204384 2207759 2201594 2235512 2279648
5180 2279648 2276828 2284345 2266555 2269978 2269874 2365425 2379120 2414663 2406319 2452259 2501935 2476696 2457688
$$ packed form
5263A580389J08056l6344k573m565j0796J9675r575M5627M4976k7113k0152P0050
5251A757655n4620p154j9824N397L8436J475l5155l4487k037J15803l8214j02196
5239A625079L3278K9597K5513O9571L7888l043M124k1734J2373j556J6121K430
5227A829641l3880N4198K0506k8453L3524Q047O727j0812N648k4617O8844M5311
5215A974684J7676N8276n4242L1524j3392j03048n593P0555K3069L7536K2883
5204B059928q17k5873k1961J4209j2686N2267M6890l8359Q234K492L286O1160
5192B148770L8225n8886K397N0642k5815j8279Q1817j4487L375o165L3918M4136
5180B279648k820P517j7790L423j04R5551J3695L5543q344M5940M9676k5239j9008
$$ plain form
5167 2457688 2413478 2445977 2448620 2503512 2515980 2566001 2529866 2477114 2482927 2509501 2520370 2562944
5155 2562944 2568245 2562302 2655040 2681170 2675245 2690669 2644045 2639541 2674870 2676864 2700785 2712596
5143 2712596 2738674 2727742 2761008 2750910 2753369 2745732 2728769 2771079 2906979 2961677 2937532 2923755
5131 2923755 2909986 2975814 3036103 2956637 2972351 3036764 3089129 3058682 3032399 3014035 3081590
5120 3081590 3059890 3040246 3104811 3131962 3240785 3229309 3209956 3216262 3304633 3348496 3329186
5109 3329186 3413005 3391127 3399503 3491142 3527753 3547533 3655905 3661502 3752804 3762174 3716649 3779808
5097 3779808 3855282 3956794 3971287 4009653 4067017 4114995 4148745 4140184 4178619 4236182 4290043
5086 4290043 4355970 4468700 4402044 4456564 4547076 4574268 4622234 4658636 4810428 4928668 4908695
$$ packed form
5167B457688m4210L2499K643N4892J2468N0021l6135n2752N813K6574J0869M2574
5155B562944N301n943R2738K6130n925J5424m6624m504L5329J994K3921J1811
5143B712596K6078j0932L3266j0098K459p637j6963M2310J35900N4698k4145j3777
5131B923755j3769O5828O0289p9466J5714O4413N2365l0447k6283j8364O7555
5120C081590k1700j9644O4565K7151J08823j1476j9353O306Q8371M3863j9310
5109C329186Q3819k1878Q376R1639L6611J9780J08372N597R1302R370m5525O3159
5097C779808P5474J01512J4493L8366N7364M7978L3750q561L8435N7563N3861
5086D290043O5927J12730o6656N4520R0512K7192M7966L6402J51792J18240j9973
$$ plain form
5075 4908695 4970598 5071287 5176438 5284388 5309798 5317647 5392081 5524599 5695260 5855031
5065 5855031 5985480 6087877 6182538 6354618 6443587 6564882 6645117 6728237 6838404 6983678
5055 6983678 7063699 7181168 7345945 7535068 7746539 7907848 8141700 8391361 8587104 8796784
5045 8796784 9068582 9364868 9695931 9993114 10315027 10721075 11088123 11530972 11933947 12400588
5035 12400588 12978819 13563077 14225202 14948515 15660348 16412739 17307130 18337995 19411968
5026 19411968 20578482 21802864 23199231 24654574 26242889 27938782 29869047 31935469
5018 31935469 34216692 36795965 39596585 42711002 46199634 50035705 54165180 58946834
5010 58946834 64489742 70653723 77449725 84852965 92866378 101133684 108778566 116802240
$$ packed form
5075D908695O1903J00689J05151J07950K5410P849P4434J32518J70661J59771
5065E855031J30449J02397R4661J72080Q8969J21295Q0235Q3120J10167J45274
5055F983678Q0021J17469J64777J89123K11471J61309K33852K49661J95743K09680
5045H796784K71798K96286L31063K97183L21913M06048L67048M42849M02975M66641
5035A2400588N78231N84258O62125P23313P11833P52391Q94391J030865J073973
5026A9411968J166514J224382J396367J455343J588315J695893J930265K066422
5018C1935469K281223K579273K800620L114417L488632L836071M129475M781654
5010E8946834N542908O163981O796002P403240Q013413Q267306P644882Q023674
$$ plain form
5002 116802240 125876281 134600501 141428914 146919411 152268323 156392688 158269113 157912444
4994 157912444 157529959 156453268 154065535 150750023 146702767 140830357 132820799 125219881
4986 125219881 118316883 111089896 102774937 94776667 88168023 82335716 75774167 69020052
4978 69020052 63259463 58251646 53366196 48649825 44497406 40978325 38000959 35365472
4970 35365472 33170426 31286228 29571333 27944143 26549328 25367332 24303874 23281413
4962 23281413 22358594 21576901 20859304 20265057 19631388 19103592 18789409 18415333 18048073
4953 18048073 17894860 17763774 17640889 17612551 17653104 17614698 17596181 17590515 17599414 17699070 17769899
4942 17769899 17744048 17680100 17511410 17353088 17204377 17022420 16790773 16565717 16372303 16251921
$$ packed form
5002A16802240R074041Q724220O828413N490497N348912M124365J876425l56669
4994A57912444l82485j076691k387733l315512m047256n872410q009558p600918
4986A25219881o902998p226987q314959p998270o608644n832307o561549o754115
4978F9020052n760589n007817m885450m716371m152419l519081k977366k635487
4970C5365472k195046j884198j714895j627190j394815j181996j063458j022461
4962B3281413r22819p81693p17597n94247o33669n27796l14183l74076l67260
4953A8048073j53213j31086j22885k8338M0553l8406j8517n666Q899R9656P0829
4942A7769899k5851o3948j68690j58322j48711j81957k31647k25056j93414j20382
$$ plain form
4932 16251921 16118787 16009312 15976293 15886209 15885358 15994685 15998309 16116205 16301611 16548757 16692846
4921 16692846 16799876 16936310 17037109 17053531 17068420 16950820 16770577 16638788 16385459 16172920
4911 16172920 15965014 15726023 15480503 15302560 15291407 15193652 15159895 15127735 15230756 15297035
4901 15297035 15422840 15576699 15746363 15924045 16039553 16178925 16260640 16433259 16382799 16281029
4891 16281029 16179183 16017708 15829814 15573599 15386727 15218904 14965435 14797536 14696146
4882 14696146 14677832 14593456 14544133 14578050 14648290 14650320 14741786 14920123 15084184 15126159 15160352
4871 15160352 15196141 15188734 15084644 14960952 14748347 14494860 14163567 13839618 13446611 13070004
4861 13070004 12712555 12383804 12007069 11606680 11209437 10812286 10452673 10117622 9765065
$$ packed form
4932A6251921j33134j09475l3019r0084q51J09327L624J17896J85406K47146J44089
4921A6692846J07030J36434J00799J6422J4889j17600j80243j31789k53329k12539
4911A6172920k07906k38991k45520j77943j1153r7755l3757l2160J03021O6279
4901A5297035J25805J53859J69664J77682J15508J39372Q1715J72619n0460j01770
4891A6281029j01846j61475j87894k56215j86872j67823k53469j67899j01390
4882A4696146j8314q4376m9323L3917P0240K030R1466J78337J64061M1975L4193
4871A5160352L5789p407j04090j23692k12605k53487l31293l23949l93007l76607
4861A3070004l57449l28751l76735m00389l97243l97151l59613l35051l52557
$$ plain form
4852 9765065 9523792 9190967 8820335 8604604 8444967 8185047 7981031 7899940 7746927 7609893
4842 7609893 7458170 7396691 7395237 7359944 7282225 7235160 7214153 7117960 7063086 6948237 6755432
4831 6755432 6639094 6429901 6318687 6136021 5922591 5838038 5774250 5613951 5566752 5510290
4821 5510290 5439269 5337527 5367325 5294851 5171272 5141196 5143058 5132869 5108677 5071947 4968303
4810 4968303 5003626 5081760 5089780 5076064 5049689 5084569 5199297 5243177 5198984 5245454 5372937
4799 5372937 5409319 5421705 5479006 5465848 5409700 5382396 5287764 5203687 5187305 5150940 5141968 5111582
4787 5111582 5113589 5124731 5137427 5172780 5202026 5246025 5289027 5324751 5319024 5377057 5408959 5364400
4775 5364400 5381886 5371881 5296360 5285812 5283550 5275916 5224866 5210164 5196039 5215624 5191919 5195362
$$ packed form
4852I765065k41273l32825l70632k15731j59637k59920k04016q1091j53013j37034
4842G609893j51723o1479j454l5293p7719m7065k1007r6193n4874j14849j92805
4831F755432j16338k09193j11214j82666k13430q4553o3788j60299m7199n6462
4821E510290p1021j01742K9798p2474j23579l0076J862j0189k4192l6730j03644
4810D968303L5323P8134Q020j3716k6375L4880J14728M3880m4193M6470J27483
4799E372937L6382J2386N7301j3158n6148k7304r4632q4077j6382l6365q972l0386
4787E111582K007J1142J2696L5353K9246M3999M3002L5724n727N8033L1902m4559
4775E364400J7486j0005p5521j0548k262p634n1050j4702j4125J9585k3705L443
$$ plain form
4763 5195362 5260437 5244332 5244143 5302894 5347379 5394430 5377942 5472472 5544746 5596198 5684473 5700032
4751 5700032 5693167 5624159 5605468 5604754 5644463 5608213 5563401 5606140 5748217 5765619 5788226 5911974
4739 5911974 5946518 6041871 6108567 6046324 6078716 6125168 6174014 6284976 6343907 6391256 6453373
4728 6453373 6561474 6661898 6788763 6880820 6987709 7138996 7169995 7240176 7361802 7494741
4718 7494741 7566916 7621636 7698383 7764096 7779408 7823065 7861121 7885400 7917453 7871659 7903879
4707 7903879 7924746 8047691 8168113 8235894 8298677 8460372 8541059 8612931 8639384 8697195 8884127
4696 8884127 8906489 8937884 8974229 8983640 8933950 8923487 8944533 8947227 8883143 8914172 8866884 8885089
4684 8885089 8918832 8729316 8711992 8697097 8713482 8545961 8377701 8198027 8100455 7993325
$$ packed form
4763E195362O5075j6105j89N8751M4485M7051j6488R4530P2274N1452Q8275J5559
4751E700032o865o9008j8691p14L9709l6250m4812M2739J42077J7402K2607J23748
4739E911974L4544R5353O6696o2243L2392M6452M8846J10962N8931M7349O2117
4728F453373J08101J00424J26865R2057J06889J51287L0999P0181J21626J32939
4718G494741P2175N4720P6747O5713J5312M3657L8056K4279L2053m5794L2220
4707G903879K0867J22945J20422O7781O2783J61695Q0687P1872K6453N7811J86932
4696H884127K2362L1395L6345R411m9690j0463K1046K694o4084L1029m7288J8205
4684H885089L3743j89516j7324j4895J6385j67521j68260j79674r7572j07130
$$ plain form
4674 7993325 7817665 7642152 7565508 7570994 7533983 7468304 7491275 7501594 7401516 7414501 7373336
4663 7373336 7342965 7316322 7300825 7239647 7241981 7194517 7216370 7132448 7017160 6963768 6882771
4652 6882771 6850403 6839795 6818431 6740325 6757785 6804014 6688576 6654625 6701634 6629641 6629943 6636436
4640 6636436 6727800 6710328 6685010 6689741 6720061 6801509 6801486 6818505 6785463 6844451 6912585 6978126
4628 6978126 7026029 7070256 7179714 7270075 7344823 7375044 7413525 7501563 7585485 7732325 7824083
4617 7824083 7893588 7934863 8059538 8155488 8236673 8347197 8416685 8571087 8732825 8772222 8839848
4606 8839848 8935997 9082474 9177986 9297981 9334307 9424302 9654602 9778509 9901525 10025869
4596 10025869 10109279 10264446 10493589 10731608 10960059 11128487 11271823 11495459 11723567 12025658
$$ packed form
4674G993325j75660j75513p6644N486l7011o5679K2971J0319j00078J2985m1165
4663G373336l0371k6643j5497o1178K334m7464K1853q3922j15288n3392q0997
4652F882771l2368j0608k1364p8106J7460M6229j15438l3951M7009p1993L02O493
4640F636436R1364j7472k5318M731L0320Q1448k3J7019l3042N8988O8134O5541
4628F978126M7903M4227J09458R0361P4748L0221L8481Q8038Q3922J46840R1758
4617G824083O9505M1275J24675R5950Q1185J10524O9488J54402J61738L9397O7626
4606H839848R6149J46477R5512J19995L6326Q9995K30300J23907J23016J24344
4596A0025869Q3410J55167K29143K38019K28451J68428J43336K23636K28108L02091
$$ plain form
4586 12025658 12342710 12587525 12789958 12906055 13202440 13561957 13874056 14163886 14483631
4577 14483631 14771999 15053267 15416643 15643555 15874283 16140508 16361988 16516384 16748368
4568 16748368 17031803 17244259 17416846 17629240 17838612 17982975 18172380 18333100 18372694 18415082
4558 18415082 18631186 18715485 18900657 19063071 19228815 19553103 19840013 20111602 20462096 20776307
4548 20776307 21076583 21416773 21625823 21909059 22227336 22531773 22797363 22854913 22899039 22920767
4538 22920767 22862757 22771809 22632241 22361394 22037321 21838293 21617697 21381352 21186893 21027373
4528 21027373 20921098 20806863 20757060 20682971 20703815 20705173 20824177 20915245 21085313 21344357
4518 21344357 21595954 21849884 22096297 22417328 22758135 23041025 23252903 23416329 23583586
$$ packed form
4586A2025658L17052K44815K02433J16097K96385L59517L12099K89830L19745
4577A4483631K88368K81268L63376K26912K30728K66225K21480J54396K31984
4568A6748368K83435K12456J72587K12394K09372J44363J89405J60720L9594M2388
4558A8415082K16104Q4299J85172J62414J65744L24288K86910K71589L50494L14211
4548B0776307L00276L40190K09050K83236L18277L04437K65590N7550M4126K1728
4538B2920767n8010r0948j39568k70847l24073j99028k20596k36345j94459j59520
4528B1027373j06275j14235m9803p4089K0844J358J19004R1068J70068K59044
4518B1344357K51597K53930K46413L21031L40807K82890K11878J63426J67257
$$ plain form
4509 23583586 23701199 23731839 23726611 23669640 23616235 23476137 23380094 23100448 22904845 22838569 22776093
4498 22776093 22805122 22773392 22746480 22779438 22974681 23202554 23373939 23563179 23867785 24191730
4488 24191730 24506121 24874515 25244676 25643331 25995593 26321754 26822725 27442068 28145762
4479 28145762 28990069 29890252 30691043 31288152 31809811 32341578 32856842 33334295 33645483
4470 33645483 33885583 34123888 34458542 34761344 35090133 35627646 36261002 37017457 37997603
4461 37997603 39079096 40386525 41824061 43437881 45147590 47118248 49212564 51192957
4453 51192957 53252315 55385163 57768718 60298900 63096032 66152277 69476519 73063380
4445 73063380 76987689 81184254 85877397 91004563 96512740 102283647 108538862 115577265
$$ packed form
4509B3583586J17613L0640n228n6971n3405j40098r6043k79646j95603o6276o2476
4498B2776093K9029l1730k6912L2958J95243K27873J71385J89240L04606L23945
4488B4191730L14391L68394L70161L98655L52262L26161N00971O19343P03694
4479B8145762Q44307R00183Q00791N97109N21659N31767N15264M77453L11188
4470C3645483K40100K38305L34654L02802L28789N37513O33356P56455R80146
4461C7997603J081493J307429J437536J613820J709709J970658K094316J980393
4453E1192957K059358K132848K383555K530182K797132L056245L324242L586861
4445G3063380L924309M196565M693143N127166N508177N770907O255215P038403
$$ plain form
4437 115577265 123554359 132155247 141101452 150222399 158875896 165950437 170876346 173895869
4429 173895869 175709723 176325705 175888685 175179819 174941181 175285967 176441499 178820897 182896572
4420 182896572 189450350 198638095 209721668 221574653 233138003 243005942 249685073 253406810
4412 253406810 254566652 253734269 252209411 251691449 252704609 254887527 258143932 261766938
4404 261766938 264958163 266455883 265540488 260959907 252708520 242257240 231040378 219703070
4396 219703070 208645474 198277572 188557212 179637381 171643668 164113800 156940698 150561557
4388 150561557 145319375 141216367 138255714 136373377 135566458 135786640 136907135 139198166
4380 139198166 142896008 147977315 153913728 159810577 165054732 169495779 173122764 176039951
$$ packed form
4437A15577265P977094Q600888Q946205R120947Q653497P074541M925909L019523
4429A73895869J813854O15982m37020p08866k38638L44786J155532K379398M075675
4420A82896572O553778R187745J1083573J1852985J1563350R867939O679131L721737
4412B53406810J159842q32383j524858n17962J013160K182918L256405L623006
4404B61766938L191225J497720r15395m580581q251387j0451280j1216862j1337308
4396B19703070j1057596j0367902r720360q919831p993713p529868p173102o379141
4388A50561557n242182m103008k960653j882337q06919K20182J120495K291031
4380A39198166L697842N081307N936413N896849N244155M441047L626985K917187
$$ plain form
4372 176039951 177969977 177841449 174713471 168152977 158363429 145946544 132880311 120966428
4364 120966428 110543648 101663349 94028030 87616011 82285727 77784099 73704222 69919897
4356 69919897 66493204 63521496 60881649 58305185 55744252 53398241 51280185 49403053
4348 49403053 47796114 46360480 45047331 43904566 42839355 41958367 41230659 40539038 39926279
4339 39926279 39257249 38706998 38185659 37780950 37503835 37325834 37137114 37041971 36894650 36659487
4329 36659487 36386403 36207251 36034691 35845363 35665781 35532922 35331846 35043307 34745793
4320 34745793 34397489 33936607 33529944 33191030 32836257 32512027 32194252 31904535 31727886
4311 31727886 31496060 31152770 30915779 30776888 30692951 30709174 30708143 30805903 31038206 31211207
$$ packed form
4372A76039951J930026j28528l127978o560494r789548j2416885j3066233j1913883
4364A20966428j0422780q880299p635319o412019n330284m501628m079877l784325
4356F9919897l426693k971708k639847k576464k560933k346011k118056j877132
4348D9403053j606939j435634j313149j142765j065211q80988p27708o91621o12759
4339C9926279o69030n50251n21339m04709k77115j78001j88720r5143j47321k35163
4329C6659487k73084j79152j72560j89328j79582j32859k01076k88539k97514
4320C4745793l48304m60882m06663l38914l54773l24230l17775k89717j76649
4311C1727886k31826l43290k36991j38891q3937J6223j031R7760K32303J73001
$$ plain form
4301 31211207 31280967 31394317 31366457 31379782 31265760 31026461 30770258 30345870 29893701 29450257
4291 29450257 29060880 28623198 28150108 27696136 27325904 26990268 26745590 26596496 26490169
4282 26490169 26273960 26111355 25916777 25740865 25567809 25542332 25408966 25256773 25099502 24877067
4272 24877067 24653444 24468375 24266677 24059358 23853778 23630169 23443599 23201946 22984034
4263 22984034 22834737 22717534 22624113 22436062 22361487 22210924 22107374 22000411 21940406 21955226
4253 21955226 21915431 21966554 22021545 21948712 21887059 21891976 21829474 21700216 21606198 21453636 21354711
4242 21354711 21329916 21289071 21349036 21342887 21321050 21295590 21339194 21419718 21525270 21592523 21696253
4231 21696253 21882950 21989042 22125833 22303662 22441240 22612301 22756208 22885088 23042715
$$ packed form
4301C1211207O9760J13350k7860J3325j14022k39299k56203m24388m52169m43444
4291B9450257l89377m37682m73090m53972l70232l35636k44678j49094j06327
4282B6490169k16209j62605j94578j75912j73056k5477j33366j52193j57271k22435
4272B4877067k23623j85069k01698k07319k05580k23609j86570k41653k17912
4263B2984034j49297j17203r3421j88051p4575j50563j03550j06963o0005J4820
4253B1955226l9795N1123N4991p2833o1653M917o2502j29258r4018j52562r8925
4242B1354711k4795m0845N9965o149k1837k5460M3604Q0524J05552O7253J03730
4231B1696253J86697J06092J36791J77829J37578J71061J43907J28880J57627
$$ plain form
4222 23042715 23248217 23461170 23770812 23939678 24145396 24401581 24645143 24808472 25049412
4213 25049412 25296809 25544264 25821315 26080323 26373662 26665999 26980029 27272622 27682655
4204 27682655 28084262 28480647 28893526 29364714 29903472 30432636 31085236 31755690 32431476
4195 32431476 33176925 33963371 34796591 35691653 36670780 37732632 38780923 39845408 41029938
4186 41029938 42307802 43741188 45260662 46937826 48716987 50467401 52158879 53633383
4178 53633383 54930716 56288199 57782276 59583149 61680278 63956068 66256973 68444923
4170 68444923 70332290 71909842 73508438 75313680 77513557 80070824 82720575 85354442
4162 85354442 87628759 89420286 91151154 93177873 95651153 98574080 101868193 105436580
$$ packed form
4222B3042715K05502K12953L09642J68866K05718K56185K43562J63329K40940
4213B5049412K47397K47455K77051K59008K93339K92337L14030K92593M10033
4204B7682655M01607L96385M12879M71188N38758N29164O52600O70454O75786
4195C2431476P45449P86446Q33220Q95062R79127J061852J048291J064485J184530
4186D1029938J277864J433386J519474J677164J779161J750414J691478J474504
4178E3633383J297333J357483J494077J800873K097129K275790K300905K187950
4170F8444923J887367J577552J598596J805242K199877K557267K649751K633867
4162H5354442K274317J791527J730868K026719K473280K922927L294113L568387
$$ plain form
4154 105436580 108817796 111720852 114063217 116095163 118111506 120178577 122589322 125554667
4146 125554667 129037524 132728607 136453839 139949381 142963898 145599556 147999668 150331121
4138 150331121 153001249 156375573 160442626 164839003 168836641 172352586 175477868 178350091
4130 178350091 181441878 184659696 187550866 189410191 189930897 189244791 187781306 186074442
4122 186074442 184917832 184684809 185382814 186710411 188006090 188883809 189166741 188785497 188173084
4113 188173084 187845381 187746576 187748588 187544295 186859902 185928511 184938793 184273125 184019161 184047388
4103 184047388 184238444 184604151 185414138 185860776 184722978 181040478 175417026 169605942 164255981
4094 164255981 159260850 154738278 150849469 147359149 144033544 140786512 137537370 134544380
$$ packed form
4154A05436580L381216K903056K342365K031946K016343K067071K410745K965345
4146A25554667L482857L691083L725232L495542L014517K635658K400112K331453
4138A50331121K670128L374324M067053M396377L997638L515945L125282K872223
4130A78350091L091787L217818K891170J859325N20706o86106j463485j706864
4122A86074442j156610k33023O98005J327597J295679Q77719K82932l81244o12413
4113A88173084l27703r8805K012k04293o84393r31391r89718o65668k53964K8227
4103A84047388J91056L65707Q09987M46638j137798l682500n623452n811084n349961
4094A64255981m995131m522572l888809l490320l325605l247032l249142k992990
$$ plain form
4086 134544380 132002016 129799402 127694462 125955102 124340778 122463353 120581670 118885613
4078 118885613 117468641 115966494 114514073 113031516 111681532 110468039 109139403 107687210
4070 107687210 106227574 105009454 104018129 103208221 102409042 101285733 99637048 97652914
4062 97652914 95583303 93498518 91347057 89426791 87801723 86465280 85469356 84830315
4054 84830315 84396161 83892623 83307381 82877508 82752559 82815637 82838368 82899917 83081312 83394499
4044 83394499 83843560 84461508 85274621 86355768 87596336 89170240 90956059 92884259 94886392
4035 94886392 96785121 98647215 100646034 102876167 105270353 107853346 110410465 112584903
4027 112584903 114268253 115587257 116709196 117547002 117700742 117176849 116535055 116329705 116671864
$$ packed form
4086A34544380k542364k202614k104940j739360j614324j877425j881683j696057
4078A18885613j416972j502147j452421j482557j349984j213493j328636j452193
4070A07687210j459636j218120r91325q09908p99179j123309j648685j984134
4062I7652914k069611k084785k151461j920266j625068j336443r95924o39041
4054H4830315m34154n03538n85242m29873j24949O3078K2731O1549J81395L13187
4044H3394499M49061O17948Q13113J081147J240568J573904J785819J928200K002133
4035I4886392J898729J862094J998819K230133K394186K582993K557119K174438
4027A12584903J683350J319004J121939Q37806J53740n23893o41794k05350L42159
$$ plain form
4018 116671864 117496135 118726602 120373931 122453728 124725261 126828471 129135023 131815500
4010 131815500 135010781 138309953 141468651 144724715 147932372 150735189 152992309 154890671
4002 154890671 156539666 157743229 158311769 158606647 159311505 160497478 161839471 162774237 162839409
3993 162839409 162435611 162005580 162102222 162933652 164195778 165229241 166153989 167365471 168520089
3984 168520089 169562681 171294200 173714660 176386713 179046460 181634064 183878497 184876635
3976 184876635 185144239 185575198 185958419 185770778 184781567 182963927 180727709 178295021 175583088
3967 175583088 172477434 169391519 166893757 165365903 164386369 163794681 163442841 162812244 161671218
3958 161671218 160319400 159454273 159192425 159472773 160271103 161445594 162616803 163071062 162840654
$$ packed form
4018A16671864Q24271J230467J647329K079797K271533K103210K306552K680477
4010A31815500L195281L299172L158698L256064L207657K802817K257120J898362
4002A54890671J648995J203563N68540K94878P04858J185973J341993R34766O5172
3993A62839409m03798m30031R6642Q31430J262126J033463R24748J211482J154618
3984A68520089J042592J731519K420460K672053K659747K587604K244433R98138
3976A84876635K67604M30959L83221j87641r89211j817640k236218k432688k711933
3967A75583088l105654l085915k497762j527854r79534n91688l51840o30597j141026
3958A61671218j351818q65127k61848K80348P98330J174491J171209M54259k30408
$$ plain form
3949 162840654 162158859 161226320 160449972 159640812 158475901 156705836 154232091 151331057 148467248
3940 148467248 145506173 142717479 140225106 137829668 135027474 131851950 128954084 126397076
3932 126397076 123922400 121614978 119681269 118210135 116780842 115210753 113765828 112553768
3924 112553768 111450730 110339344 109418362 108945137 109158695 109957960 111085378 111757572 111105537
3915 111105537 108964230 105932361 102790894 99645979 96599793 93765562 91345750 89354984
3907 89354984 87739892 86608381 85935098 85748579 86154674 86933825 87912583 88935285 89909135
3898 89909135 90876312 91864101 93166011 94602866 95702502 96881839 98523160 100227223
3890 100227223 101577453 102697920 104247051 106024488 107487774 108624033 109394533 109818096
$$ packed form
3949A62840654o81795r32539p76348q09160j164911j770065k473745k901034k863809
3940A48467248k961075k788694k492373k395438k802194l175524k897866k557008
3932A26397076k474676k307422j933709j471134j429293j570089j444925j212060
3924A12553768j103038j111386r20982m73225K13558P99265J127418O72194o52035
3915A11105537k141307l031869l141467l144915l046186k834231k419812j990766
3907H9354984j615092j131511o73283j86519M06095P79151R78758J022702R73850
3898H9909135R67177R87789J301910J436855J099636J179337J641321J704063
3890A00227223J350230J120467J549131J777437J463286J136259P70500M23563
$$ plain form
3882 109818096 110407754 111151436 111999025 113094655 114266892 114990737 114818876 114185957 113956571
3873 113956571 114515113 115587523 116778361 118120182 119794428 121974645 124497912 127223463
3865 127223463 129760937 131763392 133262927 134032453 134360355 134768551 135649724 136861361 137749464
3856 137749464 137790304 137390872 137048558 136891757 137044780 136781333 135856755 135067784 134851156
3847 134851156 135307549 136696875 138932804 141587390 144114229 146420458 148549795 149900022
3839 149900022 150201947 149421616 147888219 146509912 145661242 145480212 145805073 146364630 147141581
3830 147141581 148027191 148962980 149711810 150114387 149859582 148889614 147137016 144875090 142769957
3821 142769957 141420037 140636461 140308824 140200187 140367855 140990688 142102063 143721558 145781297
$$ packed form
3882A09818096N89658P43682Q47589J095630J172237P23845j71861o32919k29386
3873A13956571N58542J072410J190838J341821J674246K180217K523267K725551
3865A27223463K537474K002455J499535P69526L27902M08196Q81173J211637Q88103
3856A37749464M0840l99432l42314j56801J53023k63447r24578p88971k16628
3847A34851156M56393J389326K235929K654586K526839K306229K129337J350227
3839A49900022L01925p80331j533397j378307q48670j81030L24861N59557P76951
3830A47141581Q85610R35789P48830M02577k54805r69968j752598k261926k105133
3821A42769957j349920p83576l27637j08637J67668O22833J111375J619495K059739
$$ plain form
3812 145781297 147824755 149203291 150123097 151001492 152044726 152944588 153472075 152991712 151660559
3803 151660559 149898027 148421041 147571215 147258720 147328026 147308538 147289872 147529702 147962466
3794 147962466 148266900 148239542 147908338 147327883 146873654 147034113 148316115 150437237 152714478
3785 152714478 154320102 155248229 155651017 155796117 155674794 155377403 155329562 155846373 156563799
3776 156563799 156984322 156945900 156497128 156420686 156991551 157542723 157625789 157663051 158028343 158574780
3766 158574780 159202225 160051974 161497548 163606441 165748588 167820237 170090981 172534179
3758 172534179 174666164 176150318 177233461 177946621 178380358 178618997 178538906 178111045 177538080
3749 177538080 177160742 176947007 176389801 174606745 172031407 169401843 167086355 165113735
$$ packed form
3812A45781297K043458J378536R19806Q78395J043234Q99862N27487m80363j331153
3803A51660559j762532j476986q49826l12495O9306j9488j8666K39830M32764
3794A47962466L04434k7358l31204n80455m54229J60459J282002K121122K277241
3785A52714478J605624R28127M02788J45100j21323k97391m7841N16811P17426
3776A56563799M20523l8422m48772p6442N70865N51172Q3066L7262L65292N46437
3766A58574780O27445Q49749J445574K108893K142147K071649K270744K443198
3758A72534179K131985J484154J083143P13160M33737K38639q0091m27861n72965
3749A77538080l77338k13735n57206j783056k575338k629564k315488j972620
$$ plain form
3741 165113735 163754042 163390637 163934239 164884654 165908228 166512190 166654377 166115191 165175415
3732 165175415 164430705 164006125 163501570 162630388 161214740 159593892 158228594 157449559 156853368
3723 156853368 156064897 155003460 153341258 150478493 146434208 142108637 137984055 134270479
3715 134270479 131373379 129255548 128018220 127628077 127829016 128218960 128144047 127334958 125766597
3706 125766597 123736020 121507236 119339795 117059815 114948938 112945706 110983314 109046006
3698 109046006 107421686 106450327 105984702 105479295 104268612 101908312 98472485 94649617
3690 94649617 91055540 88062540 85710664 83948022 82858534 82544489 82900231 83112420 82514084
3681 82514084 80978037 79201316 77436703 75748631 74170909 72651986 71268220 69878239
$$ packed form
3741A65113735j359693l63405N43602R50415J023574O03962J42187n39186r39776
3732A65175415p44710m24580n04555q71182j415648j620848j365298p79035n96191
3723A56853368p88471j061437j662202k862765m044285m325571m124582l713576
3715A34270479k897100k117831j237328l90143K00939L89944p4913q09089j568361
3706A25766597k030577k228784k167441k279980k110877k003232j962392j937308
3698A09046006j624320r71359m65625n05407j210683k360300l435827l822868
3690I4649617l594077k993000k351876j762642j089488l14045L55742K12189n98336
3681H2514084j536047j776721j764613j688072j577722j518923j383766j389981
$$ plain form
3673 69878239 68501086 67170848 65934284 64723672 63415833 62142568 60808361 59125560
3665 59125560 57060739 55008022 53030470 51210988 49738704 48551001 47708833 47286518
3657 47286518 47127236 46881949 46282936 45251397 44040160 42964966 42064735 41447914 40821022
3648 40821022 40084633 39234850 38322909 37465164 36546394 35601759 34713726 33897580 33109329
3639 33109329 32355385 31694255 31113760 30640017 30168513 29650986 29243088 28861379 28476968
3630 28476968 28198618 27920767 27644999 27440927 27279323 27050587 26832184 26642291 26412885
3621 26412885 26270247 26046826 25929978 25710923 25499617 25349346 25096835 24980708 24830921
3612 24830921 24675838 24513373 24324500 24099262 23811684 23632791 23333125 22969722 22698490
$$ packed form
3673F9878239j377153j330238j236564j210612j307839j273265j334207j682801
3665E9125560k064821k052717j977552j819482j472284j187703q42168m22315
3657D7286518j59282k45287n99013j031539j211237j075194r00231o16821o26892
3648D0821022p36389q49783r11941q57745r18770r44635q88033q16146p88251
3639C3109329p53944o61130n80495m73743m71504n17527m07898l81709l84411
3630B8476968k78350k77851k75768k04072j61604k28736k18403j89893k29406
3621B6412885j42638k23421j16848k19055k11306j50271k52511j16127j49787
3612B4830921j55083j62465j88873k25238k87578j78893k99666l63403k71232
$$ plain form
3603 22698490 22391072 22137845 21895000 21635248 21341024 21028800 20726165 20473055 20255396
3594 20255396 19996315 19732864 19522729 19335570 19139681 18896011 18628641 18461266 18267758
3585 18267758 18115414 17923154 17813941 17622284 17485336 17369935 17226878 17107296 16933647
3576 16933647 16762034 16608266 16448636 16327944 16263153 16073789 15877881 15787132 15738206 15580447
3566 15580447 15466774 15423618 15371909 15245543 15146110 15117954 15052360 14903460 14771907 14643218
3556 14643218 14619374 14588174 14519890 14522816 14371964 14237068 14091001 14043337 13995462 13853642 13753048
3545 13753048 13642637 13677477 13613513 13465508 13444325 13371417 13242794 13149584 13133944 13136987 13046807
3534 13046807 12998544 12957879 12985423 12998877 13003879 13039194 13067537 13020633 12939087 12877030 12816888
$$ packed form
3603B2698490l07418k53227k42845k59752k94224l12224l02635k53110k17659
3594B0255396k59081k63451k10135j87159j95889k43670k67370j67375j93508
3585A8267758j52344j92260j09213j91657j36948j15401j43057j19582j73649
3576A6933647j71613j53768j59630j20692o4791j89364j95908r0749m8926j57759
3566A5580447j13673m3156n1709j26366r9433k8156o5594j48900j31553j28689
3556A4643218k3844l1200o8284K926j50852j34896j46067m7664m7875j41820j00594
3545A3753048j10411L4840o3964j48005k1183p2908j28623r3210j5640L043r0180
3534A3046807m8263m0665K7544J3454N002L5315K8343m6904q1546o2057o0142
$$ plain form
3523 12816888 12714130 12600104 12538538 12351089 12149288 11976277 11858423 11764377 11715243 11538597
3513 11538597 11376110 11263579 11153956 11058736 10992996 10985281 10934466 10901944 10829116 10778272 10820928
3502 10820928 10830325 10827240 10641325 10483061 10369703 10320420 10305656 10186302 10065760 9959254
3492 9959254 9920375 9869086 9828452 9746017 9765629 9768851 9757613 9757101 9805337 9887387 10010379 10013026
3480 10013026 10043854 10169733 10191409 10246267 10359879 10390299 10384748 10443730 10517105 10529524 10504838
3469 10504838 10529935 10653482 10717441 10741889 10910089 10951158 11072773 11132895 11149462 11227158 11172107
3458 11172107 11169054 11038943 10953936 10980462 10899364 10851936 10719467 10628262 10581705 10534620 10544001
3447 10544001 10551432 10625454 10726280 10925897 10984022 11050725 11074594 11206143 11336426 11422818 11539088
$$ packed form
3523A2816888j02758j14026o1566j87449k01801j73011j17854r4046m9134j76646
3513A1538597j62487j12531j09623r5220o5740p715n0815l2522p2828n0844M2656
3502A0820928R397l085j85915j58264j13358m9283j4764j19354j20542j06506
3492I959254l8879n1289m0634q2435J9612L222j1238n12M8236Q2050J22992K647
3480A0013026L0828J25879K1676N4858J13612L0420n551N8982P3375J2419k4686
3469A0504838K5097J23547O3959K4448J68200M1069J21615O0122J6567P7696n5051
3458A1172107l053j30111q5007K6526q1098m7428j32469r1205m6557m7085R381
3447A0544001P431P4022J00826J99617N8125O6703K3869J31549J30283Q6392J16270
$$ plain form
3436 11539088 11597670 11580313 11578031 11649345 11720813 11759507 11807554 11942493 12062457 12133060 12231561
3425 12231561 12407045 12640677 12862513 12982729 13055761 12979096 12735013 12476408 12203682 11868636
3415 11868636 11493579 11106355 10805364 10535151 10309945 10042514 9836497 9585850 9438598
3406 9438598 9296679 9134291 9059585 8882557 8708236 8507274 8343184 8208163 7989641 7866527
3396 7866527 7729000 7626772 7430331 7278997 7171311 7059428 6965971 6863925 6742080 6586065
3386 6586065 6406547 6246973 6162921 6117899 6042972 5945361 5912828 5877085 5857514 5779654 5748950
3375 5748950 5632086 5469607 5307782 5227745 5118109 4997807 4954642 4920500 4875205 4810607
3365 4810607 4781142 4742831 4725722 4767766 4662577 4617485 4553748 4499285 4438057 4320876 4181232
$$ packed form
3436A1539088N8582j7357k282P1314P1468L8694M8047J34939J19964P0603R8501
3425A2231561J75484K33632K21836J20216P3032p6665k44083k58605k72726l35046
3415A1868636l75057l87224l00991k70213k25206k67431k06017k50647j47252
3406I438598j41919j62388p4706j77028j74321k00962j64090j35021k18522j23114
3396G866527j37527j02228j96441j51334j07686j11883r3457j02046j21845j56015
3386F586065j79518j59574q4052m5022p4927r7611l2533l5743j9571p7860l0704
3375E748950j16864j62479j61825q0037j09636j20302m3165l4142m5295o4598
3365D810607k9465l8311j7109M2044j05189m5092o3737n4463o1228j17181j39644
$$ plain form
3354 4181232 3993950 3894213 3798325 3769966 3714409 3600507 3499476 3399357 3300448 3267533 3198573
3343 3198573 3119703 3111830 3100611 2989945 2900735 2822782 2736967 2701473 2684624 2610662 2552668
3332 2552668 2557590 2494755 2439201 2434621 2434057 2405612 2340286 2315155 2279891 2343895 2307673 2296898
3320 2296898 2314706 2293581 2264290 2227048 2176378 2234907 2248815 2064042 1989888 2004527 1974387
3309 1974387 1938613 1936368 1906840 1852097 1852561 1872681 1909021 1984944 1992989 1990401 2000676 1947285
3297 1947285 1861762 1865260 1820209 1767710 1767436 1782853 1714124 1789903 1784218 1739484 1780280 1761831
3285 1761831 1791774 1822199 1868920 1898052 1919267 2017425 2070780 2118926 2083756 2115288 2199046
3274 2199046 2253978 2325261 2370649 2374991 2404249 2484408 2486135 2505883 2546877 2582705 2561914 2573337
$$ packed form
3354D181232j87282r9737r5888k8359n5557j13902j01031j00119r8909l2915o8960
3343C198573p8870p873j1219j10666q9210p7953q5815l5494j6849p3962n7994
3332B552668M922o2835n5554m580n64k8445o5326k5131l5264O4004l6222j0775
3320B296898J7808k1125k9291l7242n0670N8529J3908j84773p4154J4639l0140
3309A974387l5774k245k9528n4743M64K0120L6340P5923Q045k588J0275n3391
3297A947285q5523L498m5051n2499k74J5417o8729P5779n685m4734M0796j8449
3285A761831K9943L0425M6721K9132K1215R8158N3355M8146l5170L1532Q3758
3274B199046N4932P1283M5388M342K9258Q0159J727J9748M0994L5828k0791J1423
$$ plain form
3262 2573337 2592256 2567365 2652748 2614887 2468808 2418924 2439341 2469226 2481020 2412647 2365289
3251 2365289 2291802 2284517 2254833 2224216 2201177 2090764 2058407 1973557 1873758 1799981 1784757
3240 1784757 1747935 1576578 1466822 1428524 1386327 1314703 1192639 1212155 1198541 1183166 1095616
3229 1095616 1086139 1062038 991198 955877 941409 945763 919959 942464 1095493 1097423 1035160 1043362
3217 1043362 1061624 1151074 1143105 1147364 1214223 1275756 1293070 1364030 1365420 1385372 1456880 1391010
3205 1391010 1380606 1447985 1463094 1447563 1468070 1440711 1472547 1464565 1364027 1364803 1392554 1396892
3193 1396892 1406659 1318928 1299799 1228448 1188310 1202195 1184431 1208834 1164480 1045541 985560
3182 985560 1034144 1014150 914317 888527 907412 797603 758536 660275 639368 703562 664116
$$ packed form
3262B573337J8919k4891Q5383l7861j46079m9884K0417K9885J1794o8373m7358
3251B365289p3487p285k9684l0617k3039j10413l2357q4850r9799p3777j5224
3240A784757l6822j71357j09756l8298m2197p1624j22064J9516j3614j5375q7550
3229A095616r477k4101p0840l5321j4468M354k5804K2505J53029J930o2263Q202
3217A043362J8262Q9450p969M259O6859O1533J7314P0960J390J9952P1508o5870
3205A391010j0404O7379J5109j5531K0507k7359L1836p982j00538P76K7751M338
3193A396892R767q7731j9129p1351m0138J3885j7764K4403m4354j18939n9981
3182I85560M8584j9994r9833k5790J8885j09809l9067r8261k0907O4194l9446
$$ plain form
3171 664116 648205 685651 566234 531905 525666 493840 458130 428239 450514 454823 520436 542928
3159 542928 534478 562940 616478 632757 642727 664122 697091 750663 808049 832775 891890 968421
3147 968421 962699 986387 970421 989182 962621 866255 864821 878414 860732 853085 824452 786067
3135 786067 829764 840573 858771 864099 861406 888205 923844 936237 964880 985500 1117889 1116910
3123 1116910 1107408 1114626 1109827 1088902 1107413 1159019 1162575 1172507 1196396 1227907 1197358 1329665
3111 1329665 1358255 1384985 1308713 1268623 1348161 1331937 1328795 1334288 1308157 1315858 1372426 1398079
3099 1398079 1420638 1435352 1564106 1627329 1617628 1654536 1741095 1798799 1740369 1651961 1541573
3088 1541573 1448676 1322518 1338116 1305018 1277367 1223298 1166368 1164843 1153489 1177752 1166779
$$ packed form
3171F64116j5911L7446j19417l4329o239l1826l5710k9891K2275M309O5613K2492
3159E42928q450K8462N3538J6279R970K1395L2969N3572N7386K4726N9115P6531
3147I68421n722K3688j5966J8761k6561r6366j434J3593j7682p647k8633l8385
3135G86067M3697J0809J8198N328k693K6799L5639J2393K8643K0620J32389r79
3123A116910r502P218m799k0925J8511N1606L556R932K3889L1511l0549J32307
3111A329665K8590K6730p6272m0090P9538j6224l142N493k6131P701N6568K5653
3099A398079K2559J4714J28754O3223r701L6908Q6559N7704n8430q8408j10388
3088A541573r2897j26158J5598l3098k7651n4069n6930j525j1354K4263j0973
$$ plain form
3077 1166779 1059676 951949 918194 844155 803682 786643 796647 770544 727411 689749 700815
3066 700815 737896 776207 728057 779503 797336 771646 762252 821050 753298 680719 685771 687723
3054 687723 645305 584575 603018 596888 563319 568250 524347 538225 647886 617929 601006 631001
3042 631001 723950 827821 778400 802075 984999 1065835 1163053 1259668 1346768 1413581 1537468
3031 1537468 1646944 1773622 1930260 2116886 2264017 2462728 2673106 2866043 3033561 3272294
3021 3272294 3440253 3499464 3534890 3402985 3270030 2965533 2582726 2302862 2030818 1861153
3011 1861153 1601814 1425631 1264878 1124115 1003922 823339 734512 654973 592933 558421
3001 558421 480628 387461 333920 243134 150386 139378 85252 15515 -57002 -135327 -198660 -258634
$$ packed form
3077A166779j07103j07727l3755p4039m0473j7039J0004k6103m3133l7662J1066
3066G00815L7081L8311m8150N1446J7833k5690r394N8798o7752p2579N052J952
3054F87723m2418o0730J8443o130l3569M931m3903J3878J09661k9957j6923K9995
3042F31001R2949J03871m9421K3675J82924Q0836R7218R6615Q7100O6813J23887
3031A537468J09476J26678J56638J86626J47131J98711K10378J92937J67518K38733
3021C272294J67959N9211L5426j31905j32955l04497l82807k79864k72044j69665
3011A861153k59339j76183j60753j40763j20193j80583q8827p9539o2040l4512
3001E58421p7793r3167n3541r0786r2748j1008n4126o9737p2517p8325o3333n9974
$$ plain form
2989 -258634 -261027 -289468 -275128 -341276 -361564 -357493 -331146 -362039 -435955 -429076 -373856 -406314
2977 -406314 -521663 -543850 -513767 -536291 -465481 -417205 -506056 -612035 -546828 -524506 -529536
2966 -529536 -512707 -508618 -585065 -627390 -597400 -586958 -565269 -615685 -595345 -635258 -687600 -651846
2954 -651846 -665620 -619453 -597349 -617010 -600050 -691454 -688994 -669412 -737213 -791655 -763743 -802160
2942 -802160 -795310 -771300 -779659 -858314 -892903 -903196 -874717 -828181 -888633 -893975 -918779 -930041
2930 -930041 -891760 -868331 -908709 -944315 -932669 -880380 -806623 -796508 -842214 -864035 -818152 -804599
2918 -804599 -833771 -800143 -801500 -780108 -823692 -804618 -807570 -867223 -863996 -868535 -885527 -855889
2906 -855889 -842170 -826128 -840272 -808676 -780116 -816916 -800378 -778237 -799902 -802945 -825024 -811051
$$ packed form
2989b58634k393k8441J4340o6148k0288M071K6347l0893p3916O879N5220l2458
2977d06314j15349k2187L0083k2524P0810M8276q8851j05979O5207K2322n030
2966e29536J6829M089p6447m2325K9990J0442K1689n0416K0340l9913n2342L5754
2954f51846j3774M6167K2104j9661J6960r1404K460J9582o7801n4442K7912l8417
2942h02160O850K4010q359p8655l4589j0293K8479M6536o0452n342k4804j1262
2930i30041L8281K3429m0378l5606J1646N2289P3757J0115m5706k1821M5883J3553
2918h04599k9172L3628j357K1392m3584J9074k952n9653L227m539j6992K9638
2906h55889J3719J6042j4144L1596K8560l6800J6538K2141k1665l043k2079J3973
$$ plain form
2894 -811051 -791913 -805790 -835666 -857370 -829187 -852581 -921354 -883953 -882653 -907011 -842251 -869816
2882 -869816 -863672 -829673 -805766 -820919 -811643 -801163 -866176 -866092 -858064 -910511 -914176 -924539 -931175
2869 -931175 -944968 -877740 -871410 -902767 -912747 -888656 -894864 -882679 -892937 -953385 -893694 -854096
2857 -854096 -831466 -845042 -836773 -855529 -841873 -836935 -843018 -839200 -927922 -893815 -839126 -840176 -831843
2844 -831843 -795336 -816034 -826529 -778784 -776423 -880531 -810251 -813319 -807657 -833307 -757543 -750237
2832 -750237 -764890 -695682 -790320 -801104 -791661 -779043 -750077 -771937 -755931 -704171 -716049 -747856
2820 -747856 -713314 -743459 -759181 -708196 -735461 -687986 -671885 -712748 -713869 -677448 -669676 -659723
2808 -659723 -672316 -598150 -557982 -534309 -559185 -619088 -634238 -579606 -585741 -509062 -494150 -536871
$$ packed form
2894h11051J9138j3877k9876k1704K8183k3394o8773L7401J300k4358O4760k7565
2882h69816O144L3999K3907j5153R276J0480o5013Q4Q028n2447l665j0363o636
2869i31175j3793O7228O330l1357r980K4091o208J2185j0258o0448N9691L9598
2857h54096K2630j3576Q269j8756J3656M938o083L818q8722L4107N4689j050Q333
2844h31843L6507k0698j0495M7745K361j04108P0280l068N662k5650P5764P306
2832g50237j4653O9208r4638j0784R443J2618K8966k1860J6006N1760j1878l1807
2820g47856L4542l0145j5722N0985k7265M7475J6101m0863j121L6421P772R953
2808f59723j2593P4166M0168K3673k4876n9903j5150N4632o135P6679J4912m2721
$$ plain form
2796 -536871 -519947 -514915 -534622 -511957 -491607 -541490 -519403 -550669 -499561 -485507 -478051 -478553
2784 -478553 -496168 -529332 -568921 -510747 -528603 -515754 -469536 -484485 -532560 -501601 -495355 -401520
2772 -401520 -414953 -400085 -420006 -468892 -440241 -492884 -457888 -388681 -406630 -357491 -391168 -479972
2760 -479972 -524152 -520482 -496932 -540041 -572910 -537357 -461554 -466864 -523163 -588528 -551419 -496016
2748 -496016 -495995 -473494 -494762 -504279 -553560 -552576 -522073 -558651 -585977 -556895 -525009 -532170 -428611
2735 -428611 -445866 -361705 -382667 -453290 -432474 -475983 -548452 -510447 -568880 -607048 -621655 -649981
2723 -649981 -668022 -690196 -668726 -704200 -725072 -659571 -703729 -718918 -651242 -662810 -615823 -685722
2711 -685722 -703988 -738188 -703713 -647346 -695902 -630710 -665335 -704255 -636976 -648693 -625548 -684094
$$ packed form
2796e36871J6924N032j9707K2665K0350m9883K2087l1266N1108J4054P456n02
2784d78553j7615l3164l9589N8174j7856J2849M6218j4949m8075L0959O246R3835
2772d01520j3433J4868j9921m8886K8651n2643L4996O9207j7949M9139l3677q8804
2760d79972m4180L670K3550m3109l2869L5553P5803n310n6299o5365L7109N5403
2748d96016K1K2501k1268r517m9281R84L0503l6578k7326K9082L1886p161J03559
2735d28611j7255Q4161k0962p0623K0816m3509p2469L8005n8433l8168j4607k8326
2723f49981j8041k2174K1470l5474k0872O5501m4158j5189O7676j1568M6987o9899
2711f85722j8266l4200L4475N6367m8556O5192l4625l8920O7279j1717K3145n8546
$$ plain form
2699 -684094 -684614 -681547 -715842 -687003 -681412 -751146 -748461 -762337 -845175 -799342 -752539 -758121 -802307
2686 -802307 -765129 -728100 -679737 -680871 -731447 -807047 -815110 -780033 -778436 -785484 -769201 -838890
2674 -838890 -848377 -774477 -772443 -744865 -736521 -756216 -762009 -792670 -798061 -798349 -783956 -823528 -794238
2661 -794238 -795346 -792507 -850825 -860059 -852794 -856817 -856615 -845714 -784817 -802146 -757734 -761207 -741589
2648 -741589 -760593 -815002 -849786 -801093 -785233 -740938 -758905 -741407 -795129 -793049 -764948 -716737
2636 -716737 -709112 -734606 -763583 -764315 -774746 -713030 -752642 -818968 -792984 -776064 -747863 -689460
2624 -689460 -690058 -714119 -740090 -675663 -636756 -705963 -735118 -703932 -683032 -697881 -738876 -811834
2612 -811834 -773454 -729571 -636197 -686756 -703983 -665375 -721874 -742211 -744282 -765391 -761748 -759004
$$ packed form
2699f84094n20L067l4295K8839N591o9734K685j3876q2838M5833M6803n582m4186
2686h02307L7178L7029M8363j134n0576p5600q063L5077J597p048J6283o9689
2674h38890r487P3900K034K7578Q344j9695n793l0661n391k88J4393l9572K9290
2661g94238j108K839n8318r234P265m023K02J0901O0897j7329M4412l473J9618
2648g41589j9004n4409l4784M8693J5860M4295j7967J7498n3722K080K8101M8211
2636g16737P625k5494k8977p32j0431O1716l9612o6326K5984J6920K8201N8403
2624f89460n98k4061k5971O4427L8907o9207k9155L1186K0900j4849m0995p2958
2612h11834L8380M3883R3374n0559j7227L8608n6499k0337k071k1109L643K744
$$ plain form
2600 -759004 -694295 -693088 -753254 -752012 -741163 -782468 -782461 -804967 -837699 -802026 -785863 -751407 -698443
2587 -698443 -722315 -737999 -698988 -654759 -670554 -628210 -646313 -709496 -711912 -681706 -699493 -679674
2575 -679674 -677068 -727723 -749230 -662906 -632975 -615751 -640874 -679884 -682723 -619357 -677337 -683230
2563 -683230 -644781 -654636 -635685 -668400 -740960 -698554 -680945 -631505 -593664 -662801 -589798 -572703
2551 -572703 -575200 -577586 -517161 -449723 -512284 -559850 -556152 -509451 -542362 -486395 -493314 -568180
2539 -568180 -614295 -656926 -565380 -581599 -662605 -647642 -562883 -610535 -612074 -637604 -628444 -610607
2527 -610607 -573678 -625936 -686916 -655066 -616734 -597881 -617968 -616921 -577590 -637138 -670767 -718118
2515 -718118 -708289 -629812 -616560 -641270 -578031 -596134 -670904 -674837 -645044 -671481 -621127 -574332
$$ packed form
2600g59004O4709J207o0166J242J0849m1305Pk2506l2732L5673J6163L4456N2964
2587f98443k3872j5684L9011M4229j5795M2344j8103o3183k416L0206j7787J9819
2575f79674K606n0655k1507Q6324K9931J7224k5123l9010k839O3366n7980n893
2563f83230L8449r855J8951l2715p2560M2406J7609M9440L7841o9137P3003J7095
2551e72703k497k386O0425O7438o2561m7566L698M6701l2911N5967o919p4866
2539e68180m6115m2631R1546j6219q1006J4963Q4759m7652j539k5530R160J7837
2527f10607L6929n2258o0980L1850L8332J8853k0087J047L9331n9548l3629m7351
2515g18118R829P8477J3252k4710O3239j8103p4770l933K9793k6437N0354M6795
$$ plain form
2503 -574332 -655662 -677668 -575831 -577832 -578003 -579135 -610089 -515857 -533345 -583113 -634323 -603831
2491 -603831 -536850 -591442 -638484 -585910 -617051 -598336 -577160 -577775 -559507 -496274 -543643 -550427
2479 -550427 -541503 -620822 -619812 -594171 -522133 -517936 -565768 -571141 -570550 -599919 -597127 -573017 -576701
2466 -576701 -626012 -605185 -621150 -605986 -536437 -484621 -531879 -517243 -513505 -528482 -501194 -513368
2454 -513368 -468585 -544088 -531869 -493964 -550114 -529055 -510685 -492244 -498855 -556639 -601024 -526473
2442 -526473 -488166 -487766 -470918 -425433 -407060 -451713 -488750 -508227 -529374 -586553 -526695 -545954
2430 -545954 -533903 -516555 -481740 -473126 -482055 -471816 -474194 -474568 -460163 -468592 -555978 -559897 -570656
2417 -570656 -506022 -484971 -443628 -437475 -393892 -369400 -442578 -463563 -401846 -328879 -410443 -450426
$$ packed form
2503e74332q1330k2006J01837k001j71j132l0954R4232j7488m9768n1210L0492
2491f03831O6981n4592m7042N2574l1141J8715K1176o15J8268O3233m7369o784
2479e50427Q924p9319J010K5641P2038M197m7832n373N91k9369K792K4110l684
2466e76701m9311K0827j5965J5164O9549N1816m7258J4636L738j4977K7288j2174
2454e13368M4783p5503J2219L7905n6150K1059J8370J8441o611n7784m4385P4551
2442e26473L8307M00J6848M5485J8373m4653l7037j9477k1147n7179N9858j9259
2430e45954J2051J7348L4815Q614q929J0239k378l74J4405q429q7386l919j0759
2417e70656O4634K1051M1343O153M3583K4492p3178k0985O1717P2967q1564l9983
$$ plain form
2405 -450426 -400408 -435532 -467172 -471331 -492943 -448401 -463146 -466816 -416489 -398918 -388958 -389043 -367822
2392 -367822 -388524 -370542 -403454 -374185 -383756 -358271 -350521 -426201 -413415 -402899 -377627 -348380
2380 -348380 -353774 -383973 -356004 -419823 -386353 -420763 -342110 -313981 -349780 -370690 -289576 -276374
2368 -276374 -338798 -307590 -241097 -240155 -240018 -261350 -266093 -263898 -231840 -203558 -164990 -148910 -155495
2355 -155495 -79621 -144569 -159406 -117918 -159064 -106229 -112108 -101706 -71186 -72753 -57077 -79019
2343 -79019 -115482 -74612 -56138 -113529 -120425 -79402 -25304 17691 14418 92303 110827 126067
2331 126067 163553 200693 160116 247004 329392 335950 357792 396475 464546 454498 465744 552897
2319 552897 677669 750436 744240 803916 880981 1025979 1125564 1177970 1312738 1432385 1634954
$$ packed form
2405d50426N0018l5124l1640m159k1612M4542j4745l670N0327J7571R960q5K1221
2392c67822k0702J7982l2912K9269r571K5485P750p5680J2786J0516K5272K9247
2380c48380n394l0199K7969o3819L3470l4410P8653K8129l5799k0910Q1114J3202
2368b76374o2424L1208O6493R42J37k1332m743K195L2058K8282L8568J6080o585
2355a55495P5874o4948j4837M1488m1146N2835n879J0402L0520j567J5676k1942
2343g9019l6463M0870J8474n7391o896M1023N4098M2995l273P7885J8524J5240
2331A26067L7486L7140m0577Q6888Q2388O558K1842L8683O8071j0048J1246Q7153
2319E52897J24772P2767o196N9676P7065J44998R9585N2406J34768J19647K02569
$$ plain form
2308 1634954 1792648 1978324 2162792 2417567 2677008 2984406 3146996 3450406 3877345 4359067
2298 4359067 4799427 5380462 5829623 6340019 6858434 7429922 8204507 9258751 10465838
2289 10465838 11843213 12853798 13920868 15421614 17654697 20710215 24916514 29948872
2281 29948872 33287880 29885298 22695274 17460973 14023421 11724878 9954712 8688575
2273 8688575 7603918 6754936 6017962 5531246 5138209 4858063 4552758 4275442 3780630
2264 3780630 3322823 2926883 2625912 2433110 2174286 1943679 1775256 1643165 1538856 1402087
2254 1402087 1321040 1274964 1221826 1037451 989279 895660 836934 773606 756538 672625 582152
2243 582152 571976 477109 398934 395685 342504 342467 319183 302548 282265 261950 219701 163224
$$ packed form
2308A634954J57694J85676J84468K54775K59441L07398J62590L03410M26939M81722
2298D359067M40360N81035M49161N10396N18415N71488P74585J054244J207087
2289A0465838J377375J010585J067070J500746K233083L055518M206299N032358
2281B9948872L339008l402582p190024n234301l437552k298543j770166j266137
2273H688575j084657q48982p36974m86716l93037k80146l05305k77316m94812
2264C780630m57807l95940l00971j92802k58824k30607j68423j32091j04309j36769
2254A402087q1047m6076n3138j84375m8172r3619n8726o3328j7068q3913r0473
2243E82152j0176r4867p8175l249n3181l7k3284j6635k0283k0315m2249n6477
$$ plain form
2231 163224 114280 11723 20260 -17824 5901 22323 8062 -38780 -35994 13077 398 -65025
2219 -65025 -135986 -130706 -113356 -129478 -135604 -109257 -134755 -156689 -135149 -76583 -120512 -109816
2207 -109816 -143391 -145388 -143356 -188489 -185104 -150666 -130492 -163760 -126454 -191821 -220221 -219628 -251068
2194 -251068 -197622 -190453 -194038 -205478 -231722 -237553 -254227 -217291 -229039 -193495 -239460 -272323
2182 -272323 -271494 -354692 -308802 -250623 -281111 -313139 -338654 -303486 -275900 -315107 -332227 -331934
2170 -331934 -271098 -313644 -354915 -329418 -314267 -268426 -306277 -350023 -347589 -305292 -282399 -314164
2158 -314164 -275408 -305772 -362892 -325975 -333700 -362803 -407839 -356705 -394752 -436965 -377938 -345356
2146 -345356 -351040 -402401 -379212 -305168 -297124 -337312 -304910 -328122 -369252 -326747 -289058 -338162
$$ packed form
2231A63224m8944j02557Q537l8084K3725J6422j4261m6842K786M9071j2679o5423
2219f5025p0961N280J7350j6122o126K6347k5498k1934K1540N8566m3929J0696
2207a09816l3575j997K032m5133L385L4438K0174l3268L7306o5367k8400N93l1440
2194b51068N3446P169l585j1440k6244n831j6674L6936j1748L5544m5965l2863
2182b72323Q29q3198M5890N8179l0488l2028k5515L5168K7586l9207j7120K93
2170c31934O0836m2546m1271K5497J5151M5841l7851m3746K434M2297K2893l1765
2158c14164L8756l0364n7120L6917p725k9103m5036N1134l8047m2213N9027L2582
2146c45356n684n1361K3189P4044Q044m0188L2402k3212m1130M2505L7689m9104
$$ plain form
2134 -338162 -298581 -344116 -350843 -346435 -408749 -394565 -313485 -304406 -311868 -323550 -387571 -402970
2122 -402970 -437608 -462522 -458947 -443270 -433738 -389024 -359586 -342405 -431409 -463463 -423533 -406763
2110 -406763 -448761 -469329 -449117 -467416 -424409 -408964 -386839 -374664 -394784 -334512 -367430 -363341
2098 -363341 -412173 -340008 -340498 -386845 -419979 -412364 -363545 -358882 -341019 -313118 -371295 -417009
2086 -417009 -451297 -391142 -415877 -430709 -373415 -387444 -334061 -334668 -399429 -448656 -432550 -427961
2074 -427961 -396471 -409546 -363801 -346427 -425032 -413306 -430676 -464883 -427230 -405773 -344408 -338939
2062 -338939 -451187 -417782 -357268 -419414 -436894 -417605 -431463 -483286 -482051 -420395 -445027 -506398
2050 -506398 -458252 -421093 -383732 -400970 -429703 -417681 -342194 -404375 -409245 -398494 -323724 -337945
$$ packed form
2134c38162L9581m5535o727M408o2314J4184Q1080R079p462j1682o4021j5399
2122d02970l4638k4914L575J5677R532M4714K9438J7181q9004l2054L9930J6770
2110d06763m1998k0568K0212j8299M3007J5445K2125J2175k0120O0272l2918M089
2098c63341m8832P2165m90m6347l3134P615M8819M663J7863K7901n8177m5714
2086d17009l4288O0155k4735j4832N7294j4029N3383o07o4761m9227J6106M589
2074d27961L1490j3075M5745J7374p8605J1726j7370l4207L7653K1457O1365N469
2062c38939j12248L3405O0514o2146j7480J9289j3858n1823J235O1656k4632o1371
2050e06398M8146L7159L7361j7238k8733J2022P5487o2181m870J0751P4770j4221
$$ plain form
2038 -337945 -342922 -297405 -314506 -274066 -358427 -294142 -351970 -377819 -378627 -398563 -418275 -373752
2026 -373752 -351180 -329549 -361069 -351733 -360809 -351550 -305253 -321086 -273012 -307011 -282844 -242687
2014 -242687 -222771 -287296 -215380 -182926 -274431 -354727 -303596 -360887 -382909 -397944 -351503 -377499
2002 -377499 -389336 -411073 -338010 -322282 -358599 -345016 -407333 -427751 -373971 -333027 -372289 -375259
1990 -375259 -344365 -387478 -438637 -424944 -335471 -303107 -337162 -341631 -358016 -336309 -363627 -300232
1978 -300232 -360562 -349000 -353415 -288039 -266642 -320401 -375370 -385872 -347149 -388454 -377392 -362796
1966 -362796 -355173 -379843 -419953 -436590 -350930 -347745 -343118 -319779 -337931 -311286 -311479 -304477 -333286
1953 -333286 -318187 -286995 -321330 -376419 -421143 -315339 -314081 -388185 -324351 -344151 -362151 -309738
$$ packed form
2038c37945m977M5517j7101M0440q4361O4285n7828k5849q08j9936j9712M4523
2026c73752K2572K1631l1520R336r076R259M6297j5833M8074l3999K4167M0157
2014b42687J9916o4525P1916L2454r1505q0296N1131n7291k2022j5035M6441k5996
2002c77499j1837k1737P3063J5728l6317J3583o2317k0418N3780M0944l9262k970
1990c75259L0894m3113n1159J3693Q9473L2364l4055m469j6385K1707k7318O3395
1978c00232o0330J1562m415O5376K1397n3759n4969j0502L8723m1305J1062J4596
1966c62796P623k4670m0110j6637Q5660L185M627K3339j8152K6645j93P002k8809
1953c33286J5099L1192l4335n5089m4724J05804J258p4104O3834j9800j8000N2413
$$ plain form
1941 -309738 -283544 -295364 -328414 -316022 -264924 -265698 -233458 -323973 -338916 -324674 -340711 -351045
1929 -351045 -390840 -331735 -304072 -258070 -234770 -252887 -344946 -377729 -372334 -301341 -261268 -334361
1917 -334361 -279788 -289872 -318306 -324213 -243036 -251387 -277948 -382317 -394436 -356433 -376844 -294923
1905 -294923 -297145 -319397 -309309 -316972 -327311 -310684 -305561 -273547 -273804 -264337 -312325 -317641 -308174
1892 -308174 -297349 -209910 -228118 -284830 -335767 -316840 -301384 -302283 -351457 -331764 -334665 -317161
1880 -317161 -298981 -377478 -313823 -359607 -317606 -290551 -350724 -330993 -242263 -242163 -285908 -307141
1868 -307141 -304714 -304400 -279792 -261900 -268256 -228106 -228869 -270279 -268112 -279483 -312605 -333493 -283687
1855 -283687 -253417 -237360 -264178 -300818 -262563 -253669 -257991 -293842 -264915 -258196 -274279 -277355
$$ packed form
1941c09738K6194j1820l3050J2392N1098p74L2240r0515j4943J4242j6037j0334
1929c51045l9795N9105K7663M6002K3300j8117r2059l2783N395P0993M0073p3093
1917c34361N4573j0084k8434n907Q1177q351k6561j04369j2119L8003k0411Q1921
1905b94923k222k2252J0088p663j0339J6627N123L2014k57R467m7988n316R467
1892c08174J0825Q7439j8208n6712n0937J8927J5456q99m9174J9693k901J7504
1880c17161J8180p8497O3655m5784M2001K7055o0173J9731Q8730J00m3745k1233
1868c07141K427L14K4608J7892o356M0150p63m1410K167j1371l3122k0888M9806
1855b83687L0270J6057k6818l6640L8255Q894m322l5851K8927O719j6083l076
$$ plain form
1843 -277355 -277414 -246068 -278568 -289580 -242265 -199698 -229187 -357121 -327827 -191834 -241744 -292567
1831 -292567 -288252 -296887 -265401 -292688 -257634 -249814 -242325 -267375 -238856 -247476 -265802 -247644 -238456
1818 -238456 -216634 -232146 -231703 -235167 -220182 -215408 -280631 -316884 -270939 -291215 -277634 -260965
1806 -260965 -259425 -278932 -279598 -263949 -278459 -298332 -258466 -268763 -315544 -294152 -235625 -258726
1794 -258726 -283831 -293953 -244806 -242192 -230096 -197744 -234495 -235659 -246413 -222646 -268493 -325895
1782 -325895 -313246 -294926 -328418 -331072 -273285 -234929 -297364 -387826 -328462 -283171 -289895 -289593
1770 -289593 -183683 -189113 -229947 -248278 -308275 -303820 -329824 -364675 -356595 -314080 -247818 -188074
1758 -188074 -213780 -188300 -214872 -223988 -227848 -248342 -254080 -302296 -283308 -274348 -307247 -245342
$$ packed form
1843b77355n9L1346l2500j1012M7315M2567k9489j27934K9294J35993m9910n0823
1831b92567M315q635L1486k7287L5054P820P489k5050K8519q620j8326J8158R188
1818b38456K1822j5512M43l464J4985M774o5223l6253M5945k0276J3581J6669
1806b60965J540j9507o66J5649j4510j9873L9866j0297m6781K1392N8527k3101
1794b58726k5105j0122M9147K614J2096L2352l6751j164j0754K3767m5847n7402
1782c25895J2649J8320l3492k654N7787L8356o2435r0462N9364M5291o724L02
1770b89593J05910n430m0834j8331n9997M455k6004l4851Q080M2515O6262N9744
1758a88074k5706K5480k6572r116l860k0494n738m8216J8988Q960l2899O1905
$$ plain form
1746 -245342 -207055 -203805 -164585 -114481 -169011 -260519 -222448 -253981 -247420 -204080 -193937 -134639
1734 -134639 -232570 -304684 -247281 -232276 -226129 -127782 -167984 -203853 -282645 -291595 -199301 -189443
1722 -189443 -178748 -148828 -217652 -245284 -289407 -301744 -274440 -237275 -265177 -248347 -198341 -230761
1710 -230761 -242751 -322007 -337567 -318429 -271360 -277208 -247126 -217800 -226215 -188767 -204653 -221741
1698 -221741 -209991 -218043 -240853 -275393 -299617 -254560 -162427 -158911 -172806 -162714 -160590 -192755
1686 -192755 -191391 -214479 -240506 -244126 -218619 -172931 -170144 -133339 -144770 -150980 -167162 -195933
1674 -195933 -211129 -174877 -202561 -267077 -297177 -301663 -255857 -246190 -207129 -235027 -227401 -309843
1662 -309843 -181049 -178558 -176638 -223800 -222747 -155648 -196801 -137442 -133883 -179594 -148056 -190851
$$ packed form
1746b45342L8287L250L9220N0104n4530r1508L8071l1533O561M3340J0143N9298
1734a34639r7931p2114N7403J5005O147R8347m0202l5869p8792q950R2294R858
1722a89443J0695K9920o8824k7632m4123j2337K7304L7165k7902J6830N0006l2420
1710b30761j1990p9256j5560J9138M7069n848L0082K9326q415L7448j5886j7088
1698b21741J1750q052k2810l4540k4224M5057R2133L516j3895J0092K124l2165
1686a92755J364k3088k6027l620K5507M5688K787L6805j1431o210j6182k8771
1674a95933j5196L6252k7684o4516l0100m486M5806R667L9061k7898P626q2442
1662c09843J28794K491J920m7162J053O7099m1153N9359L559m5711L1538m2795
$$ plain form
1650 -190851 -192228 -168222 -192979 -155954 -151339 -172528 -153968 -151698 -191006 -228371 -196062 -210032
1638 -210032 -159520 -113829 -116840 -115032 -155932 -135064 -124846 -183045 -175497 -164161 -166308 -140149
1626 -140149 -205627 -184676 -195970 -162736 -175351 -214147 -217319 -192121 -207940 -186470 -233683 -175343
1614 -175343 -173823 -150581 -100382 -109655 -151552 -182071 -196572 -213521 -173476 -145063 -142750 -138778
1602 -138778 -148258 -195589 -196890 -220034 -187844 -184565 -143501 -118985 -174936 -212360 -173027 -171713
1590 -171713 -212048 -158998 -199611 -166654 -196820 -238540 -262168 -245494 -146575 -111913 -83637 -85761
1578 -85761 -174178 -199269 -166385 -249684 -304501 -240007 -268847 -212216 -150571 -169684 -125244 -87250
1566 -87250 -88419 -157705 -136386 -121835 -54261 -116514 -127232 -142731 -147837 -167912 -206004 -223592
$$ packed form
1650a90851j377K4006k4757L7025M615k1189J8560K270l9308l7365L2309j3970
1638b10032N0512M5691l011J808m0900K0868J0218n8199P548J1336k147K6159
1626a40149o5478K0951j1294L3234j2615l8796l172K5198j5819K1470m7213N8340
1614a75343J520K3242N0199r273m1897l0519j4501j6949M0045K8413K313L972
1602a38778r480m7331j301k3144L2190L279M1064K4516n5951l7424L9333J314
1590a71713m0335N3050m0613L2957l0166m1720k3628J6674R8919L4662K8276k124
1578h5761q8417k5091L2884q3299n4817O4494k8840N6631O1645j9113M4440L7994
1566h7250j169o9286K1319J4551O7574o2253j0718j5499n106k0075l8092j7588
$$ plain form
1554 -223592 -208673 -188918 -203751 -139511 -140709 -141349 -170181 -193915 -147979 -150443 -153083 -72885 -124058
1541 -124058 -88683 -121116 -173886 -172748 -159860 -112916 -130728 -195767 -144182 -94137 -115723 -160383
1529 -160383 -130442 -95051 -135217 -187766 -92547 -123724 -117745 -125593 -144767 -158765 -140448 -135826
1517 -135826 -169201 -112938 -117452 -56027 -85907 -156105 -144755 -85679 -65574 -70929 -39625 -35951
1505 -35951 -60061 -72116 -66474 -28886 -77773 -125038 -132354 -140681 -179782 -186225 -245166 -227936 -171109
1492 -171109 -112836 -158885 -156361 -147096 -148655 -197121 -170626 -84199 -102719 -163288 -165785 -116423
1480 -116423 -170150 -173064 -132636 -189138 -159723 -133896 -118779 -138845 -107631 -90968 -145640 -118779
1468 -118779 -70934 -59021 -105097 -115551 -124130 -160597 -206733 -182909 -124083 -146757 -143591 -119733
$$ packed form
1554b23592J4919J9755j4833O4240j198o40k8832k3734M5936k464k640Q0198n1173
1541a24058L5375l2433n2770J138J2888M6944j7812o5039N1585N0045k1586m4660
1529a60383K9941L5391m0166n2549R5219l1177N979p848j9174j3998J8317M622
1517a35826l3375N6263m514O1425k9880p0198J1350N9076K0105n355L1304L674
1505c5951k4110j2055N642L7588m8887m7265p316q327l9101o443n8941J7230N6827
1492a71109N8273m6049K524R265j559m8466K6495Q6427j8520o0569k497M9362
1480a16423n3727k914M0428n6502K9415K5827J5117k0066L1214J6663n4672K6861
1468a18779M7845J1913m6076j0454q579l6467m6136K3824N8826k2674L166K3858
$$ plain form
1456 -119733 -119735 -155090 -130095 -143427 -106742 -76107 -56960 -71518 -41541 -103398 -96051 -55574 -81941
$$ packed form
1456a19733kl5355K4995j3332L6685L0635J9147j4558K9977o1857P347M0477k6367
$$ [...]
##END NTUPLES=NMR SPECTRUM
##END=
