##TITLE=1H_DE-80H_X3
 200.13MHz, d2o
 8 sc
 
 19ns.26.2.2025
##JCAMPDX= 6.0         $$ Bruker NMR JCAMP-DX V2.0
##DATA TYPE= NMR SPECTRUM
##DATA CLASS= NTUPLES
##ORIGIN= UXNMR, Bruker Analytische Messtechnik GmbH
##OWNER= pz
$$ XWIN-NMR		Version 3.5
$$ Thu Jun 26 11:07:10 2025 Russian Standard Time (UT+4h)  Yarkov@DPX200
##.OBSERVE FREQUENCY= 200.1313
##.OBSERVE NUCLEUS= ^1H
##.ACQUISITION MODE= SIMULTANEOUS
##.ACQUISITION SCHEME= undefined
##.AVERAGES= 8
##.DIGITISER RES= 18
##SPECTROMETER/DATA SYSTEM= spect
##.PULSE SEQUENCE= zg30
##.SOLVENT NAME= CDCl3
##.SHIFT REFERENCE= (INTERNAL, CDCl3, 0, 15.4891)
##AUDIT TRAIL= $$ (NUMBER, WHEN, WHO, WHERE, WHAT)
$$ ##TITLE= Audit trail, XWIN-NMR		Version 3.5
$$ ##JCAMPDX= 5.01
$$ ##ORIGIN= Bruker BioSpin GmbH
$$ ##OWNER= Yarkov
$$ C:/Bruker/XWIN-NMR/data/yarkov2/nmr/H-C/1/pdata/1/auditp.txt
$$ ##AUDIT TRAIL=  $$ (NUMBER, WHEN, WHO, WHERE, WHAT)
(   1,<2025-06-26 11:04:53.51 +0400>,<Yarkov>,<DPX200>,
      <created by zg, POWCHK disabled, PULCHK disabled
       configuration hash MD5:
       00 E9 B6 7A A2 85 ED C7 34 08 36 98 17 FE 4E 26
       data hash MD5: 16K
       F8 F8 15 C5 38 25 D6 B0 70 1E C8 7B 57 1E 2F E1>)
(   2,<2025-06-26 11:05:08.59 +0400>,<Yarkov>,<DPX200>,
      <Start of raw data processing
       efp BC_mod = 2 LB = 0.25 FT_mod = 6 PKNL = 1 PHC0 = -1718.752 PHC1 = 11.5666 SI = 16K 
       data hash MD5: 16K
       15 16 A7 AD FA 17 76 20 4C D8 47 9C 8D 72 68 B2>)
(   3,<2025-06-26 11:06:12.85 +0400>,<Yarkov>,<DPX200>,
      <abs ABSG = 5 
       data hash MD5: 16K
       EF 99 82 85 05 CA F4 86 F4 4A 1D E1 77 F1 23 42>)
(   4,<2025-06-26 11:06:17.48 +0400>,<Yarkov>,<DPX200>,
      <pk PHC0 = 10.28116 PHC1 = 1.6 
       data hash MD5: 16K
       C3 0F 86 25 E6 F9 DD 98 7C 66 C1 8A AF 9F 6B D9>)
(   5,<2025-06-26 11:06:33.29 +0400>,<Yarkov>,<DPX200>,
      <pk PHC0 = -9.173232 PHC1 = 9.400002 
       data hash MD5: 16K
       7B 58 16 A8 67 58 4D CE A2 7B 49 8F FF 78 21 02>)
(   6,<2025-06-26 11:06:36.18 +0400>,<Yarkov>,<DPX200>,
      <abs ABSG = 5 
       data hash MD5: 16K
       0F F1 97 2E A1 4D BB 29 7B 9D 0E 84 DD 50 9C 1C>)
$$ ##END=
$$ 
$$ hash MD5
$$ AA F9 4D 73 DA BD A6 3B 41 0A 59 0A 42 57 FB AC
##$RELAX= 
##$RELAX= 
##$RELAX= 
##$RELAX= 
##$RELAX= 
##$RELAX= 
$$ Bruker specific parameters
$$ --------------------------
##$DU= <C:/Bruker/XWIN-NMR>
##$EXPNO= 1
##$NAME= <H-C>
##$PROCNO= 1
##$TYPE= <nmr>
##$USER= <yarkov2>
##$AMP= (0..31)
100 100 100 100 100 100 100 100 100 100 100 100 100 100 100 100 100 100 
100 100 100 100 100 100 100 100 100 100 100 100 100 100 
##$AQSEQ= 0
##$AQ_mod= 1
##$AUNM= <au_zg>
##$AUTOPOS= <>
##$BF1= 200.13
##$BF2= 200.13
##$BF3= 200.13
##$BF4= 200.13
##$BF5= 200.13
##$BF6= 200.13
##$BF7= 200.13
##$BF8= 200.13
##$BYTORDA= 1
##$CFDGTYP= 0
##$CFRGTYP= 5
##$CHEMSTR= <none>
##$CNST= (0..31)
1 1 145 1 1 1 1 1 1 1 1 1 1 1 1 1 1 1 1 1 1 1 1 1 1 1 1 1 1 1 1 1 
##$CPDPRG= <>
##$CPDPRG1= <>
##$CPDPRG2= <>
##$CPDPRG3= <>
##$CPDPRG4= <mlev>
##$CPDPRG5= <mlev>
$$ [...]
##$SUBNAM3= <"">
##$SUBNAM4= <"">
##$SUBNAM5= <"">
##$SUBNAM6= <"">
##$SUBNAM7= <"">
##$SUBNAM8= <"">
##$SUBNAM9= <"">
##$SW= 18.0517328524113
##$SWIBOX= (0..15)
0 0 2 0 0 0 0 0 0 0 0 0 0 0 0 0 
##$SW_h= 3612.71676300578
##$TD= 16384
##$TD0= 1
##$TE= 0
##$TE2= 300
##$TE3= 300
##$TEG= 300
##$TL= (0..7)
0 120 120 120 120 120 120 120 
##$TP= (0..7)
150 150 150 150 150 150 150 150 
##$TP07= 0
##$TPNAME0= <>
##$TPNAME1= <>
##$TPNAME2= <>
##$TPNAME3= <>
##$TPNAME4= <>
##$TPNAME5= <>
##$TPNAME6= <>
##$TPNAME7= <>
##$TPOAL= (0..7)
0.5 0.5 0.5 0.5 0.5 0.5 0.5 0.5 
##$TPOFFS= (0..7)
0 0 0 0 0 0 0 0 
##$TUNHIN= 0
##$TUNHOUT= 0
##$TUNXOUT= 0
##$USERA1= <user>
##$USERA2= <user>
##$USERA3= <user>
##$USERA4= <user>
##$USERA5= <user>
##$V9= 5
##$VALIST= <valist>
##$VCLIST= <CCCCCCCCCCCCCCC>
##$VD= 0
##$VDLIST= <DDDDDDDDDDDDDDD>
##$VPLIST= <PPPPPPPPPPPPPPP>
##$VTLIST= <TTTTTTTTTTTTTTT>
##$WBST= 1024
##$WBSW= 4
##$XGAIN= (0..3)
0 0 0 0 
##$XL= 0
##$YL= 0
##$YMAX_a= 108905
##$YMIN_a= -108954
##$ZGOPTNS= <>
##$ZL1= 120
##$ZL2= 120
##$ZL3= 120
##$ZL4= 120
##$ABSF1= 15.51551
##$ABSF2= -2.53634
##$ABSG= 5
##$ABSL= 3
##$ALPHA= 0
##$AQORDER= 0
##$ASSFAC= 0
##$ASSFACI= 0
##$ASSFACX= 0
##$ASSWID= 0
##$AUNMP= <proc_1d>
##$AZFE= 0.1
##$AZFW= 0.1
##$BCFW= 0
##$BC_mod= 2
##$BYTORDP= 0
##$COROFFS= 0
##$CY= -3
##$DATMOD= 1
##$DC= 0
##$DFILT= <>
##$DTYPP= 0
##$F1P= 0
##$F2P= 0
##$FCOR= 1
##$FTSIZE= 16384
##$FT_mod= 6
##$GAMMA= 0
##$GB= 0
##$INTBC= 1
##$INTSCL= 3.241238e-09
##$ISEN= 128
##$LB= 0.25
##$LEV0= 0
##$LPBIN= 0
##$MAXI= 10000
##$MC2= 0
##$MEAN= 0
##$ME_mod= 0
##$MI= 1.114404
##$NCOEF= 0
##$NC_proc= -10
##$NLEV= 6
##$NOISF1= 3.799351
##$NOISF2= 2.8
##$NSP= 0
##$NTH_PI= 0
##$NZP= 0
##$OFFSET= 15.48907
##$PC= 1
##$PHC0= -1717.644
##$PHC1= 22.5666
##$PH_mod= 1
##$PKNL= yes
##$PPARMOD= 0
##$PSCAL= 0
##$PSIGN= 0
##$REVERSE= no
##$SF= 200.130006530785
##$SI= 16384
##$SIGF1= 3
##$SIGF2= 2
##$SINO= 0.751879
##$SIOLD= 32768
##$SREGLST= <19F.Aceton>
##$SSB= 0
##$STSI= 16384
##$STSR= 0
##$SW_p= 3612.71676300578
##$SYMM= 0
##$S_DEV= 0
##$TDeff= 16384
##$TDoff= 0
##$TI= <>
##$TILT= no
##$TM1= 0
##$TM2= 0
##$TOPLEV= 0
##$USERP1= <user>
##$USERP2= <user>
##$USERP3= <user>
##$USERP4= <user>
##$USERP5= <user>
##$WDW= 1
##$XDIM= 16384
##$YMAX_p= 527096969
##$YMIN_p= -3074501
$$ End of Bruker specific parameters
$$ ---------------------------------
##NTUPLES= NMR SPECTRUM
##VAR_NAME=  FREQUENCY,     SPECTRUM/REAL,   SPECTRUM/IMAG
##SYMBOL=    X,             R,               I
##VAR_TYPE=  INDEPENDENT,   DEPENDENT,       DEPENDENT
##VAR_FORM=  AFFN,          ASDF,            ASDF
##VAR_DIM=   16384,         16384,           16384
##UNITS=     HZ,            ARBITRARY UNITS, ARBITRARY UNITS
##FACTOR=    0.220516191357247, 1,           1
##FIRST=     3099.82766797975, 0,            0
##LAST=      -512.889095026035, 0,           0
##MIN=       -512.889095026035, -3074501,    0
##MAX=       3099.82766797975, 527096969,    0
$$ Real data points
##PAGE= N=1
##DATA TABLE= (X++(R..R)), XYDATA
$$ [...]
$$ plain form
7663 7193433 7330934 7658685 7968463 7852608 6825165 7234469 7730108 7637667 7663501 7532878
7653 7532878 7334880 6649009 6472444 6611107 6513901 6417286 5687927 5636598 5448922 5412286
7643 5412286 5446275 5116778 5053237 5209871 5129344 5091499 4605642 4454958 4618959 3944802
7633 3944802 3714301 3354291 3364906 3113092 3127852 2566683 2626520 2496846 1546984 1596776
7623 1596776 2107784 2186466 1918278 2282636 2021937 1876655 1298927 524541 437905 571965
7613 571965 1318149 1763484 1140316 898870 645048 1130480 1131773 713372 812167 1023988
7603 1023988 1357765 737990 -46330 64424 761405 917545 645764 792752 643087 810370
7593 810370 644424 317312 -151655 -236542 -292178 -88301 83816 201762 -86562 180629
$$ packed form
7663G193433J37501L27751L09778j15855j027443M09304M95639r2441K5834j30623
7653G532878j97998o85871j76565J38663r7206r6615p29359n1329j87676l6636
7643E412286L3989l29497o3541J56634q0527l7845m85857j50684J64001o74157
7633C944802k30501l60010J0615k51814J4760n61169N9837j29674r49862M9792
7623A596776N11008P8682k68188L64358k60699j45282n77728p74386q6636J34060
7613E71965P46184M45335o23168k41446k53822M85432J293m18401R8795K11821
7603A023988L33777o19775p84320J10754O96981J56140k71781J46988j49665J67283
7593H10370j65946l27112m68967q4887n5636K03877J72117J17946k88324K67191
$$ plain form
7583 180629 334964 707641 461867 27662 -207290 -573547 200650 -181054 -328961 3986
7573 3986 -194925 96271 -43747 6029 1041377 777675 600942 94356 -78669 149409
7563 149409 -225111 -58289 -513721 -218067 81273 102797 -187066 -321310 112691 200141
7553 200141 264993 -50826 82580 -31205 -660994 -309836 -142266 -454149 -483223 -496048
7543 -496048 -171625 -169462 -427850 -309050 -93533 358351 497455 381172 462219 286309
7533 286309 157549 -46310 -204200 -281126 -324625 -662572 -665604 -301683 -157152 416112
7523 416112 571574 458470 -233770 -15232 621357 189634 -390609 -203186 -158128 -52784
7513 -52784 -405293 -429464 -131563 -144751 -458719 -902551 -1090262 -627897 -274003 -56033
$$ packed form
7583A80629J54335L72677k45774m34205k34952l66257P74197l81704j47907L32947
7573C986j98911K91196j40018M9776J035348k63702j76733n06586j73025K28078
7563A49409l74520J66822m55432K95654K99340K1524k89863j34244M34001Q7450
7553B00141O4852l15819J33406j13785o29789L51158J67570l11883k9074j2825
7543d96048L24423K163k58388J18800K15517M51884J39104j16283Q1047j75910
7533B86309j28760k03859j57890p6926m3499l37947l032L63921J44531N73264
7523D16112J55462j13104o92240K18538O36589m31723n80243J87423M5058J05344
7513e2784l52509k4171K97901j3188l13968m43832j87711M62365L53894K17970
$$ plain form
7503 -56033 -21315 -371669 -44151 98151 72858 -85296 -368669 -218357 -361356 -747070
7493 -747070 -798433 -697308 364810 34090 -33379 -362747 -521366 -1227407 -693939 -54202
7483 -54202 -262295 -747576 -702446 -830252 -983054 -966617 -614835 -469981 -627419 -1116488
7473 -1116488 -1094533 -379829 -187549 -360239 -397816 -665248 -710764 -490382 -454085 -268577
7463 -268577 293106 204470 -508692 -717191 -947504 -1276045 -1140578 -964970 -1065374 -805952
7453 -805952 -967385 -595815 -605823 -1092505 -621050 -573824 -531049 -752231 -564423 -405871
7443 -405871 -760431 -725142 -1141275 -951646 -219749 -919044 -1087980 -591593 -159387 -428952
7433 -428952 -93807 -23688 -664415 -1050472 -629397 -411563 -759607 -193044 -473318 -727655
$$ packed form
7503e6033L4718l50354L27518J42302k5293j58154k83373J50312j42999l85714
7493g47070n1363J01125J062118l30720o7469l29368j58619p06041N33468O39737
7483e4202k08093m85281M5130j27806j52802J6437L51782J44854j57438m89069
7473a116488K1955P14704J92280j72690l7577k67432m5516K20382L6297J85508
7463b68577N61683q8636p13162k08499k30313l28541J35467J75608j00404K59422
7453h05952j61433L71570j0008m86682M71455M7226M2775k21182J87808J58552
7443d05871l54560L5289m16133J89629P31897o99295j68936M96387M32206k69565
7433d28952L35145P0119o40727l86057M21075K17834l48044N66563k80274k54337
$$ plain form
7423 -727655 -274410 59411 196898 -613768 -875836 -1004037 -1017325 -750970 -927314 -961677
7413 -961677 -1448539 -1845733 -1276538 -349893 -600224 -917758 -850225 -257236 -455469 -613400
7403 -613400 -659944 -746301 -903560 -972344 -697970 -605717 -861651 -318391 -1168627 -788219
7393 -788219 -484661 -659878 -816999 -627644 -630876 -624819 -946455 -537359 -693754 -1078610
7383 -1078610 -1691549 -897491 -782556 -870368 -831687 -1092757 -1223023 -977988 -612489 -845966
7373 -845966 -836077 -636810 -515941 -804992 -1377321 -1488945 -1485074 -1467756 -1692429 -1701147 -1685897
7362 -1685897 -1434964 -866381 -873107 -1365995 -1873191 -1182306 -1166832 -1373590 -1380162 -1744258
7352 -1744258 -1668542 -1558093 -1458434 -1544323 -1561456 -1128074 -1151952 -964470 -863843 -1158637
$$ packed form
7423g27655M53245L33821J37487q10666k62068j28201j3288K66355j76344l4363
7413i61677m86862l97194N69195R26645k50331l17534O7533N92989j98233j57931
7403f13400m6544q6357j57259o8784K74374R2253k55934N43260q50236L80408
7393g88219L03558j75217j57121J89355l232O057l21636M09096j56395l84856
7383a078610o12939P94058J14935q7812L8681k61070j30266K45035L65499k33477
7373h45966R889J99267J20869k89051n72329j11624L871J7318k24673q718J5250
7362a685897K50933N68583o726m92888n07196O90885J5474k06758o572l64096
7352a744258P5716J10449R9659q5889j7133M33382k3878J87482J00627k94794
$$ plain form
7342 -1158637 -1471176 -1540892 -1611032 -1364625 -1093067 -771580 -1204461 -1130447 -1468438 -1083026
7332 -1083026 -1367718 -1854693 -1844268 -1459014 -1356992 -1271545 -1175899 -1344323 -1094360 -918504
7322 -918504 -1464456 -1536001 -1566427 -1511597 -1875977 -1603431 -1344812 -1498460 -1240777 -1571155
7312 -1571155 -1843452 -1743989 -1135118 -1608271 -1893143 -1599326 -1743044 -1650863 -1969688 -2024639
7302 -2024639 -1979269 -1330742 -1185251 -1294248 -1293619 -1823890 -2185653 -1675990 -1290451 -1257521
7292 -1257521 -1718180 -1628303 -1625613 -1469767 -1010409 -739913 -656462 -722810 -1568236 -1398832
7282 -1398832 -1202263 -913777 -545494 -1496665 -1021739 -481325 -396757 -1389178 -1919475 -1809830
7272 -1809830 -1599620 -1025129 -1762719 -1960637 -1128547 -782808 -1337388 -1456517 -1479602 -1704295
$$ packed form
7342a158637l12539o9716p0140K46407K71558L21487m32881P4014l37991L85412
7332a083026k84692m86975J0425L85254J02022Q5447R5646j68424K49963J75856
7322i18504n45952p1545l0426N4830l64380K72546K58619j53648K57683l30378
7312a571155k72297R9463O08871m73153k84872K93817j43718R2181l18825n4951
7302b024639M5370O48527J45491j08997O29n30271l61763N09663L85539L2930
7292a257521m60659Q9877K690J55846M59358K70496Q3451o6348q45426J69404
7282a398832J96569K88486L68283r51171M74926N40414Q4568r92421n30297J09645
7272a809830K10210N74491p37590j97918Q32090L45739n54580j19129k3085k24693
$$ plain form
7262 -1704295 -1933714 -1960913 -1496532 -1021127 -1330494 -1745511 -1225048 -588495 -1155031 -1173520
7252 -1173520 -887921 -1155554 -1409114 -1642137 -1205217 -1213193 -1291302 -1191221 -1146875 -1171259
7242 -1171259 -1300946 -1423413 -1218014 -1380523 -1401442 -1110975 -1377804 -1837396 -1309574 -1063435
7232 -1063435 -1172244 -984806 -1498632 -1817641 -1743597 -1660172 -1487022 -1613782 -1914691 -1901973
7222 -1901973 -1090798 -1021627 -1486478 -1373932 -849550 -785532 -883378 -1062748 -1352025 -1485693
7212 -1485693 -1659023 -1979441 -2123043 -2189668 -1645054 -1823890 -1912098 -1729772 -1651605 -1561893
7202 -1561893 -1463751 -1403244 -1632687 -2105582 -1919868 -1992522 -2167738 -2218504 -1672339 -1599948
7192 -1599948 -1933334 -1857626 -1925181 -2109505 -2077911 -1911465 -1594858 -1388240 -1457535 -2122406
$$ packed form
7262a704295k29419k7199M64381M75405l09367m15017N20463O36553n66536j8489
7252a173520K85599k67633k53560k33023M36920p976p8109J00081M4346k4384
7242a171259j29687j22467K05399j62509k0919K90467k66829m59592N27822K46139
7232a063435j08809J87438n13826l19009P4044Q3425J73150j26760l00909J2718
7222a901973Q11175O9171m64851J12546N24382O4018r7846j79370k89277j33668
7212a485693j73330l20418j43602o6625N44614j78836q8208J82326P8167Q9712
7202a561893R8142O0507k29443m72895J85714p2654j75216n0766N46165P2391
7192a599948l33386P5708o7555j84324L1594J66446L16607K06618o9295o64871
$$ plain form
7182 -2122406 -1968424 -1790536 -1793296 -1306096 -1982056 -2271930 -2543944 -2062701 -2089691 -2285360
7172 -2285360 -1942860 -2135306 -2006466 -1678856 -1553187 -2638519 -2575285 -1706044 -1357130 -1936778
7162 -1936778 -2431944 -2230339 -2021992 -2141259 -2289896 -2315944 -2272452 -2383268 -2376336 -2297263
7152 -2297263 -2067497 -1972549 -2076350 -2061157 -1832513 -1698279 -1920954 -1752691 -1729589 -1663625
7142 -1663625 -1788680 -1755746 -2071449 -2001486 -2398886 -2373878 -2123627 -2476689 -2511548 -2809747
7132 -2809747 -2774851 -2993716 -2346009 -2276465 -2403555 -2325117 -2357371 -2428192 -2408787 -1953510 -1880598
7121 -1880598 -1983178 -2095796 -1708099 -2032201 -1486177 -1524493 -1858543 -2178077 -2366220 -2439612
7111 -2439612 -2534357 -2123543 -1696630 -2084208 -2181781 -2210345 -2648701 -2418066 -2288905 -2336698
$$ packed form
7182b122406J53982J77888k760M87200o75960k89874k72014M81243k6990j95669
7172b285360L42500j92446J28840L27610J25669j085332O3234Q69241L48914n79648
7162a936778m95166K01605K08347j19267j48637k6048M3492j10816O932P9073
7152b297263K29766R4948j03801J5193K28644J34234k22675J68263K3102O5964
7142a663625j25055L2934l15703O9963l97400K5008K50251l53062l4859k98199
7132b809747L4896k18865O47707O9544j27090P8438l2254p0821J9405M55277P2912
7121a880598j02580j12618L87697l24102N46024l8316l34050l19534j88143p3392
7111b439612r4745M10814M26913l87578r7573k8564m38356K30635J29161m7793
$$ plain form
7101 -2336698 -2441894 -2469326 -2094791 -1486951 -2373994 -3074501 -2160753 -2369886 -2505156 -2321682
7091 -2321682 -2474785 -2757083 -3020326 -2847936 -2734033 -2796912 -2581911 -2735665 -2334001 -2186783
7081 -2186783 -2039283 -2419706 -2677677 -2447526 -2060663 -2189045 -2096389 -2369731 -2146058 -1751680
7071 -1751680 -2010362 -2185294 -1913311 -1326714 -1668478 -2068290 -2258123 -2730209 -2591563 -2063828
7061 -2063828 -1982008 -2187730 -1546905 -175956 -1016543 -1788019 -1910350 -1642337 -1944523 -2132576
7051 -2132576 -2227810 -2223242 -1905588 -1905448 -1685070 -1815375 -2215084 -2338008 -2479815 -2560945 -2769317
7040 -2769317 -2415072 -2320367 -1960660 -1707358 -1670333 -1825622 -2128240 -1564140 -1582895 -2095262
7030 -2095262 -2115079 -1668746 -1677412 -1880685 -2041761 -2113457 -1956031 -2076037 -1890420 -1829773
$$ packed form
7101b336698j05196k7432L74535O07840q87043p00507R13748k09133j35270J83474
7091b321682j53103k82298k63243J72390J13903o2879K15001j53754M01664J47218
7081b186783J47500l80423k57971K30151L86863j28382R2656k73342K23673L94378
7071a751680k58682j74932K71983N86597l41764l99812j89833m72086J38646N27735
7061b063828Q1820k05722O40825J370949q40587p71476j22331K68013l02186j88053
7051b132576r5234M568L17654J40K20378j30305l99709j22924j41807q1130k08372
7040b769317L54245R4705L59707K53302L7025j55289l02618N64100j8755n12367
7030b095262j9817M46333q666k03273j61076p1696J57426j20006J85617O0647
$$ plain form
7020 -1829773 -1750908 -1378951 -1328829 -1565188 -1689981 -1643110 -1782228 -1468885 -1258738 -2123727
7010 -2123727 -2007873 -1567951 -1541645 -1719507 -1895516 -1702078 -1933622 -2270509 -2160329 -2049121
7000 -2049121 -1634463 -1441713 -2055714 -2159203 -2121428 -1872732 -2094881 -1863818 -1517277 -1766451
6990 -1766451 -1998277 -2156503 -2061207 -1980621 -1958599 -2457940 -2627207 -2659079 -2314307 -1713365
6980 -1713365 -1601579 -2044452 -2619740 -2634064 -2533398 -1857111 -2257309 -2177362 -1568640 -2057166
6970 -2057166 -2160544 -1558788 -1927608 -1850211 -1924177 -2187365 -1727979 -2022720 -2254695 -2385301
6960 -2385301 -2212408 -1776960 -1588405 -1789122 -1800025 -2181182 -1735042 -1443844 -1487469 -1561255
6950 -1561255 -2206156 -1851873 -1766157 -2071676 -2033979 -2258441 -2225651 -2118248 -2037487 -2265779
$$ packed form
7020a829773P8865L71957N0122k36359j24793M6871j39118L13343K10147q64989
7010b123727J15854M39922K6306j77862j76009J93438k31544l36887J10180J11208
7000b049121M14658J92750o14001j03489L7775K48696k22149K31063L46541k49174
6990a766451k31826j58226R5296Q0586K2022m99341j69267l1872L44772O00942
6980a713365J11786m42873n75288j4324J00666O76287m00198P9947O08722m88526
6970b057166j03378O01756l68820P7397p3966k63188M59386k94741k31975j30606
6960b385301J72893M35448J88555k00717j0903l81157M46140K91198m3625p3786
6950a561255o44901L54283Q5716l05519L7697k24462L2790J07403Q0761k28292
$$ plain form
6940 -2265779 -1502526 -1319195 -1503989 -1601422 -1711258 -1603783 -1625133 -2068262 -2539463 -2284458
6930 -2284458 -1916511 -1832392 -1624971 -1954733 -2317847 -2444553 -2248295 -1724806 -1847296 -2303030
6920 -2303030 -2157097 -2556684 -2056222 -975755 -1051109 -1560335 -2180315 -2269345 -1905182 -1563590
6910 -1563590 -1652366 -1740493 -2106250 -1592890 -1084645 -1819410 -1841214 -1821943 -2009726 -1879381
6900 -1879381 -1483047 -1434372 -2379311 -2510780 -1811876 -2218657 -2551247 -1952747 -1883793 -2111301
6890 -2111301 -1764026 -1979066 -2225926 -1882859 -1813975 -1996158 -2031514 -1991572 -2157116 -2202178
6880 -2202178 -2192214 -1836746 -2095899 -2203613 -1541803 -1270287 -1520544 -2074104 -2067395 -2156762
6870 -2156762 -2382335 -1931413 -1981819 -1795365 -2054068 -1843758 -1980599 -1757928 -1205610 -937775
$$ packed form
6940b265779P63253J83331j84794r7433j09836J07475k1350m43129m71201K55005
6930b284458L67947Q4119K07421l29762l63114j26706J96258N23489j22490m55734
6920b303030J45933l99587N00462J080467p5354n09226o19980q9030L64163L41592
6910a563590q8776q8127l65757N13360N08245p34765k1804J9271j87783J30345
6900a879381L96334M8675r44939j31469O98904m06781l32590N98500O8954k27508
6890b111301L47275k15040k46860L43067O8884j82183l5356L9942j65544m5062
6880b202178R964L55468k59153j07714O61810K71516k50257n53560O709q9367
6870b156762k25573M50922n0406J86454k58703K10310j36841K22671N52318K67835
$$ plain form
6860 -937775 -1159334 -1383398 -1459844 -1866824 -1691543 -1724718 -2131858 -1869000 -1759684 -1728918
6850 -1728918 -1890498 -1636977 -1947220 -2139105 -2259140 -2222579 -1435163 -884300 -770680 -1386323
6840 -1386323 -1847402 -1964658 -1833215 -1572953 -1517556 -1218386 -1654663 -1489793 -2023234 -1667076
6830 -1667076 -1613298 -1858423 -1768004 -2093599 -2169155 -1805977 -1984842 -1536305 -1267371 -1647188
6820 -1647188 -2065065 -2102126 -1770194 -1731714 -1314317 -1115485 -1003119 -1547345 -1752112 -1949259
6810 -1949259 -1739334 -2257890 -1325664 -1388844 -1127265 -1422798 -1216808 -1331552 -1322700 -1717302
6800 -1717302 -2095175 -1530234 -1250472 -1166298 -927405 -763163 -1018681 -1149118 -1581663 -1620902
6790 -1620902 -1800168 -1654943 -1115647 -1315151 -913998 -830228 -867123 -645819 -1599660 -1309979
$$ packed form
6860i37775k21559k24064p6446m06980J75281l3175m07140K62858J09316L0766
6850a728918j61580K53521l10243j91885j20035L6561P87416N50863J13620o15643
6840a386323m61079j17256J31443K60262N5397K99170m36277J64870n33441L56158
6830a667076N3778k45125R0419l25595p5556L63178j78865M48537K68934l79817
6820a647188m17877l7061L31932L8480M17397J98832J12366n44226k04767j97147
6810a949259K09925n18556R32226o3180K61579k95533K05990j14744Q852l94602
6800a717302l77873N64941K79762Q4174K38893J64242k55518j30437m32545l9239
6790a620902j79266J45225N39296j99504M01153Q3770l6895K21304r53841K89681
$$ plain form
6780 -1309979 -971577 -1045782 -1348035 -1739482 -1716145 -1387972 -916332 -1169564 -1320289 -1230380
6770 -1230380 -879700 -622876 -842897 -1227098 -1174059 -1225417 -1229761 -850896 -1046181 -1038477 -863185
6759 -863185 -1053613 -1043077 -1183385 -1431175 -1355142 -1531168 -1350262 -1302945 -1129106 -1291766
6749 -1291766 -1201292 -983838 -1208896 -674311 -839698 -799108 -632167 -649030 -1308697 -1268306
6739 -1268306 -1357954 -1725029 -1134038 -875399 -854179 -926117 -764303 -1002742 -768593 -855033
6729 -855033 -960736 -1109939 -1495754 -1337525 -1307820 -1235907 -1030548 -602728 -457140 -1117771
6719 -1117771 -891752 -800975 -799318 -1155224 -1210958 -567379 -269820 -197124 44669 -243322
6709 -243322 -687212 -1244757 -1254091 -1097009 -1118867 -719905 -789741 -456587 -222740 -539996
$$ packed form
6780a309979L38402p4205l02253l91447K3337L28173M71640k53232j50725Q9909
6770a230380L50680K56824k20021l84201N3039n1358m344L78865j95285P704J75292
6759h63185j90428J0536j40308k47790P6033j76026J80906M7317J73839j62660
6749a291766R0474K17454k25058N34585j65387M0590J66941j6863o59667M0391
6739a268306q9648l67075N90991K58639K1220p1938J61814k38439K34149q6440
6729h55033j05703j49203l85815J58229K9705P1913K05359M27820J45588o60631
6719a117771K26019R0777J657l55906n5734O43579K97559P2696K41793k87991
6709b43322m43890n57545r334J57082k1858L98962o9836L33154K33847l17256
$$ plain form
6699 -539996 -1017706 -696331 -656021 -1045137 -379317 -27369 102557 111592 -94469 228979
6689 228979 261112 -302794 -967712 -1029068 -456700 -513140 -1162604 -862233 -633240 -733110
6679 -733110 -735293 -1250687 -1413409 -646072 -520523 -459474 -297670 -424176 -702643 -535419
6669 -535419 -875904 -1148702 -796189 -580839 -191070 -392324 -470649 -471490 -508971 -147412 -21874
6658 -21874 -178271 57525 383831 68067 -458557 -326414 -176897 -152114 -518703 -685449
6648 -685449 -80894 -72838 -71151 57682 93471 130201 -220734 -307306 -276332 -272047 -157642
6637 -157642 -321448 -115980 364625 -139299 172704 198660 23585 268273 394375 170682
6627 170682 205271 684938 664204 267307 445973 718089 543998 96107 426150 628099
$$ packed form
6699e39996m77710L21375M0310l89116O65820L51948J29926R035k06061L23448
6689B28979L2133n63906o64918o1356N72368n6440o49464L00371K28993r9870
6679g33110k183n15394j62722P67337J25549O1049J61804j26506k78467J67224
6669e35419l40485k72798L52513K15350L89769k01254p8325q41l7481L61559J25538
6658b1874j56397K35796L26306l15764n26624J32143J49517K4783l66589j66746
6648f85449O04555Q056J687J28833L5789L6730l50935q6572L0974M285J14405
6637a57642j63806K05468M80605n03924L12003K5956j75075K44688J26102k23693
6627A70682L4589M79667k0734l96897J78666K72116j74091m47891L30043K01949
$$ plain form
6617 628099 570557 745099 796642 938301 1208717 1029728 823435 1118842 785957 421268
6607 421268 728810 968072 996473 1393778 1088960 1027128 880147 863651 766613 1435906
6597 1435906 1721381 1273492 1077417 1525516 672200 349294 394269 392387 676012 779439
6587 779439 1021871 967217 985880 600538 565225 624813 448518 730353 889358 686534
6577 686534 713623 640413 468019 600409 863732 859904 828990 859450 898034 1123626 1485168
6566 1485168 639721 593198 698867 338930 208886 -19399 29310 345725 133241 636480
6556 636480 231840 301104 461918 428293 753555 890361 835842 -270159 309727 1092698
6546 1092698 828957 352057 640409 1087946 1071070 806949 449686 530290 1025204 767565
$$ packed form
6617F28099n7542J74542N1543J41659K70416j78989k06293K95407l32885l64689
6607D21268L07542K39262K8401L97305l04818o1832j46981j6496r7038O69293
6597A435906K85475m47889j96075M48099q53316l22906M4975j882K83625J03427
6587G79439K42432n4654J8663l85342l5313N9588j76295K81835J59005k02824
6577F86534K7089p3210j72394J32390K63323l828l0914L0460L8584K25592L61542
6566A485168q45447m6523J05669l59937j30044k28285M8709L16415k12484N03239
6556F36480m04640O9264J60814l3625L25262J36806n4519j106001N79886P82971
6546A092698k63741m76900K88352M47537j6876k64121l57263Q0604M94914k57639
$$ plain form
6536 767565 308734 637597 1198165 1047816 926792 490611 178815 640997 664022 707601
6526 707601 491446 641540 696861 695839 680410 870477 761745 375683 518620 673872
6516 673872 636464 643902 267179 229473 396790 856083 838902 1076056 399373 578877 1060543
6505 1060543 515927 621390 360959 665793 889207 553369 334627 74391 399674 883746
6495 883746 760541 915779 897541 680462 306232 -31336 314228 812977 398527 809293
6485 809293 870912 1107498 658351 311741 760983 994529 1109705 916482 812079 761149
6475 761149 74731 395699 265866 273528 1060124 446976 -63502 75555 520579 685659
6465 685659 525427 429080 293047 749823 771100 573246 462075 470319 344865 435540 802926
$$ packed form
6536G67565m58831L28863N60568j50349j21024m36181l11796M62182K3025M3579
6526G07601k16155J50094N5321j022j5429J90067j08732l86062J42937J55252
6516F73872l7408P438l76723l7706J67317M59293j7181K37154o76683J79504M81666
6505A060543n44616J05463k60431L04834K23414l35838k18742k60236L25283M84072
6495H83746j23205J55238j8238k17079l74230l37568L45564M98749m14450M10766
6485H09293O1619K36586m49147l46610M49242K33546J15176j93223j04403n0930
6475G61149o86418L20968j29833P662P86596o13148n10478J39057M45024J65080
6465F85659j60232r6347j36033M56776K1277j97854j11171Q244j25454R0675L67386
$$ plain form
6454 802926 732246 675229 616537 928823 441973 809700 696933 327437 291182 332314 1073167
6443 1073167 938068 765971 899466 879376 696117 1072620 687148 535945 538375 786103
6433 786103 1274136 924523 506997 637339 1265613 1364648 778836 1017143 1305109 880200
6423 880200 893031 1061914 1208304 1461658 1243059 969761 1218965 909745 1042765 1112853
6413 1112853 1179487 920278 785593 974036 1018460 871276 624426 904254 734582 687073
6403 687073 457799 1054041 1243249 1397884 1122872 578201 1239517 1027769 1125161 903736
6393 903736 328891 414059 344028 867926 1223806 1180817 925733 710613 1040830 909719
6383 909719 1296275 1249945 1344291 1035515 855190 1087482 1484817 832241 915626 954326
$$ packed form
6454H02926p0680n7017n8692L12286m86850L67727j12767l69496l6255M1132P40853
6443A073167j35099j72097J33495k0090j83259L76503l85472j51203K430K47728
6433G86103M88033l49613m17526J30342O28274R9035n85812K38307K87966m24909
6423H80200J2831J68883J46390K53354k18599k73298K49204l09220J33020P0088
6413A112853O6634k59209j34685J88443M4424j47184k46850K79828j69672m7509
6403F87073k29274N96242J89208J54635k75012n44671O61316k11748R7392k21425
6393I03736n74845Q5168p0031N23898L55880m2989k55084k15120L30217j31111
6383I09719L86556m6330R4346l08776j80325K32292L97335o52576Q3385L8700
$$ plain form
6373 954326 1250264 1332490 1312088 1602663 1464168 1501682 1550973 2023781 2240290 2090790
6363 2090790 1457051 1367519 1203477 1343482 722147 1024584 1877210 1746882 1238037 1096022
6353 1096022 1565015 1424898 1688358 1182272 1109479 1764409 1870257 1662111 1275139 974924
6343 974924 744070 1044001 1321989 1392203 1168521 1469733 1837705 2009414 1977703 1781886
6333 1781886 1658151 1323257 1667972 1457947 1935421 1749099 1070631 1633504 1822413 1866439
6323 1866439 1963003 2000531 2245186 2675240 2758025 2638280 2320416 2055306 2250095 1848704
6313 1848704 2248950 2642886 2173249 1890144 1930736 2296961 1826899 1826729 2204494 2647757
6303 2647757 2577898 2409144 2716410 2456789 2436737 2770655 2556431 2194481 2446076 2887717
$$ packed form
6373I54326K95938Q2226k0402K90575j38495L7514M9291M72808K16509j49500
6363B090790o33739q9532j64042J40005o21335L02437Q52626j30328n08845j42015
6353A096022M68993j40117K63460n06086p2793O54930J05848k08146l86972l00215
6343I74924k30854K99931K77988P0214k23682L01212L67972J71709l1711j95817
6333A781886j23735l34894L44715k10025M77474j86322o78468N62873J88909M4026
6323A866439R6564L7528K44655M30054Q2785j19745l17864k65110J94789m01391
6313A848704M00246L93936m69637k83105M0592L66225m70062j70L77765M43263
6303B647757o9859j68754L07266k59621k0052L33918k14224l61950K51595M41641
$$ plain form
6293 2887717 2423584 2359285 2940751 2938705 2886072 3069475 2891163 3002243 2731813 2590218
6283 2590218 3067952 2979365 3388930 3424739 3496715 3271422 2627223 3671057 3658023 2989052
6273 2989052 2629396 3519028 3640900 3436756 3206252 3302133 3491703 3493001 3501797 3750900
6263 3750900 3382728 3209164 3140820 3722848 3948375 3708644 3830425 3965084 3624912 3575449
6253 3575449 3214642 3007932 3655170 3246093 3263804 2891609 2532416 3001731 3338942 3631453
6243 3631453 3911532 3605687 3665554 3674287 4047936 3901679 4187782 3773180 3586365 3866641
6233 3866641 3714531 3669087 3678220 3670853 3980738 3875541 3843268 4131329 4474259 4307568 4071996
6222 4071996 4006343 3854770 3920693 4007092 4139722 4254927 4689154 4412338 4915766 5210995
$$ packed form
6293B887717m64133o4299N81466k046n2633J83403j78312J11080k70430j41595
6283B590218M77734q8587M09565L5809P1976k25293o44199J043834j3034o68971
6273B989052l59656Q89632J21872k04144k30504R5881J89570J298Q796K49103
6263C750900l68172j73564o8344N82028K25527k39731J21781J34659l40172m9463
6253C575449l60807k06710O47238m09077J7711l72195l59193M69315L37211K92511
6243C631453K80079l05845N9867Q733L73649j46257K86103m14602j86815K80276
6233C866641j52110m5444R133p367L09885j05197l2273K88061L42930j66691k35572
6222D071996o5653j51573O5923Q6399J32630J15205M34227k76816N03428K95229
$$ plain form
6212 5210995 4389754 3694433 3822658 4147693 3771017 4222667 4207694 4323462 4613647 4224632
6202 4224632 3908096 4256147 4588638 4927586 4964774 5168549 5570909 4757505 4261243 4239730
6192 4239730 4725460 4751998 4255565 4561212 5224644 4852868 4678067 5024193 4397051 5108301
6182 5108301 5579465 5064415 5373351 5445852 5509565 5754684 5590954 5284932 5236155 5157352
6172 5157352 5444877 5326718 5282978 5684170 6285615 6443213 6093948 6533922 6147804 5820840
6162 5820840 5561473 5734246 5104743 4962722 5703718 5731796 5790426 5757455 5752927 5920014
6152 5920014 6366183 6434466 6127761 6258542 6142431 5955854 5889978 5775494 5645873 6174750
6142 6174750 6247533 5984206 6574616 7107460 7202448 6946753 6873492 6601743 6073012 6123205
$$ packed form
6212E210995q21241o95321J28225L25035l76676M51650j4973J15768K90185l89015
6202D224632l16536L48051L32491L38948L7188K03775M02360q13404m96262k1513
6192D239730M85730K6538m96433L05647O63432l71776j74801L46126o27142P11250
6182E108301M71164n15050L08936P2501O3713K45119j63730l06022m8777p8803
6172E157352K87525j18159m3740M01192O01445J57598l49265M39974l86118l26964
6162E820840k59367J72773o29503j42021P40996K8078N8630l2971m528J67087
6152E920014M46169O8283l06705J30781j16111j86577o5876j14484j29621N28877
6142F174750P2783k63327N90410N32844R4988k55695p3261k71749n28731N0193
$$ plain form
6132 6123205 6653473 6840816 6832660 6247600 6511285 6924759 7189542 7104611 7076076 7480384
6122 7480384 7148814 6761361 6909696 7275645 6985406 6835434 7240586 7085911 7003659 7321119
6112 7321119 7422710 7170213 7133772 6935184 7024458 7192533 7171980 7457964 7698573 7654266
6102 7654266 7278649 7097316 7620170 7185502 7348627 7281694 7512420 7719218 7207128 7360258
6092 7360258 7377863 7340327 7409241 7554967 7643053 8044022 8020970 7681820 7222593 7626061
6082 7626061 8089674 8191594 8258740 8043459 7745989 7534344 7356831 7477442 7867337 7960098
6072 7960098 7636651 7898304 8437602 8620493 8461158 8738935 8715372 8518432 8447325 7990331
6062 7990331 8237416 8118264 8106930 8154976 8296576 8976173 9145581 8854444 8744884 8956896
$$ packed form
6132F123205N30268J87343q156n85060K63685M13474K64783q4931k8535M04308
6122G480384l31570l87453J48335L65949k90239j49972M05152j54675q2252L17460
6112G321119J01591k52497l6441j98588Q9274J68075k0553K85984K40609m4307
6102G654266l75617j81333N22854m34668J63125o6933K30726K06798n12090J53130
6092G360258J7605l7536O8914J45726Q8086M00969k3052l39150m59227M03468
6082G626061M63613J01920O7146k15281k97470k11645j77513J20611L89895R2761
6072G960098l23447K61653N39298J82891j59335K77777k3563j96940p1107m56994
6062G990331K47085j19152j1334M8046J41600O79597J69408k91137j09560K12012
$$ plain form
6052 8956896 9050228 9361355 9028486 8763194 8783907 8863093 9263204 8872719 8932837 9258909
6042 9258909 9510579 9432070 9667231 9805771 9870309 9132811 9029723 9030870 9553744 10022904
6032 10022904 9632279 9580553 9423866 10295744 10192125 9987025 9430648 9543809 9671082 9330417
6022 9330417 9808312 10095085 9555309 9888201 10341284 10616989 10946028 10044857 9901603 10206398
6012 10206398 10322744 10676403 11194386 10752379 10699075 11159315 10742200 10896797 11166074 11450265
6002 11450265 12299776 11938259 11264046 11557774 11756786 11640616 12180657 12329133 12127419
5993 12127419 12393510 11870199 12041445 12678911 12880863 12873233 12923114 13046869 12653768 12363696
5983 12363696 13040939 12994801 12968531 13021559 12928361 13166843 13611137 13944554 13708104 13875649
$$ packed form
6052H956896R3332L11127l32869k65292K0713P9186M00111l90485O0118L26072
6042I258909K51670p8509K35161J38540O4538p37498j03088J147N22874M69160
6032A0022904l90625n1726j56687Q71878j03619k05100n56377J13161J27273l40665
6022I330417M77895K86773n39776L32892M53083K75705L29039r01171j43254L04795
6012A0206398J16346L53659N17983m42007n3304M60240m17115J54597K69277K84191
6002A1450265Q49511l61517o74213K93728J99012j16170N40041J48476k01714
5993A2127419K66091n23311J71246O37466K01952p630M9881J23755l93101k90072
5983A2363696O77243m6138k6270N3028r3198K38482M44294L33417k36450J67545
$$ plain form
5973 13875649 13798415 13973303 13944911 14251378 14008306 14321376 15103988 14997810 15029732 15266328
5963 15266328 15055786 14458407 14227593 14661384 15246682 14939733 15140716 15793581 15489635
5954 15489635 15463092 15368828 15277330 15698935 15981103 16083185 15462226 15438970 15695965 16208983
5944 16208983 16184465 16376947 16841987 16852549 16964841 17101571 16989554 16930399 16719130 16846720
5934 16846720 17939694 18418824 17990477 17954197 17868088 18423720 18232352 18062466 18456259 18751240
5924 18751240 19206941 18781829 18198243 19020897 19094565 19020166 19467433 19773302 20367374 20150274
5914 20150274 20525647 20942691 20984373 21205373 21113822 20762790 21708903 21361205 20649290 21413424
5904 21413424 21961996 22323997 22649292 22764425 22890805 23467079 24399193 25006875 25216765
$$ packed form
5973A3875649p7234J74888k8392L06467k43072L13070P82612j06178L1922K36596
5963A5266328k10542n97379k30814M33791N85298l06949K00983O52865l03946
5954A5489635k6543r4264r1498M21605K82168J02082o20959k3256K56995N13018
5944A6208983k4518J92482M65040J0562J12292J36730j12017n9155k11269J27590
5934A6846720J092974M79130m28347l6280q6109N55632j91368j69886L93793K94981
5924A8751240M55701m25112n83586Q22654P3668p4399M47267L05869N94072k17100
5914B0150274L75373M17044M1682K21000r1551l51032R46113l47698p11915P64134
5904B1413424N48572L62001L25295J15133J26380N76274R32114O07682K09890
$$ plain form
5895 25216765 25682742 25921865 26216425 27064389 27161042 27530371 27412379 26960511 26957346 26520250
5885 26520250 25800044 25166879 24759599 24326232 23845017 23502791 22757966 22327320 22082944
5876 22082944 21814020 21240546 21333706 21431439 20874854 21076126 21049808 20362281 20198675 20035388
5866 20035388 20080319 20210747 20126522 20274758 20008205 20116465 20123952 20062507 19999679 19769100
5856 19769100 20378134 20497425 20366217 20286749 20724176 20377418 20162168 20310492 20154846 20321729
5846 20321729 20017579 19992976 19840566 20055909 20260568 20830846 20583911 20492691 20508560 20926241
5836 20926241 20799936 20576194 20204314 20581412 21067550 20825256 20791109 20988690 21279369 21351553
5826 21351553 20921751 20660569 21278554 21597060 21283046 21348771 21557347 21427763 21081803 20670890
$$ packed form
5895B5216765M65977K39123K94560Q47964R6653L69329j17992m51868l165m37096
5885B6520250p20206o33165m07280m33367m81215l42226p44825m30646k44376
5876B2082944k68924n73474R3160R7733n56585K01272k6318o87527j63606j63287
5866B0035388M4931J30428q4225J48236k66553J08260P487o1445o2828k30579
5856A9769100O09034J19291j31208p9468M37427l46758k15250J48324j55646J66883
5846B0321729l04150k4603j52410K15343K04659N70278k46935r1220J5869M17681
5836B0926241j26305k23742l71880L77098M86138k42294l4147J97581K90679P2184
5826B1351553m29802k61182O17985L18506l14014O5725K08576j29584l45960m10913
$$ plain form
5816 20670890 20645581 21020111 21034983 20744293 20994576 21022098 21143371 21597165 21694744 21170959
5806 21170959 20867226 20747585 21459764 21205862 21468228 21773859 22246112 22276209 21859138 21747363
5796 21747363 21908593 22116778 22360394 23027816 22681566 22763099 22752893 22892164 22950388 22339753
5786 22339753 23206565 23245582 23209175 23496463 23710648 23827492 23203160 23677044 24050710 24080658
5776 24080658 23652347 24254307 24507759 23978063 24368636 24899654 25225255 25067628 25109891 25272436
5766 25272436 25168874 25509859 26220200 26889003 26639421 26809062 26698630 26358302 26418416 26466655
5756 26466655 27260381 27492782 27920339 27872876 27874923 27988102 27451856 28286647 28637782 28795846
5746 28795846 29047481 28531360 27891310 28201869 28707465 28382273 28745880 29721708 29423586
$$ packed form
5816B0670890k5309L74530J4872k90690K50283K7522J21273M53794R7579n23785
5806B1170959l03733j19641P12179k53902K62366L05631M72253L0097m17071j11775
5796B1747363J61230K08185K43616O67422l46250Q1533j0206J39271N8224o10635
5786B2339753Q66812L9017l6407K87288K14185J16844o24332M73884L73666K9948
5776B4080658m28311O01960K53452n29696L90573N31018L25601j57627M2263J62545
5766B5272436j03562L40985P10341O68803k49582J69641j10432l40328O0114M8239
5756B6466655P93726K32401M27557m7463K047J13179n36246Q34791L51135J58064
5746B8795846K51635n16121o40050L10559N05596l25192L63607R75828k98122
$$ plain form
5737 29423586 29693631 30332802 29864782 30337241 30386340 30939411 31178463 31191763 31864616 32490540
5727 32490540 32665632 32490831 32588815 32574664 33369601 33908521 34144544 34253087 34341695 34351706
5717 34351706 34558875 34212472 34159931 34197022 35021961 35550616 35362442 35997279 36463826 36503529
5707 36503529 36414968 37286292 37785441 38120761 37921523 38227461 38594897 39242104 39296796 39425351
5697 39425351 40104340 40470014 41089071 41246613 41328286 41599272 42119145 43294868 43719354
5688 43719354 43739170 44406631 45362644 45441494 45724478 45867493 46260441 47138690 47425862 47837623
5678 47837623 48465057 49867778 50074578 50449408 51136781 51406258 52269911 52862324 53491275
5669 53491275 54357080 55508040 55955890 56563871 57542525 57955312 58698854 59641549 60878400
$$ packed form
5737B9423586K70045O39171m68020M72459M9099N53071K39052J3300O72853O25924
5727C2490540J75092j74801R7984j4151P94937N38920K36023J08543Q8608J0011
5717C4351706K07169l46403n2541L7091Q24939N28655j88174O34837M66547L9703
5707C6503529q8561Q71324M99149L35320j99238L05938L67436O47207N4692J28555
5697C9425351O78989L65674O19057J57542Q1673K70986N19873J175723M24486
5688D3719354J9816O67461R56013P8850K82984J43015L92948Q78249K87172M11761
5678D7837623O27434J402721K06800L74830O87373K69477Q63653N92413O28951
5669E3491275Q65805J150960M47850O07981R78654M12787P43542R42695J236851
$$ plain form
5660 60878400 61294784 62220734 63492261 64473826 65524050 66200613 67065788 67817933 68642482
5651 68642482 69589768 70499249 71863605 72488561 73541341 75592906 76708006 78095894 79771311
5642 79771311 81652792 84142364 85149874 86683431 88633042 90396113 92024956 93806203
5634 93806203 95255409 97035496 99160692 100468605 102482700 104651448 107112970 109156296
5626 109156296 110987757 113581292 115944596 118279069 121028222 124321425 127809629 131457978
5618 131457978 135353606 139518114 144587550 149151352 153116449 156869644 161151742 165754487
5610 165754487 168782873 170024460 169634361 167932175 165683490 165136466 164899479 164436547 164585506
5601 164585506 165045232 166416799 168145170 170398391 172847358 176136568 179623795 183611616
$$ packed form
5660F0878400M16384R25950J271527R81565J050224O76563Q65175P52145Q24549
5651F8642482R47286R09481J364356O24956J052780K051565J115100J387888J675417
5642G9771311J881481K489572J007510J533557J949611J763071J628843J781247
5634I3806203J449206J780087K125196J307913K014095K168748K461522K043326
5626A09156296J831461K593535K363304K334473K749153L293203L488204L648349
5618A31457978L895628M164508N069436M563802L965097L753195M282098M602745
5610A65754487L028386J241587l90099j702186k248685n47024k36987m62932J48959
5601A64585506M59726J371567J728371K253221K448967L289210L487227L987821
$$ plain form
5593 183611616 188014664 193184181 198522562 204157741 210318362 216848263 224321141 231960939
5585 231960939 239761504 247032715 254619046 258097698 260090272 262065871 262412220 260375322
5577 260375322 255041206 246900621 237903540 228588329 219742082 211934661 205780860 201117368
5569 201117368 197765373 195607786 193958211 194040780 194589598 195966296 197622072 200340159
5561 200340159 203719166 207663793 212194652 217059975 223097665 228916394 233904481 238534319
5553 238534319 243478605 247090276 247792781 244143623 236389846 228800682 220298263 211523423
5545 211523423 201896787 191646238 180763184 170255910 161109142 153934649 147215972 141954195
5537 141954195 138022748 134978806 131881479 128874370 127002947 125297172 123927763 122874954
$$ packed form
5593A83611616M403048N169517N338381N635179O160621O529901P472878P639798
5585B31960939P800565P271211P586331L478652J992574J975599L46349k036898
5577B60375322n334116q140585q997081r315211q846247p807421o153801m663492
5569B01117368l351995k157587j649575Q2569N48818J376698J655776K718087
5561B00340159L379007L944627M530859M865323O037690N818729M988087M629838
5553B38534319M944286L611671P02505l649158p753777p589164q502419q774840
5545B11523423r626636j0250549j0883054j0507274r146768p174493o718677n261777
5537A41954195l931447l043942l097327l007109j871423j705775j369409j052809
$$ plain form
5529 122874954 122870318 123614714 123631908 124408615 125441170 126202717 126421498 126505474 125899573 124954785
5519 124954785 123455581 119124293 112603763 105556028 98663662 92055984 86514828 82436673
5511 82436673 78514775 75219094 72533325 69722490 66728759 64860783 63297912 61680099
5503 61680099 60466531 58683239 57306655 56028390 54616580 53172211 52160091 51669842
5495 51669842 51061680 49133581 48741178 48323315 48089823 47187186 45443636 44290589 43328589
5486 43328589 42781447 42018374 41569183 41562101 40140308 39191180 38733558 38283096 38273134 38168289
5476 38168289 37285536 36414951 36228974 36075200 35508303 34969728 34783612 34221846 34141271 33891214
5466 33891214 33554824 33636409 33079601 33171488 32593125 32207387 32197738 32342983 32526775 32286145
$$ packed form
5529A22874954m636P44396J7194P76707J032555P61547K18781Q3976o05901r44788
5519A24954785j499204m331288o520530p047735o892366o607678n541156m078155
5511H2436673l921898l295681k685769k810835k993731j867976j562871j617813
5503F1680099j213568j783292j376584j278265j411810j444369j012120m90249
5495E1669842o08162j928099l92403m17863k33492r02637j743550j153047r62000
5486D3328589n47142p63073m49191p082j421793r49128m57622m50462r962j04845
5476C8168289q82753q70585j85977j53774n66897n38575j86116n61766q0575k50057
5466C3891214l36390Q1585n56808R1887n78363l85738r649J45245J83792k40630
$$ plain form
5456 32286145 31882957 31555992 31733800 31630671 31516659 31818155 31388570 30792621 30497044
5447 30497044 30267523 29977839 29691002 29790348 30042184 29916203 30250553 29979579 29412338 29685571
5437 29685571 29945283 30218751 29845206 29271599 29636515 29365844 29095559 28883683 29069819
5428 29069819 29223106 29222248 29512896 29454127 29752085 30013529 29761770 28976832 29025904 29331316
5418 29331316 28935643 28921077 29161287 28619961 28650270 28915948 28644431 28088831 28655182 29014776
5408 29014776 29195435 29421134 29049193 29493523 29569125 29450505 29457043 29431344 29298939 29040993
5398 29040993 29434521 29063897 28835485 29126175 29276818 29054760 29003703 29000847 28792597 29066787
5388 29066787 29987239 30254887 30472561 30167880 29960557 29953094 29850988 29889619 29297093 29160352
$$ packed form
5456C2286145m03188l26965J77808j03129j14012L01496m29585n95949k95577
5447C0497044k29521k89684k86837R9346K51836j25981L34350k70974n67241K73233
5437B9685571K59712K73468l73545n73607L64916k70671k70285k11876J86136
5428B9069819J53287q58K90648n8769K97958K61444k51759p84938M9072L05412
5418B9331316l95673j4566K40210n41326L0309K65678k71517n55600N66351L59594
5408B9014776J80659K25699l71941M44330P5602j18620O538k5699j32405k57946
5398B9040993L93528l70624k28412K90690J50643k22058n1057k856k08250K74190
5388B9066787R20452K67648K17674l04681k07323p463j02106L8631n92526j36741
$$ plain form
5378 29160352 29466518 30073309 30538824 30487841 30262114 29903691 30098201 30435168 31209657 31199683
5368 31199683 31147639 31394759 31236529 31786503 32622196 32986135 33103299 33769018 34435079 33981535
5358 33981535 33752388 34291270 35105232 35056784 35463310 35725136 36083074 36866893 36777655 37426865
5348 37426865 37958376 38518414 39432219 40176425 40715504 42326079 43608333 44204005 44791694
5339 44791694 45750567 46071107 46280718 45915324 45307625 43589769 41659764 39874902 38176594
5330 38176594 37009496 35568369 35057951 34475919 34097577 32885836 32646890 32121853 31958675
5321 31958675 31545543 31739534 31358401 31297983 31026818 30655218 30567086 31241212 31169143 30395981
5311 30395981 30442316 30582461 31028751 31055302 30969965 30188802 30402201 30500233 30275418 29625828
$$ packed form
5378B9160352L06166O06791M65515n0983k25727l58423J94510L36967P74489r974
5368C1199683n2044K47120j58230N49974Q35693L63939J17164O65719O66061m53544
5358C3981535k29147N38882Q13962m8448M06526K61826L57938P83819q9238O49210
5348C7426865N31511N60038R13805P44206N39079J610575J282254N95672N87689
5339D4791694R58873L20540K09611l65394o07699j717856j930005j784862j698308
5330C8176594j167098j441127n10418n82032l78342j211741k38946n25037j63178
5321C1958675m13132J93991l81133o0418k71165l71600q8132O74126p2069p73162
5311C0395981M6335J40145M46290K6551q5337p81163K13399R8032k24815o49590
$$ plain form
5301 29625828 30063209 29918749 29579419 29091372 28972790 29549424 29918253 29711936 30371367
5292 30371367 30428153 30140357 29589259 29496026 29432434 29615418 29998503 30292736 30422957 29822036
5282 29822036 29593171 29990565 29979466 30101049 30201348 30061396 30070637 30394913 30807194 30542134
5272 30542134 30319127 30032889 30456607 30872057 31508526 31181169 31086345 31732793 31607544 31287023
5262 31287023 31135054 31559674 32058584 31615462 31698773 31849010 31898699 32248578 32155131 31651179
5252 31651179 31999107 32568266 32237466 32101007 32515405 32276434 32215150 32257509 32496391 33070705
5242 33070705 32281529 32336414 32944671 33097946 33538440 33744959 33477053 33773582 33441448 33665844
5232 33665844 33954820 34141283 34988998 35044103 34579456 34916503 35243169 35277512 35438663 35790048
$$ packed form
5301B9625828M37381j44460l39330m88047j18582N76634L68829k06317O59431
5292C0371367N6786k87796n51098r3233o3592J82984L83085K94233J30221o00921
5282B9822036k28865L97394j1099J21583J00299j39952R241L24276M12281k65060
5272C0542134k23007k86238M23718M15450O36469l27357r4824O46448j25249l20521
5262C1287023j51969M24620M98910m43122Q3311J50237M9689L49879r3447n03952
5252C1651179L47928N69159l30800j36459M14398k38971o1284M2359K38882N74314
5242C3070705p89176N4885O08257J53275M40494K06519k67906K96529l32134K24396
5232C3665844K88976J86463Q47715N5105m64647L37047L26666L4343J61151L51385
$$ plain form
5222 35790048 35974781 36151226 36409640 36010491 36097859 36498050 36445985 36361342 36069070 36099824
5212 36099824 36369230 36311518 36517087 36467492 36390768 36027430 36364687 36636564 37011926 36707855
5202 36707855 36964185 36945583 36705419 37423651 37733523 37615497 37544531 37406572 37788620 38262863
5192 38262863 38115256 38196524 38854756 38602994 38327011 38693567 38479095 38661063 38666946 38830596
5182 38830596 38931958 38923154 39130379 39010174 39305585 40046491 40063455 40092315 39398228 39895322
5172 39895322 40221048 39628096 39633504 39356020 39704908 40208275 40441022 40646154 40862221 41053704
5162 41053704 41025112 40974523 41420363 41600142 41022819 40923641 41222632 42013222 41621272 41768893
5152 41768893 42289324 42209187 42281822 42397967 43144848 43414133 43033641 43190922 43450028 44001688
$$ packed form
5222C5790048J84733J76445K58414l99149Q7368M00191n2065q4643k92272L0754
5212C6099824K69406n7712K05569m9595p6724l63338L37257K71877L75362l04071
5202C6707855K56330j8602k40164P18232L09872j18026p0966j37959L82048M74243
5192C8262863j47607Q1268O58232k51762k75983L66556k14472J81968N883J63650
5182C8830596J01362q804K07225j20205K95411P40906J6964K8860o94087M97094
5172C9895322L25726n92952N408k77484L48888N03367K32747K05132K16067J91483
5162D1053704k8592n0589M45840J79779n77323r9178K98991P90590l91950J47621
5152D1768893N20431q0137P2635J16145P46881K69285l80492J57281K59106N51660
$$ plain form
5142 44001688 44196211 44309184 44872489 45069767 45343762 45284337 45139475 45140410 45478113 46227823
5132 46227823 46366782 46299771 46465631 46802639 47429471 47202836 47701160 47447348 47562404 47609839
5122 47609839 47462030 48056145 47934313 47727863 48199157 48528233 49457478 50097812 49761824
5113 49761824 50236800 50447123 50687276 51296286 51538029 51753940 52423446 52679159 52923025
5104 52923025 53112182 53765009 54081651 54407566 54688775 55137544 55315039 56043284 56806819
5095 56806819 56456991 56705175 57179902 57298402 57182563 57769976 58192123 58361162 58765143
5086 58765143 59747403 59890832 60185509 60623858 61395467 61843215 62379415 62526574 63268328
5077 63268328 63218302 63837665 64030869 64481540 65623394 65392770 65609020 66476175 67097602
$$ packed form
5142D4001688J94523J12973N63305J97278K73995n9425j44862R35L37703P49710
5132D6227823J38959o7011J65860L37008O26832k26635M98324k53812J15056M7435
5122D7609839j47809N94115j21832k06450M71294L29076R29245O40334l35988
5113D9761824M74976K10323K40153O09010K41743K15911O69506K55713K43866
5104E2923025J89157O52827L16642L25915K81209M48769J77495P28245P63535
5095E6806819l49828K48184M74727J18500j15839N87413M22147J69039M03981
5086E8765143R82260J43429K94677M38349P71609M47748N36200J47159P41754
5077F3268328n0026O19363J93204M50671J141854k30624K16250Q67155O21427
$$ plain form
5068 67097602 67536819 67677200 68217798 68867735 69330446 69714946 70552251 70982604 71595866
5059 71595866 72524347 72628463 73401584 74085687 74899339 74831414 75294104 75689540 76838687
5050 76838687 78187775 78153510 78990502 79536163 79788297 80703865 82034319 83046620 83385783
5041 83385783 84360305 85251209 86132205 87183458 87237332 87695229 89119862 89999640 90887290
5032 90887290 92205701 93561282 94293759 95587914 96565503 97842122 98963426 100375087
5024 100375087 101417299 102567992 104166995 105964843 107301108 108816537 110177863 111438496
5016 111438496 112649274 114345284 115955163 117231993 118866553 120619760 122125001 124525473
5008 124525473 125885529 127744262 129849712 132070299 133696124 135922198 138214178 139823188
$$ packed form
5068F7097602M39217J40381N40598O49937M62711L84500Q37305M30353O13262
5059G1595866R28481J04116P73121O84103Q13652o7925M62690L95436J149147
5050G6838687J349088l4265Q36992N45661K52134R15568J330454J012301L39163
5041H3385783R74522Q90904Q80996J051253N3874M57897J424633Q79778Q87650
5032I0887290J318411J355581P32477J294155R77589J276619J121304J411661
5024A00375087J042212J150693J599003J797848J336265J515429J361326J260633
5016A11438496J210778J696010J609879J276830J634560J753207J505241K400472
5008A24525473J360056J858733K105450K220587J625825K226074K291980J609010
$$ plain form
5000 139823188 141911640 144237939 146859810 149231072 151316191 153382777 156489977 159196569
4992 159196569 162744766 166103841 169849841 174200726 177754174 181754029 185852456 189529114
4984 189529114 192751208 196331924 200606892 204329155 208093392 211993226 216183079 220918728
4976 220918728 226139959 231498407 236741032 241754072 247154550 253266027 259689693 266562381
4968 266562381 274015712 282229247 290907850 299845448 308665440 317649641 327241146 335704696
4960 335704696 343914673 350548773 355392744 357825298 357851953 356679850 353724233 350308016
4952 350308016 348034313 346141950 345737492 346730772 349099343 351826963 356783609 362767895
4944 362767895 368670764 375608445 383636811 392774547 401613118 411032951 421179859 432560650
$$ packed form
5000A39823188K088452K326299K621871K371262K085119K066586L107200K706592
4992A59196569L548197L359075L746000M350885L553448L999855M098427L676658
4984A89529114L222094L580716M274968L722263L764237L899834M189853M735649
4976B20918728N221231N358448N242625N013040N400478O111477O423666O872688
4968B66562381P453331Q213535Q678603Q937598Q819992Q984201R591505Q463550
4960C35704696Q209977O634100M843971K432554K6655j172103k955617l416217
4952C50308016k273703j892363m04458R93280K368571K727620M956646N984286
4944C62767895N902869O937681Q028366R137736Q838571R419833J0146908J1380791
$$ plain form
4936 432560650 444869254 457129307 469496595 480848051 492188339 502465931 512116420
4929 512116420 519785246 524540548 527096969 526467786 520912338 510859256 498399293 484368911
4921 484368911 470486825 458367249 448268771 439728485 433485289 429321205 425775280 423696494
4913 423696494 422815716 421423205 419152810 417689014 415563552 412744409 408863387 404432855
4905 404432855 399754968 394842791 390293807 386689354 383443057 379768982 376082507 371650818
4897 371650818 367515354 362663748 356513580 348901141 341079582 331308056 320512755 309921343
4889 309921343 299621505 290023796 281705200 274795800 268958796 263603901 258422978 252846875
4881 252846875 247574679 241090898 234017993 226550510 218455969 209212539 199385707 189973482
$$ packed form
4936D32560650J2308604J2260053J2367288J1351456J1340288J0277592R650489
4929E12116420P668826M755302K556421o29183n555448j0053082j2459963j4030382
4921D84368911j3882086j2119576j0098478q540286o243196m164084l545925k078786
4913D23696494q80778j392511k270395j463796k125462k819143l881022m430532
4905D04432855m677887m912177m548984l604453l246297l674075l686475m431689
4897C71650818m135464m851606o150168p612439p821559r771526j0795301j0591412
4889C09921343j0299838r597709q318596o909400n837004n354895n180923n576103
4881B52846875n272196o483781p072905p467483q094541r243430r826832r412225
$$ plain form
4873 189973482 180873534 172639670 165156850 158857999 153042888 147408999 141679138 137148642
4865 137148642 132893601 128930546 124571424 120933829 118307565 115322619 111944045 109732863
4857 109732863 107356909 104665350 102044735 99942309 98283282 96525711 94613654 93039347
4849 93039347 91527897 90059529 89167082 87852697 86284365 85288963 84849563 83449579 82469994
4840 82469994 81290289 80305961 80055029 79176177 78017205 77509858 76789489 76214157 75872171
4831 75872171 74923855 73936251 73909115 73457513 73062325 72578470 72412632 71838727 70618767
4822 70618767 70100125 70207645 69712345 69766155 69413857 69355487 68781033 67966241 67783989 68032854
4812 68032854 67617991 66926406 66678991 67174347 67317631 66733512 66635239 67379207 66796141 66011442
$$ packed form
4873A89973482r099948q233864p482820o298851n815111n633889n729861m530496
4865A37148642m255041l963055m359122l637595k626264k984946l378574k211182
4857A09732863k375954k691559k620615k102426j659027j757571j912057j574307
4849I3039347j511450j468368q92447j314385j568332r95402m39400j399984r79585
4840H2469994j179705r84328k50932q78852j158972n07347p20369n75332l41986
4831G5872171r48316r87604k7136m51602l95188m83855j65838n73905j219960
4822G0618767n18642J07520m95300N3810l52298n8370n74454q14792j82252K48865
4812F8032854m14863o91585k47415M95356J43284n84119r8273P43968n83066p84699
$$ plain form
4802 66011442 66274681 66170122 65880511 65893008 65693801 66013624 65893255 65896298 66353451 66470025
4792 66470025 66255711 65677996 65820268 65718767 66259159 65980294 66235843 66454708 66101014
4783 66101014 65634322 65715809 66322043 65718000 65974531 66667154 66869351 67257699 67408996 67731235
4773 67731235 67711778 68128310 68425014 68525462 68738858 69117002 69405302 69446431 69382358 70235578
4763 70235578 70538632 70594029 70309475 70649670 71251780 70939761 71236761 71627475 72105397 72783519
4753 72783519 72827390 73138932 73817509 74291725 74433027 75047872 76187414 76358954 77062142
4744 77062142 77938793 78506213 79285828 79534544 80688683 81885496 82926236 83475688 84234834
4735 84234834 84862415 85516908 86356273 87266123 88043771 89144318 89795558 90929422 91953345
$$ packed form
4802F6011442K63239j04559k89611J2497j99207L19823j20369L043M57153J16574
4792F6470025k14314n77715J42272j01501N40392k78865K55549K18865l53694
4783F6101014m66692Q1487O06234o04043K56531O92623K02197L88348J51297L22239
4773F7731235j9457M16532K96704J00448K13396L78144K88300M1129o4073Q53220
4763G0235578L03054N5397k84554L40195O02110l12019K97000L90714M77922O78122
4753G2783519M3871L11542O78577M74216J41302O14845J139542J71540P03188
4744G7062142Q76651N67420P79615K48716J154139J196813J040740N49452P59146
4735H4234834O27581O54493Q39365R09850P77648J100547O51240J133864J023923
$$ plain form
4726 91953345 93193818 94743861 96185559 96923421 98143746 99143387 100612497 101845053
4718 101845053 102524742 103580667 105230359 107148241 108978301 111036728 112443823 114693903
4710 114693903 116279884 118449872 120583223 123114269 125366400 127191780 129663232 132223406
4702 132223406 134852849 137576947 140237476 143061156 145055367 147541655 149826004 153308985
4694 153308985 156947083 160280501 164353628 167903055 171443929 176251628 182574886 188069739
4686 188069739 193871154 200110184 206408746 212314503 218211759 223615721 228019772 230974404
4678 230974404 233631452 235024987 234291150 232777732 231300740 229579557 227564916 226814776
4670 226814776 226947875 227349981 228745293 230331268 232027530 234947240 238246176 241637720
$$ packed form
4726I1953345J240473J550043J441698P37862J220325R99641J469110J232556
4718A01845053O79689J055925J649692J917882J830060K058427J407095K250080
4710A14693903J585981K169988K133351K531046K252131J825380K471452K560174
4702A32223406K629443K724098K660529K823680J994211K486288K284349L482981
4694A53308985L638098L333418M073127L549427L540874M807699O323258N494853
4686A88069739N801415O239030O298562N905757N897256N403962M404051K954632
4678B30974404K657048J393535p33837j513418j476992j721183k014641p50140
4670B26814776J33099M02106J395312J585975J696262K919710L298936L391544
$$ plain form
4662 241637720 245519186 250400587 254865992 259174867 263647306 267482796 270419772 272566280
4654 272566280 273193395 272292862 270592593 268197243 263678858 258515687 253039163 246728050
4646 246728050 240661640 234566822 228250351 222731121 217095360 212035936 206563523 201660032
4638 201660032 196737344 192115001 188713047 186764402 184799064 183395680 183185387 184040121
4630 184040121 184294688 185923126 187597083 188856201 189543306 188638211 187189461 184814929
4622 184814929 180340269 173798404 165592718 155595825 145711904 136564715 128375612 121325329
4614 121325329 114862610 108389257 103580454 98593407 95048454 91674867 88244475 85519210
4606 85519210 82516474 80169190 78421591 76745524 74334587 72090577 70327619 69128864
$$ packed form
4662B41637720L881466M881401M465405M308875M472439L835490K936976K146508
4654B72566280O27115r00533j700269k395350m518385n163171n476524o311113
4646B46728050o066410o094818o316471n519230n635761n059424n472413m903491
4638B01660032m922688m622343l401954j948645j965338j403384k10293Q54734
4630A84040121K54567J628438J673957J259118O87105r05095j448750k374532
4622A84814929m474660o541865q205686r996893r883921r147189q189103p050283
4614A21325329o462719o473353m808803m987047l544953l373587l430392k725265
4606H5519210l002736k347284j747599j676067k410937k244010j762958j198755
$$ plain form
4598 69128864 67626775 66194450 64568444 63090787 61953150 61124518 60628225 59547242
4590 59547242 58474614 57497670 56835568 56124327 55448337 54498765 53905089 53170528 52219750
4581 52219750 51357081 51394748 50506754 50170421 49380938 48969948 48667884 48428134 47892799 46927213
4571 46927213 45853359 45339284 44912571 44629302 44859751 44814959 43892367 43492947 43786982
4562 43786982 44136064 44290120 43477267 42601013 42346708 42220815 42053919 41863954 41541430
4553 41541430 41605980 41153905 40537190 40668400 40895700 40684600 40439391 40435342 40463087 40373915
4543 40373915 39894892 39825412 39966431 39688982 39189165 39305805 39209488 38751936 38943698 39231027
4533 39231027 39126768 38911874 39103114 38998619 39067910 39128666 39060013 38769002 38684012 38795795
$$ packed form
4598F9128864j502089j432325j626006j477657j137637q28632m96293j080983
4590E9547242j072628r76944o62102p11241o75990r49572n93676p34561r50778
4581E2219750q62669L7667q87994l36333p89483m10990l02064k39750n35335r65586
4571D6927213j073854n14075m26713k83269K30449m4792r22592l99420K94035
4562D3786982L49082J54056q12853q76254k54305j25893j66896j89965l22524
4553D1541430O4550m52075o16715J31210K27300k11100k45209m049K7745q9172
4543D0373915m79023o9480J41019k77449m99817J16640r6317m57552J91762K87329
4533C9231027j04259k14894J91240j04495O9291O0756o8653k91011q4990J11783
$$ plain form
4523 38795795 38764666 38230638 38182372 38687663 38706815 38689590 38503750 38904740 38705604 38546780
4513 38546780 38626824 38607614 38318542 38246345 38612597 38339951 38343136 38489857 38368901 38486981
4503 38486981 38637865 38449182 38357869 38223696 38195505 38579574 38828467 38137799 38678639 38338600
4493 38338600 38203593 37943789 37994631 37812417 37797386 37933740 37990794 38205240 38514680 38879285
4483 38879285 38713391 38821662 38638370 38755591 38832426 39163900 39387887 38741006 38884528 39382322
4473 39382322 39126942 38746465 38821284 39253233 39342419 39353192 39179925 39208788 39400071 39481625
4463 39481625 38891272 38442032 38972972 39108106 39528902 40008194 39732007 39571271 39318560
4454 39318560 38829545 38984476 39056810 39050986 39465899 40292471 40155675 40005367 39697204 39693340
$$ packed form
4523C8795795l1129n34028m8266N05291J9152j7225j85840M00990j99136j58824
4513C8546780Q0044j9210k89072p2197L66252k72646L185J46721j20956J18080
4503C8486981J50884j88683r1313j34173k8191L84069K48893o90668N40840l40039
4493C8338600j35007k59804N0842j82214j5031J36354N7054K14446L09440L64605
4483C8879285j65894J08271j83292J17221P6835L31474K23987o46881J43522M97794
4473C9382322k55380l80477P4819M31949Q9186J0773j73267K8863J91283Q1554
4463C9481625n90353m49240N30940J35134M20796M79292k76187j60736k52711
4454C9318560m89015J54931P2334n824M14913Q26572j36796j50308l08163l864
$$ plain form
4444 39693340 40100900 39991748 39842880 39771321 39359818 39251958 39279458 39393762 39063602 38611713
4434 38611713 38826579 39082329 39020834 38777678 38575857 38322075 37725032 37473793 37497443 37157984
4424 37157984 37150179 37839470 38087737 38178703 37802701 37638632 37376837 37322681 37981816 38104226
4414 38104226 37667100 37545547 37592472 37680564 37601325 36896645 36815911 36720100 36656797 36615940 36617115
4403 36617115 36015804 36158830 36258433 36326519 36264732 36234535 36156385 35898268 35485135 35784317
4393 35784317 36163487 35833641 35894208 36257579 35831805 36056424 36584377 36671656 36181827 36240892
4383 36240892 35828549 35906724 35841634 35894420 35539198 35849942 35854589 35906291 36143825 35890975
4373 35890975 36344380 36631659 36137015 36352020 37307120 36944992 36253063 36630092 36917894
$$ packed form
4444C9693340M07560j09152j48868p1559m11503j07860K7500J14304l30160m51889
4434C8611713K14866K55750o1495k43156k01821k53782n97043k51239K3650l39459
4424C7157984p805O89291K48267R0966l76002j64069k61795n4156O59135J22410
4414C8104226m37126j21553M6925Q8092p9239p04680q0734r5811o3303m0857J175
4403C6617115o01311J43026R9603O8086o1787l0197p8150k58117m13133K99182
4393C5784317L79170l29846O0567L63371m25774K24619N27953Q7279m89829N9065
4383C6240892m12343P8175o5090N2786l55222L10744M647N1702K37534k52850
4373C5890975M53405K87279m94644K15005R55100l62128o91929L77029K87802
$$ plain form
4364 36917894 36661290 36679544 36725878 36998785 37234044 37124301 37717621 37333342 37326274 37918555
4354 37918555 37795613 37753862 37569484 37283321 37435600 38168994 38362555 38208261 38417946 38434992
4344 38434992 38521707 38716100 38344953 38444521 38558885 38370511 38228511 38739115 39050480 38804034
4334 38804034 38473932 38958157 39042429 39283856 38945720 39455190 40025491 40211283 40335103 40242473
4324 40242473 39977108 39503315 38848671 39261092 39260938 39588931 39539177 40311408 40132877 39876945
4314 39876945 40099717 40478806 40928656 40416960 40432033 41105097 41189025 41137033 41327318 41266051
4304 41266051 41120991 41150009 41229808 41727584 42439375 42817468 42880341 42640552 43200581 43169471
4294 43169471 43201972 42326411 42313598 42297412 42419798 42753911 43033809 43106398 43953631 44261717
$$ packed form
4364C6917894k56604J8254M6334K72907K35259j09743N93320l84279p068N92281
4354C7918555j22942m1751j84378k86163J52279P33394J93561j54294K09685J7046
4344C8434992Q6715J94393l71147R9568J14364j88374j42000N10604L11365k46446
4334C8804034l30102M84225Q4272K41427l38136N09470N70301J85792J23820r2630
4324D0242473k65365m73793o54644M12421j54L27993m9754P72231j78531k55932
4314C9876945K22772L79089M49850n11696J5073O73064Q3928n1992J90285o1267
4304D1266051j45060K9018P9799M97776P11791L78093O2873k39789N60029l1110
4294D3169471L2501q75561j2813j6186J22386L34113K79898P2589Q47233L08086
$$ plain form
4284 44261717 44284461 44413943 44323560 44221274 44571212 44721640 44771185 45211344 44991258 45086692
4274 45086692 45393302 45771418 46009900 46235506 46036473 45935258 46584078 46761596 46943222
4265 46943222 47820694 47873398 47424867 47095490 47838893 48215410 48362966 48836235 48798111 49080894
4255 49080894 49513799 50083811 51025165 50528028 50837217 51179062 51109137 51685564 51731323 51747791
4245 51747791 52082412 52870257 52847589 52996495 53416709 53424172 53795775 53965167 53822376 54127775
4235 54127775 54273989 54352648 55227355 55456681 55905344 56908486 57228562 56840177 57319043
4226 57319043 57841994 57883554 57666125 58128466 58207298 58290767 58762534 59031207 59283581 59219788
4216 59219788 60002700 60735599 60846366 60327931 60727152 60762955 60729013 61027569 61069270 61107910
$$ packed form
4284D4261717K2744J29482r0383j02286L49938J50428M9545M40159k20086R5434
4274D5086692L06610L78116K38482K25606j99033j01215O48820J77518J81626
4265D6943222Q77472N2704m48531l29377P43403L76517J47556M73269l8124K82783
4255D9080894M32905N70012R41354m97137L09189L41845o9925N76427M5759J6468
4245E1747791L34621P87845k2668J48906M20214P463L71603J69392j42791L05399
4235E4127775J46214P8659Q74707K29326M48663J003142L20076l88385M78866
4226E7319043N22951M1560k17429M62341P8832Q3469M71767K68673K52374o3793
4216E9219788P82912P32899J10767n18435L99221L5803l3942K98556M1701L8640
$$ plain form
4206 61107910 61653168 61838090 61931305 62389955 62373315 62935163 63013260 63089641 63508181 63651577
4196 63651577 63756543 63639476 63405446 62894344 63384526 63336405 63412770 64155336 64071995 64244744
4186 64244744 64385004 64734011 64383903 63848579 64299113 64297746 64238761 63870670 64254599 64466620
4176 64466620 64316644 64329146 64419988 64148335 63651343 63430354 62758057 62283813 62542638 62662997
4166 62662997 62537405 62805207 62564395 62198907 62181902 62270660 62288127 62293818 62230880 62085930
4156 62085930 62379318 62163750 61993226 62096756 62412565 62335388 61971902 62147211 62512619 62258009
4146 62258009 62574492 62515605 62813671 62504017 62326055 62164692 61932747 62118749 62220641 61454361
4136 61454361 61228371 61547012 61802504 62017386 62160257 62254339 62022808 62474425 62537125 62156264
$$ packed form
4206F1107910N45258J84922R3215M58650j6640N61848P8097P6381M18540J43396
4196F3651577J04966j17067k34030n11102M90182m8121P6365P42566q3341J72749
4186F4244744J40260L49007l50108n35324M50534j367n8985l68091L83929K12021
4176F4466620j49976J2502R0842k71653m96992k20989o72297m74244K58825J20359
4166F2662997j25592K67802k40812l65488j7005Q8758J7467N691o2938j44950
4156F2085930K93388k15568j70524J03530L15809p7177l63486J75309L65408k54610
4146F2258009L16483n8887K98066l09654j77962j61363k31945J86002J01892p66280
4136F1454361k25990L18641K55492K14882J42871R4082k31531M51617O2700l80861
$$ plain form
4126 62156264 62393927 62811409 62363657 62848497 63716952 63732346 63777782 63156967 63513732 64255502
4116 64255502 64090740 64201056 64360397 64636916 65015650 65218426 65025924 65692427 65888951
4107 65888951 65526375 65919456 66460521 66231537 66479297 66717806 67200307 67497345 67879373
4098 67879373 67681198 68014093 68537510 68800071 68991135 69228285 69205534 69574924 69910459 70409377
4088 70409377 71144109 71368010 71318686 71903898 72083726 72989764 73574368 74436522 74528808 74327990
4078 74327990 75280748 75938964 76215042 76610143 76735290 77191880 77577394 77766227 77718918 78012052
4068 78012052 78568576 78756478 79844221 79929987 79611260 80220809 80653550 81393015 82341515
4059 82341515 82823605 83303916 83552023 83931611 84407190 85019429 85520407 85990213 86941014
$$ packed form
4126F2156264K37663M17482m47752M84840Q68455J5394M5436o20815L56765P41770
4116F4255502j64762J10316J59341K76519L78734K02776j92502O66503J96524
4107F5888951l62576L93081N41065k28984K47760K38509M82501K97038L82028
4098F7879373j98175L32895N23417K62561J91064K37150k2751L69390L35535M98918
4088G0409377P34732K23901m9324N85212J79828R06038N84604Q62154R2286k00818
4078G4327990R52758O58216K76078L95101J25147M56590L85514J88833m7309K93134
4068G8012052N56524J87902J087743Q5766l18727O09549M32741P39465R48500
4059H2341515M82090M80311K48107L79588M75579O12239N00978M69806R50801
$$ plain form
4050 86941014 87869645 88654183 89385038 90086925 89780297 90106334 90694496 91639361 92355847
4041 92355847 93050361 94322819 94542165 94885583 95860038 96320490 96797505 97390539 97887745
4032 97887745 98919966 99293397 99948875 101022238 102197558 102815090 103478467 104399853 104876277
4023 104876277 105466352 106478834 107103024 108112550 109382522 110546587 111365565 112668977
4015 112668977 113660021 114810886 115253840 116570605 118302707 119448173 120344347 121824298
4007 121824298 123312793 124872659 125281344 126504119 127676227 128790377 130468265 132199543
3999 132199543 133294851 134945145 136955849 138526946 139943736 141552715 143055452 144839254
3991 144839254 146647650 148512763 150949460 152776737 154745260 156839251 159118212 161024507
$$ packed form
4050H6941014R28631P84538P30855P01887l06628L26037N88162R44865P16486
4041I2355847O94514J272458K19346L43418R74455M60452M77015N93034M97206
4032I7887745J032221L73431O55478J073363J175320O17532O63377R21386M76424
4023A04876277N90075J012482O24190J009526J269972J164065Q18978J303412
4015A12668977R91044J150865M42954J316765J732102J145466Q96174J479951
4007A21824298J488495J559866M08685J222775J172108J114150J677888J731278
3999A32199543J095308J650294K010704J571097J416790J608979J502737J783802
3991A44839254J808396J865113K436697J827277J968523K093991K278961J906295
$$ plain form
3983 161024507 163244614 166892072 169210255 172132450 175018425 177645870 180631739 182729532
3975 182729532 185701799 187990426 190620285 193169066 195494132 197624149 199959077 201904004
3967 201904004 204190635 206582098 209021296 211697967 214714729 218242107 221542873 224773331
3959 224773331 228539950 231896991 235813497 238850096 242722944 246301180 249554596 253168609
3951 253168609 256199046 260076719 263671645 266211476 269105513 271852873 274079219 276498750
3943 276498750 279019389 280812256 282675970 284680048 286672080 288615028 290435291 292303392
3935 292303392 293845468 296324001 298563970 300360802 303372565 306624632 308930807 310828332
3927 310828332 312845224 314759226 317279213 319517456 321217420 323087391 323909049 325008321
$$ packed form
3983A61024507K220107L647458K318183K922195K885975K627445K985869K097793
3975A82729532K972267K288627K629859K548781K325066K130017K334928J944927
3967B01904004K286631K391463K439198K676671L016762L527378L300766L230458
3959B24773331L766619L357041L916506L036599L872848L578236L253416L614013
3951B53168609L030437L877673L594926K539831K894037K747360K226346K419531
3943B76498750K520639J792867J863714K004078J992032J942948J820263J868101
3935B92303392J542076K478533K239969J796832L011763L252067K306175J897525
3927C10828332K016892J914002K519987K238243J699964J869971Q21658J099272
$$ plain form
3919 325008321 326017615 326898276 327315165 328344235 329806134 330404122 331296764 332332073 332549486
3910 332549486 333236809 334354323 334892293 335168269 336200828 337098783 338307512 339331084 340305682
3901 340305682 341335005 342555806 343722609 344722899 346311629 347458714 348865622 350176902
3893 350176902 351521992 352477882 353715442 354841166 355642105 356700373 357723532 358115840
3885 358115840 359211094 360762154 361512815 361991855 362723392 363815809 364835093 365816797 367261001
3876 367261001 368986965 370198158 372569058 375325807 377408557 380435390 383472363 386431398
3868 386431398 389278249 392093445 394021783 395770236 397452437 399342068 401499225 403177579
3860 403177579 404994359 407352248 408910723 411255585 413285372 415709579 418340240 420995803
$$ packed form
3919C25008321J009294Q80661M16889J029070J461899N97988Q92642J035309K17413
3910C32549486O87323J117514N37970K75976J032559Q97955J208729J023572R74598
3901C40305682J029323J220801J166803J000290J588730J147085J406908J311280
3893C50176902J345090R55890J237560J125724Q00939J058268J023159L92308
3885C58115840J095254J551060P50661M79040P31537J092417J019284R81704J444204
3876C67261001J725964J211193K370900K756749K082750L026833L036973K959035
3868C86431398K846851K815196J928338J748453J682201J889631K157157J678354
3860D03177579J816780K357889J558475K344862K029787K424207K630661K655563
$$ plain form
3852 420995803 423801286 426881341 429830296 432994211 437105708 440490571 444785741 449226404
3844 449226404 453264283 457882159 462102122 465723034 469934554 473410358 476060360 478037402
3836 478037402 478846291 479070570 478654066 476937809 474493159 471794409 468695845 466699321
3828 466699321 464326030 461969518 459823732 457020649 453850965 449951906 445673233 439906141
3820 439906141 434010223 427113805 420250489 412696093 405304588 398765589 392754260 386710342
3812 386710342 379903090 372981205 365924051 358310536 350138521 342549896 334730317 326346211
3804 326346211 317987544 310650958 303914211 296624149 290235293 284281639 277909195 272189119
3796 272189119 266696995 261291914 256086895 251287750 246206341 240429142 236107900 231352081
$$ packed form
3852D20995803K805483L080055K948955L163915M111497L384863M295170M440663
3844D49226404M037879M617876M219963L620912M211520L475804K650002J977042
3836D78037402Q08889K24279m16504j716257k444650k698750l098564j996524
3828D66699321k373291k356512k145786k803083l169684l899059m278673n767092
3820D39906141n895918o896418o863316p554396p391505o538999o011329o043918
3812C86710342o807252o921885p057154p613515q172015p588625p819579q384106
3804C26346211q358667p336586o736747p290062o388856n953654o372444n720076
3796B72189119n492124n405081n205019m799145n081409n777199m321242m755819
$$ plain form
3788 231352081 226032712 220845547 216307294 211676071 207841673 203862733 200101707 196224088
3780 196224088 192240602 188194930 184256938 180606193 177398693 174640854 171851718 168155533
3772 168155533 165073633 161968902 158656034 156102422 153898219 151760174 150033852 147613089
3764 147613089 145751878 144373799 142709712 140919449 139004738 137504557 135616473 133869360
3756 133869360 132152453 130009827 127830359 126110278 124085769 122577460 120572778 118981176
3748 118981176 117100502 115423239 113372398 111362394 110300294 109678493 108202671 107151031
3740 107151031 106163875 106036204 104385991 102656312 101580783 101035701 100309665 98925207 97998391
3731 97998391 97034847 96325395 95204748 93559599 93713771 93364224 92536404 90736589 89657017
$$ packed form
3788B31352081n319369n187165m538253m631223l834398l978940l761026l877619
3780A96224088l983486m045672l937992l650745l207500k757839k789136l696185
3772A68155533l081900l104731l312868k553612k204203k138045j726322k420763
3764A47613089j861211j378079j664087j790263j914711j500181j888084j747113
3756A33869360j716907k142626k179468j720081k024509j508309k004682j591602
3748A18981176j880674j677263k050841k010004j062100o21801j475822j051640
3740A07151031r87156j27671j650213j729679j075529n45082p26036j384458r26816
3731I7998391r63544p09452j120647j645149J54172l49547q27820j799815j079572
$$ plain form
3722 89657017 89028868 88131333 87365717 86175554 85272155 84400760 83773047 82565137 82141733
3713 82141733 81765507 81296217 79953750 79618735 78524663 77688195 77626589 76610544 75710841
3704 75710841 74894647 74946537 74613783 73544805 72958708 72411018 71470897 71326327 71357852 70648459
3694 70648459 69899226 69357425 68781420 67498511 66980692 66492593 66117042 65601682 65405651
3685 65405651 64948183 63809091 63203102 63010577 62577116 62634012 62367251 61541200 61085386
3676 61085386 60547933 60408034 59997507 59820883 59519496 59447390 58787348 57717105 57506155
3667 57506155 56806046 56894815 56863848 56143527 55899159 55678183 55322444 54826853 54260526 54178935
3657 54178935 53911863 53820877 54032649 53601892 52798395 52509673 52852694 52129907 51488496 51456015
$$ packed form
3722H9657017o28149q97535p65616j190163r03399q71395o27713j207910m23404
3713H2141733l76226m69290j342467l35015j094072q36468o1606j016045q99703
3704G5710841q16194N1890l32754j068978n86097n47690r40121j44570L1525p09393
3694G0648459p49233n41801n76005j282909n17819m88099l75551n15360j96031
3685F5405651m57468j139092o05989j92525m33461N6896k66761q26051m55814
3676F1085386n37453j39899m10527j76624l01387p2106o60042j070243k10950
3667E7506155p00109Q8769l0967p20321k44368k20976l55739m95591n66327q1591
3657E4178935k67072r0986K11772m30757q03497k88722L43021p22787o41411l2481
$$ plain form
3647 51456015 51620181 51374388 51500088 51083904 50704458 50859043 50631930 50481708 49784012
3638 49784012 49439970 49974440 49009251 48794955 48963627 48600765 48823558 48552356 47713376
3629 47713376 47110865 47664670 47772583 48128113 47519275 46636195 46642345 46508579 46652836 46208807
3619 46208807 45641328 45784961 45953797 45192008 44755694 44479607 44109123 44937991 44805396
3610 44805396 43889061 43686456 43331534 43188806 43249566 42756752 42269951 42266002 42677965 42581390
3600 42581390 42613262 42414837 41832578 41265800 42270591 42355951 41808444 41960850 41427926 41238862
3590 41238862 41172265 41037765 40824954 40953512 41057120 40755096 41476635 41039735 40738297 41075881
3580 41075881 41169047 41243380 41414316 41404097 41247120 40578663 40430831 41182799 41288782 40627667
$$ packed form
3647E1456015J64166k45793J25700m16184l79446J54585k27113j50222o97696
3638D9784012l44042N34470r65189k14296J68672l62862K22793k71202q38980
3629D7713376o02511N53805J07913L55530o08838q83080O150j33766J44257m44029
3619D6208807n67479J43633J68836p61789m36314k76087l70484Q28868j32595
3610D4805396r16335k02605l54922j42728O0760m92814m86801l949M11963r6575
3600D2581390L1872j98425n82259n66778J004791Q5360n47507J52406n32924j89064
3590D1238862o6597j34500k12811J28558J03608l02024P21539m36900l01438L37584
3580D1075881R3166P4333J70936j0219j56977o68457j47832P51968J05983o61115
$$ plain form
3570 40627667 40799901 40702076 41328565 42333858 41734598 41539001 41951283 41514451 41249946
3561 41249946 41937742 42119227 42160410 42484274 42616773 41976211 42166644 42584144 42260014 42263490
3551 42263490 42838581 43642043 43696479 43073976 43112606 43147244 43460739 43300189 43204707 43167679
3541 43167679 43766147 43992860 43966477 44116359 44366017 45265627 44955354 44370422 44784754 45181302
3531 45181302 45468821 45476711 45977653 45787351 46155309 46518736 46902021 47162923 47458522 47638806
3521 47638806 48285251 47986320 48387312 48700843 48755112 49221864 50173453 50498577 50079028 50289367
3511 50289367 50833715 51150878 51851744 51692573 51890767 52363182 52334907 52599281 51859477 52519536
3501 52519536 53265804 53348295 53560086 54081909 54581125 54852352 54868197 55261652 55135712 55468800
$$ packed form
3570D0627667J72234r7825O26489J005293n99260j95597M12282m36832k64505
3561D1249946O87796J81485M1183L23864J32499o40562J90433M17500l24130L476
3551D2263490N75091Q03462N4436o22503L8630L4638L13495j60550r5482l7028
3541D3167679N98468K26713k6383J49882K49658Q99610l10273n84932M14332L96548
3531D5181302K87519P890N00942j90302L67958L63427L83285K60902K95599J80284
3521D7638806O46445k98931M00992L13531N4269M66752R51589L25124m19549K10339
3511E0289367N44348L17163P00866j59171J98194M72415k8275K64374p39804O60059
3501E2519536P46268Q2491K11791N21823M99216K71227J5845L93455j25940L33088
$$ plain form
3491 55468800 55765875 56331182 56794729 57075233 57625031 58067752 58532202 59591832 60146570
3482 60146570 60991196 61523707 61992333 61844461 61787964 61859258 61665300 60958036 59608035 58291886
3472 58291886 57166154 55786518 53854441 52195002 51396774 49801283 48654315 47423858
3464 47423858 46219935 45318138 44341714 42918245 41834829 40984912 40306121 39588868 38903579
3455 38903579 38284407 37214151 36429547 35577123 34629267 33682810 33084628 32783664 32296101
3446 32296101 32181596 31348036 30315374 29813100 29325572 29199665 28935769 28476903 27743019
3437 27743019 27719395 27594410 27298663 27079067 26828369 26366406 26113090 25517521 25310867 25162822
3427 25162822 25055392 25110167 25018344 24390042 24440246 24179511 23627120 23833592 23820949 23240262
$$ packed form
3491E5468800K97075N65307M63547K80504N49798M42721M64450J059630N54738
3482F0146570Q44626N32511M68626j47872n6497P1294j93958p07264j350001j316149
3472E8291886j125732j379636j932077j659439p98228j595491j146968j230457
3464D7423858j203923r01797r76424j423469j083416q49917o78791p17253o85289
3455C8903579o19172j070256p84604q52424r47856r46457n98182l00964m87563
3446C2296101j14505q33560j032662n02274m87528j25907k63896m58866p33884
3437B7743019k3624j24985k95747k19596k50698m61963k53316n95569k06654j48045
3427B5162822j07430N4775r1823o28302N0204k60735n52391K06472j2643n80687
$$ plain form
3417 23240262 22934772 22952457 22921142 22449028 22265671 21735263 21733880 21566433 21692158 21797434
3407 21797434 21881107 21394923 21371056 21450815 20708846 20981158 21068813 20880985 20555237 20721673
3397 20721673 20712920 20207475 20119681 20332230 20168268 20058947 20044238 19696307 20105471 20240642
3387 20240642 20159430 19965516 19175341 19304952 20157763 20053989 19614126 19549359 19295759 19431988
3377 19431988 19153465 18938109 19219950 18922449 18486119 18661966 18490029 18919184 18738376
3368 18738376 18862134 18979171 19083316 18581804 18551858 19195376 19414254 18789639 18624526 18938964
3358 18938964 18700725 18952880 18805935 18802547 19122467 19188255 18709179 18911840 18879456 18367389
3348 18367389 18135989 18129545 18225888 17443640 17142436 17571521 17712891 17516587 17256848 16930095
$$ packed form
3417B3240262l05490J7685l1315m72114j83357n30408j383j67447J25725J05276
3407B1797434Q3673m86184k3867P9759p41969K72312Q7655j87828l25748J66436
3397B0721673q753n05445q7794K12549j63962j09321j4709l47931M09164J35171
3387B0240642q1212j93914p90175J29611Q52811j03774m39863o4767k53600J36229
3377A9431988k78523k15356K81841k97501m36330J75847j71937M29155j80808
3368A8738376J23758J17037J04145n01512k9946O43518K18878o24615j65113L14438
3358A8938964k38239K52155j46945l388L19920O5788m79076K02661l2384n12067
3348A8367389k31400o444R6343p82248l01204M29085J41370j96304k59739l26753
$$ plain form
3338 16930095 17381683 17762546 16774900 16366362 16312775 16163814 16136648 16056569 16347351 16406133
3328 16406133 15674834 15628287 15942849 16298196 16202921 15776148 15779639 15652007 15552799 15331825
3318 15331825 15372833 15321936 15369428 14947817 14810453 14923246 15000369 15335570 14788967 15030151
3308 15030151 15091063 14803389 14823455 14958594 15219036 15388555 15097373 15028959 14969240 14356857
3298 14356857 14436395 14553980 14510872 15035666 14533190 14124089 14886149 14645559 14099400 14361838
3288 14361838 14383678 13942392 14385879 14754809 14377717 14365135 13809506 14130098 14222219 13988908
3278 13988908 13849120 13727447 14070407 14116774 14433227 14362403 13603174 13635461 13860320 13498268
3268 13498268 13906978 13924129 13619621 13583125 14040096 13803067 13707441 13568289 13563984 14036927
$$ packed form
3338A6930095M51588L80863r87646m08538n3587j48961k7166q0079K90782N8782
3328A6406133p31299m6547L14562L55347r5275m26773L491j27632r9208k20974
3318A5331825M1008n0897M7492m21611j37364J12793P7123L35201n46603K41184
3308A5030151O0912k87674K0066J35139K60442J69519k91182o8414n9719o12383
3298A4356857P9538J17585m3108N24794n02476m09101P62060k40590n46159K62438
3288A4361838K1840m41286M43487L68930l77092j2582n55629L20592R2121k33311
3278A3988908j39788j21673L42960M6367L16453p0824p59229L2287K24859l62052
3268A3498268M08710J7151l04508l6496M56971k37029r5626j39152m305M72943
$$ plain form
3258 14036927 14341119 14402046 14272083 13945824 14049185 13995576 13670123 13655662 13955687 13691385
3248 13691385 13786260 13804694 13880061 14262637 14342166 14240715 14263215 14505913 14045464 13775368
3238 13775368 14048114 13872871 13868171 14224692 14605050 14847475 14725496 14786543 14179916 14067392
3228 14067392 13969302 13967911 14427420 14835441 14243631 14708836 15213742 15409186 15558854 15579342
3218 15579342 15443705 15439788 15331301 15548482 15857202 16008846 16091091 16216339 16315911 16229996
3208 16229996 16156460 16078011 16371346 16592776 16442824 16953901 16982827 16622537 16706163 17137478
3198 17137478 17177849 17312230 17645560 17579536 17647911 18243217 18532295 18161456 18449989 18688143
3188 18688143 19111457 19071010 19052618 20059370 20430604 20514087 20570385 20218965 20958360 21629651
$$ packed form
3258A4036927L04192O0927j29963l26259J03361n3609l25453j4461L00025k64302
3248A3691385R4875J8434P5367L82576P9529j01451K2500K42698m60449k70096
3238A3775368K72746j75243m700L56521L80358K42425j21979O1047o06627j12524
3228A4067392r8090j391M59509M08021n91810M65205N04906J95444J49668K0488
3218A5579342j35637l917j08487K17181L08720J51644Q2245J25248R9572q5915
3208A6229996p3536p8449K93335K21430j49952N11077K8926l60290Q3626M31315
3198A7137478M0371J34381L33330o6024O8375N95306K89078l70839K88533K38154
3188A8688143M23314m0447j8392J006752L71234Q3483N6298l51420P39395O71291
$$ plain form
3178 21629651 22181719 22480318 22603519 22526326 23047304 23913816 23807226 24517675 24899629 24553249
3168 24553249 25043961 25211884 25766846 26326447 26515876 26511028 27690867 27873857 28128514 28738709
3158 28738709 29472459 29810143 30028530 30984274 31404657 31146449 31256405 31147433 31319755
3149 31319755 31645371 31260650 31198565 31374033 31624006 32065280 32316101 32405488 32749581 32979864
3139 32979864 32928678 32938781 33377178 33893426 34555106 35103218 35897178 36372734 36660504 37258570
3129 37258570 37512643 37593571 37333690 36478640 34696685 33453935 32194045 30974854 29539680
3120 29539680 28761159 27987217 26938989 26997073 26650414 26757962 26590197 25986046 25823833
3111 25823833 25871949 25799093 25622947 25694962 25891056 25593646 26224217 26730994 26523070 26290493
$$ packed form
3178B1629651N52068K98599J23201p7193N20978Q66512j06590P10449L81954l46380
3168B4553249M90712J67923N54962N59601J89429m848J179839J82990K54657O10195
3158B8738709P33750L37684K18387R55744M20383k58208J09956j08972J72322
3149C1319755L25616l84721o2085J75468K49973M41274K50821Q9387L44093K30283
3139C2979864n1186J0103M38397N16248O61680N48112P93960M75556K87770N98066
3129C7258570K54073Q0928k59881q55050j781955j242750j259890j219191j435174
3120B9539680p78521p73942j048228N8084l46659J07548j67765o04151j62213
3111B5823833M8116p2856j76146P2015J96094k97410O30571N06777k07924k32577
$$ plain form
3101 26290493 26321070 26826476 26980817 26531623 25724590 25586838 25276638 24002063 22443933
3092 22443933 21177361 20104274 19631559 19034015 18279330 17527482 16884018 16166633 15461618
3083 15461618 14619476 14096371 14407095 13741104 14002813 13716105 13420424 12914231 13050890
3074 13050890 12616225 12299908 12217447 12182093 12034058 12043436 11260154 10867809 11363519 10942507
3064 10942507 10349040 10314746 10616647 10617189 10416907 10153791 9934154 9878421 9778953 9636847
3054 9636847 9308600 9156803 9394036 9792762 9461331 8699515 8360548 8885382 8968424 8106733
3044 8106733 8158405 8545560 9030024 9286430 9223688 8725858 8333003 8335393 8547586 9123256
3034 9123256 8600523 7973714 8484710 8463774 7908134 7846518 8269474 8178193 7930888 7889643
$$ packed form
3101B6290493L0577N05406J54341m49194q07033j37752l10200j274575j558130
3092B2443933j266572j073087m72715n97544p54685p51848o43464p17385p05015
3083A5461618q42142n23105L10724o65991K61709k86708k95681n06193J36659
3074A3050890m34665l16317q2461l5354j48035R378p83282l92345M95710m21012
3064A0942507n93467l4294L01901N42k00282k63116k19637n5733r9468j42106
3054I636847l28247j51797K37233L98726l31431p61816l38967N24834Q3042q61691
3044H106733N1672L87155M84464K56406o2742m97830l92855K390K12193N75670
3034I123256n22733o26809N10996k0936n55640o1616M22956r1281k47305m1245
$$ plain form
3024 7889643 7954146 7847994 7670291 7589212 7431177 7769513 7636799 7147871 7356254 7691514
3014 7691514 8090039 8029334 7781513 7342643 7100236 7326487 7338858 7565678 7823421 7312420
3004 7312420 7247694 7225587 7949459 7689108 6948003 7437408 7337422 6618930 6737730 6292529
2994 6292529 6414540 6361306 6408317 6607987 6886733 6397946 6705866 7065925 6976147 6957273
2984 6957273 7334990 7000400 5885147 6245391 6678106 7028802 6743018 6490291 6633460
2975 6633460 6599630 6718037 6846064 6972739 6953942 7253573 7157438 6758479 6400529 6265679
2965 6265679 5753975 6005376 6756999 6638653 6523343 6383662 6211662 6132147 6931793 6441429
2955 6441429 5994010 6284174 5990962 6044556 5861785 5937329 6148551 6372021 6236787 6009358
$$ packed form
3024G889643O4503j06152j77703q1079j58035L38336j32714m88928K08383L35260
3014G691514L98525o0705k47821m38870k42407K26251J2371K26820K57743n11001
3004G312420o4726k2107P23872k60351p41105M89405r9986p18492J18800m45201
2994F292529J22011n3234M7011J99670K78746m88787L07920L60059q9778j8874
2984F957273L77717l34590j115253L60244M32715L50696k85784k52727J43169
2975F633460l3830J18407J28027J26675j8797K99631r6135l98959l57950j34850
2965F265679n11704K51401P51623j18346j15310j39681j72000p9515P99646m90364
2955F441429m47419K90164k93212N3594j82771P5544K11222K23470j35234k27429
$$ plain form
2945 6009358 6200048 6237627 5731001 5532944 5955421 5869355 5662901 5844678 5914545 6007679
2935 6007679 6049861 5691665 5368249 5443632 5598991 5912923 5919594 6131870 6248453 6081421
2925 6081421 6173494 5725587 5617714 5430259 5198836 5729142 5997298 5903813 6213205 5910794
2915 5910794 5841762 5788798 5779824 5499613 5112915 5052235 5387129 5007987 4770219 5043372
2905 5043372 5370723 5207286 5146430 5687337 5701042 5756548 5849817 5525791 5019509 4703640
2895 4703640 5173081 4740724 5023835 5250117 5045854 4852506 4909058 4601118 4479532 4919915
2885 4919915 5436590 5302809 5353357 5235638 4996580 4934192 5160260 5160026 5030514 4855567
2875 4855567 5576247 5642651 5527772 4489419 4319926 5045830 4843587 4864818 5205353 4900420
$$ packed form
2945F009358J90690L7579n06626j98057M22477q6066k06454J81777O9867R3134
2935F007679M2182l58196l23416P5383J55359L13932O671K12276J16583j67032
2925F081421R2073m47907j07873j87455k31423N30306K68156r3485L09392l02411
2915E910794o9032n2964q974k80211l86698o0680L34894l79142k37768K73153
2905E043372L27351j63437o0856N40907J3705N5506R3269l24026n06282l15869
2895D703640M69441m32357K83111K26282k04263j93348N6552l07940j21586M40383
2885D919915N16675j33781N0548j17719k39058o2388K26068k34j29512j74947
2875D855567P20680O6404j14879j038353j69493P25904k02243K1231L40535l04933
$$ plain form
2865 4900420 5119575 4844990 4743284 5660678 5350708 5253719 4871369 4963920 5084683 5204000
2855 5204000 4897379 5083866 5192617 4945397 4881192 5237953 5321316 5763167 5851262 5709667
2845 5709667 4967111 4633515 4522828 5107803 4370349 4068005 4501340 4816912 5167238 4570749
2835 4570749 4857576 4865942 4568812 4458720 3997098 4555052 4732564 4462390 4696475 4904390
2825 4904390 4875089 5045590 4960022 4688552 4255594 5166243 5331169 4999045 4659073 4689276
2815 4689276 5091999 4956928 5150295 5051090 4307730 4164534 4814250 5381848 5436057 4948208
2805 4948208 5149165 5210825 4909037 5021950 4840403 4381308 4441969 4571669 4480893 4616603
2795 4616603 4679091 4129459 3538009 3309806 3263547 3896704 4639292 4655636 4668871 4397253
$$ packed form
2865D900420K19155k74585j01706R17394l09970r6989l82350R2551J20763J19317
2855E204000l06621J86487J08751k47220o4205L56761Q3363M41851Q8095j41595
2845E709667p42556l33596j10687N84975p37454l02344M33335L15572L50326n96489
2835D570749K86827Q366k97130j10092m61622N57954J77512k70174K34085K07915
2825D904390k9301J70501q5568k71470m32958R10649J64926l32124l39972L0203
2815D689276M02723j35071J93367r9205p43360j43196O49716N67598N4209m87849
2805D948208K00957O1660l01788J12913j81547m59095O0661J29700r0776J35710
2795D616603O2488n49632n91450k28203m6259O33157P42588J6344J3235k71618
$$ plain form
2785 4397253 4349230 4512177 4431710 4473034 4918895 4747277 3822391 3812570 4323529 4430778
2775 4430778 4180470 3970270 4649545 4818547 4593787 4653952 4763927 4725468 4835015 4587591
2765 4587591 4514512 4315957 4162967 4455129 4692933 4450956 4352371 4368476 4369272 4510199 4766468
2754 4766468 4592317 4571550 4800441 4610431 4208422 4517852 4926204 4597412 4350303 3731415
2744 3731415 3889818 4216637 4113272 4185692 4022604 4598539 4443868 3727605 4309878 3957231
2734 3957231 4114128 4070046 4225344 4154263 4361815 4459914 4321223 4069973 4017185 4307408
2724 4307408 4315408 4197779 3907386 3762223 3575182 3658843 4090517 4367985 3824671 4081397
2714 4081397 4283052 4429467 4083560 3886439 4411074 4340232 3907839 3464250 3731937 3980761
$$ packed form
2785D397253m8023J62947q0467M1324M45861j71618r24886r821N10959J07249
2775D430778k50308k10200O79275J69002k24760O0165J09975l8459J09547k47424
2765D587591p3079j98555j52990K92162K37804k41977r8585J6105P96J40927K56269
2754D766468j74151k0767K28891j90010m02009L09430M08352l28792k47109o18888
2744C731415J58403L26819j03365P2420j63088N75935j54671p16263N82273l52647
2734C957231J56897m4082J55298p1081K07552R8099j38691k51250n2788K90223
2724D307408Q000j17629k90393j45163j87041Q3661M31674K77468n43314K56726
2714D081397K01655J46415l45907j97121N24635p0842m32393m43589K67687K48824
$$ plain form
2704 3980761 3794152 4106842 3565953 3413681 3190036 3119381 3712111 4271563 4200426 3893469
2694 3893469 3784038 3878150 3955587 3601308 3521662 4151119 3670005 3040326 3654099 4225695
2684 4225695 4478311 4410943 4765247 4391091 3888409 3758986 3916885 4037514 3931291 3802679
2674 3802679 3594030 3640305 4342911 4470475 4376055 4465767 4425279 4108070 3868372 3717301
2664 3717301 3419394 4009015 3824123 3636162 3372227 3077046 3387213 3945474 3658279 3714385
2654 3714385 3921161 3506672 3007152 3454211 3703736 3997415 3977086 3940311 3541328 3067534
2644 3067534 3302666 3764283 3487869 3646574 3779742 4124274 3794868 3591726 3855569 3607640
2634 3607640 3944279 4021500 3832823 4295538 4672550 4406740 4073418 4019177 3982253 3526715
$$ packed form
2704C980761j86609L12690n40889j52272k23645p0655N92730N59452p1137l06957
2694C893469j09431R4112P7437l54279p9646O29457m81114o29679O13773N71596
2684D225695K52616o7368L54304l74156n02682j29423J57899J20629j06223j28612
2674C802679k08649M6275P02606J27564r4420Q9712m0488l17209k39698j51071
2664C717301k97907N89621j84892j87961k63935k95181L10167N58261k87195N6106
2654C714385K06776m14489m99520M47059K49525K93679k0329l6775l98983m73794
2644C067534K35132M61617k76414J58705J33168L44532l29406k03142K63843k47929
2634C607640L36639P7221j88677M62715L77012k65810l33322n4241l6924m55538
$$ plain form
2624 3526715 3919699 4245324 4142335 4431790 4177613 3663433 3459199 3261074 3474136 3947248
2614 3947248 3520175 3572311 4106517 3958434 4102058 4469587 4582153 4358575 4104483 3876492
2604 3876492 4267411 3611867 3625408 3749339 4339846 4381754 3888753 4310264 4991591 4807697
2594 4807697 4676827 4278215 4216290 3885847 4214947 4083276 4029490 4004344 4348040 3935171
2584 3935171 4261244 4535901 4237025 4397163 4117906 4111507 4523728 4004471 4196625 4231579
2574 4231579 3829043 4030147 4056124 3888288 3909567 4414505 4329889 3702718 3893777 3719089
2564 3719089 3470302 3560212 3788931 4023237 4095822 4316891 4018366 3756143 3630295 4070630
2554 4070630 4019703 3934842 4198517 3983799 4063871 4341326 3870356 3985310 3564475 3590221
$$ packed form
2624C526715L92984L25625j02989K89455k54177n14180k04234j98125K13062M73112
2614C947248m27073N2136N34206j48083J43624L67529J12566k23578k54092k27991
2604C876492L90919o55544J3541J23931N90507M1908m93001M21511O81327j83894
2594D807697j30870l98612o1925l30443L29100j31671n3786k5146L43696m12869
2584C935171L26073K74657k98876J60138k79257o399M12221n19257J92154L4954
2574D231579m02536K01104K5977j67836K1279N04938q4616o27171J91059j74688
2564C719089k48787Q9910K28719K34306P2585K21069k98525k62223j25848M40335
2554D070630n0927q4861K63675k14718Q0072K77455m70970J14954m20835K5746
$$ plain form
2544 3590221 3823184 4299566 3894697 3974783 4513841 4335950 4165050 4308949 4068722 3884643
2534 3884643 3858027 3449695 3827328 4532989 4178795 4340834 4358093 4086482 4132861 4674518
2524 4674518 4538116 3873444 3737997 3965220 4216735 4374316 4755976 4676888 4678648 4664426
2514 4664426 4643172 3869559 3950690 4218040 4334957 4460972 4492493 4625079 4501265 5070386
2504 5070386 5416686 5032080 4965185 5163612 4599798 4706060 4802150 5389585 5505330 5941738
2494 5941738 5640109 5546889 5462915 5551499 5107320 4844953 4726795 4521436 5002717 5008621
2484 5008621 4609143 4657622 4961308 4958831 4724870 4922853 5182950 5271879 5383009 5534220
2474 5534220 4974653 4851237 5422416 5078331 4970940 5364021 5505905 5074277 5668885 5806283
$$ packed form
2544C590221K32963M76382m04869Q0086N39058j77891j70900J43899k40227j84079
2534C884643k6616m08332L77633P05661l54194J62039J7259k71611M6379N41657
2524D674518j36402o64672j35447K27223K51515J57581L81660p9088J760j4222
2514D664426k1254p73613Q1131K67350J16917J26015L1521J32586j23814N69121
2504E070386L46300l84606o6895J98427n63814J06262R6090N87435J15745M36408
2494E941738l01629r3220q3974Q8584m44179k62367j18158k05359M81281N904
2484E008621l99478M8479L03686k477k33961J97983K60097Q8929J11130J51211
2474E534220n59567j23416N71179l44085j07391L93081J41884m31628N94608J37398
$$ plain form
2464 5806283 5779942 5726599 5400043 5430140 5252257 5278710 5638491 5890394 5974075 6053206 6388993
2453 6388993 5639083 5421237 5593708 5883279 6517232 6122318 5989107 6576674 6271767 6325572
2443 6325572 6454188 6695243 6802909 7139075 6795763 6256623 6903240 7325087 7222803 6806983
2433 6806983 6995547 7523850 7031660 7417873 7641306 7394980 7683170 7603650 7278320 7482294
2423 7482294 8438089 8215160 8278738 8325308 8362393 8403026 9058193 9442150 8704593 8582384
2413 8582384 9217482 9604234 10124431 10153266 9922937 9885272 10270838 10441979 10516437 10768436
2403 10768436 10710048 10951066 11060365 11159587 11013275 11473063 11161176 11407055 11939742 12287500
2393 12287500 12972734 13045127 12607156 12770326 13171985 13762299 13921732 14244024 14442614 14928093
$$ packed form
2464E806283k6341n3343l26556L0097j77883K6453L59781K51903Q3681P9131L35787
2453F388993p49910k17846J72471K89571O33953l94914j33211N87567l04907N3805
2443F325572J28616K41055J07666L36166l43312n39140O46617M21847j02284m15820
2433F806983J88564N28303m92190L86213K23433k46326K88190p9520l25330K03974
2423G482294R55795k22929O3578M6570L7085M0633O55167L83957p37557j22209
2413H582384O35098L86752N20197K8835k30329l7665L85566J71141P4458K51999
2403A0768436n8388K41018J09299R9222j46312M59788l11887K45879N32687L47758
2393A2287500O85234P2393m37971J63170M01659N90314J59433L22292J98590M85479
$$ plain form
2383 14928093 15474959 16156477 16305767 16346085 16072629 16098178 17399199 18832715 18728652
2374 18728652 18841520 19531656 19588454 19800629 20382581 20719956 20719262 21301977 21388943 21750448
2364 21750448 22144130 22709031 23766300 24676734 25780687 26683430 28076904 29500883 31348199
2355 31348199 33435733 33882548 34486081 34870317 35660305 36146495 36480345 37462624 38976662
2346 38976662 40285122 41080339 42642259 43570632 45094666 46430646 48114261 50329218
2338 50329218 52451252 55129234 58273883 62819647 68458899 73595709 79020743 82966014
2330 82966014 83948855 86902040 91255854 97317930 95025086 80421521 67603077 59155654
2322 59155654 51703238 45813389 41031613 37153765 33474675 31226563 29333391 27185731
$$ packed form
2383A4928093N46866O81518J49290M0318k73456K5549J301021J433516j04063
2374A8728652J12868O90136N6798K12175N81952L37375o94N82715Q6966L61505
2364B1750448L93682N64901J057269R10434J103953R02743J393474J423979J847316
2355C1348199K087534M46815O03533L84236P89988M86190L33850R82279J514038
2346C8976662J308460P95217J561920R28373J524034J335980J683615K214957
2338E0329218K122034K677982L144649M545764N639252N136810N425034L945271
2330H2966014R82841K953185M353814O062076k292844j4603565j2818444q447423
2322E9155654p452416n889849m781776l877848l679090k248112j893172k147660
$$ plain form
2314 27185731 24922456 23909157 23523236 22448429 21229585 19973420 18764678 17680325
2306 17680325 16962191 16522139 15764696 15290430 14361225 13569765 12849597 12453701 11875174
2297 11875174 11503191 11545497 11163801 10874358 10772114 10460358 10281009 9753547 9094216 8757971
2287 8757971 8433333 8201595 8546813 8096930 7373479 7576115 7123068 7073871 6891811 6980007
$$ packed form
2314B7185731k263275j013299l85921j074807j218844j256165j208742j084353
2306A7680325p18134m40052p57443m74266r29205p91460p20168l95896n78527
2297A1875174l71983M2306l81696k89443j02244l11756j79349n27462o59331l36245
2287H757971l24638k31738L45218m49883p23451K02636m53047m9197j82060Q8196
$$ [...]
##END NTUPLES=NMR SPECTRUM
##END=
