##TITLE=1H_DE-80H_X3
 200.13MHz, d2o
 8 sc
 
 19ns.26.2.2025
##JCAMPDX= 6.0         $$ Bruker NMR JCAMP-DX V2.0
##DATA TYPE= NMR SPECTRUM
##DATA CLASS= NTUPLES
##ORIGIN= UXNMR, Bruker Analytische Messtechnik GmbH
##OWNER= pz
$$ XWIN-NMR		Version 3.5
$$ Fri Jun 20 16:15:07 2025 Russian Standard Time (UT+4h)  Yarkov@DPX200
##.OBSERVE FREQUENCY= 200.1313
##.OBSERVE NUCLEUS= ^1H
##.ACQUISITION MODE= SIMULTANEOUS
##.ACQUISITION SCHEME= undefined
##.AVERAGES= 8
##.DIGITISER RES= 18
##SPECTROMETER/DATA SYSTEM= spect
##.PULSE SEQUENCE= zg30
##.SOLVENT NAME= DMSO
##.SHIFT REFERENCE= (INTERNAL, DMSO, 0, 15.5353)
##AUDIT TRAIL= $$ (NUMBER, WHEN, WHO, WHERE, WHAT)
$$ ##TITLE= Audit trail, XWIN-NMR		Version 3.5
$$ ##JCAMPDX= 5.01
$$ ##ORIGIN= Bruker BioSpin GmbH
$$ ##OWNER= Yarkov
$$ C:/Bruker/XWIN-NMR/data/yarkov2/nmr/H-C/1/pdata/1/auditp.txt
$$ ##AUDIT TRAIL=  $$ (NUMBER, WHEN, WHO, WHERE, WHAT)
(   1,<2025-06-20 16:14:08.59 +0400>,<Yarkov>,<DPX200>,
      <created by zg, POWCHK disabled, PULCHK disabled
       configuration hash MD5:
       00 E9 B6 7A A2 85 ED C7 34 08 36 98 17 FE 4E 26
       data hash MD5: 16K
       BC BE A5 94 B6 DE C6 B0 82 88 75 CA 02 3E AF EA>)
(   2,<2025-06-20 16:14:13.00 +0400>,<Yarkov>,<DPX200>,
      <Start of raw data processing
       efp BC_mod = 2 LB = 0.25 FT_mod = 6 PKNL = 1 PHC0 = -1702.658 PHC1 = -8.633403 SI = 16K 
       data hash MD5: 16K
       E9 38 D2 38 D6 0D 39 19 97 5E 81 67 A2 F6 92 54>)
(   3,<2025-06-20 16:14:29.59 +0400>,<Yarkov>,<DPX200>,
      <pk PHC0 = -3.52905 PHC1 = -2.200001 
       data hash MD5: 16K
       9F 92 15 C9 81 3F 74 85 94 48 08 81 72 10 F1 09>)
$$ ##END=
$$ 
$$ hash MD5
$$ 0C 40 83 6A 0E C4 28 D4 6A 39 31 4D CB 34 97 BC
##$RELAX= 
##$RELAX= 
##$RELAX= 
##$RELAX= 
##$RELAX= 
##$RELAX= 
$$ Bruker specific parameters
$$ --------------------------
##$DU= <C:/Bruker/XWIN-NMR>
##$EXPNO= 1
##$NAME= <H-C>
##$PROCNO= 1
##$TYPE= <nmr>
##$USER= <yarkov2>
##$AMP= (0..31)
100 100 100 100 100 100 100 100 100 100 100 100 100 100 100 100 100 100 
100 100 100 100 100 100 100 100 100 100 100 100 100 100 
##$AQSEQ= 0
##$AQ_mod= 1
##$AUNM= <au_zg>
##$AUTOPOS= <>
##$BF1= 200.13
##$BF2= 200.13
##$BF3= 200.13
##$BF4= 200.13
##$BF5= 200.13
##$BF6= 200.13
##$BF7= 200.13
##$BF8= 200.13
##$BYTORDA= 1
##$CFDGTYP= 0
##$CFRGTYP= 5
##$CHEMSTR= <none>
##$CNST= (0..31)
1 1 145 1 1 1 1 1 1 1 1 1 1 1 1 1 1 1 1 1 1 1 1 1 1 1 1 1 1 1 1 1 
##$CPDPRG= <>
##$CPDPRG1= <>
##$CPDPRG2= <>
##$CPDPRG3= <>
##$CPDPRG4= <mlev>
##$CPDPRG5= <mlev>
##$CPDPRG6= <mlev>
##$CPDPRG7= <mlev>
##$CPDPRG8= <mlev>
##$CPDPRGB= <>
##$CPDPRGT= <>
##$D= (0..31)
0 0.7 0 0 0 0 0 0 0 0 0 0.03 0 0 0 0 0 0 0 0 0 0 0 0 0 0 0 0 0 0 0 0 
##$DATE= 1750421647
##$DBL= (0..7)
120 120 120 120 120 120 120 120 
##$DBP= (0..7)
150 150 150 150 150 150 150 150 
##$DBP07= 0
##$DBPNAM0= <>
##$DBPNAM1= <>
##$DBPNAM2= <>
##$DBPNAM3= <>
##$DBPNAM4= <>
##$DBPNAM5= <>
##$DBPNAM6= <>
##$DBPNAM7= <>
##$DBPOAL= (0..7)
0.5 0.5 0.5 0.5 0.5 0.5 0.5 0.5 
##$DBPOFFS= (0..7)
$$ [...]
##$SUBNAM2= <"">
##$SUBNAM3= <"">
##$SUBNAM4= <"">
##$SUBNAM5= <"">
##$SUBNAM6= <"">
##$SUBNAM7= <"">
##$SUBNAM8= <"">
##$SUBNAM9= <"">
##$SW= 18.0517328524113
##$SWIBOX= (0..15)
0 0 2 0 0 0 0 0 0 0 0 0 0 0 0 0 
##$SW_h= 3612.71676300578
##$TD= 16384
##$TD0= 1
##$TE= 0
##$TE2= 300
##$TE3= 300
##$TEG= 300
##$TL= (0..7)
0 120 120 120 120 120 120 120 
##$TP= (0..7)
150 150 150 150 150 150 150 150 
##$TP07= 0
##$TPNAME0= <>
##$TPNAME1= <>
##$TPNAME2= <>
##$TPNAME3= <>
##$TPNAME4= <>
##$TPNAME5= <>
##$TPNAME6= <>
##$TPNAME7= <>
##$TPOAL= (0..7)
0.5 0.5 0.5 0.5 0.5 0.5 0.5 0.5 
##$TPOFFS= (0..7)
0 0 0 0 0 0 0 0 
##$TUNHIN= 0
##$TUNHOUT= 0
##$TUNXOUT= 0
##$USERA1= <user>
##$USERA2= <user>
##$USERA3= <user>
##$USERA4= <user>
##$USERA5= <user>
##$V9= 5
##$VALIST= <valist>
##$VCLIST= <CCCCCCCCCCCCCCC>
##$VD= 0
##$VDLIST= <DDDDDDDDDDDDDDD>
##$VPLIST= <PPPPPPPPPPPPPPP>
##$VTLIST= <TTTTTTTTTTTTTTT>
##$WBST= 1024
##$WBSW= 4
##$XGAIN= (0..3)
0 0 0 0 
##$XL= 0
##$YL= 0
##$YMAX_a= 123535
##$YMIN_a= -90475
##$ZGOPTNS= <>
##$ZL1= 120
##$ZL2= 120
##$ZL3= 120
##$ZL4= 120
##$ABSF1= 0
##$ABSF2= 0
##$ABSG= 0
##$ABSL= 0
##$ALPHA= 0
##$AQORDER= 0
##$ASSFAC= 0
##$ASSFACI= 0
##$ASSFACX= 0
##$ASSWID= 0
##$AUNMP= <proc_1d>
##$AZFE= 0.1
##$AZFW= 0.1
##$BCFW= 0
##$BC_mod= 2
##$BYTORDP= 0
##$COROFFS= 0
##$CY= -3
##$DATMOD= 1
##$DC= 0
##$DFILT= <>
##$DTYPP= 0
##$F1P= 0
##$F2P= 0
##$FCOR= 1
##$FTSIZE= 16384
##$FT_mod= 6
##$GAMMA= 0
##$GB= 0
##$INTBC= 1
##$INTSCL= 3.241238e-09
##$ISEN= 128
##$LB= 0.25
##$LEV0= 0
##$LPBIN= 0
##$MAXI= 10000
##$MC2= 0
##$MEAN= 0
##$ME_mod= 0
##$MI= 1.114404
##$NCOEF= 0
##$NC_proc= -9
##$NLEV= 6
##$NOISF1= 3.799351
##$NOISF2= 2.8
##$NSP= 0
##$NTH_PI= 0
##$NZP= 0
##$OFFSET= 15.53535
##$PC= 1
##$PHC0= -1706.187
##$PHC1= -10.8334
##$PH_mod= 1
##$PKNL= yes
##$PPARMOD= 0
##$PSCAL= 0
##$PSIGN= 0
##$REVERSE= no
##$SF= 200.129997269525
##$SI= 16384
##$SIGF1= 3
##$SIGF2= 2
##$SINO= 0.751879
##$SIOLD= 32768
##$SREGLST= <19F.Aceton>
##$SSB= 0
##$STSI= 16384
##$STSR= 0
##$SW_p= 3612.71676300578
##$SYMM= 0
##$S_DEV= 0
##$TDeff= 16384
##$TDoff= 0
##$TI= <>
##$TILT= no
##$TM1= 0
##$TM2= 0
##$TOPLEV= 0
##$USERP1= <user>
##$USERP2= <user>
##$USERP3= <user>
##$USERP4= <user>
##$USERP5= <user>
##$WDW= 1
##$XDIM= 16384
##$YMAX_p= 391181352
##$YMIN_p= -3496650
$$ End of Bruker specific parameters
$$ ---------------------------------
##NTUPLES= NMR SPECTRUM
##VAR_NAME=  FREQUENCY,     SPECTRUM/REAL,   SPECTRUM/IMAG
##SYMBOL=    X,             R,               I
##VAR_TYPE=  INDEPENDENT,   DEPENDENT,       DEPENDENT
##VAR_FORM=  AFFN,          ASDF,            ASDF
##VAR_DIM=   16384,         16384,           16384
##UNITS=     HZ,            ARBITRARY UNITS, ARBITRARY UNITS
##FACTOR=    0.220516191357247, 1,           1
##FIRST=     3109.08952223833, 0,            0
##LAST=      -503.627240767453, 0,           0
##MIN=       -503.627240767453, -3496650,    0
##MAX=       3109.08952223833, 391181352,    0
$$ Real data points
##PAGE= N=1
##DATA TABLE= (X++(R..R)), XYDATA
$$ [...]
$$ plain form
6593 18050813 17848323 17818093 17879465 18114134 17603996 17368726 17236099 17239990 17417322 17376815
6583 17376815 17485983 17416827 17348783 17186546 16950875 16860357 17033805 16841775 17002331 17055306
6573 17055306 16890170 16714715 16624786 16464026 16635717 16454125 16257654 16285330 16234587 16329557
6563 16329557 16298119 16306205 16038668 15814055 15738152 15705179 15833067 15647943 15496924 15738896
6553 15738896 15522780 15530489 15421530 15294797 15256213 15188748 15101791 15246389 15411706 15293452
6543 15293452 15228507 15400421 15173453 15012452 15042120 15045062 15226435 14966995 15090554 15061846
6533 15061846 14946401 14429997 14280516 14406279 14634332 14684421 14628368 14514018 14285782 14057242
6523 14057242 14089226 14139814 14116459 14354154 13886094 13752303 13859094 14000053 13849340 13678914
$$ packed form
6593A8050813k02490l0230O1372K34669n10138k35270j32627L891J77332m0507
6583A7376815J09168o9156o8044j62237k35671r0518J73448j92030J60556N2975
6573A7055306j65136j75455q9929j60760J71691j81592j96471K7676n0743R4970
6563A6329557l1438Q086k67537k24613p5903l2973J27888j85124j51019K41972
6553A5738896k16116P709j08959j26733l8584o7465q6957J44598J65317j18254
6543A5293452o4945J71914k26968j61001K9668K942J81373k59440J23559k8708
6533A5061846j15445n16404j49481J25763K28053N0089n6053j14350k28236k28540
6523A4057242L1984N0588k3355K37695m68060j33791J06791J40959j50713j70426
$$ plain form
6513 13678914 13755742 13693277 13716338 13695297 13757827 13811910 13753669 13464607 13238335 13325832 13435821
6502 13435821 13420164 13075832 13088664 13113865 12981087 13174763 13099338 12894625 13228045 13046229
6492 13046229 12794549 12798161 12866534 12732796 12698281 12609127 12634027 12574031 12634594 12543166 12508500
6481 12508500 12891579 12638092 12938825 12979699 12708795 12704897 12481010 12843214 12805323 12420502
6471 12420502 12272352 12314171 12427218 12447557 12231934 12261394 12480133 12491282 12539029 12161366
6461 12161366 11969185 11917154 12042815 12416283 12216711 12099990 12014917 11907659 11757065 11663735
6451 11663735 11659498 11684685 11802877 11656164 11550959 11472906 11693349 11802033 11888807 12051863
6441 12051863 11856183 11613980 11499428 11317543 11366946 11713134 11611905 11500111 11690565 11633312
$$ packed form
6513A3678914P6828o2465K3061k1041O2530N4083n8241k89062k26272Q7497J09989
6502A3435821j5657l44332J2832K5201j32778J93676p5425k04713L33420j81816
6492A3046229k51680L612O8373j33738l4515q9154K4900n9996O0563r1428l4666
6481A2508500L83079k53487L00733M0874k70904l898k23887L62204l7891l84821
6471A2420502j48150M1819J13047K0339k15623K9460K18739J1149M7747l77663
6461A2161366j92181n2031J25661L73468j99572j16721q5073j07258j50594r3330
6451A1663735m237K5187J18192j46713j05205p8053K20443J08684Q6774J63056
6441A2051863j95680k42203j14552j81885M9403L46188j01229j11794J90454n7253
$$ plain form
6431 11633312 11364567 11214909 11228850 11110206 11404014 11497497 11487129 11381602 11390164 11676517
6421 11676517 11427762 11273399 11277691 11453872 11435800 11418691 11335739 11079685 11040237 11173288
6411 11173288 11385454 11347469 11157974 10981731 11001367 11034514 11136382 11400090 11101449 10995334
6401 10995334 11073078 10876552 10875349 11027947 10839159 10651667 10961224 10693930 10613304 10583984
6391 10583984 10641128 10683381 10791831 10653609 10531698 10459084 10351339 10547855 10790978 10617651
6381 10617651 10319176 10129004 10255320 10090628 10084155 10111819 10391048 10571433 10295767 10454783
6371 10454783 10601998 10365312 10163116 10129250 10192474 10316803 10219183 10093881 10254609 10415647
6361 10415647 10262333 10343278 10181829 10234107 10113090 9924757 10016189 10178342 9985072 9972162
$$ packed form
6431A1633312k68745j49658J3941j18644K93808R3483j0368j05527Q562K86353
6421A1676517k48755j54363M292J76181j8072j7109q2952k56054l9448J33051
6411A1173288K12166l7985j89495j76243J9636L3147J01868K63708k98641j06115
6401A0995334P7744j96526j203J52598j88788j87492L09557k67294q0626k9320
6391A0583984N7144M2253J08450j38222j21911p2614j07745J96516K43123j73327
6381A0617651k98475j90172J26316j64692o473K7664K79229J80385k75666J59016
6371A0454783J47215k36686k02196l3866O3224J24329r7620j25302J60728J61038
6361A0415647j53314Q0945j61449N2278j21017j88333R1432J62153j93270j2910
$$ plain form
6351 9972162 10066471 10038155 9845620 9902951 10060240 9879363 9765473 9984547 9842902 9723125
6341 9723125 9936346 9998106 10095307 10012652 9688591 9484722 9860430 9996776 10057801 9961173
6331 9961173 10008009 9867450 9685131 9720508 9810210 9629741 9627113 9674378 9827853 9867834 9762122
6320 9762122 9897326 9724317 9553881 9493537 9373095 9471458 9752063 9588275 9586335 9469779
6310 9469779 9532230 9656583 9775891 9698835 9892298 9852277 9769069 9653416 9800425 9418342
6300 9418342 9288068 9736120 9715719 9693925 9608431 9743937 9859149 9468433 9419794 9424172 9343873
6289 9343873 9684603 9521274 9471572 9533736 9530316 9718792 9791848 9673974 9448091 9270012
6279 9270012 9387124 9603899 10001276 9993337 9859732 9677466 9635252 9807807 9485352 9472876
$$ packed form
6351I972162R4309k8316j92535N7331J57289j80877j13890K19074j41645j19777
6341I723125K13221O1760R7201q2655l24061k03869L75708J36346O1025r6628
6331I961173M6836j40559j82319L5377Q9702j80469k628M7265J53475L9981j05712
6320I762122J35204j73009j70436o0344j20442R8363K80605j63788j940j16556
6310I469779O2451J24353J19308p7056J93463m0021q3208j15653J47009l82083
6300I418342j30274M48052k0401k1794q5494J35506J15212l90716m8639M378q0299
6289I343873L40730j63329m9702O2164l420J88476P3056j17874k25883j78079
6279I270012J17112K16775L97377p939j33605j82266m2214J72555l22455j2476
$$ plain form
6269 9472876 9629752 9652953 9558160 9631627 9759325 9778451 9663736 9381517 9566866 9501217
6259 9501217 9467823 9766375 9472854 9375171 9378154 9647102 9711552 9480239 9394550 9355096 9260618
6248 9260618 9391213 9517783 9518905 9633063 9536881 9415049 9288187 9335341 9399240 9593375
6238 9593375 9623512 9712447 9851585 10032555 10172837 9969897 9712108 9736587 9650983 9591116
6228 9591116 9813334 9996907 9866847 9617839 9535001 9800873 10051903 9949262 9903479 10142804
6218 10142804 10356141 10241870 10069764 9992661 10072749 10355226 10314568 10320703 9976863 9900735
6208 9900735 9937930 10064435 10104327 10023374 10212650 9948270 10139772 10283776 10279502 10406861
6198 10406861 10426141 10258002 10282075 10282515 10400561 10596949 10560804 10586633 10683506 10792202 10736693
$$ packed form
6269I472876J56876K3201r4793P3467J27698J9126j14715k82219J85349o5649
6259I501217l3394K98552k93521r7683K983K68948O4450k31313q5689l9454r4478
6248I260618J30595J26570J122J14158r6182j21832j26862M7154O3899J94135
6238I593375L0137Q8935J39138J80970J40282k02940k57789K4479q5604n9867
6228I591116K22218J83573j30060k49008q2838K65872K51030j02641m5783K39325
6218A0142804K13337j14271j72106p7103Q0088K82477m0658O135l43840p6128
6208I900735L7195J26505L9892q0953J89276k64380J91502J44004m274J27359
6198A0406861J9280j68139K4073M40J18046J96388l6145K5829R6873J08696n5509
$$ plain form
6187 10736693 10691797 11069222 11100525 10856743 10894224 10814287 10895502 10921450 11041844 10718485
6177 10718485 10842329 11249253 11300909 11446585 11468459 11077114 11001940 11031786 11009611 11110683
6167 11110683 11355696 11458683 11505036 11554972 11452761 11623210 11921210 12106791 12135473 12205425
6157 12205425 12063036 11968837 12221357 12443547 12456343 12290839 12395244 12721891 12990264 13153975
6147 13153975 13308000 13443747 13622501 13721457 13930494 14116651 14398315 14817856 15000696 15320921
6137 15320921 15410996 15765556 16293609 16560068 16929172 17472152 17959704 18353315 19150630 20207310
6127 20207310 20825577 21695599 22529843 23366073 24680257 25689978 26375291 26743380 27206520
6118 27206520 27186960 26510854 25949377 25346264 24657327 24174383 24124200 24007382 23760874 23802147
$$ packed form
6187A0736693m4896L77425L1303k43782L7481p9937Q1215K5948J20394l23359
6177A0718485J23844M06924N1656J45676K1874l91345p5174K9846k2175J01072
6167A1110683K45013J02987M6353M9936j02211J70449K98000J85581K8682O9952
6157A2205425j42389r4199K52520K22190J2796j65504J04405L26647K68373J63711
6147A3153975J54025J35747J78754R8956K09037J86157K81664M19541J82840L20225
6137A5320921R0075L54560N28053K66459L69104N42980M87552L93611P97315J056680
6127B0207310O18267Q70022Q34244Q36230J314184J009721O85313L68089M63140
6118B7206520j9560o76106n61477o03113o88937m82944n0183j16818k46508M1273
$$ plain form
6108 23802147 23921617 24339403 24825244 25386686 26086126 26873575 27518436 28208631 29447101
6099 29447101 30614209 31853882 33732858 35094107 36618346 38750113 40574803 43100239
6091 43100239 45751519 48221266 50355186 52078738 52806356 52336367 50434242 47821453
6083 47821453 44701849 42071292 39912641 38178357 36311154 34897948 33924530 33185480
6075 33185480 32753315 32515945 32176238 32253534 32425581 32497293 32545925 33336135 34252403 35157416
6065 35157416 36479898 37788596 39395971 41127034 42816707 44643118 47196937 49653620
6057 49653620 51916607 53820097 54362424 53581871 52005087 49079209 45824627 42948378
6049 42948378 40118219 37490720 35448385 33293085 31984739 30852962 29953332 29115234
$$ packed form
6108B3802147J19470M17786M85841N61442O99440P87449O44861O90195J238470
6099B9447101J167108J239673J878976J361249J524239K131767J824690K525436
6091D3100239K651280K469747K133920J723552P27618m69989j902125k612789
6083D7821453l119604k630557k158651j734284j867203j413206r73418p39050
6075C3185480m32165k37370l39707P7296J72047P1712M8632P90210R16268R05013
6065C5157416J322482J308698J607375J731063J689673J826411K553819K456683
6057D9653620K262987J903490N42327p80553j576784k925878l254582k876249
6049D2948378k830159k627499k042335k155300j308346j131777q99630q38098
$$ plain form
6041 29115234 28190733 27520457 27031461 26411761 25783821 25479734 25409754 25311462 25328609 25502722
6031 25502722 25756587 26266610 26572698 27049065 27392052 27809608 28471859 28907804 29308353
6022 29308353 29028473 28265280 27013227 25833466 24714167 23592847 22363547 21564670 20880070
6013 20880070 20157075 19518956 18954202 18598682 18246718 17894651 17694783 17378704 17085996
6004 17085996 16861962 16338962 16096340 15760322 15655363 15663247 15344802 15073665 15353980 15277438
5994 15277438 14911108 14716372 14867207 14656219 14585227 14152306 14007881 14155071 14051737 14150894
5984 14150894 13841006 14179229 14063591 13917280 13836673 13604801 13499433 13460843 13597760 13461298
5974 13461298 13334788 13387288 13046055 12962370 12838908 12804683 12685860 12514014 12538551 12525368
$$ packed form
6041B9115234r24501o70276m88996o19700o27940l04087o9980r8292J7147J74113
6031B5502722K53865N10023L06088M76367L42987M17556O62251M35945M00549
6022B9308353k79880p63193j252053j179761j119299j121320j229300p98877o84600
6013B0880070p22995o38119n64754l55520l51964l52067j99868l16079k92708
6004A7085996k24034n23000k42622l36018j04959P884l18445k71137K80315p6542
5994A5277438l66330j94736J50835k10988p0992m32921j44425J47190j03334R9157
5984A4150894l09888L38223j15638j46311q0607k31872j05368l8590J36917j36462
5974A3461298j26510N2500l41233q3685j23462l4225j18823j71846K4537j3183
$$ plain form
5964 12525368 12694450 12666946 12306209 12083712 12254283 12420029 12218826 12302017 12114464 11901185
5954 11901185 11824022 11864111 12058445 11890632 11814395 11857626 11868220 11760179 11749259 11815902 11737121
5943 11737121 11537616 11658494 11499085 11571311 11511962 11202393 11211693 11209643 11150980 11002582 11039539
5932 11039539 10997513 10946216 10727609 10755470 10552732 10243633 10446345 10585182 10532596 10616919
5922 10616919 10601853 10524014 10509814 10518050 10484921 10380700 10191222 9969583 10206237 10080500
5912 10080500 10060737 9717935 9806034 10035026 10350988 10093508 9757992 9817157 9839197 9813446
5902 9813446 9738518 9534997 9776689 9582130 9445649 9626056 9553225 9363052 9188353 9293296
5892 9293296 9261764 9291079 9036593 8934996 8971823 8720617 8955915 9219903 9086185 8804435
$$ packed form
5964A2525368J69082k7504l60737k22497J70571J65746k01203Q3191j87553k13279
5954A1901185p7163M0089J94334j67813p6237M3231J0594j08041j0920O6643p8781
5943A1737121j99505J20878j59409P2226n9349l09569R300k050n8663j48398L6957
5932A1039539m2026n1297k18607K7861k02738l09099K02712J38837n2586Q4323
5922A0616919j5066p7839j4200Q236l3129j04221j89478k21639K36654j25737
5912A0080500j9763l42802Q8099K28992L15962k57480l35516N9165K2040k5751
5902I813446p4928k03521K41692j94559j36481J80407p2831j90173j74699J04943
5892I293296l1532K9315k54486j01597L6827k51206K35298K63988j33718k81750
$$ plain form
5882 8804435 8889748 8651684 8796391 8796370 8734221 9035295 9107051 9161580 8897804 8877013 8751829
5871 8751829 8860164 8859143 8624162 8457593 8606899 8484567 8691980 8691754 8499846 8554477 8761698
5860 8761698 8498252 8456924 8679177 8595187 8356720 8146942 7981224 8181405 8112656 8009625
5850 8009625 8291158 8135715 7737526 7751136 7855082 7809742 7846676 7795154 7644221 7707151
5840 7707151 7858432 7743880 7822592 7831021 7714110 7645684 7598716 7601852 7404850 7419896 7315982
5829 7315982 7420666 7747550 7756494 7476139 7373961 7508879 7686518 7672639 7350703 7152012
5819 7152012 7072653 7102205 7084481 7086855 7163558 7013017 6803705 6855396 6860809 6866963 7109077
5808 7109077 7355686 7219683 7107060 6819317 6906887 6716085 6888966 6904493 6772796 6699753
$$ packed form
5882H804435Q5313k38064J44707k1o2149L01074P1756N4529k63776k0791j25184
5871H751829J08335j021k34981j66569J49306j22332K07413k26j91908N4631K07221
5860H761698k63446m1328K22253q3990k38467k09778j65718K00181o8749j03031
5850H009625K81533j55443l98189J3610J03946m5340L6934n1522j50933O2930
5840G707151J51281j14552P8712Q429j16911o8426m6968L136j97002J5046j03914
5829G315982J04684L26884Q944k80355j02178J34918J77639j3879l21936j98691
5819G152012p9359K9552j7724K374P6703j50541k09312N1691N413O154K42114
5808G109077K46609j36003j12623k87743Q7570j90802J72881J5527j31697p3043
$$ plain form
5798 6699753 6594445 6594312 6602040 6833624 6858385 6918661 6960578 6790220 6562826 6655052 6684739
5787 6684739 6815259 6834497 6817016 6836851 6749046 6623151 6512084 6429527 6425970 6063674 6165688
5776 6165688 6109468 6278973 6375283 5953565 5907421 6228125 6407418 6411477 6247626 6267355 6248221
5765 6248221 6272853 6409717 6361049 6322668 6060060 5917074 6042100 6101911 6085427 6058355 6134676
5754 6134676 6286643 6199777 6099361 5808197 6019718 6096505 5845791 5785142 5740181 5896269
5744 5896269 6071327 5921340 5788361 6124614 6221517 6136562 5910312 6033917 6166983 6128368
5734 6128368 5971136 6215110 6491220 6367386 6220418 6116173 6006761 5918412 6033975 6341498
5724 6341498 6452775 6633504 6927089 6900821 7163849 7102155 6983629 6759768 6859182 7017100
$$ packed form
5798F699753j05308j33P728K31584K4761O0276M1917j70358k27394R2226K9687
5787F684739J30520J9238j7481J9835q7805j25895j11067q2557l557l62296J02014
5776F165688n6220J69505R6310m21718m6144L20704J79293M059j63851J9729j9134
5765F248221K4632J36864m8668l8381k62608j42986J25026N9811j6484k7072P6321
5754F134676J51967q6866j00416k91164K11521P6787k50714o0649m4961J56088
5744E896269J75058j49987j32979L36253R6903q4955k26250J23605J33066l8615
5734F128368j57232K43974K76110j23834j46968j04245j09412q8349J15563L07523
5724F341498J11277J80729K93585k6268K63028o1694j18526k23861R9414J57918
$$ plain form
5714 7017100 7290052 7274880 7331426 7291641 7155479 7546267 7599556 7622421 7855692 7779965 8185642
5703 8185642 8066430 8109867 8300111 8374975 8482674 8754336 8697204 8700202 8941806 9091045
5693 9091045 9303916 9745184 10255405 10605638 11192983 11554525 11976728 12564667 13605482
5684 13605482 14273062 14814616 15389175 15939562 17081949 17907541 18752923 20256178 21635749
5675 21635749 23354914 24605432 26239115 28340441 30670890 32977075 35444592 38368152
5667 38368152 41454206 44980444 48304397 51930430 55704935 58052661 58797943 57683807
5659 57683807 54148492 49291039 44382778 39784468 35793306 32177436 29307847 26867790
5651 26867790 24951821 23364634 21629424 19999779 18817246 17987865 17036291 15959491
$$ packed form
5714G017100K72952j5172N6546l9785j36162L90788N3289K2865K33271p5727M05677
5703H185642j19212M3437J90244P4864J07699K71662n7132K998K41604J49239
5693I091045K12871M41268N10221L50233N87345L61542M22203N87939J040815
5684A3605482O67580N41554N74559N50387J142387Q25592Q45382J503255J379571
5675B1635749J719165J250518J633683K101326K330449K306185K467517K923560
5667C8368152L086054L526238L323953L626033L774505K347726P45282j114136
5659E7683807l535315m857453m908261m598310l991162l615870k869589k440057
5651B6867790j915969j587187j735210j629645j182533q29381r51574j076800
$$ plain form
5643 15959491 15009981 14026335 13550269 13093234 12369374 11955790 11545999 11100798 10608282
5634 10608282 10261504 10034627 9921124 9572385 9667245 9448939 9146104 8733493 8596940 8607965
5624 8607965 8518267 8402920 8189250 7880973 7644413 7481498 7345813 7347434 7246430 7289627
5614 7289627 7195973 7340879 7350313 7029908 6924602 6865469 7037849 7001695 6836879 7128756
5604 7128756 7397655 7364229 7381297 7376605 7168232 6950914 6904112 6976186 6618404 6612799 6579540
5593 6579540 6459916 6302133 6358825 6416608 6409218 6132349 5988272 6103870 5819190 5876875
5583 5876875 5908800 5943143 6034286 5557013 5185363 5136214 5030056 5243552 5198933 5022501
5573 5022501 4940502 4715668 4986194 4947709 5113743 5136235 5229480 5193105 5129203 5132060 4880367
$$ packed form
5643A5959491r49510r83646m76066m57035p23860m13584m09791m45201m92516
5634A0608282l46778k26877j13503l48739R4860k18306l02835m12611j36553J1025
5624H607965q9698j15347k13670l08277k36560j62915j35685J621j01004M3197
5614G289627r3654J44906R434l20405j05306n9133J72380l6154j64816K91877
5604G128756K68899l3426J7068m692k08373k17318m6802P2074l57782n605l3259
5593F579540j19624j57783N6692N7783p390k76869j44077J15598k84680N7685
5583E876875L1925L4343R1143m77273l71650m9149j06158K13496m4619j76432
5573E022501q1999k24834K70526l8485J66034K2492R3245l6375o3902K857k51693
$$ plain form
5562 4880367 4754890 4917262 4909905 4582314 4811291 4939483 4759870 4908133 4938025 4679497
5552 4679497 4745289 4749030 5037255 5038473 4905935 4665263 4748930 5068453 4827973 5015535 5009085
5541 5009085 4697584 4790429 4741595 4756021 4713634 4581974 4749667 4906453 4777445 4853120
5531 4853120 4883703 4724311 4933035 4978512 4630038 4363585 4433894 4745587 4969984 4950536
5521 4950536 4955471 4951603 4702916 4735936 4835040 4599774 4611361 4915684 4914584 4832033 4790583
5510 4790583 4874945 4893544 5010052 5053654 5101726 4890089 5043780 5055645 5070084 5046572 4904001
5499 4904001 4970420 5291345 5260667 5123781 5180002 5059429 5328077 5388945 5363899 5259704
5489 5259704 5432755 5352127 5234352 5561042 5690417 5693990 5755943 5929584 5975947 5793851
$$ packed form
5562D880367j25477J62372p357l27591K28977J28192j79613J48263K9892k58528
5552D679497O5792L741K88225J218j32538k40672Q3667L19523k40480J87562o450
5541E009085l11501R2845m8834J4426m2387j31660J67693J56786j29008P5675
5531D853120L0583j59392K08724M5477l48474k66453P0309L11693K24397j9448
5521D950536M935l868k48687L3020R9104k35266J1587L04323j100q2551m1450
5510D790583Q4362J8599J16508M3602M8072k11637J53691J1865J4439k3512j42571
5499D904001O6419L20925l0678j36886N6221j20573K68648O0868k5046j04195
5489E259704J73051q0628j17775L26690J29375L573O1953J73641M6363j82096
$$ plain form
5479 5793851 6115811 6347304 6231454 5940157 5673757 5750995 6065738 6292303 6466661 6368112
5469 6368112 6304780 6383965 6134374 6365214 6411275 6302718 6313457 6513287 6519975 6424159 6674920
5458 6674920 6544226 6693188 6796596 7147511 7274632 7220117 7403800 7481897 7633260 7664730
5448 7664730 7901114 7888031 7789964 7739497 7458934 7461456 7626034 7862655 7538073 7789592
5438 7789592 7788179 7765131 7798143 7518016 7690170 7656530 7609231 7370307 7489060 7631126 7813315
5427 7813315 8099975 8263998 8326807 8303215 8033899 8323482 8708524 8876432 8724964 8844625
5417 8844625 9179833 9338386 9667983 9808869 9803407 9675752 9448806 9473076 9572685 9378161
5407 9378161 9407921 9295559 9222883 9303082 9416142 9558271 9615068 9783182 9628825 9734755
$$ packed form
5479E793851L21960K31493j15850k91297k66400P7238L14743K26565J74358r8549
5469F368112o3332P9185k49591K30840M6061j08557J0739J99830O688r5816K50761
5458F674920j30694J48962J03408L50915J27121n4515J83683P8097J51363L1470
5448G664730K36384j3083r8067n0467k80563K522J64578K36621l24582K51519
5438G789592j413k3048L3012k80127J72154l3640m7299k38924J18753J42066J82189
5427G813315K86660J64023O2809k3592k69316K89583L85042J67908j51468J19661
5417H844625L35208J58553L29597J40886n462j27655k26946K4270R9609j94524
5407I378161K9760j12362p2676Q0199J13060J42129N6797J68114j54357J05930
$$ plain form
5397 9734755 9977457 9840983 9906064 10073815 10233249 10388958 10647756 10567514 10427356 10475835
5387 10475835 10652718 10706749 10924349 11336994 11466669 11584496 11754790 11854143 12075653 12008548
5377 12008548 11870105 12207751 12544420 12692081 12798898 12876816 13519532 14136546 14192374 14328850
5367 14328850 14810656 14999207 15310632 15572364 15813546 15923932 16062294 16597241 16863397
5358 16863397 16922978 17347345 17915726 18350688 19004647 19342034 19923739 20302948 20802626 21108773
5348 21108773 21682376 22317415 22719141 23552744 24096055 24521450 25357629 26216263 27201036
5339 27201036 28086509 28985526 29841306 30660590 31665383 32964489 34301736 35524990 36785638
5330 36785638 38128704 39642708 41560734 43496715 45459908 47974102 50086399 52368534
$$ packed form
5397I734755K42702j36474O5081J67751J59434J55709K58798q0242j40158M8479
5387A0475835J76883N4031K17600M12645J29675J17827J70294R9353K21510o7105
5377A2008548j38443L37646L36669J47661J06817P7918O42716O17014N5828J36476
5367A4328850M81806J88551L11425K61732K41182J10386J38362N34947K66156
5358A6863397N9581M24367N68381M34962O53959L37387N81705L79209M99678L06147
5348B1108773N73603O35039M01726Q33603N43311M25395Q36179Q58634R84773
5339B7201036Q85473Q99017Q55780Q19284J004793J299106J337247J223254J260648
5330C6785638J343066J514004J918026J935981J963193K514194K112297K282135
$$ plain form
5322 52368534 54899823 57941478 61064697 64331339 67815310 71776749 75784939 79876603
5314 79876603 84742668 89904439 95306602 100843488 107107304 114018887 121008971 128567632
5306 128567632 136611429 144863268 153651326 162723964 172109769 181188053 190255705 198763750
5298 198763750 206022737 212001572 215648374 216513569 214922940 210379701 203564264 195208034
5290 195208034 185400564 174716188 163926214 153679897 144043944 134858731 126127723 118389659
5282 118389659 111086314 104563289 98265968 92353672 86989144 82022507 77666423 73653803
5274 73653803 69571348 65886476 62480819 59119007 56350916 53745871 50960254 48688936
5266 48688936 46629814 44612265 42605501 40998071 39650430 37945064 36350800 34831974
$$ packed form
5322E2368534K531289L041655L123219L266642L483971L961439M008190M091664
5314G9876603M866065N161771N402163N536886O263816O911583O990084P558661
5306A28567632Q043797Q251839Q788058R072638R385805R078284R067652Q508045
5298A98763750P258987N978835L646802Q65195j590629m543239o815437q356230
5290A95208034r807470j0684376j0789974j0246317r635953r185213q731008p738064
5282A18389659p303345o523025o297321n912296n364528m966637m356084m012620
5274G3653803m082455l684872l405657l361812k768091k605045k785617k271318
5266D8688936k059122k017549k006764j607430j347641j705366j594264j518826
$$ plain form
5258 34831974 33273026 32111519 30737546 29816695 28972863 27767757 26737405 25834305 25043173
5249 25043173 24205710 23620856 22624352 21777016 20900737 20689379 20291392 19921586 19552295
5240 19552295 18976074 18249077 17845067 17632904 17168284 16652746 16458416 16277972 15617560
5231 15617560 15269852 15145128 14927456 14739589 14517517 14367097 13946667 13796470 13464873
5222 13464873 13117418 12903833 12788740 12645361 12750256 12640884 12451633 12581554 12350440
5213 12350440 12038551 11804021 11705990 11597757 11728656 11746273 11767665 11664607 11576546 11361726
5203 11361726 11177437 11259929 11379753 11416355 11315512 11181916 11316630 11322872 11556984 11623294
5193 11623294 11760783 11665896 11695738 11698973 11965027 12287838 12520072 12656245 12498181 12528891
$$ packed form
5258C4831974j558948j161507j373973r20851q43832j205106j030352r03100p91132
5249B5043173q37463n84854r96504q47336q76279k11358l97987l69806l69291
5240A9552295n76221p26997m04010k12163m64620n15538j94330j80444o60412
5231A5617560l47708j24724k17672j87867k22072j50420m20430j50197l31597
5222A3464873l47455k13585j15093j43379J04895j09372j89251J29921k31114
5213A2350440l11889k34530r8031j08233J30899J7617K1392j03058q8061k14820
5203A1361726j84289Q2492J19824L6602j00843j33596J34714O242K34112O6310
5193A1623294J37489r4887K9842L235K66054L22811K32234J36173j58064L0710
$$ plain form
5183 12528891 12410970 11860428 11303986 11007235 10870602 10715643 10338098 9994742 9786803
5174 9786803 9702204 9763759 9662515 9473784 9193689 9285658 9370099 9103207 9255710 8917941
5164 8917941 8996625 8861616 9016449 9097040 8933985 8827995 8720181 8745385 8617104 8826044
5154 8826044 8668166 8532813 8546971 8621150 8879505 9174306 9146773 8989935 9069632 9082961
5144 9082961 8997361 9097476 9314072 9383344 9134119 9284073 9246291 9166696 9462012 9580778
5134 9580778 9422926 9375906 9338559 9238645 9366976 9512654 9515055 9391026 9607716 9710590
5124 9710590 9791507 9999835 10246762 10472529 10034311 10254187 10360939 10370472 10642439 10802740
5114 10802740 10870272 10892865 10845606 10734010 11037512 11109028 11504600 11326187 10900475 10975299
$$ packed form
5183A2528891j17921n50542n56442k96751j36633j54959l77545l43356k07939
5174I786803q4599O1555j01244j88731k80095R1969Q4441k66892J52503l37769
5164H917941P8684j35009J54833Q0591j63055j05990j07814K5204j28281K08940
5154H826044j57878j35353J4158P4179K58355K94801k7533j56838P9697J3329
5144I082961q5600J00115K16596O9272k49225J49954l7782p9595K95316J18766
5134I580778j57852m7020l7347r9914J28331J45678K401j24029K16690J02874
5124I710590Q0917K08328K46927K25767m38218K19876J06752R533K71967J60301
5114A0802740O7532K2593m7259j11596L03502P1516L95572j78413m25712P4824
$$ plain form
5104 10975299 11448678 11674725 12040093 12031815 11794051 11983806 11835353 12138854 12362855 12507177
5094 12507177 12748795 12843034 13198834 13354975 13455440 13645069 13970279 14254996 14253746 14499353
5084 14499353 14556741 14535443 14767772 15018939 15311954 15866828 16013079 16169790 16556985 16825704
5074 16825704 16901434 17457716 18017414 18330278 18884585 19098776 19392072 19869953 20460968 21202420
5064 21202420 21736727 22292832 22926450 23439548 23610140 24360942 24789788 24862691 24971390 25038795
5054 25038795 25226757 25468910 25866563 26302791 26866820 27480543 27919608 28324955 28893911
5045 28893911 29379803 30108714 30758509 31332716 32184501 32863733 33450915 34294318 35176085
5036 35176085 36122573 36882272 37873472 38802754 39870651 41112040 42349794 43576337 45089950
$$ packed form
5104A0975299M73379K26047L65368q278k37764J89755j48453L03501K24001J44322
5094A2507177K41618R4239L55800J56141J00465J89629L25210K84717j250K45607
5084A4499353N7388k1298K32329K51167K93015N54874J46251J56711L87195K68719
5074A6825704P5730N56282N59698L12864N54307K14191K93296M77881N91015P41452
5064B1202420N34307N56105O33618N13098J70592P50802M28846P2903J08699O7405
5054B5038795J87962K42153L97653M36228N64029O13723M39065M05347N68956
5045B8893911M85892P28911O49795N74207Q51785O79232N87182Q43403Q81767
5036C5176085R46488P59699R91200R29282J067897J241389J237754J226543J513613
$$ plain form
5027 45089950 46063098 47218931 47995298 48565287 49037322 49203100 49690266 50066126 50348249
5018 50348249 50999774 51508821 52471717 53337979 54113190 55233880 56492239 57778011 59083133
5009 59083133 60699110 62229337 63814326 65916388 67898594 70136015 72531728 74937733
5001 74937733 77498016 79992724 82763954 85603073 88577321 91793738 94934307 98314896
4993 98314896 102118584 105330438 108669332 111922528 114929567 117894692 121079396 124345456
4985 124345456 127526326 130615198 133650942 136648032 139571853 142384877 145744813 148862229
4977 148862229 152032737 155309663 158261091 161615194 164859731 168116902 171222549 174774145
4969 174774145 177866266 180870023 184308906 187813630 190955409 193844976 196501881 199096474
$$ packed form
5027D5089950R73148J155833P76367N69989M72035J65778M87166L75860K82123
5018E0348249O51525N09047R62896Q66262P75211J120690J258359J285772J305122
5009E9083133J615977J530227J584989K102062J982206K237421K395713K406005
5001G4937733K560283K494708K771230K839119K974248L216417L140569L380589
4993I8314896L803688L211854L338894L253196L007039K965125L184704L266060
4985A24345456L180870L088872L035744K997090K923821K813024L359936L117416
4977A48862229L170508L276926K951428L354103L244537L257171L105647L551596
4969A74774145L092121L003757L438883L504724L141779K889567K656905K594593
$$ plain form
4961 199096474 201396157 202949307 204362324 205281119 205770447 205803067 205017180 203959697 202490222
4952 202490222 200524047 197844419 194995057 192344072 189292793 186264652 183031524 179719476
4944 179719476 176249506 173335368 169937578 166546388 163379049 159882377 155857526 152541834
4936 152541834 149179511 145507853 141732691 138306313 134640578 130961838 127187813 123355221
4928 123355221 119907561 116526928 112546963 109213150 105923460 102351672 99121020 95612947
4920 95612947 91951564 88280008 84569380 80813994 76941913 73175195 70129930 67108048
4912 67108048 64161244 61586676 58926691 56530512 54454818 52429921 50466861 48651131
4904 48651131 46831416 45180589 43529880 42023827 40987291 39537015 38035874 36772399
$$ packed form
4961A99096474K299683J553150J413017R18795M89328L2620p85887j057483j469475
4952B02490222j966175k679628k849362k650985l051279l028141l233128l312048
4944A79719476l469970k914138l397790l391190l167339l496672m024851l315692
4936A52541834l362323l671658l775162l426378l665735l678740l774025l832592
4928A23355221l447660l380633l979965l333813l289690l571788l230652l508073
4920I5612947l661383l671556l710628l755386l872081l766718l045265l021882
4912F7108048k946804k574568k659985k396179k075694k024897j963060j815730
4904D8651131j819715j650827j650709j506053j036536j450276j501141j263475
$$ plain form
4896 36772399 35520002 34527347 33167373 32091003 31566810 30795048 30190111 29192855 28433455
4887 28433455 27224768 26412203 25716438 24959200 24355549 23873081 23331892 22641531 22127791
4878 22127791 21712302 21026316 20573074 20193016 20064624 19720908 19167290 18768136 18335770
4869 18335770 17913461 17502555 17407399 17352102 17013769 16536374 16196425 15676822 15209400 15387704
4859 15387704 15052709 14793160 14933984 14508879 14153691 13789725 13531067 13498218 13317396 13197141
4849 13197141 13027867 12701556 12341559 12338246 12457739 12258767 12166075 11737005 11575583 11652537
4839 11652537 11438916 11409497 10906036 10666683 10743824 10617565 10466399 10644123 10504767 10620310
4829 10620310 10458137 10208488 10245916 10192619 9756795 9730303 9875499 9945163 9743543 9533009
$$ packed form
4896C6772399j252397r92655j359974j076370n24193p71762o04937r97256p59400
4887B8433455j208687q12565o95765p57238o03651m82468n41189o90361n13740
4878B2127791m15489o85986m53242l80058j28392l43716n53618l99154m32366
4869A8335770m22309m10906r5156n5297l38333m77395l39949n19603m67422J78304
4859A5387704l34995k59549J40824m25105l55188l63966k58658l2849j80822j20255
4849A3197141j69274l26311l59997l313J19493j98972r2692m29070j61422P6954
4839A1652537k13621k9419n03461k39353P7141j26259j51166J77724j39356J15543
4829A0620310j62173k49649L7428n3297m35824k6492J45196O9664k01620k10534
$$ plain form
4819 9533009 9763425 9778470 9678108 9642717 9570339 9590727 9724581 9418556 9207354 9460443
4809 9460443 9661932 9727775 9726224 9582052 9872937 10364107 10041392 9812736 10108363 10139730
4799 10139730 9991069 10032959 10240486 10339863 10805058 10875385 11037204 11334999 11500410 11890091
4789 11890091 12313142 12407781 12784791 13224152 13492260 13813861 14350642 15048717 15690511 16104472
4779 16104472 16141007 16055510 15821698 15588435 15186205 14584396 13801634 13032982 12567575 12084952
4769 12084952 11907672 11505765 11417458 11338158 11255489 10977453 10835767 10783499 10643564 10463839
4759 10463839 10471823 10419707 10422760 10021464 10006637 10285927 10311222 10221024 10385192 10489014 10503421
4748 10503421 10509201 10870840 10805565 10703814 10710972 10909602 11089084 11195532 11440343 11305088
$$ packed form
4819I533009K30416J5045j00362l5391p2378K0388J33854l06025k11202K53089
4809I460443K01489O5843j551j44172K90885M91170l22715k28656K95627L1367
4799A0139730j48661M1890K07527R9377M65195P0327J61819K97795J65411L89681
4789A1890091M23051R4639L77010M39361K68108L21601N36781O98075O41794M13961
4779A6104472L6535q5497k33812k33263m02230o01809p82762p68652m65407m82623
4769A2084952j77280m01907q8307p9300q2669k78036j41686n2268j39935j79725
4759A0463839P984n2116L053m01296j4827K79290K5295r0198J64168J03822J4407
4748A0503421N780L61639o5275j01751P158J98630J79482J06448K44811j35255
$$ plain form
4738 11305088 11176812 11239056 11449735 10997596 10945903 10913164 11012678 11213652 11147343 11065354
4728 11065354 11254444 11615590 11909197 11852190 11845528 11932069 11923400 12021918 11972679 11910175 12250826
4717 12250826 12351573 12628012 12735350 12737044 12755999 12973419 13209743 13426224 13603810 13578948
4707 13578948 13668799 13959770 14074843 14120099 14098808 14247286 14534603 14779784 14883285 15023785
4697 15023785 14859448 15119727 15573612 15718615 15939389 16126680 16200660 16486860 16532339 16854744
4687 16854744 17119664 17379703 17809365 17878613 18168653 18479554 18798221 19055259 19482583 19584074
4677 19584074 19972458 20461193 20696227 20828164 21347057 21758527 21911878 22402948 22916059
4668 22916059 22965249 23325719 23982396 24537528 24970372 25440517 25969530 26415942 27295986 27846578
$$ packed form
4738A1305088j28276O2244K10679m52139n1693l2739R9514K00974o6309q1989
4728A1065354J89090L61146K93607n7007o662Q6541q669R8518m9239o2504L40651
4717A2250826J00747K76439J07338J694J8955K17420K36324K16481J77586k4862
4707A3578948Q9851K90971J15073M5256k1291J48478K87317K45181J03501J40500
4697A5023785j64337K60279M53885J45003K20774J87291P3980K86200M5479L22405
4687A6854744K64920K60039M29662O9248K90040L10901L18667K57038M27324J01491
4677A9584074L88384M88735K35034J31937N18893M11470J53351M91070N13111
4668B2916059M9190L60470O56677N55132M32844M70145N29013M46412Q80044N50592
$$ plain form
4658 27846578 28345052 29291253 29973208 30657644 31701323 32489320 33093763 33880204 34837106
4649 34837106 35937910 36889088 38334973 39654815 40743409 41907713 43060454 44560604
4641 44560604 46442294 48053128 49819196 51857038 53895952 56029137 58482179 60962132
4633 60962132 63742071 66803756 69520935 72810652 76684915 80557829 84590420 88903425
4625 88903425 92940846 96434091 99238915 101092926 102256383 103144051 104387623 106189586
4617 106189586 108362948 111075866 114277138 118209914 122347408 127187070 132473638 138122271
4609 138122271 144056677 150663396 157613170 164534039 171474241 178703797 185834751 192928948
4601 192928948 199938337 207001779 214683424 221609512 228225044 234496693 239983404 245556375
$$ packed form
4658B7846578M98474R46201O81955O84436J043679P87997O04443P86441R56902
4649C4837106J100804R51178J445885J319842J088594J164304J152741J500150
4641D4560604J881690J610834J766068K037842K038914K133185K453042K479953
4633F0962132K779939L061685K717179L289717L874263L872914M032591M313005
4625H8903425M037421L493245K804824J854011J163457Q87668J243572J801963
4617A06189586K173362K712918L201272L932776M137494M839662N286568N648633
4609A38122271N934406O606719O949774O920869O940202P229556P130954P094197
4601A92928948P009389P063442P681645O926088O615532O271649N486711N572971
$$ plain form
4593 245556375 250508380 255021444 259446760 263605398 267546177 270602476 272654359 273687758
4585 273687758 274408935 274861599 274989889 275338141 275595968 275251726 274461064 273054200 270922794
4576 270922794 268771201 266182443 263442207 260373513 256707397 252647294 248098638 243091687
4568 243091687 237776497 232344133 226633282 220663668 214549420 209177294 203782062 198526087
4560 198526087 193530599 188162416 183097751 178685055 174046251 169709565 165472546 160893031
4552 160893031 156991762 153072570 149187130 145238690 141355260 137780056 134145907 130218854
4544 130218854 126494405 122514537 118504233 114374765 110412880 106407636 102289643 98320320
4536 98320320 94331787 90685387 86875762 83207547 79874679 76459777 73026785 69994792
$$ packed form
4593B45556375M952005M513064M425316M158638L940779L056299K051883J033399
4585B73687758P21177M52664J28290L48252K57827l44242p90662j406864k131406
4576B70922794k151593k588758k740236l068694l666116m060103m548656n006951
4568B43091687n315190n432364n710851n969614o114248n372126n395232n255975
4560A98526087m995488n368183n064665m412696m638804m336686m237019m579515
4552A60893031l901269l919192l885440l948440l883430l575204l634149l927053
4544A30218854l724449l979868m010304m129468l961885m005244m117993l969323
4536I8320320l988533l646400l809625l668215l332868l414902l432992l031993
$$ plain form
4528 69994792 66958270 64270543 61494316 58921986 56649941 54263671 52114811 50015202
4520 50015202 48098531 45963855 44093241 42519212 40730126 39101343 37869392 36746772
4512 36746772 35454281 34112869 32836342 31891523 30608156 29361779 28382957 27538065 26674686
4503 26674686 25837824 25010204 24261927 23671289 23175912 22379013 21677577 21198147 20644124
4494 20644124 19934277 19255424 18433591 18065523 17599880 17029546 16458106 16064446 15666167
4485 15666167 15019562 14686164 14618915 14355969 14042259 13727984 13231082 12843746 12662881 12402397
4475 12402397 12012233 11650133 11345666 10935934 10585504 10488702 10176811 9737234 9479699 9463273
4465 9463273 9388379 9087739 8765862 8566187 8514708 8487926 8470094 8430930 8112239 7971880
$$ packed form
4528F9994792l036522k687727k776227k572330k272045k386270k148860k099609
4520E0015202j916671k134676j870614j574029j789086j628783j231951j122620
4512C6746772j292491j341412j276527r44819j283367j246377r78822q44892q63379
4503B6674686q36862q27620p48277n90638m95377p96899p01436m79430n54023
4494B0644124p09847o78853q21833l68068m65643n70334n71440l93660l98279
4485A5666167o46605l33398o7249k62946l13710l14275m96902l87336j80865k60484
4475A2402397l90164l62100l04467m09732l50430r6802l11891m39577k57535j6426
4465I463273p4894l00640l21877j99675n1479k6782j7832l9164l18691j40359
$$ plain form
4455 7971880 7609877 7518437 7547616 7262233 6891437 6845893 6700279 6446167 6360126 6223108
4445 6223108 6258924 6104429 6305114 6123489 5931682 5972853 5833421 5679345 5543486 5263064
4435 5263064 5065378 4950118 4756854 4892152 4782275 4961815 4802633 4558781 4596657 4514228
4425 4514228 4355605 4511006 4367796 4340262 4590262 4307178 4029763 4047516 4128431 3980470
4415 3980470 3988137 4022801 4441411 4389951 4050086 4013708 4048169 3900869 3475950 3631554 3964725
4404 3964725 3981809 3747432 3694622 3748023 3608053 3472875 3388785 3389252 3375112 3291059 3322614
4393 3322614 3456849 3263650 3245226 3606356 3757582 3817605 3427897 3676374 3458886 3232977
4383 3232977 3286852 3287361 3381632 3193505 2883931 3111667 3151526 3349772 3469475 3347203 3272654
$$ packed form
4455G971880l62003r1440K9179k85383l70796m5544j45614k54112q6041j37018
4445F223108L5816j54495K00685j81625j91807M1171j39432j54076j35859k80422
4435E263064j97686j15260j93264J35298j09877J79540j59182k43852L7876q2429
4425D514228j58623J55401j43210k7534K50000k83084k77415J7753Q0915j47961
4415C980470P667L4664M18610n1460l39865l6378L4461j47300m24919J55604L33171
4404C964725J7084k34377n2810N3401j39970j35178q4090M67j4140q4053L1555
4393C322614J34235j93199j8424L61130J51226O0023l89708K48477k17488k25909
4383C232977N3875N09R4271j88127l09574K27736L9859J98246J19703j22272p4549
$$ plain form
4372 3272654 3021929 3107180 3344183 3442046 3388368 3173791 3124536 3271852 3467024 3381146
4362 3381146 3426384 3215302 3272092 3244376 3263627 3515128 3580425 3409111 3073309 3159420 3396152
4351 3396152 3407557 3229772 3195379 3382499 3262337 3036372 3383456 3396253 3416918 3116768
4341 3116768 3267530 3386909 3254960 3368410 3586554 3819258 3815915 3648962 3691719 3772608
4331 3772608 3865329 3881788 3688498 3831573 3790902 3554092 3686850 3636312 4002418 3840160
4321 3840160 3610166 3994436 4103398 3900743 3994665 4102493 4498693 4696453 4621053 4522208
4311 4522208 4482368 4422622 4708846 5045692 5213752 5057938 4700284 4937575 4905936 5108311
4301 5108311 5133301 4856054 5020567 5012021 5089969 5539343 5497099 5449395 5606280 5680971 5786784
$$ packed form
4372C272654k50725Q5251K37003R7863n3678k14577m9255J47316J95172q5878
4362C381146M5238k11082N6790k7716J9251K51501O5297j71314l35802Q6111K36732
4351C396152J1405j77785l4393J87120j20162k25965L47084J2797K0665l00150
4341C116768J50762J19379j31949J13450K18144K32704l343j66953M2757Q0889
4331C772608R2721J6459j93290J43075m0671k36810J32758n0538L66106j62258
4321C840160k29994L84270J08962k02655R3922J07828L96200J97760p5400r8845
4311D522208l9840n9746K86224L36846J68060j55814l57654K37291l1639K02375
4301E108311K4990k77247J64513q546P7948M49374m2244m7704J56885P4691J05813
$$ plain form
4290 5786784 5558012 5725882 5682849 5770818 6165243 6417892 6512287 6457707 6506883 6585861 6649367
4279 6649367 6542801 6573553 6507341 6397282 6468962 6541660 6509800 6493114 6970315 6939925 6641554
4268 6641554 6798180 6971664 7085512 7288460 7119737 7137597 7062562 7084218 7124936 7247869
4258 7247869 7337658 7335267 7459842 7614587 7647487 7545336 7650972 7692544 7593339 7767518 7788353
4247 7788353 7752454 7918652 8053122 8219124 8307857 8170009 8126514 8184946 8433284 8561943
4237 8561943 8864149 9179182 9152992 9534992 9711108 9678923 9687508 9683566 9610551 10080623 10268530
4226 10268530 10213774 10227076 10640248 11077451 11609212 11939897 12188739 12476203 13087936 13536685
4216 13536685 14232070 14578089 14823059 15024045 15439722 15474167 15460556 15436774 15328495 15549323
$$ packed form
4290E786784k28772J67870m3033Q7969L94425K52649R4395n4580M9176P8978O3506
4279F649367j06566L0752o6212j10059P1680P2698l1860j6686M77201l0390k98371
4268F641554J56626J73484J13848K02948j68723J7860p5035K1656M0718J22933
4258G247869Q9789k391J24575J54745L2900j02151J05636M1572r9205J74179K0835
4247G788353l5899J66198J34470J66002Q8733j37848m3495N8432K48338J28659
4237H561943L02206L15033k6190L82000J76116l2185Q585l942p3015M70072J87907
4226A0268530n4756J3302M13172M37203N31761L30685K48842K87464O11733M48749
4216A3536685O95385L46019K44970K00986M15677L4445j3611k3782j08279K20828
$$ plain form
4206 15549323 15600838 15703930 15609843 15938892 16334927 16661104 17056110 17227495 17330541 17663323
4196 17663323 17958037 18486210 18845496 19172121 19326758 19306385 19417991 19553488 19602332 19756659
4186 19756659 20149404 20298305 20689000 21418328 22019754 22661956 23238809 23230562 23397813 23188424
4176 23188424 22596567 21868243 21062936 20385261 19930634 19267731 19169084 18666590 18323989 18238703
4166 18238703 18423785 18409093 18213135 18047644 17881323 17937044 17454663 17098017 16878949 16892815
4156 16892815 16420601 16108632 15967385 15674675 15431140 15360409 15358862 15583525 15563334 15463054
4146 15463054 15346216 15328248 15027581 14896627 14775752 14222983 13590828 13293748 13230191 12943469
4136 12943469 12622248 12506429 12118025 12267549 12121807 12039825 11836977 11580449 11794305 11429617
$$ packed form
4206A5549323N1515J03092r4087L29049L96035L26177L95006J71385J03046L32782
4196A7663323K94714N28173L59286L26625J54637k0373J11606J35497M8844J54327
4186A9756659L92745J48901L90695P29328O01426O42202N76853q247J67251k09389
4176B3188424n91857p28324q05307o77675m54627o62903r8647n02494l42601q5286
4166A8238703J85082j4692j95958j65491j66321N5721m82381l56646k19068J3866
4156A6892815m72214l11969j41247k92710k43535p0731j547K24663k0191j00280
4146A5463054j16838j7968l00667j30954j20875n52769o32155k97080o3557k86722
4136A2943469l21221j15819l88404J49524j45742q1982k02848k56528K13856l64688
$$ plain form
4126 11429617 11584701 11706396 11728573 11867279 11750730 11912975 11951867 12090189 11934105 12076507
4116 12076507 12086680 12244526 12434317 12323914 12598616 12531988 12488930 12642344 12925408 12641245
4106 12641245 13070754 13285078 13159324 13515821 13742520 13663333 13853790 14085449 14188396 14402645
4096 14402645 14569052 14532078 14648813 15026909 14982160 15186257 15614899 15770134 15996962 15900052
4086 15900052 15935142 16351638 16707614 17048974 17196811 17275068 17461759 17971031 18390830 18514446
4076 18514446 18879818 19090790 19030409 19551253 19888003 20195554 20190800 20785555 21464636 21951996
4066 21951996 22548149 22803627 23187019 23634459 24023861 24590433 25065444 25918995 26634163
4057 26634163 27268158 27812577 28644441 29400435 29957663 30833112 31434927 32354143 33594396
$$ packed form
4126A1429617J55084J21695K2177J38706j16549J62245L8892J38322j56084J42402
4116A2076507J0173J57846J89791j10403K74702o6628m3058J53414K83064k84163
4106A2641245M29509K14324j25754L56497K26699p9187J90457K31659J02947K14249
4096A4402645J66407l6974J16735L78096m4749K04097M28642J55235K26828r6910
4086A5900052L5090M16496L55976L41360J47837P8257J86691N09272M19799J23616
4076A8514446L65372K10972o0381N20844L36750L07551m754N94755O79081M87360
4066B1951996N96153K55478L83392M47440L89402N66572M75011Q53551P15168
4057B6634163O33995N44419Q31864P55994N57228Q75449O01815R19216J240253
$$ plain form
4048 33594396 34622776 35812178 36757642 37852852 39039709 40723123 41967898 43100494
4040 43100494 44135388 45181701 46196192 46910399 47526278 47907974 48218532 48616502 48920029
4031 48920029 48910833 49126838 49617377 50274724 50929288 51799782 52376478 53440447 54243814 55279690
4021 55279690 56228637 57377487 58626605 59969600 61164447 62416134 64026786 65635066
4013 65635066 67094120 68606739 70387533 72182518 74047975 76104606 77955956 79915979
4005 79915979 81785901 83893944 86120991 88730118 91030811 93635883 95869851 98420736
3997 98420736 101295311 104144177 106939858 110140574 113689591 117174699 121073021 124751331
3989 124751331 128861182 133003825 137676410 142727660 147440747 152505072 157882408 163518954
$$ packed form
4048C3594396J028380J189402R45464J095210J186857J683414J244775J132596
4040D3100494J034894J046313J014491P14207O15879L81696L10558L97970L03527
4031D8920029r196K16005M90539O57347O54564Q70494N76696J063969Q03367J035876
4021E5279690R48947J148850J249118J342995J194847J251687J610652J608280
4013F5635066J459054J512619J780794J794985J865457K056631J851350J960023
4005G9915979J869922K108043K227047K609127K300693K605072K233968K550885
3997I8420736K874575K848866K795681L200716L549017L485108L898322L678310
3989A24751331M109851M142643M672585N051250M713087N064325N377336N636546
$$ plain form
3981 163518954 169734137 175932822 182113843 188844607 195483531 202290365 209320861 216007155
3973 216007155 223017384 229909339 237052702 244244079 251174460 258299020 265732568 272871974
3965 272871974 280142266 287620383 294846021 302078134 309147794 316373058 323643882 330551793
3957 330551793 337140682 343405074 349730392 355276912 360873780 366083045 370710767 375189065
3949 375189065 379336564 382713398 385745200 388402312 390189316 391146828 391181352 390415299 389100088
3940 389100088 386824566 383605033 379451780 374641692 369529054 364091399 357965705 351188460
3932 351188460 344614311 337676682 330671356 323044910 315774169 308262333 300384677 292791756
3924 292791756 284896839 276989830 268790484 260899412 253216925 245659791 238331541 231051727
$$ packed form
3981A63518954O215183O198685O181021O730764O638924O806834P030496O686294
3973B16007155P010229O891955P143363P191377O930381P124560P433548P139406
3965B72871974P270292P478117P225638P232113P069660P225264P270824O907911
3957C30551793O588889O264392O325318N546520N596868N209265M627722M478298
3949C75189065M147499L376834L031802K657112J787004R57512L4524p66053j315211
3940C89100088k275522l219533m153253m810088n112638n437655o125694o777245
3932C51188460o574149o937629p005326p626446p270741p511836p877656p592921
3924B92791756p894917p907009q199346p891072p682487p557134p328250p279814
$$ plain form
3916 231051727 223760938 216519451 209292989 202167351 195196437 187838004 181185234 174559285
3908 174559285 167816073 160976740 154241959 147910445 142014478 136053173 130581776 125431429
3900 125431429 120042371 115195650 110729217 106148060 102003149 98035604 94533849 91046807
3892 91046807 87466153 84268872 81464524 78670499 75921167 73261030 70685691 68496535
3884 68496535 66135308 64129946 61818491 59685393 57615439 55809453 53872100 52098925
3876 52098925 50251218 48487215 46433978 45010275 43449836 41735853 40108605 38607916
3868 38607916 37208640 36077401 35081032 33866579 32659496 31291836 30160084 28999324
3860 28999324 27577148 26524412 25930594 25239667 24134387 23371522 22402904 21539738 21088593
$$ packed form
3916B31051727p290789p241487p226462p125638o970914p358433o652770o625949
3908A74559285o743212o839333o734781o331514n895967n961305n471397n150347
3900A25431429n389058m846721m466433m581157m144911l967545l501755l487042
3892I1046807l580654l197281k804348k794025k749332k660137k575339k189156
3884F8496535k361227k005362k311455k133098k069954j805986j937353j773175
3876E2098925j847707j764003k053237j423703j560439j713983j627248j500689
3868C8607916j399276j131239r96369j214453j207083j367660j131752j160760
3860B8999324j422176j052736n93818o90927j105280p62865r68618q63166m51145
$$ plain form
3851 21088593 20431526 19887808 19196141 18618311 18086655 17481985 16983814 16422344 15590383
3842 15590383 15253768 14592066 13971102 13693615 13281610 12916573 12763224 12364701 12131251
3833 12131251 11741220 11525230 11098734 10913037 10619058 10380058 10076902 9516047 9377769
3824 9377769 9167189 8890496 8585205 8501457 8097909 7810548 7459495 7426676 7170339 6999698
3814 6999698 6735166 6734928 6787114 6552458 6249518 6105583 5963228 5799633 5738234 5427242
3804 5427242 5201472 5200870 5171663 5005773 4945262 4800942 4951424 4535944 4546241 4486861 4137508
3793 4137508 4342617 4309311 4189171 4099499 3848205 3738492 3684436 3579073 3402526 3389773
3783 3389773 3497156 3281508 2898342 2986870 2929166 3014891 3064820 3001895 2745952 2848100
$$ packed form
3851B1088593o57067n43718o91667n77830n31656o04670m98171n61470q31961
3842A5590383l36615o61702o20964k77487m12005l65037j53349l98523k33450
3833A2131251l90031k15990m26496j85697k93979k39000l03156n60855j38278
3824I377769k10580k76693l05291q3748m03548k87361l51053l2819k56337j70641
3814F999698k64532k38N2186k34656l02940j43935j42355j63595o1399l10992
3804E427242k25770o02k9207j65890o0511j44320J50482m15480J0297n9380l49353
3793D137508K05109l3306j20140q9672k51294j09713n4056j05363j76547j2753
3783C389773J07383k15648l83166Q8528n7704Q5725M9929o2925k55943J02148
$$ plain form
3773 2848100 2845573 2706404 2663333 2515751 2583524 2645287 2663493 2701941 2752404 2635411 2619705
3762 2619705 2395695 2522745 2618868 2621376 2455444 2308945 2324112 2615050 2535907 2457253 2665405
3751 2665405 2688927 2815343 2855829 2560659 2384010 2385390 2343768 2385892 2210551 2492686 2776143
3740 2776143 2797645 2681858 2527018 2254456 2351445 2540453 2571558 2434994 2486328 2744309
3730 2744309 2864033 2793753 2866945 2868649 2612881 2702094 2650006 3026884 3186971 2845970 2641592
3719 2641592 2810465 2835427 2605701 2363761 2326767 2428890 2287761 2557637 2479003 2436376
3709 2436376 2461990 2331132 2289646 2408867 2518379 2283142 2298672 2191794 2132191 2076848
3699 2076848 2147091 1882129 1953351 2178344 2186311 2109146 2071551 2020206 1991823 2204565 2318627
$$ packed form
3773B848100k527j39169m3071j47582O7773O1763J8206L8448N0463j16993j5706
3762B619705k24010J27050R6123K508j65932j46499J5167K90938p9143p8654K08152
3751B665405K3522J26416M0486k95170j76649J380m1622M2124j75341K82135K83457
3740B776143K1502j15787j54840k72562R6989J89008L1105j36564N1334K57981
3730B744309J19724p0280P3192J704k55768Q9213n2088L76878J60087l41001k04378
3719B641592J68873K4962k29726k41940l6994J02123j41129K69876p8634m2627
3709B436376K5614j30858m1486J19221J09512k35237J5530j06878n9603n5343
3699B076848P0243k64962P1222K24993P967p7165l7595n1345k8383K12742J14062
$$ plain form
3688 2318627 2330638 2359581 2341634 2138500 2044337 2110585 2228568 2183943 1976505 2003975 2071313
3677 2071313 1789925 1597433 1966643 1939109 1872539 1899072 1673500 1689160 1723464 1774977 1750095
3666 1750095 2138608 2054035 1998676 1850431 1798547 1949767 1993608 2024004 2017299 1873708 1960086
3655 1960086 2169742 2020700 1938594 1978052 1967855 2107011 2183328 2131762 2138652 2064153 2024528
3644 2024528 2312265 2119989 2169282 2086400 1850003 1884788 1570141 1645312 1822109 1926322
3634 1926322 1717691 1505789 1427707 1727740 1753113 1552764 1731300 1739764 1711318 1775759 1809062
3623 1809062 1772408 1454199 1564194 1617308 1536034 1509274 1438827 1290278 1332615 1118985 931900
3612 931900 1169421 1060903 872342 1164645 999808 980177 1205199 1261255 1122824 751685
$$ packed form
3688B318627J2011K8943j7947k03134r4163O6248J17983m4625k07438K7470O7338
3677B071313k81388j92492L69210k7534o6570K6533k25572J5660L4304N1513k4882
3666A750095L88513q4573n5359j48245n1884J51220M3841L0396o705j43591Q6378
3655A960086K09656j49042q2106L9458j0197J39156P6317n1566O890p4499l9625
3644B024528K87737j92276M9293q2882k36397L4785l14647P5171J76797J04213
3634A926322k08631k11902p8082L00033K5373k00349J78536Q464k8446O4441L3303
3623A809062l6654l18209J09995N3114q1274k6760p0447j48549M2337k13630j87085
3612I31900K37521j08518j88561K92303j64837j9631K25022N6056j38431l71139
$$ plain form
3602 751685 927411 1003390 864415 683035 721473 687702 486893 575586 606452 426406 485030
3591 485030 592980 579252 594760 380552 513267 406744 571270 556117 325280 392461
3581 392461 457880 89274 -59925 420857 579251 562448 572404 381444 461593 586788 817270
3570 817270 746780 359614 488203 438384 270159 395556 379306 411047 360885 311749 409285
3559 409285 288497 403177 380167 520190 747358 590725 521937 379314 189385 420808
3549 420808 417345 650713 938068 1122158 1140877 1319590 1059410 1035802 897016 1121787
3539 1121787 1083033 912662 968797 825568 1029678 1018377 948386 1231228 1257630 1173828 1170850
3528 1170850 1070843 1270283 1080686 1014473 1119581 1114736 1409307 1525082 1349919 1561143
$$ packed form
3602G51685J75726P5979j38975j81380L8438l3771k00809Q8693L0866j80046N8624
3591D85030J07950j3728J5508k14208J32715j06523J64526j5153k30837O7181
3581C92461O5419l68606j49199M80782J58394j6803R956j90960Q0149J25195K30482
3570H17270p0490l87166J28589m9819j68225J25397j6250L1741n0162m9136R7536
3559D09285j20788J14680k3010J40023K27168j56633o8788j42623j89929K31423
3549D20808l463K33368K87355J84090J8719J78713k60180k3608j38786K24771
3539A121787l8754j70371N6135j43229K04110j1301o9991K82842K6402q3802k978
3528A170850j00007J99440j89597o6213J05108m845K94571J15775j75163K11224
$$ plain form
3518 1561143 1380842 1553369 1537931 1389157 1672457 1726873 1959413 2160200 2098068 2095429
3508 2095429 2310494 2370051 2613100 2759650 2495772 2655793 2928728 2799808 2828456 3184704
3498 3184704 3252819 3619209 3777862 3523203 3685947 3993940 3874140 3813293 3795160 3998634
3488 3998634 4220187 4513687 4671833 4590650 4854394 4995576 5083320 5378450 5768921 5931818
3478 5931818 6245519 6553210 6647584 6737696 7230517 7372669 7199570 7337648 7980890 8509785
3468 8509785 8844153 8960491 9463354 9838830 10267103 10651643 11142301 11494956 12039664 12409893
3458 12409893 13238346 14075542 14621399 15368277 16222908 16924218 17695597 18920303 19728592
3449 19728592 20725042 21946380 23303770 24397225 26290481 28092440 29676158 31489231
$$ packed form
3518A561143j80301J72527j5438j48774K83300N4416K32540K00787o2132k639
3508B095429K15065N9557K43049J46550k63878J60021K72935j28920K8648L56248
3498C184704O8115L66390J58653k54659J62744L07993j19800o0847j8133K03474
3488C998634K21553K93500J58146q1183K63744J41182Q7744K95130L90471J62897
3478E931818L13701L07691R4374R0112M92821J42152j73099J38078O43242N28895
3468H509785L34368J16338N02863L75476M28273L84540M90658L52655N44708L70229
3458A2409893Q28453Q37196N45857P46878Q54631P01310P71379J224706Q08289
3449A9728592R96450J221338J357390J093455J893256J801959J583718J813073
$$ plain form
3441 31489231 33433974 35418945 37705041 40673567 43703396 46360273 49350641 52232824
3433 52232824 54748108 56705063 57432390 56544401 54480368 52184272 49869359 47485057
3425 47485057 45591154 44432023 43536331 43364964 43338310 43580510 44070082 44596972 45468723
3416 45468723 46771359 48446345 49913349 51955809 54189977 56728555 59640887 62689011
3408 62689011 66095956 70265222 74742602 79554436 84590636 90119761 95872110 100570347
3400 100570347 103995698 105493424 104149980 100151886 94315607 88205221 82637582 77375356
3392 77375356 72703997 68531201 65307704 62439978 59604204 57491872 55443135 53505011
3384 53505011 51717035 50531879 49073051 47860478 47377261 47062399 46765123 46546099 46715079
$$ packed form
3441C1489231J944743J984971K286096K968526L029829K656877K990368K882183
3433E2232824K515284J956955P27327q87989k064033k296096k314913k384302
3425D7485057j893903j159131q95692j71367k6654K42200M89572N26890Q71751
3416D5468723J302636J674986J467004K042460K234168K538578K912332L048124
3408F2689011L406945M169266M477380M811834N036200N529125N752349M698237
3400A00570347L425351J497726j343444l998094n836279o110386n567639n262226
3392G7375356m671359m172796l223497k867726k835774k112332k048737j938124
3384E3505011j787976j185156j458828j212573m83217l14862k97276k19024J68980
$$ plain form
3375 46715079 46970635 47691339 48489182 49326909 50388350 51626482 52988995 53682977 53214831
3366 53214831 51594453 48712145 45166652 41278855 37173038 33640569 30774448 28132091
3358 28132091 25674325 23667324 21967495 20449003 18696381 17649503 16683028 15844309
3350 15844309 15073431 13905773 12847951 12112084 11671769 11213223 10686406 10215162 9693131
3341 9693131 8828639 8594617 8299324 7781079 7561487 7184126 6832160 6587896 6124947 5793777
3331 5793777 5347928 5299414 4871500 4732364 4558672 4153782 3841391 3730779 3584816 3327167
3321 3327167 3408123 3154936 2857724 2915725 2885373 2749205 2792649 2618873 2437275 2472688
3311 2472688 2458066 2235734 2246895 2202668 1882847 2082318 2117157 2192875 2332495 2380740 2226674
$$ packed form
3375D6715079K55556P20704P97843Q37727J061441J238132J362513O93982m68146
3366E3214831j620378k882308l545493l887797m105817l532469k866121k642357
3358B8132091k457766k007001j699829j518492j752622j046878r66475q38719
3350A5844309p70878j167658j057822p35867m40315m58546n26817m71244n22031
3341I693131q64492k34022k95293n18245k19592l77361l51966k44264m62949l31170
3331E793777m45849m8514m27914j39136j73692m04890l12391j10612j45963k57649
3321C327167Q0956k53187k97212N8001l0352j36168M3444j73776j81598L5413
3311B472688j4622k22332J1161m4227l19821J99471L4839P5718J39620M8245j54066
$$ plain form
3300 2226674 2206487 2316694 2390882 2534947 2266435 2047916 1978353 1977814 2222395 2279117 2141196
3289 2141196 1874361 1923479 2054281 1877785 1660621 1521497 1695667 1876121 1826813 1728533
3279 1728533 1508711 1807655 1796990 1660725 1881781 1864787 1807688 1730399 1865810 1630689
3269 1630689 1500925 1634004 2060067 2266004 2093261 2073285 2224818 2458151 2278884 1911671
3259 1911671 1825164 1681403 1360871 696278 499094 587381 475016 278694 443183 282988
3249 282988 -184247 -309003 -329250 -192985 -382711 -521404 -525094 -720595 -968343 -783924
3239 -783924 -762125 -672321 -503416 -411794 -567587 -731930 -723631 -495270 -421060 -419858 -438704
3228 -438704 -544024 -782304 -995153 -1108420 -1086786 -1066274 -1655778 -1703176 -1485432 -1583046
$$ packed form
3300B226674k0187J10207P4188J44065k68512k18519o9563n39K44581N6722j37921
3289B141196k66835M9118J30802j76496k17164j39124J74170J80454m9308r8280
3279A728533k19822K98944j0665j36265K21056j6994n7099p7289J35411k35121
3269A630689j29764J33079M26063K05937j72743j9976J51533K33333j79267l67213
3259A911671q6507j43761l20532o64593j97184Q8287j12365j96322J64489j60195
3249B82988m67235j24756k0247J36265j89726j38693l690j95501k47748J84419
3239g83924K1799Q9804J68905R1622j55793j64343Q299K28361P4210J202j8846
3228d38704j05320k38280k12849j13267K1634K0512n89504m7398K17744r7614
$$ plain form
3218 -1583046 -1664310 -1491881 -1593431 -1501944 -1639336 -1782826 -1661297 -1625661 -1943957 -2162485
3208 -2162485 -2046562 -2411203 -2298072 -2010110 -1931782 -2018819 -1847183 -1898042 -2083690 -2016194
3198 -2016194 -1942331 -2035493 -1903874 -1890809 -1916417 -1727072 -1747283 -1569358 -1736585 -1887407
3188 -1887407 -1962698 -1992085 -2168602 -1960928 -2181801 -2239378 -1959260 -2141028 -2008439 -1985317
3178 -1985317 -1837990 -1992117 -1942513 -1904244 -2233132 -2174215 -2057631 -1900673 -1830317 -1809462
3168 -1809462 -1783694 -1736961 -1749840 -1786673 -2009937 -1747463 -1596462 -1670295 -1910267 -1610193
3158 -1610193 -1506780 -1530013 -1120044 -1201686 -1428655 -1240162 -1434752 -1340131 -1238756 -1211413
3148 -1211413 -981398 -1380483 -1563946 -1243877 -1344303 -1185421 -1106022 -842994 -905013 -779689
$$ packed form
3218a583046q1264J72429j01550R1487j37392j43490J21529L5636l18296k18528
3208b162485J15923l64641J13131K87962P8328q7037J71636n0859j85648O7496
3198b016194P3863r3162J31619J3065k5608J89345k0211J77925j67227j50822
3188a887407p5291k9387j76517K07674k20873n7577K80118j81768J32589K3122
3178a985317J47327j54127M9604L8269l28888N8917J16584J56958P0356K0855
3168a809462K5768M6733j2879l6833k23264K62474J51001p3833k39972L00074
3158a610193J03413k3233M09969q1642k26969J88493j94590R4621J01375K7343
3148a211413K30015l99085j83463L20069j00426J58882P9399K63028o2019J25324
$$ plain form
3138 -779689 -818735 -1053213 -1091275 -1066077 -1002656 -1115092 -1104520 -1015588 -819336 -698672 -623076
3127 -623076 -611799 -406951 -257032 -399626 -635828 -264477 -388203 51501 302678 364675
3117 364675 527076 434016 481067 801528 919130 1108781 1070274 1253724 1398707 1636348
3107 1636348 1673215 1962313 1860827 1917940 2302288 2774320 2898490 3353091 3790786 3994628
3097 3994628 4093148 4359338 4761828 5211168 5551671 5731058 6224016 6464494 6875694 7300974
3087 7300974 7820500 8175133 8458252 8767091 9019382 9202731 9052372 9290454 9559661 9827567
3077 9827567 10052638 9622176 9950400 10275654 10202747 10501545 10975178 11262865 11666091 11787681
3067 11787681 12025951 12412482 12770460 13348824 14037809 14327407 15065625 15779654 16367192
$$ packed form
3138g79689l9046k34478l8062K5198O3421j12436J0572Q8932J96252J20664P5596
3127f23076J1277K04848J49919j42594k36202L71351j23726M39704K51177O1997
3117C64675J62401r3060M7051L20461J17602J89651l8507J83450J44983K37641
3107A636348L6867K89098j01486N7113L84348M72032J24170M54601M37695K03842
3097C994628R8520K66190M02490M49340L40503J79387M92958K40478M11200M25280
3087G300974N19526L54633K83119L08839K52291J83349j50359K38082K69207K67906
3077I827567K25071m30462L28224L25254p2907K98798M73633K87687M03226J21590
3067A1787681K38270L86531L57978N78364O88985K89598P38218P14029N87538
$$ plain form
3058 16367192 16897654 17128734 17395759 17334371 17374095 17084431 16273585 15537440 14516392 14056908
3048 14056908 13597557 13095104 12754431 12384084 11990219 11593824 11531757 11208695 10981001 10724894
3038 10724894 10205342 9985785 9859517 9379519 9160431 9036956 8900888 8751719 8481712
3029 8481712 8073051 7954423 8070656 7883896 7610557 7259904 6612088 6130840 5921292 5534847
3019 5534847 4756538 4113163 3736431 3190824 2873304 2430263 2094241 2120881 1764681 1363462
3009 1363462 1183764 1059690 936810 645624 476794 138141 -38288 16039 -249400 -315847
2999 -315847 -475055 -578822 -705544 -1046353 -1047126 -1077290 -1211374 -1374405 -1405613 -1456623 -1378378
2988 -1378378 -1671332 -1925408 -1733159 -1975635 -2165694 -2018122 -2303287 -2364690 -1944205 -1943174
$$ packed form
3058A6367192N30462K31080K67025o1388L9724k89664q10846p36145j021048m59484
3048A4056908m59351n02453l40673l70347l93865l96395o2067l23062k27694k56107
3038A0724894n19552k19557j26268m79998k19088j23475j36068j49169k70007
3029H481712m08661j18628J16233j86760k73339l50653o47816m81248k09548l86445
3019E534847p78309o43375l76732n45607l17520m43041l36022K6640l56200m01219
3009A363462j79698j24074j22880k91186j68830l38653j76429N4327k65439o6447
2999c15847j59208j03767j26722l40809p73l0164j34084j63031l1208n1010P8245
2988a378378k92954k54076J92249k42476j90059J47572k85165o1403M20485J031
$$ plain form
2978 -1943174 -2163607 -1984877 -2346865 -2445924 -2483296 -2659942 -2657280 -2558882 -2693759 -2732425 -2617748
2967 -2617748 -2585949 -2766990 -2628835 -2423881 -2677885 -2711668 -2843585 -2569365 -2535932 -2742049
2957 -2742049 -2857994 -3072874 -3086922 -2923686 -2891243 -2901895 -2709770 -2572743 -2691136 -2617648
2947 -2617648 -2749339 -2758996 -2786144 -2873293 -2776121 -2819173 -2818806 -2784318 -2878203 -3017139 -3048768 -3017000
2935 -3017000 -3008663 -3007154 -2969206 -3173335 -3087976 -2736129 -2862918 -3068429 -3149841 -2782252 -3005591
2924 -3005591 -3198228 -3335608 -3273590 -3222078 -3168588 -3295022 -3263484 -3161444 -3104284 -2951124
2914 -2951124 -2991239 -3160002 -3037311 -3104183 -3241527 -3262696 -3392888 -3154047 -3065510 -2923595
2904 -2923595 -2878842 -2875495 -2928900 -2737546 -2745277 -2856610 -3212801 -3012435 -2961220 -3181959 -3127740
$$ packed form
2978a943174k20433J78730l61988r9059l7372j76646K662R8398j34877l8666J14677
2967b617748L1799j81041J38155K04954k54004l3783j31917K74220L3433k06117
2957b742049j15945k14880j4048J63236L2443j0652J92125J37027j18393P3488
2947b617648j31691r657k7148q7149R7172m3052L67L4488r3885j38936l1629L1768
2935c017000Q337J509L7948k04129Q5359L51847j26789k05511q1412L67589k23339
2924c005591j92637j37380O2018N1512N3490j26434L1538J02040N7160J53160
2914b951124m0115j68763J22691o6872j37344k1169j30192K38841Q8537J41915
2904b923595M4753L347n3405J91354p731j11333l56191K00366N1215k20739N4219
$$ plain form
2893 -3127740 -2957922 -2737737 -2714192 -2859188 -2853117 -2922259 -3032698 -3104529 -2992035 -2782348
2883 -2782348 -3044090 -3065248 -2767641 -2740592 -3029606 -3084342 -3105532 -3025506 -3007676 -2985985 -2835659
2872 -2835659 -3077820 -3086260 -3131797 -3171755 -2983278 -2957952 -3003768 -3031716 -2784808 -2718048 -2922468
2861 -2922468 -3409308 -3176499 -3103750 -2946625 -2977099 -3190183 -3199564 -3479736 -3318902 -3258515
2851 -3258515 -3219976 -3380299 -3335083 -3246788 -3248010 -3188274 -3021247 -2711558 -2954022 -3223354 -2989150
2840 -2989150 -3060373 -3092607 -3170403 -3358544 -3367234 -3222996 -3496650 -3288472 -2894547 -2865430 -3143315
2829 -3143315 -3356249 -3285799 -3426923 -3364012 -3127129 -3097896 -3394521 -3212285 -2936000 -2790078
2819 -2790078 -2534092 -2770603 -2822217 -2953099 -3101180 -3141364 -3086234 -3181867 -3235486 -3124699
$$ packed form
2893c127740J69818K20185K3545j44996O071o9142j10439p1831J12494K09687
2883b782348k61742k1158K97607K7049k89014n4736k1190Q0026J7830K1691J50326
2872b835659k42161q440m5537l9958J88477K5326m5816k7948K46908O6760k04420
2861b922468m86840K32809P2749J57125l0474k13084r381k80172J60834O0387
2851c258515L8539j60323M5216Q8295j222N9736J67027L09689k42464k69332K34204
2840b989150p1223l2234p7796j88141q690J44238k73654K08178L93925K9117k77885
2829c143315k12934P0450j41124O2911K36883K9233k96625J82236K76285J45922
2819b790078K55986k36511n1614j30882j48081m0184N5130r5633n3619J10787
$$ plain form
2809 -3124699 -3015118 -3092624 -3133105 -3223888 -2970589 -2742364 -2931378 -2894006 -2908783 -2857695 -2877384
2798 -2877384 -3002219 -3212071 -3046693 -3081465 -2834223 -2931833 -2890664 -2845084 -2853037 -2896461 -3306693
2787 -3306693 -3346358 -2881706 -2785760 -2777343 -2795517 -2909220 -3104778 -3274857 -3053822 -2826808
2777 -2826808 -2880704 -3011890 -3242772 -3221402 -2970363 -2909228 -2914376 -2854047 -2573207 -2749294 -3029962
2766 -3029962 -2806025 -2692940 -2951176 -3215672 -3138140 -3116255 -3133702 -2990335 -2762522 -2783394
2756 -2783394 -2916318 -3237157 -3299805 -3231160 -3025449 -2913623 -3096344 -3142560 -3241971 -3284778
2746 -3284778 -3203695 -3061523 -3197213 -3121418 -2868674 -2993847 -3138086 -2943330 -3039996 -3455942
2736 -3455942 -3317646 -3203692 -2958644 -2825769 -3041515 -2656931 -2652358 -2568440 -2724922 -3000568
$$ packed form
2809c124699J09581p7506m0481r0783K53299K28225j89014L7372j4777N1088j9689
2798b877384j24835k09852J65378l4772K47242r7610M1169M5580p953m3424m10232
2787c306693l9665M64652R5946Q417j8174j13703j95558j70079K21035K27014
2777b826808n3896j31186k30882K1370K51039O1135n148O0329K80840j76087k80668
2766c029962K23937J13085k58236k64496P7532K1885j7447J43367K27813k0872
2756b783394j32924l20839o2648O8645K05711J11826j82721m6216r9411m2807
2746c284778Q1083J42172j35690P5795K52744j25173j44239J94756r6666m15946
2736c455942J38296J13954K45048J32875k15746L84584M573Q3918j56482k75646
$$ plain form
2726 -3000568 -3019174 -2875852 -3080234 -2933406 -3070136 -3037280 -3016992 -2948607 -2824006 -2880960
2716 -2880960 -2803856 -2872531 -3089036 -3027098 -3076977 -2879586 -2981405 -3275771 -3082997 -3146188
2706 -3146188 -3117461 -3346708 -3065108 -2986298 -2754255 -3093552 -3251135 -2957114 -2839259 -2919626
2696 -2919626 -2840095 -2608186 -3128929 -3163219 -3075009 -2801378 -2857252 -2989812 -2752613 -2826051
2686 -2826051 -3082684 -3252855 -3108498 -3103244 -3098940 -2993021 -2889665 -2947410 -2856076 -2667037 -2620842
2675 -2620842 -2927218 -3137924 -3033605 -2980669 -3092144 -2947486 -3009463 -3166722 -3347944 -3219043
2665 -3219043 -3132003 -3138173 -2843078 -2839878 -2768318 -2938483 -2966079 -3040888 -2777571 -2735650 -2780981
2654 -2780981 -2912913 -3133316 -3098013 -3145240 -3008937 -2964609 -2761674 -3048598 -2989134 -2971896
$$ packed form
2726c000568j8606J43322k04382J46828j36730L2856K0288O8385J24601n6954
2716b880960P7104o8675k16505O1938m9879J97391j01819k94366J92774o3191
2706c146188K8727k29247K81600P8810K32043l39297j57583K94021J17855q0367
2696b919626P9531K31909n20743l4290Q8210K73631n5874j32560K37199p3438
2686b826051k56633j70171J44357N254M304J05919J03356n7745R1334J89039M6195
2675b620842l06376k10706J04319N2936j11475J44658o1977j57259j81222J28901
2665c219043Q7040o170K95095L200P1560j70165k7596p4809K63317M1921m5331
2654b780981j31932k20403L5303m7227J36303M4328K02935k86924N9464J7238
$$ plain form
2644 -2971896 -3111143 -2862964 -2638390 -2809396 -3117012 -3064952 -3212799 -3113151 -3025857 -2975431
2634 -2975431 -2894503 -2793015 -3021480 -2960338 -2948484 -3195535 -3463623 -3322894 -2952544 -2823667
2624 -2823667 -2833495 -3035615 -2945534 -2823445 -2824324 -2930979 -2866849 -2714431 -2822146 -2822696 -2748897
2613 -2748897 -2573244 -2758690 -2889852 -2789331 -2800887 -2710483 -2916679 -3139162 -3096016 -2848488
2603 -2848488 -2596487 -2667883 -2961289 -2702296 -2439470 -2609750 -2729459 -2381971 -2456617 -2474091
2593 -2474091 -2719322 -2726347 -2782800 -3227144 -3263651 -3106492 -3131154 -3241831 -3028584 -2969338 -3266527
2582 -3266527 -3015716 -3041319 -3001873 -2786086 -2539437 -2662057 -2495563 -2420789 -2650987 -2876580
2572 -2876580 -2879117 -2909423 -3141930 -2817950 -2747215 -2551212 -2714269 -2781458 -2670535 -2537467
$$ packed form
2644b971896j39247K48179K24574j71006l07616N2060j47847R9648Q7294N0426
2634b975431Q0928J01488k28465O1142J1854k47051k68088J40729L70350J28877
2624b823667r828k02120R0081J22089q79j06655O4130J52418j07715n50P3799
2613b748897J75653j85446j31162J00521j1556R0404k06196k22483M3146K47528
2603b848488K52001p1396k93406K58993K62826j70280j19709L47488p4646j7474
2593b474091k45231p025n6453m44344l6507J57159k4662j10677K13247N9246k97189
2582c266527K50811k5603L9446K15787K46649j22620J66494P4774k30198k25593
2572b876580k537l0306k32507L23980P0735J96003j63057o7189J10923J33068
$$ plain form
2562 -2537467 -2545794 -2488680 -2549137 -2861255 -2993728 -3110069 -3103260 -2803401 -2767001 -2771635 -2632933
2551 -2632933 -2773936 -3010303 -2824933 -2762313 -2907358 -3091789 -2828088 -2873798 -2751114 -2722652
2541 -2722652 -2659007 -2674589 -2789537 -2674673 -2836441 -2927935 -3191536 -3016782 -2662620 -2771591
2531 -2771591 -2770814 -2553881 -2689929 -2750931 -2753640 -3041583 -2778449 -2549953 -2769935 -3095756 -3037804
2520 -3037804 -2753104 -2679460 -2792121 -2657929 -2667315 -2715103 -2743468 -2919360 -2907916 -2822960 -2911906
2509 -2911906 -2887909 -2658495 -2845277 -2851165 -2669725 -2469294 -2724289 -2855750 -2854535 -2767856 -2914749
2498 -2914749 -2957602 -2473408 -2525546 -2327602 -2725906 -2911157 -2828598 -2971218 -2941325 -3126390
2488 -3126390 -2928476 -3058254 -2912557 -2842523 -2753688 -2720610 -2919524 -2901946 -2768476 -2876184
$$ packed form
2562b537467q327N7114o0457l12118j32473j16341O809K99859L6400m634J38702
2551b632933j41003k36367J85370O2620j45045j84431K63701m5710J22684K8462
2541b722652O3645j5582j14948J14864j61768r1494k63601J74754L54162j08971
2531b771591P77K16933j36048o1002k709k87943K63134K28496k19982l25821N7952
2520c037804K84700P3644j12661J34192r386m7788k8365j75892J1444Q4956q8946
2509b911906K3997K29414j86782n888J81440K00431k54995j31461J215Q6679j46893
2498b914749m2853M84194n2138J97944l98304j85251Q2559j42620K9893j85065
2488c126390J97914j29778J45697P0034Q8835L3078j98914J7578J33470j07708
$$ plain form
2478 -2876184 -2702521 -2516103 -2385693 -2576042 -2686469 -2574205 -2688581 -2758388 -2892674 -2753578
2468 -2753578 -2715965 -2866601 -2568770 -2622850 -2754932 -2796813 -2645240 -2574140 -2813288 -2772307
2458 -2772307 -2709918 -2686544 -2613933 -2446385 -2492318 -2721765 -2572730 -2534749 -2555705 -2538561 -2749792
2447 -2749792 -2929872 -2640160 -2677337 -2913450 -2908190 -2899282 -2494549 -2672722 -2838729 -2980369
2437 -2980369 -2869218 -2888793 -2809962 -2788296 -2567464 -2701509 -2672120 -2823961 -2988042 -3087877
2427 -3087877 -3036855 -2727717 -3017317 -3067258 -2630815 -2522118 -2764805 -2820698 -2677545 -2560623
2417 -2560623 -2448839 -2654079 -2811009 -2859532 -3001045 -2617586 -2738880 -2805704 -2543470 -2526286
2407 -2526286 -2423502 -2618595 -2712591 -2562659 -2680632 -2709702 -2483379 -2474588 -2834150 -2651247
$$ packed form
2478b876184J73663J86418J30410j90349j10427J12264j14376o9807j34286J39096
2468b753578L7613j50636K97831n4080j32082m1881J51573P1100k39148M0981
2458b772307O2389K3374P2611J67548m5933k29447J49035L7981k0956J7144k11231
2447b749792j80080K89712l7177k36113N260Q908M04733j78173j66007j41640
2437b980369J11151j9575P8831K1666K20832j34045K9389j51841j64081r9835
2427c087877N1022L09138k89600m9941M36443J08697k42687n5893J43153J16922
2417b560623J11784k05240j56930m8523j41513L83459j21294o6824K62234J7184
2407b526286J02784j95093r3996J49932j17973k9070K26323Q791l59562J82903
$$ plain form
2397 -2651247 -2594096 -2365942 -2260241 -2398748 -2843330 -2940584 -2722465 -2548744 -2474425 -2698727
2387 -2698727 -2702118 -2624257 -2712958 -2758765 -2477066 -2618095 -2514410 -2430836 -2664121 -2497411 -2531460
2376 -2531460 -2699905 -2989776 -2814834 -2701596 -2772216 -2841831 -2751398 -2650365 -2710214 -2539619
2366 -2539619 -2574185 -2362256 -2487162 -2534520 -2603781 -2545014 -2403124 -2501207 -2650976 -2509737
2356 -2509737 -2335435 -2536841 -2707857 -2970597 -2866132 -2725834 -2723803 -2652045 -2453909 -2530077
2346 -2530077 -2708238 -2971669 -2744954 -2688830 -2634213 -2518232 -2606314 -3009210 -3050562 -2747442
2336 -2747442 -2582526 -2334566 -2306729 -2268746 -2395447 -2332802 -2539866 -2526288 -2451763 -2470251 -2425484
2325 -2425484 -2431576 -2592213 -2468552 -2339398 -2322767 -2052201 -1957713 -1927956 -2118315 -2053478 -2165884
$$ packed form
2397b651247N7151K28154J05701j38507m44582r7254K18119J73721P4319k24302
2387b698727l391P7861q8701m5807K81699j41029J03685Q3574k33285J66710l4049
2376b531460j68445k89871J74942J13238p0620o9615R0433J01033n9849J70595
2366b539619l4566K11929j24906m7358o9261N8767J41890r8083j49769J41239
2356b509737J74302k01406j71016k62740J04465J40298K031P1758J98136p6168
2346b530077j78161k63431K26715N6124N4617J15981q8082m02896m1352L03120
2336b747442J64916K47960K7837L7983j26701O2645k07064J3578P4525j8488M4767
2325b425484o092j60637J23661J29154J6631K70566R4488K9757j90359O4837j12406
$$ plain form
2314 -2165884 -2386470 -2194242 -2169385 -1841038 -2101957 -2188557 -1994552 -1833463 -1810087 -1897973
2304 -1897973 -1708393 -1469396 -1304787 -1297366 -1093874 -1043399 -764183 -793297 -675570 -492700
2294 -492700 -537698 -261082 9819 134919 455398 854412 843036 1270623 1464324 1484977
2284 1484977 1194678 765979 703452 248612 -108135 -423427 -583428 -669761 -1025790 -1257890
2274 -1257890 -1411429 -1523254 -1679879 -1884382 -1831047 -1644373 -1731910 -1940495 -1996630 -1911338
2264 -1911338 -2040418 -1917736 -2094776 -2450168 -2474792 -2381842 -2560530 -2385823 -2228404 -2329652
2254 -2329652 -2470481 -2647255 -2586734 -2365165 -2192072 -2258287 -2206188 -2574101 -2405356 -2382867
2244 -2382867 -2481680 -2569322 -2519649 -2562109 -2403483 -2557044 -2440986 -2620827 -2548488 -2388304
$$ packed form
2314b165884k20586J92228K4857L28347k60919q6600J94005J61089K3376q7886
2304a897973J89580K38997J64609P421K03492N0475K79216k9114J17727J82870
2294d92700m4998K76616K70901J25100L20479L99014j1376M27587J93701K0653
2284A484977k90299m28699o2527m54840l56747l15292j60001q6333l56029k32100
2274a257890j53539j11825j56625k04503N3335J86674q7537k08585n6135Q5292
2264a911338j29080J22682j77040l55392k4624R2950j78688J74707J57419j01248
2254b329652j40829j76774O0521K21569J73093o6215N2099l67913J68745K2489
2244b382867r8813q7642M9673m2460J58626j53561J16058j79841P2339J60184
$$ plain form
2234 -2388304 -2578949 -2773843 -2641741 -2669564 -2527263 -2419281 -2319069 -2286007 -2260773 -2341250
2224 -2341250 -2669734 -2465019 -2527956 -2490420 -2516990 -2566607 -2662172 -2460661 -2504535 -2543416 -2849487
2213 -2849487 -2791477 -2619540 -2639631 -2783149 -2740226 -2710829 -2737797 -2613664 -2731364 -2714849 -2792560
2202 -2792560 -2999383 -2716647 -2642159 -2541486 -2793226 -2676457 -2810024 -2720118 -2690373 -3095540
2192 -3095540 -3120593 -2895824 -2901925 -2968461 -2851480 -2687513 -2704667 -2804336 -2751983 -2948376 -2777631
2181 -2777631 -2563636 -2529149 -2704263 -2568876 -2709947 -2896411 -2726151 -2504507 -2367095 -2514008
2171 -2514008 -2323220 -2507661 -2673788 -2579283 -2608707 -2521422 -2261777 -2528069 -2773915 -2874752
2161 -2874752 -3022762 -2778133 -2681132 -2750935 -2829274 -2790739 -2338529 -2167673 -2381053 -2461951
$$ packed form
2234b388304j90645j94894J32102k7823J42301J07982J00212L3062K5234q0477
2224b341250l28484K04715o2937L7536k6570m9617r5565K01511m3874l8881l06071
2213b849487N8010J71937k0091j43518M2923K9397k6968J24133j17700J6515p7711
2202b792560k06823K82736P4488J00673k51740J16769j33567Q9906K9745m05167
2192c095540k5053K24769o101o6536J16981J63967j7154r9669N2353j96393J70745
2181b777631K13995L4487j75114J35387j41071j86464J70260K21644J37412j46913
2171b514008J90788j84441j66127R4505k9424Q7285K59645k66292k45846j00837
2161b874752j48010K44629R7001o9803p8339L8535M52210J70856k13380q0898
$$ plain form
2151 -2461951 -2627583 -2461608 -2249369 -2681066 -2637118 -2582272 -2543824 -2421784 -2790268 -2755844
2141 -2755844 -2669338 -2870368 -3081595 -2954121 -2844139 -2894893 -2964344 -2741910 -2724533 -2418924
2131 -2418924 -2611728 -2601269 -2516121 -2416961 -2582017 -2418189 -2295999 -2447244 -2376451 -2433040
2121 -2433040 -2334621 -2395860 -2636900 -2687730 -2702853 -2894966 -2905515 -2677614 -2585296 -2746681 -2769121
2110 -2769121 -2738868 -2763182 -2834705 -2831832 -2674796 -2596196 -2572022 -2709066 -2643817 -2643113 -2726538 -2807344
2098 -2807344 -2817236 -2950047 -2669383 -2427595 -2747668 -2691429 -2493906 -2510880 -2314731 -2203865
2088 -2203865 -2416191 -2408596 -2286423 -2396333 -2396928 -2256594 -2603676 -2628158 -2801291 -2681287 -2576800
2077 -2576800 -2439329 -2557497 -2586604 -2387286 -2494549 -2819740 -2830088 -2904359 -2674551 -2596057
$$ packed form
2151b461951j65632J65975K12239m31697M3948N4846L8448J22040l68484L4424
2141b755844Q6506k01030k11227J27474J09982n0754o9451K22434J7377L05609
2131b418924j92804J0459Q5148R9160j65056J63828J22190j51245P0793n6589
2121b433040R8419o1239k41040n0830j5123j92113j0549K27901R2318j61385k2440
2110b769121L0253k4314p1523K873J57036P8600K4174j37044O5249P04q3425q0806
2098b807344r892j32811K80664K41788l20073N6239J97523j6974J96149J10866
2088b203865k12326P595J22173j09910n95J40334l47082k4482j73133J20004J04487
2077b576800J37471j18168k9107J99318j07263l25191j0348p4271K29808P8494
$$ plain form
2067 -2596057 -2860960 -2601943 -2383587 -2442148 -2463164 -2520770 -2835829 -2717889 -2507458 -2370055
2057 -2370055 -2173085 -2515896 -2554119 -2551676 -2754094 -2690791 -2525753 -2585941 -2725915 -2619399
2047 -2619399 -2913956 -2872021 -2551079 -2469024 -2659190 -2699936 -2531252 -2630263 -2538910 -2373392
2037 -2373392 -2109942 -2344728 -2572391 -2516044 -2450501 -2510970 -2728954 -2712884 -2340960 -2219103
2027 -2219103 -2488404 -2523153 -2610227 -2640571 -2705618 -2590302 -2436370 -2261331 -2635417 -2761735
2017 -2761735 -2568627 -2284979 -2511945 -2798446 -2670954 -2581905 -2590807 -2595321 -2625687 -2681088 -2676111
2006 -2676111 -2711774 -2487304 -2422181 -2511132 -2492002 -2706107 -2652884 -2649782 -2424069 -2385514 -2431945
1995 -2431945 -2409257 -2466822 -2550263 -2653485 -2435733 -2222579 -2365789 -2513319 -2512758 -2839449 -3002786
$$ packed form
2067b596057k64903K59017K18356n8561k1016n7606l15059J17940K10431J37403
2057b370055J96970l42811l8223K443k02418O3303J65038o0188j39974J06516
2047b619399k94557M1935L20942Q2055j90166m0746J68684r9011R1353J65518
2037b373392K63450k34786k27663N6347O5543o0469k17984J6070L71924J21857
2027b219103k69301l4749q7074l0344o5047J15316J53932J75039l74086j26318
2017b761735J93108K83648k26966k86501J27492Q9049q902m514l0366n5401M977
2006b676111l5663K24470O5123q8951J9130k14105N3223L102K25713L8555m6431
1995b431945K2688n7565q3441j03222K17752K13154j43210j47530N61l26691j63337
$$ plain form
1984 -3002786 -2736958 -2702352 -2807075 -2790837 -2714448 -2574888 -2724123 -2685081 -2667357 -2523885
1974 -2523885 -2869130 -2683253 -2463205 -2426138 -2182987 -2489670 -2753400 -2636434 -2666051 -2452397
1964 -2452397 -2616153 -2825864 -2582867 -2238676 -2410236 -2597197 -2247795 -2225088 -2488859 -2460802
1954 -2460802 -2458487 -2244392 -2316159 -2486463 -2475693 -2331685 -2391167 -2332490 -2709396 -2854978 -2820431
1943 -2820431 -2605151 -2507088 -2519933 -2204585 -2318124 -2137701 -2322156 -2570085 -2686606 -3057147
1933 -3057147 -3060943 -2732247 -2853124 -2682806 -2539062 -2761184 -2721706 -2383735 -2383891 -2199381 -2369102
1922 -2369102 -2337254 -2196308 -2329545 -2446492 -2570451 -2435013 -2376405 -2433523 -2358006 -2448459
1912 -2448459 -2471247 -2226890 -2226528 -2262948 -2286825 -2347672 -2250976 -2584866 -2588521 -2566668 -2285455
$$ packed form
1984c002786K65828L4606j04723J6238P6389J39560j49235L9042J7724J43472
1974b523885l45245J85877K20048L7067K43151l06683k63730J16966k9617K13654
1964b452397j63756k09711K42997L44191j71560j86961L49402K2707k63771K8057
1954b460802K315K14095p1767j70304J0770J44008n9482N8677l76906j45582L4547
1943b820431K15280R8063j2845L15348j13539J80423j84455k47929j16521l70541
1933c057147l796L28696j20877J70318J43744k22122L9478L37971j56J84510j69721
1922b369102L1848J40946j33237j16947j23959J35438N8608n7118P5517r0453
1912b448459k2788K44357L62l6420k3877o0847R6696l33890l655K1853K81213
$$ plain form
1901 -2285455 -2513828 -2777858 -2688710 -2519951 -2474854 -2476188 -2586370 -2446187 -2108481 -2527511
1891 -2527511 -2593534 -2659461 -2707621 -2682082 -2457701 -2332847 -2532721 -2564134 -2523955 -2314249 -2211610
1880 -2211610 -2327583 -2309642 -2418049 -2262548 -2297216 -2461950 -2465633 -2592237 -2329492 -2197583
1870 -2197583 -2480225 -2821556 -2612315 -2439504 -2378125 -2515952 -2609163 -2632061 -2403712 -2497050
1860 -2497050 -2476366 -2450507 -2713184 -2543457 -2411533 -2450915 -2480005 -2490625 -2593905 -2502085 -2310555
1849 -2310555 -2374587 -2484399 -2427589 -2266257 -2216576 -2524382 -2648748 -2682251 -2629654 -2641424 -2874747
1838 -2874747 -2955287 -2552683 -2479382 -2328327 -2457120 -2480998 -2386062 -2192380 -2291271 -2472857
1828 -2472857 -2432880 -2405436 -2339207 -2397741 -2575009 -2799126 -2789366 -2667496 -2464835 -2430411 -2598626
$$ packed form
1901b285455k28373k64030Q9148J68759M5097j334j10182J40183L37706m19030
1891b527511o6023o5927m8160K5539K24381J24854j99874l1413M0179K09706J02639
1880b211610j15973J7941j08407J55501l4668j64734l683j26604K62745J31909
1870b197583k82642l41331K09241J72811O1379j37827r3211k2898K28349r3338
1860b497050K0684K5859k62677J69727J31924l9382k9090j0620j03280R1820J91530
1849b310555o4032j09812N6810J61332M9681l07806j24366l3503N2597j1770k33323
1838b874747q0540M02604P3301J51055j28793k3878R4936J93682r8891j81586
1828b472857L9977K7444O6229n8534j77268k24117R760J21870K02661L4424j68215
$$ plain form
1817 -2598626 -2489525 -2111409 -2108522 -2207921 -2289144 -2641361 -2806406 -2587295 -2372792 -2472307
1807 -2472307 -2560546 -2611908 -2626923 -2673801 -2498558 -2343467 -2260214 -2171848 -2257535 -2510189 -2503765
1796 -2503765 -2450621 -2630844 -2524106 -2595163 -2459046 -2283351 -2472005 -2524630 -2356207 -2356678 -2184665
1785 -2184665 -2343941 -2520345 -2324171 -2114343 -2383697 -2609572 -2454487 -2539787 -2594429 -2665533
1775 -2665533 -2716950 -2866948 -2940283 -3079980 -2783278 -2600059 -2344144 -2395229 -2630257 -2349954
1765 -2349954 -2314338 -2337146 -2560760 -2434889 -2488157 -2523794 -2238950 -2214007 -2137951 -2257426 -2474435
1754 -2474435 -2656601 -2701337 -2677223 -2569078 -2560611 -2405970 -2464802 -2549522 -2440506 -2387491 -2417339
1743 -2417339 -2529716 -2630621 -2568234 -2539629 -2436384 -2436644 -2429486 -2255056 -2232505 -2463675 -2351356
$$ packed form
1817b598626J09101L78116K887r9399q1223l52217j65045K19111K14503r9515
1807b472307q8239n1362j5015m6878J75243J55091Q3253Q8366q5687k52654O424
1796b503765N3144j80223J06738p1057J36117J75695j88654n2625J68423m71J72013
1785b184665j59276j76404J96174K09828k69354k25875J55085q5300n4642p1104
1775b665533n1417j49998p3335j39697K96702J83219K55915n1085k35028K80303
1765b349954L5616k2808k23614J25871n3268l5637K84844K4943P6056j19475k17009
1754b474435j82166m4736K4114J08145Q467J54641n8832q4720J09016N3015k9848
1743b417339j12377j00905O2387K8605J03245k60P158J74430K2551k31170J12319
$$ plain form
1732 -2351356 -2407993 -2442326 -2293557 -2505253 -2652742 -2658013 -2346190 -2168830 -2191753 -2307750
1722 -2307750 -1975037 -2241949 -2167224 -2373582 -2588028 -2347604 -2563005 -2823609 -2412756 -2243945
1712 -2243945 -2491257 -2570330 -2563021 -2367369 -2148134 -2064313 -2158320 -2294862 -2511874 -2466938 -2638649
1701 -2638649 -2439989 -2301637 -2409788 -2417018 -2694284 -2596389 -2553972 -2410340 -2219491 -2104753
1691 -2104753 -2218055 -2148936 -2256404 -2367623 -2433026 -2465653 -2320408 -2509028 -2465581 -2492648
1681 -2492648 -2604535 -2335918 -2442539 -2493713 -2665809 -2703912 -2399349 -2386341 -2481992 -2457050
1671 -2457050 -2254935 -2476393 -2352534 -2550935 -2543182 -2495550 -2396245 -2213772 -2574473 -2309140
1661 -2309140 -2226397 -2469755 -2325400 -2548232 -2512062 -2420573 -2261924 -2046304 -2074251 -2090260
$$ packed form
1732b351356n6637l4333J48769k11696j47489n271L11823J77360k2923j15997
1722b307750L32713k66912P4725k06358k14446K40424k15401k60604M10853J68811
1712b243945k47312p9073P309J95652K19235Q3821r4007j36542k17012M4936j71711
1701b638649J98660J38352j08151p230k77266R7895M2417J43632J90849J14738
1691b104753j13302O9119j07468j11219o5403l2627J45245j88620M3447k7067
1681b492648j11887K68617j06621n1174j72096l8103L04563J3008r5651K4942
1671b457050K02115k21458J23859j98401P753M7632R9305J82473l60701K65333
1661b309140Q2743k43358J44355k22832L6170R1489J58649K15620k7947j6009
$$ plain form
1651 -2090260 -2091135 -2136493 -2240250 -2502946 -2381767 -2564697 -2631039 -2630594 -2454516 -2634422 -2696995
1640 -2696995 -2513854 -2384588 -2270298 -2590549 -2489609 -2523998 -2480108 -2400372 -2118461 -2255104
1630 -2255104 -2320517 -2373345 -2388948 -2536890 -2765458 -2343007 -2072339 -2357986 -2382333 -2255023
1620 -2255023 -2407660 -2664868 -2764754 -2604360 -2575503 -2723208 -2757168 -2649406 -2775035 -2569613
1610 -2569613 -2204030 -2127129 -2196020 -2428240 -2541282 -2694249 -2684275 -2704409 -2600032 -2608579 -2609872
1599 -2609872 -2424879 -2453539 -2429489 -2398486 -2405943 -2349307 -2162439 -2067382 -1987222 -2201506 -2506063
1588 -2506063 -2408589 -2622155 -2610312 -2615391 -2535648 -2430628 -2262329 -2442634 -2764332 -2644999
1578 -2644999 -2366294 -2264648 -2292854 -2398574 -2443624 -2366880 -2528582 -2267809 -2301612 -2677756
$$ packed form
1651b090260q75m5358j03757k62696J21179j82930o6342M45J76078j79906o2573
1640b696995J83141J29266J14290l20251J00940l4389M3890P9736K81911j36643
1630b255104o5413n2828j5603j47942k28568M22451K70668k85647k4347J27310
1620b255023j52637k57208r9886J60394K8857j47705l3960J07762j25629K05422
1610b569613L65583P6901o8891k32220j13042j52967R974k0134J04377q547j293
1599b609872J84993k8660K4050L1003p457N6636J86868R5057Q0160k14284l04557
1588b506063R7474k13566J1843n079P9743J05020J68299j80305l21698J19333
1578b644999K78705J01646k8206j05720m5050P6744j61702K60773l3803l76144
$$ plain form
1568 -2677756 -2634491 -2644208 -2493266 -2334381 -2305792 -2264542 -2273218 -2179176 -2279563 -2316035 -2556978
1557 -2556978 -2471486 -2243691 -2118033 -2390687 -2609712 -2625236 -2513119 -2705742 -2652629 -2453196
1547 -2453196 -2286913 -2357469 -2463887 -2558771 -2557574 -2488569 -2486363 -2315009 -2186827 -2265671 -2382287
1536 -2382287 -2345716 -2537506 -2589948 -2252526 -2329642 -2414018 -2355398 -2410483 -2116581 -1973154 -2010783
1525 -2010783 -2099472 -2240024 -2328503 -2154072 -2200390 -2254605 -2338948 -2290638 -2357285 -2464722 -2391737
1514 -2391737 -2330759 -2195923 -2217269 -2294414 -2489072 -2622462 -2402853 -2304553 -2338456 -2375107 -2469429
1503 -2469429 -2399485 -2311750 -2576331 -2826018 -2708045 -2500601 -2198146 -2181045 -2271095 -2352289
1493 -2352289 -2393836 -2391797 -2433171 -2464324 -2404463 -2385289 -2260808 -2298942 -2314867 -1870773 -2385717
$$ packed form
1568b677756M3265r717J50942J58885K8589M1250q676R4042j00387l6472k40943
1557b556978Q5492K27795J25658k72654k19025j5524J12117j92623N3113J99433
1547b453196J66283p0556j06418r4884J197O9005K206J71354J28182p8844j16616
1536b382287L6571j91790n2442L37422p7116q4376N8620n5085K93902J43427l7629
1525b010783q8689j40552q8479J74431m6318n4215q4343M8310o6647j07437P2985
1514b391737O0978J34836k1346p7145j94658j33390K19609R8300l3903l6651r4322
1503b469429O9944Q7735k64581k49687J17973K07444L02455J7101r0050q1194
1493b352289m1547K039m1374l1153N9861J9174J24481l8134j5925M44094n14944
$$ plain form
1482 -2385717 -2516511 -2364496 -2368680 -2191319 -2246939 -2176435 -2070593 -2199705 -2590797 -2328146
1472 -2328146 -2134852 -2310884 -2296571 -2252948 -2315870 -2617813 -2643774 -2347555 -2244683 -2490031
1462 -2490031 -2416490 -2487486 -2223098 -2155138 -2304918 -2452746 -2460119 -2549716 -2355815 -2463922 -2568362
1451 -2568362 -2376147 -2257898 -2325351 -2413391 -1905019 -2160572 -2445794 -2220157 -2277257 -2330355
1441 -2330355 -2345785 -2360300 -2397766 -2242275 -2312532 -2529847 -2610950 -2806463 -2740314 -2636469 -2323254
1430 -2323254 -2326736 -2577190 -2673721 -2325938 -2219153 -2307154 -2474441 -2485903 -2392504 -2430864 -2298116
1419 -2298116 -2301124 -2491653 -2446058 -2209997 -2103387 -2333025 -2408947 -2303323 -2103704 -2230168
1409 -2230168 -2403542 -2451126 -2309491 -2477320 -2210909 -2297408 -2438003 -2406155 -2435286 -2525093
$$ packed form
1482b385717j30794J52015m184J77361n5620P0504J05842j29112l91092K62651
1472b328146J93294j76032J4313M3623o2922l01943k5961K96219J02872k45348
1462b490031P3541p0996K64388O7960j49780j47828p373q9597J93901j08107j04440
1451b568362J92215J18249o7453q8040N08372k55553k85222K25637n7100n3098
1441b330355j5430j4515l7466J55491p0257k17315q1103j95513O6149J03845L13215
1430b323254l482k50454r6531L47783J06785q8001j67287j1462R3399l8360J32748
1419b298116l008j90529M5595K36061J06610k29638p5922J05624J99619j26464
1409b230168j73374m7584J41635j67829K66411q6499j40595L1848k9131q9807
$$ plain form
1399 -2525093 -2583746 -2582558 -2505333 -2389707 -2202446 -2009526 -2220560 -2373508 -2239925 -2170604
1389 -2170604 -2222610 -1945768 -2159027 -2057414 -2414032 -2605117 -2456687 -2341510 -2154380 -2479871
1379 -2479871 -2394048 -2491781 -2378598 -2251055 -2467369 -2493766 -2377769 -2377277 -2383150 -2310029 -2429777
1368 -2429777 -2269760 -2135877 -2058369 -2142811 -2393514 -2542463 -2650416 -2498861 -2307222 -2406298
1358 -2406298 -2339017 -2249409 -2144187 -2350751 -2385176 -2368490 -2416570 -2310036 -2389570 -2484060 -2243304
1347 -2243304 -2310179 -2359214 -2277959 -2228515 -2329161 -2395329 -2190570 -2430263 -2555476 -2461865 -2521433
1336 -2521433 -2506115 -2453915 -2184856 -2418494 -2667622 -2618768 -2496761 -2585299 -2585649 -2770365 -2473362
1325 -2473362 -2028771 -1905628 -2037061 -2049246 -2126627 -2471600 -2329910 -2209670 -2108738 -2292830
$$ packed form
1399b525093n8653J188P7225J15626J87261J92920k11034j52948J33583O9321
1389b170604n2006K76842k13259J01613l56618j91085J48430J15177J87130l25491
1379b479871Q5823r7733J13183J27543k16314k6397J15997M92n873P3121j19748
1368b429777J60017J33883P7508q4442k50703j48949j07953J51555J91639r9076
1358b406298O7281Q9608J05222k06564l4425J6686m8080J06534p9534r4490K40756
1347b243304o6875m9035Q1255M9444j00646o6168K04759k39693j25213R3611n9568
1336b521433J5318N2200K69059k33638k49128M8854J22007q8538l50j84716K97003
1325b473362M44591J23143j31433j2185p7381l44973J41690J20240J00932j84092
$$ plain form
1315 -2292830 -2233178 -2191366 -2110876 -2079161 -2088766 -2156995 -2367653 -2199831 -2436915 -2707311 -2520732
1304 -2520732 -2618182 -2503248 -2595279 -2617121 -2373750 -2666321 -2365567 -2351616 -2322095 -2098489
1294 -2098489 -2190689 -2447261 -2246032 -2334673 -2373764 -2334671 -2190907 -2186858 -2272917 -2086826 -2149943
1283 -2149943 -2349219 -2371616 -2244472 -2233370 -2088779 -2102243 -2132250 -2229165 -2107323 -2084017 -2040379
1272 -2040379 -2178638 -1880384 -2076008 -2107935 -2281380 -2104937 -2186406 -2408991 -2563450 -2471537
1262 -2471537 -2465628 -2190482 -2324461 -2232185 -2152813 -2058785 -2121179 -2300843 -2376677 -2516968 -2418989
1251 -2418989 -2567427 -2418449 -2332896 -2320308 -2299319 -2438388 -2025165 -2020605 -2247983 -2031411
1241 -2031411 -2091147 -2041813 -2178632 -1931047 -1780769 -2117909 -2438559 -2451607 -2343177 -2413935
$$ packed form
1315b292830N9652M1812Q0490L1715r605o8229k10658J67822k37084k70396J86579
1304b520732r7450J14934r2031k1842K43371k92571L00754J3951K9521K23606
1294b098489r2200k56572K01229q8641l9091L9093J43764M049q6059J86091o3117
1283b149943j99276k2397J27144J1102J44591j3464l0007r6915J21842K3306M3638
1272b040379j38259K98254j95624l1927j73445J76443q1469k22585j54459R1913
1262b471537N909K75146j33979R2276P9372R4028o2394j79664p5834j40291R7979
1251b418989j48438J48978Q5553J2588K0989j39069M13223M560k27378K16572
1241b031411n9736M9334j36819K47585J50278l37140l20650j3048J08430p0758
$$ plain form
1231 -2413935 -2388869 -2311383 -2256779 -2333221 -2175874 -2269285 -2342821 -2309778 -2409698 -2276730 -2124993
1220 -2124993 -2396183 -2666266 -2458428 -2430257 -2042504 -2044844 -2023436 -2025306 -1996578 -1946187 -2018298
1209 -2018298 -2150291 -2249965 -2574333 -2641141 -2532236 -2615291 -2457252 -2370043 -2542851 -2356377
1199 -2356377 -2388335 -2319380 -2475780 -2386881 -2485302 -2018648 -2171365 -2282251 -2207559 -2312246
1189 -2312246 -2267572 -2078527 -2131359 -2274184 -2218451 -2318729 -1970793 -2153159 -2425416 -2183337
1179 -2183337 -1988704 -2751693 -2733371 -2411878 -2374556 -2186551 -2198151 -1972896 -2115047 -2425485
1169 -2425485 -2313766 -2509208 -2381322 -2167710 -2432498 -2509155 -2335878 -2383215 -2472278 -2389998
1159 -2389998 -2379042 -2302992 -2436543 -2439682 -2087392 -2063649 -2163504 -2220278 -2334282 -2125320 -1930702
$$ packed form
1231b413935K5066P7486N4604p6442J57347r3411p3536L3043r9920J32968J51737
1220b124993k71190k70083K07838K8171L87753k340K1408j870K8728N0391p2111
1209b018298j31993r9674l24368o6808J08905q3055J58039Q7209j72808J86474
1199b356377l1958O8955j56400Q8899r8421M66654j52717j10886P4692j04687
1189b312246M4674J89045n2832j42825N5733j00278L47936j82366k72257K42079
1179b183337J94633p62989J8322L21493L7322J88005j1600K25255j42151l10438
1169b425485J11719j95442J27886K13612k64788p6657J73277m7337q9063Q2280
1159b389998J0956P6050j33551l139L52290K3743r9855n6774j14004K08962J94618
$$ plain form
1148 -1930702 -1951031 -1999569 -2215064 -2142307 -1936502 -2255091 -1947718 -2009729 -2018417 -2028965 -1944809
1137 -1944809 -1539596 -1922036 -2237548 -2134618 -2377204 -2329994 -2432561 -2290659 -2169436 -2315638
1127 -2315638 -2299801 -2468823 -2380447 -2639758 -2463024 -2372784 -2359194 -2354837 -2142166 -2301698 -2227088
$$ packed form
1148a930702k0329m8538k15495P2757K05805l18589L07373o2011q688j0548Q4156
1137a944809M05213l82440l15512J02930k42586M7210j02567J41902J21223j46202
1127b315638J5837j69022Q8376k59311J76734R0240J3590M357K12671j59532P4610
$$ [...]
##END NTUPLES=NMR SPECTRUM
##END=
