##TITLE=1H_DE-80H_X3
 200.13MHz, d2o
 8 sc
 
 19ns.26.2.2025
##JCAMPDX= 6.0         $$ Bruker NMR JCAMP-DX V2.0
##DATA TYPE= NMR SPECTRUM
##DATA CLASS= NTUPLES
##ORIGIN= UXNMR, Bruker Analytische Messtechnik GmbH
##OWNER= pz
$$ XWIN-NMR		Version 3.5
$$ Fri Jun 20 15:44:50 2025 Russian Standard Time (UT+4h)  Yarkov@DPX200
##.OBSERVE FREQUENCY= 200.1313
##.OBSERVE NUCLEUS= ^1H
##.ACQUISITION MODE= SIMULTANEOUS
##.ACQUISITION SCHEME= undefined
##.AVERAGES= 8
##.DIGITISER RES= 18
##SPECTROMETER/DATA SYSTEM= spect
##.PULSE SEQUENCE= zg30
##.SOLVENT NAME= CDCl3
##.SHIFT REFERENCE= (INTERNAL, CDCl3, 0, 15.5398)
##AUDIT TRAIL= $$ (NUMBER, WHEN, WHO, WHERE, WHAT)
$$ ##TITLE= Audit trail, XWIN-NMR		Version 3.5
$$ ##JCAMPDX= 5.01
$$ ##ORIGIN= Bruker BioSpin GmbH
$$ ##OWNER= Yarkov
$$ C:/Bruker/XWIN-NMR/data/yarkov2/nmr/H-C/1/pdata/1/auditp.txt
$$ ##AUDIT TRAIL=  $$ (NUMBER, WHEN, WHO, WHERE, WHAT)
(   1,<2025-06-20 15:43:43.32 +0400>,<Yarkov>,<DPX200>,
      <created by zg, POWCHK disabled, PULCHK disabled
       configuration hash MD5:
       00 E9 B6 7A A2 85 ED C7 34 08 36 98 17 FE 4E 26
       data hash MD5: 16K
       90 DF F3 B6 C8 53 31 8D FA ED 3C B1 F0 B6 F9 80>)
(   2,<2025-06-20 15:43:54.29 +0400>,<Yarkov>,<DPX200>,
      <Start of raw data processing
       efp BC_mod = 2 LB = 0.25 FT_mod = 6 PKNL = 1 PHC0 = -1722.08 PHC1 = 17.76659 SI = 16K 
       data hash MD5: 16K
       89 89 AC 15 36 FE 9E 96 AE 0E 68 77 EE EB 62 DD>)
(   3,<2025-06-20 15:44:05.67 +0400>,<Yarkov>,<DPX200>,
      <abs ABSG = 5 
       data hash MD5: 16K
       EC A6 8B 2A 31 D6 46 54 F5 A3 AF C2 0A E0 96 E4>)
$$ ##END=
$$ 
$$ hash MD5
$$ 54 DA F3 03 34 8B 78 C3 D9 61 84 72 E8 C7 A4 2F
##$RELAX= 
##$RELAX= 
##$RELAX= 
##$RELAX= 
##$RELAX= 
##$RELAX= 
$$ Bruker specific parameters
$$ --------------------------
##$DU= <C:/Bruker/XWIN-NMR>
##$EXPNO= 1
##$NAME= <H-C>
##$PROCNO= 1
##$TYPE= <nmr>
##$USER= <yarkov2>
##$AMP= (0..31)
100 100 100 100 100 100 100 100 100 100 100 100 100 100 100 100 100 100 
100 100 100 100 100 100 100 100 100 100 100 100 100 100 
##$AQSEQ= 0
##$AQ_mod= 1
##$AUNM= <au_zg>
##$AUTOPOS= <>
##$BF1= 200.13
##$BF2= 200.13
##$BF3= 200.13
##$BF4= 200.13
##$BF5= 200.13
##$BF6= 200.13
##$BF7= 200.13
##$BF8= 200.13
##$BYTORDA= 1
##$CFDGTYP= 0
##$CFRGTYP= 5
##$CHEMSTR= <none>
##$CNST= (0..31)
1 1 145 1 1 1 1 1 1 1 1 1 1 1 1 1 1 1 1 1 1 1 1 1 1 1 1 1 1 1 1 1 
##$CPDPRG= <>
##$CPDPRG1= <>
##$CPDPRG2= <>
##$CPDPRG3= <>
##$CPDPRG4= <mlev>
##$CPDPRG5= <mlev>
##$CPDPRG6= <mlev>
##$CPDPRG7= <mlev>
##$CPDPRG8= <mlev>
##$CPDPRGB= <>
##$CPDPRGT= <>
##$D= (0..31)
0 0.7 0 0 0 0 0 0 0 0 0 0.03 0 0 0 0 0 0 0 0 0 0 0 0 0 0 0 0 0 0 0 0 
##$DATE= 1750419822
##$DBL= (0..7)
120 120 120 120 120 120 120 120 
##$DBP= (0..7)
150 150 150 150 150 150 150 150 
##$DBP07= 0
##$DBPNAM0= <>
##$DBPNAM1= <>
##$DBPNAM2= <>
##$DBPNAM3= <>
##$DBPNAM4= <>
##$DBPNAM5= <>
##$DBPNAM6= <>
##$DBPNAM7= <>
##$DBPOAL= (0..7)
0.5 0.5 0.5 0.5 0.5 0.5 0.5 0.5 
##$DBPOFFS= (0..7)
0 0 0 0 0 0 0 0 
##$DE= 6
$$ [...]
##$SUBNAM3= <"">
##$SUBNAM4= <"">
##$SUBNAM5= <"">
##$SUBNAM6= <"">
##$SUBNAM7= <"">
##$SUBNAM8= <"">
##$SUBNAM9= <"">
##$SW= 18.0517328524113
##$SWIBOX= (0..15)
0 0 2 0 0 0 0 0 0 0 0 0 0 0 0 0 
##$SW_h= 3612.71676300578
##$TD= 16384
##$TD0= 1
##$TE= 0
##$TE2= 300
##$TE3= 300
##$TEG= 300
##$TL= (0..7)
0 120 120 120 120 120 120 120 
##$TP= (0..7)
150 150 150 150 150 150 150 150 
##$TP07= 0
##$TPNAME0= <>
##$TPNAME1= <>
##$TPNAME2= <>
##$TPNAME3= <>
##$TPNAME4= <>
##$TPNAME5= <>
##$TPNAME6= <>
##$TPNAME7= <>
##$TPOAL= (0..7)
0.5 0.5 0.5 0.5 0.5 0.5 0.5 0.5 
##$TPOFFS= (0..7)
0 0 0 0 0 0 0 0 
##$TUNHIN= 0
##$TUNHOUT= 0
##$TUNXOUT= 0
##$USERA1= <user>
##$USERA2= <user>
##$USERA3= <user>
##$USERA4= <user>
##$USERA5= <user>
##$V9= 5
##$VALIST= <valist>
##$VCLIST= <CCCCCCCCCCCCCCC>
##$VD= 0
##$VDLIST= <DDDDDDDDDDDDDDD>
##$VPLIST= <PPPPPPPPPPPPPPP>
##$VTLIST= <TTTTTTTTTTTTTTT>
##$WBST= 1024
##$WBSW= 4
##$XGAIN= (0..3)
0 0 0 0 
##$XL= 0
##$YL= 0
##$YMAX_a= 255694
##$YMIN_a= -191772
##$ZGOPTNS= <>
##$ZL1= 120
##$ZL2= 120
##$ZL3= 120
##$ZL4= 120
##$ABSF1= 15.47805
##$ABSF2= -2.573799
##$ABSG= 5
##$ABSL= 3
##$ALPHA= 0
##$AQORDER= 0
##$ASSFAC= 0
##$ASSFACI= 0
##$ASSFACX= 0
##$ASSWID= 0
##$AUNMP= <proc_1d>
##$AZFE= 0.1
##$AZFW= 0.1
##$BCFW= 0
##$BC_mod= 2
##$BYTORDP= 0
##$COROFFS= 0
##$CY= -3
##$DATMOD= 1
##$DC= 0
##$DFILT= <>
##$DTYPP= 0
##$F1P= 0
##$F2P= 0
##$FCOR= 1
##$FTSIZE= 16384
##$FT_mod= 6
##$GAMMA= 0
##$GB= 0
##$INTBC= 1
##$INTSCL= 3.241238e-09
##$ISEN= 128
##$LB= 0.25
##$LEV0= 0
##$LPBIN= 0
##$MAXI= 10000
##$MC2= 0
##$MEAN= 0
##$ME_mod= 0
##$MI= 1.114404
##$NCOEF= 0
##$NC_proc= -8
##$NLEV= 6
##$NOISF1= 3.799351
##$NOISF2= 2.8
##$NSP= 0
##$NTH_PI= 0
##$NZP= 0
##$OFFSET= 15.53975
##$PC= 1
##$PHC0= -1722.08
##$PHC1= 17.76659
##$PH_mod= 1
##$PKNL= yes
##$PPARMOD= 0
##$PSCAL= 0
##$PSIGN= 0
##$REVERSE= no
##$SF= 200.129996388053
##$SI= 16384
##$SIGF1= 3
##$SIGF2= 2
##$SINO= 0.751879
##$SIOLD= 32768
##$SREGLST= <19F.Aceton>
##$SSB= 0
##$STSI= 16384
##$STSR= 0
##$SW_p= 3612.71676300578
##$SYMM= 0
##$S_DEV= 0
##$TDeff= 16384
##$TDoff= 0
##$TI= <>
##$TILT= no
##$TM1= 0
##$TM2= 0
##$TOPLEV= 0
##$USERP1= <user>
##$USERP2= <user>
##$USERP3= <user>
##$USERP4= <user>
##$USERP5= <user>
##$WDW= 1
##$XDIM= 16384
##$YMAX_p= 323454747
##$YMIN_p= -773274
$$ End of Bruker specific parameters
$$ ---------------------------------
##NTUPLES= NMR SPECTRUM
##VAR_NAME=  FREQUENCY,     SPECTRUM/REAL,   SPECTRUM/IMAG
##SYMBOL=    X,             R,               I
##VAR_TYPE=  INDEPENDENT,   DEPENDENT,       DEPENDENT
##VAR_FORM=  AFFN,          ASDF,            ASDF
##VAR_DIM=   16384,         16384,           16384
##UNITS=     HZ,            ARBITRARY UNITS, ARBITRARY UNITS
##FACTOR=    0.220516191357247, 1,           1
##FIRST=     3109.97013122057, 0,            0
##LAST=      -502.746631785215, 0,           0
##MIN=       -502.746631785215, -773274,     0
##MAX=       3109.97013122057, 323454747,    0
$$ Real data points
##PAGE= N=1
##DATA TABLE= (X++(R..R)), XYDATA
$$ [...]
$$ plain form
6739 9813043 9630785 9385644 9217426 9088484 9028970 9001003 9015931 9328487 9329862 9096551
6729 9096551 8909292 9198761 8959466 8928597 8662483 8882453 8976960 8813845 8673617 8474550
6719 8474550 8665864 8796915 8731810 8833603 8899550 8858281 8873416 8772427 8786218 8780091 8447780
6708 8447780 8390631 8381928 8128386 8374721 8657885 8761035 8548873 8322871 8413123 8904067
6698 8904067 8742821 8604395 8166135 7934562 7879119 7952532 8000114 8108555 8321411 8335242
6688 8335242 8330798 8106192 8073880 7990364 7825726 8028324 8374962 8229689 8050903 8106268
6678 8106268 7789012 7679244 7481613 7516616 7615775 7530619 7685463 7743979 7598594 7688033
6668 7688033 7823894 7616016 7599942 7739641 7652866 7815808 7936676 7873118 7738146 7590653
$$ packed form
6739I813043j82258k45141j68218j28942n9514k7967J4928L12556J375k33311
6729I096551j87259K89469k39295l0869k66114K19970R4507j63115j40228j99067
6719H474550J91314J31051o5105J01793O5947m1269J5135j00989J3791o127l32311
6708H447780n7149q703k53542K46335K83164J03150k12162k26002R0252M90944
6698H904067j61246j38426m38260k31573n5443P3413M7582J08441K12856J3831
6688H335242m444k24606l2312q3516j64638K02598L46638j45273j78786N5365
6678H106268l17256j09768j97631L5003R9159q5156J54844N8516j45385Q9439
6668G688033J35861k07878j6074J39699q6775J62942J20868o3558j34972j47493
$$ plain form
6658 7590653 7639179 7510004 7408744 7530826 7632417 7426397 7414109 7209703 7297258 7176759
6648 7176759 7070376 7194175 7596277 7371761 7222449 7161676 7022695 7019076 7172174 7261783
6638 7261783 7010063 6908747 7011261 7079146 6952056 7014596 6744894 6492693 6390161 6481585
6628 6481585 6734141 6678223 6434837 6603787 6615409 6607178 6491263 6358034 6604495 6620023
6618 6620023 6820343 6819275 6611364 6619641 6658351 6764001 6702865 6718282 6669119 6480175 6464900
6607 6464900 6316149 6207495 6179939 6298687 6535059 6551771 6541339 6421860 6372181 6458068
6597 6458068 6207780 5897831 5992562 6023654 6236524 6331777 6081404 5830110 5704783 5940995
6587 5940995 5993772 5838715 5816035 5841143 5736753 5639795 5732949 5891738 6255950 5997821
$$ packed form
6658G590653M8526j29175j01260J22082J01591k06020j2288k04406Q7555j20499
6648G176759j06383J23799M02102k24516j49312o0773j38981l619J53098Q9609
6638G261783k51720j01316J02514O7885j27090O2540k69702k52201j02532R1424
6628F481585K52556n5918k43386J68950J1622q231j15915j33229K46461J5528
6618F620023K00320j068k07911Q277L8710J05650o1136J5417m9163j88944j5275
6607F464900j48751j08654k7556J18748K36372J6712j0432j19479m9679Q5887
6597F458068k50288l09949R4731L1092K12870R5253k50373k51294j25327K36212
6587E940995N2777j55057k2680K5108j04390r6958R3154J58789L64212k58129
$$ plain form
6577 5997821 6115460 6438837 6193375 6179836 6045176 5674799 5722584 5890115 5821820 5820021
6567 5820021 5894073 5780172 5837325 5746408 5576046 5358024 5372013 5698659 5631471 5410779
6557 5410779 5560776 5663176 5796691 5810289 5482208 5389604 5289889 5165460 5214599 5308172
6547 5308172 5246609 5088678 5202255 5314423 5231481 4923368 4970887 5175158 5370912 5436921
6537 5436921 5343894 5229187 5096204 5329768 5206050 4965707 5219043 5309402 5354519 5412754
6527 5412754 5288203 4976246 5044700 5200092 4771817 4957288 5154709 5179791 5142918 4934836
6517 4934836 4840827 4979324 4777341 4702275 4887322 5011280 4874313 5075916 4788560 4570432
6507 4570432 4507227 4653753 4776873 4718305 4677553 4857631 4981603 5020242 4902219 4826620
$$ packed form
6577E997821J17639L23377k45462j3539j34660l70377M7785J67531o8295j799
6567E820021P4052j13901N7153r0917j70362k18022J3989L26646o7188k20692
6557E410779J49997J02400J33515J3598l28081r2604r9715j24429M9139R3573
6547E308172o1563j57931J13577J12168q2942l08113M7519K04271J95754O6009
6537E436921r3027j14707j32983K33564j23718k40343K53336R0359M5117N8235
6527E412754j24551l11957O8454J55392m28275J85471J97421K5082l6873k08082
6517D934836r4009J38497k01983p5066J85047J23958j36967K01603k87356k18128
6507D570432o3205J46526J23120n8568m0752J80078J23972L8639j18023p5599
$$ plain form
6497 4826620 5021494 5029214 4859959 4833179 4820914 4905489 4798545 4707441 4647731 4587869 4565557
6486 4565557 4289559 4447634 4521688 4381855 4354352 4236700 4499844 4948989 4692257 4612031
6476 4612031 4535973 4255169 4257510 4393898 4572386 4334722 4169858 4444805 4477795 4526780
6466 4526780 4779045 4530540 4154082 4280730 4259025 4424659 4265684 4276093 4321577 4246419
6456 4246419 4183089 4022607 4212526 4048022 3831725 4041662 4057583 4254428 4228877 4144880
6446 4144880 3962268 3993764 4119789 4228091 4289075 4089440 4156748 4170837 3883061 3871314
6436 3871314 3700884 3616643 3807731 3912604 3868133 3897730 3694396 3899041 3937757 3889452
6426 3889452 3748899 3748443 3703056 3908689 4082310 4077438 3773629 3770858 3839200 3874858 3907686
$$ packed form
6497D826620J94874P720j69255k6780j2265Q4575j06944r1104n9710n9862k2312
6486D565557k75998J58075P4054j39833k7503j17652K63144M49145k56732q0226
6476D612031p6058k80804K341J36388J78488k37664j64864K74947L2990M8985
6466D526780K52265k48505l76458J26648k1705J65634j58975J0409M5484p5158
6456D246419o3330j60482J89919j64504k16297K09937J5921J96845k5551q3997
6446D144880j82612L1496J26025J08302O0984j99635O7308J4089k87776j1747
6436C871314j70430q4241J91088J04873m4471K9597k03334K04645L8716m8305
6426C889452j40553m56m5387K05633J73621m872l03809k771O8342L5658L2828
$$ plain form
6415 3907686 3475478 3356569 3593598 3554962 3677967 3641374 3710807 3533013 3336597 3525173
6405 3525173 3298488 3577621 3584099 3634083 3506845 3434758 3270728 3307230 3601596 3783001
6395 3783001 3309706 3394324 3473233 3553267 3437414 3504568 3543113 3795255 3597819 3379448
6385 3379448 3519865 3444345 3454649 3291820 3315488 3270268 3127556 3350789 3383962 3218464
6375 3218464 3330369 3380504 3336365 3138064 3053986 3053683 3085376 3220444 3365758 3358129 3168121
6364 3168121 3248060 3149962 3210833 3304056 3286707 3039504 2974544 3047200 3092973 3304351 2929587
6353 2929587 3006214 3001280 2826817 2951495 2897224 2860425 2716143 2703478 2778470 2842485 2895839
6342 2895839 2725561 2604718 2814055 3026615 2965173 3073775 3244816 2682722 2737300 2717556
$$ packed form
6415C907686m32208j18909K37029l8636J23005l6593O9433j77794j96416J88576
6405C525173k26685K79133O478M9984j27238p2087j64030L6502K94366J81405
6395C783001m73295Q4618P8909Q0034j15853O7154L8545K52142j97436k18371
6385C379448J40417p5520J0304j62829K3668m5220j42712K23233L3173j65498
6375C218464J11905N0135m4139j98301q4078l03L1693J35068J45314p629j90008
6364C168121P9939r8098O0871R3223j7349k47203o4960P2656M5773K11378l74764
6353B929587P6627m934j74463J24678n4271l6799j44282j2665P4992O4015N3354
6342B895839j70278j20843K09337K12560o1442J08602J71041n62094N4578j9744
$$ plain form
6332 2717556 2716205 2924794 2940187 2985152 2965081 3035078 2626423 2731555 2841086 2894906 2783675
6321 2783675 2870903 2897897 2833659 2750127 2861636 2598416 2603802 2867115 2753789 2358935 2438903
6310 2438903 2668426 2428834 2510211 2417566 2458494 2532163 2326245 2588306 2633811 2737596
6300 2737596 2543974 2396394 2422015 2497338 2442145 2409466 2500462 2314722 2338526 2377370 2247910
6289 2247910 2075834 2300927 2429172 2383251 2408014 2628440 2244609 2161122 2213447 2123907
6279 2123907 2000645 2176823 2140696 2040187 1970234 2109491 2468875 2539403 2436331 2246250
6269 2246250 2196887 2100886 2063870 2091300 2162905 1987885 2074195 1953597 1979504 1943344 2012775
6258 2012775 1979032 2122349 2158663 2110091 2094191 2186259 2144302 2012248 2123897 2020501 2111561
$$ packed form
6332B717556j351K08589J5393M4965k0071O9997m08655J05132J09531N3820j11231
6321B783675Q7228K6994o4238q3532J11509k63220N386K63313j13326l94854P9968
6310B438903K29523k39592Q1377r2645M0928P3669k05918K62061M5505J03785
6300B737596j93622j47580K5621P5323n5193l2679R0996j85740K3804L8844j29460
6289B247910j72076K25093J28245m5921K4763K20426l83831q3487N2325q9540
6279B123907j23262J76178l6127j00509o9953J39257L59384P0528j03072j90081
6269B246250m9363r6001l7016K7430P1605j75020Q6310j20598K5907l6160O9431
6258B012775l3743J43317L6314m8572j5900R2068m1957j32054J11649j03396R1060
$$ plain form
6247 2111561 1996321 1902153 2135561 2138594 2171077 2092174 2316615 2229442 1811330 1863382 1853686
6236 1853686 2289285 2212985 1941239 2069119 2063079 2012087 2198123 2237170 2126310 1984308
6226 1984308 2067097 2074808 2105181 1867171 1893462 2087386 2081382 1794730 1637038 1396942 1485400
6215 1485400 1627885 1895668 2129433 2165170 2273622 2083046 1780618 1897461 1816431 1664504
6205 1664504 1733692 1825394 1842666 1766439 1761657 1892532 1959583 1772810 1749871 1840917 2225209
6194 2225209 1829306 1615234 1623242 1715855 1761474 1867937 1946769 2086612 1928725 1784782
6184 1784782 1770666 1941359 1761268 1527987 1530986 1836075 1865733 1696794 1719045 1723619 1800005
6173 1800005 1315992 1320466 1512973 1636205 1511622 1593467 1481352 1341886 1501154 1831143
$$ packed form
6247B111561j15240r4168K33408L033L2483p8903K24441q7173m18112N2052r696
6236A853686M35599p6300k71746J27880o040n0992J86036L9047j10860j42002
6226A984308Q2789P711L0373k38010K6291J93924o004k86652j57692k40096Q8458
6215A485400J42485K67783K33765L5737J08452j90576l02428J16843q1030j51927
6205A664504O9188R1702J7272p6227m782J30875O7051j86773k2939R1046L84292
6194B225209l95903k14072Q008R2613M5619J06463P8832J39843j57887j43943
6184A784782j4116J70693j80091k33281K999L05089K9658j68939K2251M574P6386
6173A800005m84013M474J92507J23232j24583Q1845j12115j39466J59268L29989
$$ plain form
6163 1831143 1814105 1688909 1665115 1768727 1727173 1667848 1902161 1773762 1584627 1873895
6153 1873895 1857154 1791776 1945669 1874155 2004545 2125988 1971016 1750673 1902488 1953092
6143 1953092 1761520 1866038 1706893 1596246 1630444 1467383 1444802 1448312 1580338 1378886
6133 1378886 1435034 1626083 1648181 1789549 1903413 1706964 1749926 1414325 1353264 1326963
6123 1326963 1484171 1529706 1407263 1427268 1124206 1307234 1566939 1727200 1694139 1514116
6113 1514116 1591597 1575190 1558866 1491045 1551525 1544270 1701651 1583337 1459995 1316492 1292645
6102 1292645 1283144 1321269 1636832 1538022 1618569 1660584 1526321 1551483 1579915 1515575 1616522
6091 1616522 1432808 1718610 1864503 1768890 1454095 1457255 1600861 1724673 1765713 1755153
$$ packed form
6163A831143j7038j25196k3794J03612m1554n9325K34313j28399j89135K89268
6153A873895j6741o5378J53893p1514J30390J21443j54972k20343J51815N0604
6143A953092j91572J04518j59145j10647L4198j63061k2581L510J32026k01452
6133A378886N6148J91049K2098J41368J13864j96449M2962l35601o1061k6301
6123A326963J57208M5535j22443K0005l03062J83028K59705J60261l3061j80023
6113A514116P7481j6407j6324o7821O0480p255J57381j18314j23342j43503k3847
6102A292645r501L8125L15563r8810Q0547M2015j34263K5162K8432o4340J00947
6091A616522j83714K85802J45893r5613l14795L160J43606J23812M1040j0560
$$ plain form
6081 1755153 1720715 1495284 1523851 1455596 1465828 1240248 1358117 1423313 1521047 1733403 1521742
6070 1521742 1739370 1610392 1430509 1078208 1249232 1298771 1299834 1492972 1461246 1569930
6060 1569930 1619930 1585167 1522972 1592454 1251680 1191984 1152358 1334655 1502859 1407273 1549982
6049 1549982 1685516 1678889 1401734 1316405 1196719 1426350 1600582 1691784 1616339 1498561
6039 1498561 1256652 1144467 1233980 1235302 1198758 1362366 1439290 1212679 924655 799078
6029 799078 986287 1170681 1093290 1170909 1538266 1560505 1235381 1137600 1277616 1312156 1476871
6018 1476871 1309328 1245992 1276854 1485766 1500718 1477693 1346118 1443041 1562612 1533935 1440739
6007 1440739 1373875 1268416 1092047 1254980 1352229 1295663 1038927 1132931 1357292 1097931
$$ packed form
6081A755153l4438k25431K8567o8255J0232k25580J17869O5196R7734K12356k11661
6070A521742K17628j28978j79883l52301J71024M9539J063J93138l1726J08684
6060A569930N0000l4763o2195O9482l40774n9696l9626J82297J68204r5586J42709
6049A549982J35534o627k77155q5329j19686K29631J74232R1202p5445j17778
6039A498561k41909j12185Q9513J322l6544J63608P6924k26611k88024j25577
6029G99078J87209J84394p7391P7619L67357K2239l25124r7781J40016L4540J64715
6018A476871j67543o3336L0862K08912J4952k3025j31575R6923J19571k8677r3196
6007A440739o6864j05459j76369J62933R7249n6566k56736R4004K24361k59361
$$ plain form
5997 1097931 1179973 1483222 1553094 1467790 1106675 1174420 1121768 1044321 1156411 1159596 1363252
5986 1363252 1565078 1599252 1368886 1175312 1100898 1445457 1624987 1472315 1534949 1368345
5976 1368345 1117621 1113589 884880 901801 1089576 853725 898921 1101702 1215351 1249822
5966 1249822 1266150 1117679 1023824 1147342 1043812 1120050 1147417 1230723 1440211 1482117 1361986
5955 1361986 1441415 1317932 1408813 1352651 1303019 1348931 1096673 1096314 1511515 1413076 1338513
5944 1338513 1386168 948582 759115 877152 905630 899194 863990 727144 932042 1115737
5934 1115737 907966 934456 1066733 925728 1042324 1050218 1293627 1223808 917511 884671
5924 884671 772831 651618 663602 852210 820140 749138 593009 475493 639039 908919
$$ packed form
5997A097931Q2042L03249O9872q5304l61115O7745n2652p7447J12090L185K03656
5986A363252K01826L4174k30366j93574p4414L44559J79530j52672O2634j66604
5976A368345k50724m032k28709J6921J87775k35851M5196K02781J13649L4471
5966A249822J6328j48471r3855J23518j03530P6238K7367Q3306K09488M1906j20131
5955A361986P9429j23483R0881n6162m9632M5912k52258l59M15201r8439p4563
5944A338513M7655m37586j89467J18037K8478o436l5204j36846K04898J83695
5934A115737k07771K6490J32277j41005J16596P894K43409o9819l06297l2840
5924H84671j11840j21213J1984J88608l2070p1002j56129j17516J63546K69880
$$ plain form
5914 908919 1006733 745011 871508 683476 697210 732014 721378 637394 609907 732927 657601
5903 657601 724771 636975 649393 601881 475803 558571 405729 473946 504221 441959 706729
5892 706729 616873 688782 771312 709973 765024 852771 376163 596454 650010 731427 688373
5881 688373 730416 805607 886645 763602 615233 714010 440397 555911 540856 573458 795715
5870 795715 1014065 650998 624528 502095 613934 607134 545042 754296 918791 888066 709938
5859 709938 576367 686349 661136 757684 470629 486342 563026 475628 712888 712228 647845
5848 647845 514841 497678 432818 632729 503643 586024 606667 603815 684326 669070 545047
5837 545047 501212 534492 625507 689998 471678 501228 545067 701042 792203 571727 175889
$$ packed form
5914I08919R7814k61722J26497j88032J3734L4804j0636q3984k7487J23020p5326
5903F57601O7170q7796J2418m7512j26078Q2768j52842O8217L0275o2262K64770
5892G06729q9856P1909Q2530o1339N5051Q7747m76608K20291N3556Q1417m3054
5881F88373M2043P5191Q1038j23043j48369R8777k73613J15514j5055L2602K22257
5870G95715K18350l63067k6470j22433J11839o800o2092K09254J64495l0725j78128
5859G09938j33571J09982k5213R6548k87055J5713P6684q7398K37260o60o4383
5848F47845j33004j7163o4860J99911j29086Q2381K0643k852Q0511j5256j24023
5837E45047m3835L3280R1015O4491k18320K9550M3839J55975R1161k20476l95838
$$ plain form
5826 175889 444666 589521 612511 439830 149908 233397 314289 373717 572699 588259 595280
5815 595280 679473 509342 226825 335620 717351 719989 744645 687431 635069 432945 446672
5804 446672 664355 159755 355752 478888 476113 412035 461377 787073 605530 495014
5794 495014 535201 698795 485934 406195 345124 472862 647504 512388 271854 721163
5784 721163 711011 630942 869286 768057 587873 387561 471677 592240 748231 592152
5774 592152 262300 445492 296049 188251 112148 80919 247831 369092 441022 256766
5764 256766 445650 632568 555969 251798 94189 248754 318457 662887 829342 727235
5754 727235 632787 649968 493834 686152 716341 712536 939110 622093 560383 610371 540463
$$ packed form
5826A75889K68777J44855K2990j72681k89922Q3489Q0892N9428J98982J5560P021
5815E95280Q4193j70131k82517J08795L81731K638K4656n7214n2362k02124J3727
5804D46672K17683n04600J95997J23136k775o4078M9342L25696j81543j10516
5794D95014M0187J63594k12861p9739o1071J27738J74642j35116k40534M49309
5784G21163j0152q0069K38344j01229j80184k00312Q4116J20563J55991j56079
5774E92152l29852J83192j49443j07798p6103l1229J66912J21261P1930j84256
5764B56766J88884J86918p6599l04171j57609J54565O9703L44430J66455j02107
5754G27235r4448J7181j56134J92318L0189l805K26574l17017o1710M9988o9908
$$ plain form
5743 540463 618502 683010 558161 423453 369344 529435 416978 391434 619711 445789
5733 445789 352656 217982 438923 654779 660217 838054 640876 636505 657313 603498 676020
5722 676020 653468 585404 383683 280341 333998 481520 621715 555938 694359 859688
5712 859688 618316 686255 815059 897497 887605 866176 770965 789467 757783 813771 815427 869125
5700 869125 885918 909325 1043913 839842 1148325 1254885 1103564 1113499 1161328 946763 874174
5689 874174 1235369 942839 967164 1282580 1213609 1110187 1168634 1032552 1022402 1144334
5679 1144334 1284969 1360175 1278641 1227986 1055701 1187893 1251244 1452865 1384182 1227669
5669 1227669 1035469 950720 1162233 1334391 1498287 1566668 1577622 1538781 1184864 1322174
$$ packed form
5743E40463P8039O4508j24849j34708n4109J60091j12457k5544K28277j73922
5733D45789r3133j34674K20941K15856N438J77837j97178m371K0808n3815P2522
5722F76020k2552o8064k01721j03342N3657J47522J40195o5777J38421J65329
5712H59688k41372O7939J28804Q2438r892k1429r5211J8502l1684N5988J656N3698
5700H69125J6793K3407J34588k04071L08483J06560j51321R935M7829k14565p2589
5689H74174L61195k92530K4325L15416o8971j03422N8447j36082j0150J21932
5679A144334J40635P5206q1534n0655j72285J32192O3351K01621o8683j56513
5669A227669j92200q4749K11513J72158J63896O8381J0954l8841l53917J37310
$$ plain form
5659 1322174 1446021 1462013 1347945 1524864 1772292 1592659 1328887 1520685 1477704 1512126
5649 1512126 1638900 1623653 1576282 1542933 1675405 1754821 1670256 1469086 1747453 1821024 1835779
5638 1835779 1959138 1747755 1765197 2114009 2282994 2195303 1813038 1790116 2034805 2025194
5628 2025194 2111530 2363791 2212211 1940451 2377282 2562506 2593655 2411053 2389139 2490334
5618 2490334 2259567 2434590 2569729 2666123 2657915 2551200 2556199 2686790 2705269 2843221 3113965
5607 3113965 2858048 2709595 2601956 2785256 2821922 2761529 2402163 2359401 2204207 2058254
5597 2058254 2053800 2088946 2275165 2346322 2413067 2206944 2226181 1926785 2180347 2208650 2307551
5586 2307551 2240546 2387518 2195092 1873497 2108677 2026065 1910714 2232589 2220222 1938497
$$ packed form
5659A322174J23847J5992j14068J76919K47428j79633k63772J91798m2981L4422
5649A512126J26774j5247m7371l3349J32472P9416q4565k01170K78367P3571J4755
5638A835779J23359k11383J7442L48812J68985q7691l82265k2922K44689r611
5628B025194Q6336K52261j51580k71760M36831J85224L1149j82602k1914J01195
5618B490334k30767J75023J35139R6394q208j06715M999J30591J8479J37952K70744
5607C113965k55917j48453j07639J83300L6666o0393l59366m2762j55194j45953
5597B058254m454L5146J86219P1157O6745k06123J9237k99396K53562K8303R8901
5586B307551o7005J46972j92426l21595K35180q2612j15351L21875j2367k81725
$$ plain form
5576 1938497 1844616 1861511 1960681 2093033 1940492 1842212 1942808 2281640 2329548 2406434 2074363
5565 2074363 1964664 2022055 1879123 2070836 2059300 2039273 2384704 2472283 2441116 2526014 2506388
5554 2506388 2200894 2340218 2667046 2938689 2644240 2281587 2584212 2632467 2469331 2361711
5544 2361711 2531418 2622628 2748499 2640976 2555691 2349521 2523479 2211270 2469084 2796179
5534 2796179 2701977 2638331 2784588 2825816 2485010 2534800 2521193 2649212 2638886 2613425 2664194
5523 2664194 2649738 2673455 2325585 2391263 2702257 2919364 2982272 2865478 3009180 3080071
5513 3080071 3281320 3033748 2879371 2952081 3022073 3312172 3531396 3389448 3400334 3607635
5503 3607635 3517492 3612323 3641300 3880179 3545903 3677830 4081548 3846550 3605857 3752974
$$ packed form
5576A938497r3881J6895R9170J32352j52541r8280J00596L38832M7908P6886l32071
5565B074363j09699N7391j42932J91713j1536k0027L45431Q7579l1167Q4898j9626
5554B506388l05494J39324L26828K71643k94449l62653L02625M8255j63136j07620
5544B361711J69707R1210J25871j07523q5285k06170J73958l12209K57814L27095
5534B796179r4202o3646J46257M1228l40806M9790j3607J28019j0326k5461N0769
5523B664194j4456K3717l47870O5678L10994K17107O2908j16794J43702P0891
5513C080071K01249k47572j54377P2710O9992K90099K19224j41948J0886K07301
5503C607635r0143R4831K8977K38879l34276J31927M03718k34998k40693J47117
$$ plain form
5493 3752974 3720855 3897593 4090880 4207970 4228509 4409272 4781478 4520343 4289950 4032950
5483 4032950 4352454 4819926 5221049 5264169 5170635 4987589 5280159 5395424 5361262 5437561
5473 5437561 5306175 5539692 5468550 5542856 5757634 5903774 5970514 6019464 6044768 6111098 6209372
5462 6209372 6121390 6297270 6403433 6468232 6280239 6504895 6884732 6629225 7073449 7071218
5452 7071218 7030119 7131317 7080445 7232362 7486720 7795716 7817432 8042170 8274769 8378516
5442 8378516 8366144 8327475 8329927 8453953 8519529 8665995 8622961 8915523 9323715 9677240 9833264
5431 9833264 9687415 10067402 9916167 9855704 10135908 10221021 10433893 10740723 11018306 11121235
5421 11121235 11271614 11610776 11799023 12015759 12311742 12593066 12677550 12741106 13032621 13356524
$$ packed form
5493C752974l2119J76738J93287J17090K0539J80763L72206k61135k30393k57000
5483D032950L19504M67472M01123M3120r3534j83046K92570J15265l4162P6299
5473E437561j31386K33517p1142P4306K14778J46140O6740M8950K5304O6330R8274
5462F209372q7982J75880J06163O4799j87993K24656L79837k55507M44224k231
5452G071218m1099J01198n0872J51917K54358L08996K1716K24738K32599J03747
5442H378516j2372l8669K452J24026O5576J46466m3034K92562M08192L53525J56024
5431I833264j45849L79987j51235o0463K80204Q5113K12872L06830K77583J02929
5421A1121235J50379L39162J88247K16736K95983K81324Q4484O3556K91515L23903
$$ plain form
5411 13356524 13714679 13805139 14053072 14149193 14400258 14403787 14528789 15024408 15489824 15765534
5401 15765534 16053646 16460530 17008378 17020449 17487482 18021613 18102933 18466799 18973621 19255766
5391 19255766 19594314 20223681 20612483 21125294 21490861 21935459 22563105 23458971 23896338
5382 23896338 24474772 25253291 26100879 26600273 27245624 28004899 28815269 29561349 30268638
5373 30268638 30752323 31575139 32657840 33823050 34735199 35892313 36835296 38005153 39391262
5364 39391262 40425711 41707585 42769730 44053792 45403467 46994996 48549094 50176798
5356 50176798 51823724 53517179 55308473 57345672 59205661 61104336 63401294 65543612
5348 65543612 67682733 70177913 73198642 76125850 78675662 81667047 84737813 87903286
$$ packed form
5411A3356524L58155R0460K47933R6121K51065L529J25002M95619M65416K75710
5401A5765534K88112M06884N47848J2071M67033N34131Q1320L63866N06822K82145
5391A9255766L38548O29367L88802N12811L65567M44598O27646Q95866M37367
5382B3896338N78434P78519Q47588M99394O45351P59275Q10370P46080P07289
5373C0268638M83685Q22816J082701J165210R12149J157114R42983J169857J386109
5364C9391262J034449J281874J062145J284062J349675J591529J554098J627704
5356E0176798J646926J693455J791294K037199J859989J898675K296958K142318
5348F5543612K139121K495180L020729K927208K549812K991385L070766L165473
$$ plain form
5340 87903286 91364441 95077705 98662219 102133489 106049860 110194099 114561479 119112199
5332 119112199 124056506 129165646 134102722 139255784 144505449 150280419 155844344 161524682
5324 161524682 167402473 173361485 179410956 185348951 190805745 196362432 201851179 206785652
5316 206785652 211462046 215575690 218941769 221847995 224079343 225660428 225777353 224971913
5308 224971913 223559783 221043794 217838662 213626713 208490453 202851513 197144976 190927395
5300 190927395 184689371 178301697 171574465 165035589 159109741 153196392 147155157 141464442
5292 141464442 136207248 130995413 125838502 120873074 116180385 111935059 107734194 103814820
5284 103814820 100102478 96250595 93075535 89848774 86705636 83662469 80640126 77997024
$$ packed form
5340H7903286L461155L713264L584514L471270L916371M144239M367380M550720
5332A19112199M944307N109140M937076N153062N249665N774970N563925N680338
5324A61524682N877791N959012O049471N937995N456794N556687N488747M934473
5316B06785652M676394M113644L366079K906226K231348J581085J16925q05440
5308B24971913j412130k515989l205132m211949n136260n638940n706537o217581
5300A90927395o238024o387674o727232o538876n925848n913349o041235n690715
5292A41464442n257194n211835n156911m965428m692689m245326m200865l919374
5284A03814820l712342l851883l175060l226761l143138l043167l022343k643102
$$ plain form
5276 77997024 75438262 72874632 70472624 67955735 66030308 64087840 61977908 59777319
5268 59777319 58061597 56723130 54953712 53173533 51438112 50102492 48908703 47622982
5260 47622982 46457056 45374534 44158308 43017687 42040379 41068944 40004156 38873374
5252 38873374 37994146 37142270 35978720 35438570 34521111 33731934 33127639 32623330 32041616
5243 32041616 31405306 30932869 30262420 29552444 29134850 28549553 28065281 27623522 26847155
5234 26847155 26314419 26014419 25592712 24839306 24553899 24139439 23725629 23297974 23117943
5225 23117943 22911440 22565506 22245344 21875595 21434024 21080086 20729123 20421487 20048220
5216 20048220 19867964 19687367 19533182 19533375 19064370 18860547 18903283 18913685 18362417 17872003
$$ packed form
5276G7997024k558762k563630k402008k516889j925427j942468k109932k200589
5268E9777319j715722j338467j769418j780179j735421j335620j193789j285721
5260D7622982j165926j082522j216226j140621r77308r71435j064788j130782
5252C8873374q79228q51876j163550n40150r17459p89177o04295n04309n81714
5243C2041616o36310m72437o70449p09976m17594n85297m84272m41759p76367
5234B6847155n32736l00000m21707p53406k85407m14460m13810m27655j80031
5225B3117943k06503l45934l20162l69749m41571l53938l50963l07636l73267
5216B0048220j80256j80597j54185J93m69005k03823M2736J0402n51268m90414
$$ plain form
5206 17872003 17873086 17710251 17565634 17354806 17329616 17036719 16631824 16586891 16134262 16272568
5196 16272568 16263346 15921852 15734328 15866799 15849217 15687625 15393448 15141612 14949071 14858026
5186 14858026 14825744 14802211 14595812 14160283 14038090 14031994 13815370 13779670 13942006 13712948
5176 13712948 13564866 13476268 13221022 13273185 13213404 13089638 12963230 12845273 12723291 12636916
5166 12636916 12766007 12401616 12080428 12176406 12144515 12134997 12076990 11903223 11750184 11631751
5156 11631751 11652040 11680154 11706457 11926554 11872522 11832057 11966707 11658561 11759989 11889949
5146 11889949 12008166 11760553 11675875 11784087 11521169 11631040 11948864 11694060 11741874 11861233
5136 11861233 12035012 12094621 12033493 11806293 11706508 12172348 12339516 12282194 12099798 11981034
$$ packed form
5206A7872003J083j62835j44617k10828k5190k92897m04895m4933m52629J38306
5196A6272568r222l41494j87524J32471j7582j61592k94177k51836j92541r1045
5186A4858026l2282k3533k06399m35529j22193o096k16624l5700J62336k29058
5176A3712948j48082q8598k55246N2163n9781j23766j26408j17957j21982q6375
5166A2636916J29091l64391l21188R5978l1891r518n8007j73767j53039j18433
5156A1631751K0289K8114K6303K20097n4032m0465J34650l08146J01428J29960
5146A1889949J18217k47613q4678J08212k62918J09871L17824k54804M7814J19359
5136A1861233J73779N9609o1128k27200r9785M65840J67168n7322j82396j18764
$$ plain form
5126 11981034 12288557 12228183 12277580 12482223 12357357 12634792 12682110 12835733 12777747 12623565
5116 12623565 12982731 13016365 12884082 13122594 13139927 13170349 13349772 13315135 13432478 13375004
5106 13375004 13554878 13552530 13839043 14049700 14198616 14608916 14406261 14444775 14424362 14715770
5096 14715770 15248503 15256000 15490827 15555279 15619710 15827339 15851283 15946240 16304977 16485259
5086 16485259 16611916 16883394 16797304 17018973 17365463 17452214 17820089 18262087 18859562 18928358
5076 18928358 19011817 19382970 19520382 19824979 20030615 20444639 20845946 21185489 21471767 21903061
5066 21903061 22375367 22759678 23275176 23527238 24160876 24626204 24741881 25411651 26194480
5057 26194480 26726818 27507507 27985009 28289521 28827406 29537527 30317626 30795012 31368207
$$ packed form
5126A1981034L07523o0374M9397K04643j24866K77435M7318J53623n7986j54182
5116A2623565L59166L3634j32283K38512J7333L0422J79423l4637J17343n7474
5106A3375004J79874k348K86513K10657J48916M10300k02655L8514k0413K91408
5096A4715770N32733P497K34827O4452O4431K07629K3944R4957L58737J80282
5086A6485259J26657K71478q6090K21669L46490Q6751L67875M41998N97475O8796
5076A8928358Q3459L71153J37412L04597K05636M14024M01307L39543K86278M31294
5066B1903061M72306L84311N15498K52062O33638M65328J15677O69770P82829
5057B6194480N32338P80689M77502L04512N37885P10121P80099M77386N73195
$$ plain form
5048 31368207 32034147 32964122 34085301 34770809 35551523 36779421 37408382 38444562 39304469
5039 39304469 40410081 41416435 42359917 43664411 45165959 46312625 47520968 48812773
5031 48812773 49889828 51449125 52965628 54744811 56358836 58216459 59604609 61055703
5023 61055703 62749981 64797749 67078776 68966743 70770371 72617771 75105224 77122402
5015 77122402 79111188 81191843 83734235 86295238 88876216 91341836 93505755 95992823
5007 95992823 98973018 101592232 104186931 106698695 108912065 111625278 114503263 117137101
4999 117137101 119832548 122118239 124510444 127125098 129541006 132026795 134494247 136940303
4991 136940303 139241453 141504924 143444826 145343387 147576641 149769006 151935790 154151887
$$ packed form
5048C1368207O65940R29975J121179O85508P80714J227898O28961J036180Q59907
5039C9304469J105612J006354R43482J304494J501548J146666J208343J291805
5031D8812773J077055J559297J516503J779183J614025J857623J388150J451094
5023F1055703J694278K047768K281027J887967J803628J847400K487453K017178
5015G7122402J988786K080655K542392K561003K580978K465620K163919K487068
5007I5992823K980195K619214K594699K511764K213370K713213K877985K633838
4999A17137101K695447K285691K392205K614654K415908K485789K467452K446056
4991A36940303K301150K263471J939902J898561K233254K192365K166784K216097
$$ plain form
4983 154151887 156085214 157991291 159821046 161159961 162472188 163757580 165035148 165752877
4975 165752877 166559628 167081008 167354156 167547698 167777111 167500150 167058866 166485350 165534553
4966 165534553 164459705 163237764 162159860 160464338 158686709 156870674 154971159 153108158
4958 153108158 150993175 148726457 146433735 144074336 141906136 139390820 137141240 134691888
4950 134691888 132132526 129267542 126920233 124410416 121913134 119107459 116394986 113710255
4942 113710255 111359236 108406207 105602183 103107844 100692914 98259013 95401690 92732856
4934 92732856 90554867 88157976 85880621 83687467 81222056 79032548 77004343 75037426
4926 75037426 72823406 70726159 69127008 67336307 65619644 63970681 62393496 60770964
$$ packed form
4983A54151887J933327J906077J829755J338915J312227J285392J277568P17729
4975A65752877Q06751N21380K73148J93542K29413k76961m41284n73516r50797
4966A65534553j074848j221941j077904j695522j777629j816035j899515j863001
4958A53108158k114983k266718k292722k359399k168200k515316k249580k449352
4950A34691888k559362k864984k347309k509817k497282k805675k712473k684731
4942A13710255k351019k953029k804024k494339k414930k433901k857323k668834
4934I2732856k177989k396891k277355k193154k465411k189508k028205j966917
4926G5037426k214020k097247j599151j790701j716663j648963j577185j622532
$$ plain form
4918 60770964 59195665 57595900 56001953 54982149 53532092 52316707 50671212 49331391
4910 49331391 48085101 46841929 45854705 44845055 43848738 42588892 41481853 40604262 39603269
4901 39603269 38661931 37832107 36917479 36223586 35622518 34765503 34001646 33309060 32628995
4892 32628995 31902290 31317440 30710145 30066670 29757099 29369144 28454018 27670325 27256990
4883 27256990 26909959 26482453 25815848 25534111 25311562 24990376 24659618 24237357 23665752
4874 23665752 22995988 22594605 22231582 22016819 21690023 21209160 20762356 20536403 20440482 20177072
4864 20177072 19850404 19510005 19272193 19143820 18940995 18524122 18333461 18130749 17907323
4855 17907323 17729983 17619047 17524017 17184174 16942581 16689844 16364408 16427260 16298747 15955264
$$ packed form
4918F0770964j575299j599765j593947j019804j450057j215385j645495j339821
4910D9331391j246290j243172r87224j009650r96317j259846j107039q77591j000993
4901C9603269r41338q29824r14628o93893o01068q57015p63857o92586o80065
4892C2628995p26705n84850o07295o43475l09571l87955r15126p83693m13335
4883B7256990l47031m27506o66605k81737k22549l21186l30758m22261n71605
4874B3665752o69764m01383l63023k14763l26796m80863m46804k25953r5921k63410
4864B0177072l26668l40399k37812j28373k02825m16873j90661k02712k23426
4855A7907323j77340j10936r5030l39843k41593k52737l25436O2852j28513l43483
$$ plain form
4845 15955264 15691634 15422252 15312327 15253324 14939062 15060923 15042436 14746992 14539216 14395566
4835 14395566 14338709 14097890 14248780 14159095 14047716 13619124 13591178 13851737 13713931 13430042
4825 13430042 13139030 13003489 12987103 12857758 12743217 12703159 12654592 12426504 12464109 12316797
4815 12316797 12528785 12686216 12411038 12129659 12010967 11906970 11991700 11817555 11681091 11379261
4805 11379261 11406543 11575416 11563371 11493206 11268515 11183058 11445126 11281245 11307543 11275563
4795 11275563 11357364 11417413 11653147 11713253 11670493 11606135 11538351 11631595 11861806 11954699 11723610
4784 11723610 11607129 11398628 11584229 11571756 11354191 11433532 11638095 11412935 11136212 11077067
4774 11077067 11183620 11045247 10686557 10407065 10709363 11176346 11216674 10999256 10933330 10594285
$$ packed form
4845A5955264k63630k69382j09925n9003l14262J21861j8487k95444k07776j43650
4835A4395566n6857k40819J50890q9685j11379m28592k7946K60559j37806k83889
4825A3430042k91012j35541j6386j29345j14541m0058m8567k28088L7605j47312
4815A2316797K11988J57431k75178k81379j18692j03997Q4730j74145j36464l01830
4805A1379261K7282J68873j2045p0165k24691q5457K62068j63881K6298l1980
4795A1275563Q1801O0049K35734O0106m2760o4358o7784R3244K30211R2893k31089
4784A1723610j16481k08501J85601j2473k17565P9341K04563k25160k76723n9145
4774A1077067J06553j38373l58690k79492L02298M66983M0328k17418o5926l39045
$$ plain form
4764 10594285 10653351 10652990 10466440 10547172 10898797 10819651 10751595 10588997 10451478 10383249 10614224
4753 10614224 10651347 10499313 10603613 10473184 10506808 10798884 10342118 10171860 10125987 10072023
4743 10072023 10591971 10789394 10550672 10571884 10775951 11136419 10888751 10666655 10757731 10982704
4733 10982704 11128006 11006457 10937582 11003800 10881478 11176812 11327406 11302094 11205373 11221349
4723 11221349 11337888 11564225 11698294 11856431 11796624 11910225 11931596 12240082 12462942 12078880
4713 12078880 12136767 12207779 12298011 12415345 12797085 13012297 13121409 13131855 13209755 13522664
4703 13522664 13532245 13381378 13515565 13705334 13704596 14035459 14248548 14346756 14609598 14852637
4693 14852637 15154105 15215666 15481588 15579503 15880348 16063994 16398600 16774304 16922465 16932692
$$ packed form
4764A0594285N9066l61j86550Q0732L51625p9146o8056j62598j37519o8229K30975
4753A0614224L7123j52034J04300j30429L3624K92076m56766j70258m5873n3964
4743A0072023N19948J97423k38722K1212K04067L60468k47668k22096R1076K24973
4733A0982704J45302j21549o8875O6218j22322K95334J50594k5312r6721J5976
4723A1221349J16539K26337J34069J58137n9807J13601K1371L08486K22860l84062
4713A2078880N7887P1012R0232J17334L81740K15212J09112J0446P7900L12909
4703A3522664R581j50867J34187J89769p38L30863K13089R8208K62842K43039
4693A4852637L01468O1561K65922R7915L00845J83646L34606L75704J48161J0227
$$ plain form
4683 16932692 17015433 17013853 17421766 17513653 17648599 18154265 18450012 18785306 19098670 19450202
4673 19450202 19688143 20031600 20456388 20868744 21096920 21359483 21738134 22146122 22390536
4664 22390536 22827170 23618246 23986123 24292938 24788346 25246120 26008124 26331289 26857022
4655 26857022 27664344 28245204 28994524 29682205 30289364 30825608 31512654 32230323 33048399
4646 33048399 33825389 34748306 35728133 36706706 37752363 38665398 39814538 41245417 42317988
4637 42317988 43551424 44685575 46063121 47323706 48906536 50526628 51742906 53355838
4629 53355838 54953849 56690205 58442807 60114174 61718837 63098735 64796613 66604081
4621 66604081 68397510 69711804 71330694 73082561 74670339 76422027 78277687 80438423
$$ packed form
4683A6932692Q2741j580M07913R1887J34946N05666K95747L35294L13364L51532
4673A9450202K37941L43457M24788M12356K28176K62563L78651M07988K44414
4664B2390536M36634P91076L67877L06815M95408M57774P62004L23165N25733
4655B6857022Q07322N80860P49320O87681O07159N36244O87046P17669Q18076
4646C3048399P76990R22917R79827R78573J045657R13035J149140J430879J072571
4637D2317988J233436J134151J377546J260585J582830J620092J216278J612932
4629E3355838J598011J736356J752602J671367J604663J379898J697878J807468
4621F6604081J793429J314294J618890J751867J587778J751688J855660K160736
$$ plain form
4613 80438423 82597645 84385427 86187934 88819570 90884782 93393583 95963600 98180025
4605 98180025 100917191 103794533 106669198 109244322 112112177 114921864 117921461 120705178
4597 120705178 123357326 125853251 128629618 131222221 133866303 136372069 138688550 140792224
4589 140792224 143047978 145217908 147290007 148751470 150162121 152026036 153738901 155186446
4581 155186446 156632754 157981694 158904079 160125015 161284012 162261065 163243803 163895762 164843101
4572 164843101 165838939 166472606 167510618 168627086 169578134 170446846 171093379 171763146 172827670
4563 172827670 173402816 174167160 175189724 176138535 177018116 177570697 178107031 178928156 179346612
4554 179346612 180134202 180265460 180464783 181016432 181211964 180955758 180518757 179928171 179248446
$$ packed form
4613H0438423K159222J787782J802507K631636K065212K508801K570017K216425
4605I8180025K737166K877342K874665K575124K867855K809687K999597K783717
4597A20705178K652148K495925K776367K592603K644082K505766K316481K103674
4589A40792224K255754K169930K072099J461463J410651J863915J712865J447545
4581A55186446J446308J348940R22385J220936J158997R77053R82738O51959R47339
4572A64843101R95838O33667J038012J116468R51048Q68712O46533O69767J064524
4563A72827670N75146P64344J022564R48811Q79581N52581N36334Q21125M18456
4554A79346612P87590J31258J99323N51649J95532k56206m37001n90586o79725
$$ plain form
4545 179248446 178775571 177838792 176700159 175633970 174116157 172649409 170854595 169049981
4537 169049981 167156980 165085432 162973160 160737382 158223394 156026417 153867941 151478015
4529 151478015 148845112 146383597 143693235 140976441 138403640 135995360 133321512 130828663
4521 130828663 128538509 126085099 123559326 120742261 117791651 115124581 112547004 109679250
4513 109679250 107291888 104578677 101938516 99442329 96951481 94362738 91647961 89315995
4505 89315995 87174502 84964768 82611750 80316693 78063291 76258707 74268828 71938207
4497 71938207 69908413 68213300 66725408 65018631 63224983 61414383 59898378 58173850
4489 58173850 56660901 55279214 54116063 52810655 51280222 50425194 49182973 47904171
$$ packed form
4545A79248446m72875r36779j138633j066189j517813j466748j794814j804614
4537A69049981j893001k071548k112272k235778k513988k196977k158476k389926
4529A51478015k632903k461515k690362k716794k572801k408280k673848k492849
4521A30828663k290154k453410k525773k817065k950610k667070k577577k867754
4513A09679250k387362k713211k640161k496187k490848k588743k714777k331966
4505H9315995k141493k209734k353018k295057k253402j804584j989879k330621
4497G1938207k029794j695113j487892j706777j793648j810600j516005j724528
4489E8173850j512949j381687j163151j305408j530433q55028j242221j278802
$$ plain form
4481 47904171 46574962 45357815 44304317 43543152 42849652 41896127 40934039 39972538 39109683
4472 39109683 38233040 37470010 36541923 35709147 34993641 34350950 33872137 33347000 32576034
4463 32576034 31904907 31096290 30445882 29998155 29485130 28659697 28118865 27445754 26963221
4454 26963221 26885846 26584097 25881205 25621077 25218711 24709798 24156923 23677233 23374789 22894195
4444 22894195 22660048 22377896 21651007 21224186 20899591 20618411 20143850 20027983 19930255 19587652
4434 19587652 18970972 18567231 18694609 18469834 18242815 17792682 17455461 17040362 17051525 16815115
4424 16815115 16479163 16319078 15900586 15801309 15726146 15272447 14998087 15006500 14590049 14223116
4414 14223116 14115599 14158991 14290617 13986598 13745494 13430824 13340110 13111317 13141090 13007677
$$ packed form
4481D7904171j329209j217147j053498p61165o93500r53525r62088r61501q62855
4472C9109683q76643p63030r28087q32776p15506o42691m78813n25137p70966
4463C2576034o71127q08617o50408m47727n13025q25433n40832o73111m82533
4454B6963221p7375l01749p02892k60128m02366n08913n52875m79690l02444m80594
4444B2894195k34147k82152p26889m26821l24595k81180m74561j15867r7728l42603
4434A9587652o16680m03741J27378k24775k27019m50133l37221m15099J1163k36410
4424A6815115l35952j60085m18492r9277p5163m53699k74360Q413m16451l66933
4414A4223116j07517M3392J31626l04019k41104l14670r0714k28793K9773j33413
$$ plain form
4404 13007677 12666303 12504852 12331992 12480770 12163792 12127809 12084607 12235001 12089744 11866030
4394 11866030 11572457 11467821 11267962 11060202 11079752 10970300 10881802 10730172 10662971 10786195
4384 10786195 10537612 10145594 10137566 10068772 10046808 9898135 10238996 10021583 9661480 9632991
4374 9632991 9738725 9792842 9622960 9278334 9312892 9129835 8849710 9093505 8972533 8685229
4364 8685229 8847408 8755342 8527600 8460198 8636774 8578862 8328924 8142868 7926738 7965337
4354 7965337 7981479 8093722 8052790 7992631 8015269 7900485 7923425 8044446 8004817 7646039 7725930
4343 7725930 7909615 7808244 7907141 7543071 7527417 7639799 7648526 7424306 7150276 7138717
4333 7138717 7402251 7476113 7358165 7211521 7131975 7106043 6958010 6885056 6985246 7064942
$$ packed form
4404A3007677l41374j61451j72860J48778l16978l5983m3202J50394j45257k23714
4394A1866030k93573j04636j99859k07760J9550j09452q8498j51630o7201J23224
4384A0786195k48583l92018q028o8794k1964j48673L40861k17413l60103k8489
4374I632991J05734N4117j69882l44626L4558j83057k80125K43795j20972k87304
4364H685229J62179r2066k27742o7402J76576n7912k49938j86056k16130L8599
4354G965337J6142J12243m0932o0159K2638j14784K2940J21021l9629l58778P9891
4343G725930J83685j01371R8897l64070j5654J12382Q727k24220k74030j1559
4333G138717K63534P3862j17948j46644p9546k5932j48033p2954J00190P9696
$$ plain form
4323 7064942 7062492 7148837 7138763 7022235 6821327 6875723 7085843 6932858 7024477 6629506 6461278
4312 6461278 6664979 6676636 6544066 6545096 6649567 6706788 6805632 6711460 6816511 6651685 6918871
4301 6918871 6752540 6447140 6533272 6637742 6571545 6691514 6755516 6840418 6921632 6985141 7104090
4290 7104090 7178857 7337347 7237808 7139850 7083998 7197620 7200962 7371250 7402415 7091278 7153629
4279 7153629 7180859 7216646 7341705 7354474 7232036 7281662 7378669 7475417 7323503 7287897 7255129
4268 7255129 7486110 7184759 7410833 7555026 7363719 7397787 7629649 7729604 7774032 7888496
4258 7888496 7850576 7537020 7556206 7814917 7822716 7875083 7692418 7698139 7439605 7616066 7550631
4247 7550631 7643947 7399598 7307732 7251751 7386691 7442534 7362520 7636003 7552830 7603374 7608647
$$ packed form
4323G064942k450Q6345j0074j16528k00908N4396K10120j52985R1619l94971j68228
4312F461278K03701J1657j32570J030J04471N7221R8844r4172J05051j64826K67186
4301F918871j66331l05400Q6132J04470o6197J19969O4002Q4902Q1214O3509J18949
4290G104090P4767J58490r9539r7958n5852J13622L342J70288L1165l11137O2351
4279G153629K7230L5787J25059J2769j22438M9626R7007R6748j51914l5606l2768
4268G255129K30981l01351K26074J44193j91307L4068K31862R9955M4428J14464
4258G888496l7920l13556J9186K58711P799N2367j82665N721k58534J76461o5435
4247G550631R3316k44349r1866n5981J34940N5843q0014K73483q3173N0544N273
$$ plain form
4236 7608647 7849906 8046555 7705241 7580030 7503091 7352478 7439940 7785606 7820096 7693466
4226 7693466 7821680 7705690 7753039 8127860 7953894 7891733 7821423 7491824 7684427 7914840
4216 7914840 7783198 7448808 7608630 7608026 7899177 7895185 7779383 7918908 7976304 8178575 8129563
4205 8129563 7713707 7808113 7856099 7822510 7944523 7863036 8050108 8105487 8460749 8292622
4195 8292622 8256417 8206862 8035454 7842989 8065187 8463034 8288634 8088932 8275670 8322410
4185 8322410 8342591 8551676 8401171 8458361 8489228 8518265 8568517 8348747 8226694 8215742 8226865
4174 8226865 8119882 8291010 8325703 8323455 8584901 8496540 8660897 8572920 8540267 8624751 8473231
4163 8473231 8636915 8438327 8665561 8781465 8723217 8668374 8654379 8844171 8710775 8662349
$$ packed form
4236G608647K41259J96649l41314j25211p6939j50613Q7462L45666L4490j26630
4226G693466J28214j15990M7349L74821j73966o2161p0310l29599J92603K30413
4216G914840j31642l34390J59822o04K91151l992j15802J39525N7396K02271m9012
4205H129563m15856R4406M7986l3589J22013q1487J87072N5379L55262j68127
4195H292622l6205m9555j71408j92465K22198L97847j74400j99702J86738M6740
4185H322410K0181K09085j50505N7190L0867K9037N0252k19770j22053j0952J1123
4174H226865j06983J71128L4693k248K61446q8361J64357q7977l2653Q4484j51520
4163H473231J63684j98588K27234J15904n8248n4843j3995J89792j33396m8426
$$ plain form
4153 8662349 8684031 8728773 8844392 8784924 9155326 9143359 9018466 9081916 9211296 9460191
4143 9460191 9449529 9461005 9540326 9540952 9539384 9499454 9757911 9821493 9756920 9866279 9955144 10190553
4131 10190553 10295368 10279016 10490939 10536294 10596983 10688834 10770967 11017935 11144169 11049845
4121 11049845 10940543 11307316 11705204 11780901 11658066 11732077 11932696 12020553 12050635 12483775
4111 12483775 12694686 13065877 12967960 13038119 13114990 13195044 13181005 13538524 13772686 14086911
4101 14086911 14559832 14686900 14870729 14791142 14981292 14903728 15162961 15669545 15896760 16034138
4091 16034138 16501968 16383045 16488790 16773408 17186949 17380844 17520134 17895685 18056164
4082 18056164 18450137 18631261 19084039 19585705 20049469 20341205 20734113 20991042 21281357
$$ packed form
4153H662349K1682M4742J15619n9468L70402j1967j24893O3450J29380K48895
4143I460191j0662J1476P9321O26j568l9930K58457O3582o4573J09359Q8865K35409
4131A0190553J04815j6352K11923M5355O0689R1851Q2133K46968J26234r4324
4121A1049845j09302L66773L97888P5697j22835P4011K00619Q7857L0082M33140
4111A2483775K10911L71191r7917P0159P6871Q0054j4039L57519K34162L14225
4101A4086911M72921J27068J83829p9587J90150p7564K59233N06584K27215J37378
4091A6034138M67830j18923J05745K84618M13541J93895J39290L75551J60479
4082A8056164L93973J81124M52778N01666M63764K91736L92908K56929K90315
$$ plain form
4073 21281357 21471909 21954308 22306059 22631811 23047032 23469133 24330944 24634708 24840892
4064 24840892 25311649 25650500 26399225 26951014 27645865 28340391 28624872 29305464 29876457
4055 29876457 30738364 31434874 32009476 32642415 33276163 33936559 34702253 35574817 36406686
4046 36406686 37532891 38173261 39015375 40257114 41366562 42392432 43340346 44088033 45388309
4037 45388309 46460098 47566028 48592580 49887236 51096337 52006386 53045394 54175197
4029 54175197 55018117 56025467 57283108 58153212 59139406 59912464 61359445 62956045 64230602
4020 64230602 65350385 66613058 67916897 69394481 70907984 72468963 74345846 76076810
4012 76076810 77956464 79653815 81378031 83363190 85079004 86910431 89144359 91361168
$$ packed form
4073B1281357J90552M82399L51751L25752M15221M22101Q61811L03764K06184
4064B4840892M70757L38851P48725N51789O94851O94526K84481O80592N70993
4055B9876457Q61907O96510N74602O32939O33748O60396P65694Q72564Q31869
4046C6406686J126205O40370Q42114J241739J109448J025870R47914P47687J300276
4037D5388309J071789J105930J026552J294656J209101R10049J039008J129803
4029E4175197Q42920J007350J257641Q70104R86194P73058J446981J596600J274557
4020F4230602J119783J262673J303839J477584J513503J560979J876883J730964
4012G6076810J879654J697351J724216J985159J715814J831427K233928K216809
$$ plain form
4004 91361168 93779084 95930787 98245998 100942900 103557058 106169358 108762306 111481379
3996 111481379 114328336 117118826 120188555 123320548 126686348 130277288 133610210 137008487
3988 137008487 140741672 144912819 148838712 152922042 156843289 160870983 165165882 169654228
3980 169654228 174121499 178989444 183755547 188541675 193366986 197981814 203006408 208361137
3972 208361137 213651296 218824876 223757107 228756420 233838667 239060840 244319055 249411187
3964 249411187 254193291 258895680 263879010 268871972 273551747 278187364 282737246 286926078
3956 286926078 290693894 294634259 298535961 301992196 305108404 308688612 311499148 313936207
3948 313936207 316302227 318416498 320179500 321806970 322718893 323212710 323294352 323454747 322912784
$$ packed form
4004I1361168K417916K151703K315211K696902K614158K612300K592948K719073
3996A11481379K846957K790490L069729L131993L365800L590940L332922L398277
3988A37008487L733185M171147L925893M083330L921247M027694M294899M488346
3980A69654228M467271M867945M766103M786128M825311M614828N024594N354729
3972B08361137N290159N173580M932231M999313N082247N222173N258215N092132
3964B49411187M782104M702389M983330M992962M679775M635617M549882M188832
3956B86926078L767816L940365L901702L456235L116208L580208K810536K437059
3948C13936207K366020K114271J763002J627470R11923M93817Q1642J60395n41963
$$ plain form
3939 322912784 321878701 320903971 319201159 317421623 315653575 313083631 310068780 307136379
3931 307136379 303679299 299906980 295620246 291586185 287588856 283676508 279026761 274105290
3923 274105290 269584005 264751833 259818875 254982886 249834515 244939295 239993369 234920754
3915 234920754 229801066 224774606 219687034 214564949 209472800 204492383 199355673 194738914
3907 194738914 190191652 185104246 180297968 175652660 171177184 166853425 162510587 158217356
3899 158217356 154148732 150116670 146159275 142472944 138646871 135115785 131780676 128114373
3891 128114373 124661491 121845545 118649247 115853952 113119595 110149734 107394598 104893617
3883 104893617 102219534 99638501 97216546 95020541 92926307 90708757 88679095 87061772
$$ packed form
3939C22912784j034083r74730j702812j779536j768048k569944l014851k932401
3931C07136379l457080l772319m286734m034061l997329l912348m649747m921471
3923B74105290m521285m832172m932958m835989n148371m895220m945926n072615
3915B34920754n119688n026460n087572n122085n092149m980417n136710m616759
3907A94738914m547262n087406m806278m645308m475476m323759m342838m293231
3899A58217356m068624m032062l957395l686331l826073l531086l335109l666303
3891A28114373l452882k815946l196298k795295k734357k969861k755136k500981
3883A04893617k674083k581033k421955k196005k094234k217550k029662j617323
$$ plain form
3875 87061772 84791963 82591986 80614451 78661239 76805810 75062851 73491895 71849132
3867 71849132 70218081 68459728 66913636 65289880 63894085 62379751 61109046 59810991
3859 59810991 58571523 57202292 56068088 54878322 53519288 52704057 51530908 50544635
3851 50544635 49954989 48846814 47829291 46805426 45889557 44866384 43930023 43019781 42020530
3842 42020530 41740733 41296573 40544020 39783347 38872839 37860629 37134940 36578158 36244065
3833 36244065 35671339 34905174 34101496 33669247 33084193 32606177 32167886 31508879 30961112
3824 30961112 30364492 29780316 29318366 29062617 28762055 28228119 27629874 27239954 26952030
3815 26952030 26578422 26084159 26182522 25696200 25105706 24754565 24242903 23988824 23795753 23216559
$$ packed form
3875H7061772k269809k199977j977535j953212j855429j742959j570956j642763
3867G1849132j631051j758353j546092j623756j395795j514334j270705j298055
3859E9810991j239468j369231j134204j189766j359034q15231j173149r86273
3851E0544635n89646j108175j017523j023865r15869j023173r36361r10242r99251
3842D2020530k79797m44160p52553p60673r10508j012210p25689n56782l34093
3833C6244065n72726p66165q03678m32249n85054m78016m38291o59007n47767
3824C0961112n96620n84176m61950k55749l00562n33936n98245l89920k87924
3815B6952030l73608m94263R8363m86322n90494l51141n11662k54079j93071n79194
$$ plain form
3805 23216559 22884350 22701893 22371917 22078616 21531601 21140606 20929399 20740313 20625966
3796 20625966 20474949 20433851 19964179 19562427 19431184 19199132 18829613 18613469 18166025 17968536
3786 17968536 17754628 17579936 17497318 17384795 17182498 16965796 16948905 16648191 16320315 16210481
3776 16210481 16093464 15917724 15829350 15641890 15729590 15540400 15466710 15120704 15027747 14631450
3766 14631450 14488102 14500481 14326638 14133202 13814643 13837628 13692357 13381831 13461799 13381454
3756 13381454 12938813 12810018 12757400 12604096 12426608 12530171 12513527 12221562 12267925 12334904
3746 12334904 11898335 11668297 11797790 11841343 11789514 11752883 11747712 11430235 11339260 11358322 10924677
3735 10924677 10890478 10934824 10859988 10678746 10361639 10417453 10444252 10088290 10033752 10042538 10224315
$$ packed form
3805B3216559l32209j82457l29976k93301n47015l90995k11207j89086j14347
3796B0625966j51017m1098m69672m01752j31243k32052l69519k16144m47444j97489
3786A7968536k13908j74692q2618j12523k02297k16702j6891l00714l27876j09834
3776A6210481j17017j75740q8374j87460Q7700j89190p3690l46006r2957l96297
3766A4631450j43348J2379j73843j93436l18559K2985j45271l10526P9968q0345
3756A3381454m42641j28795n2618j53304j77488J03563j6644k91965M6363O6979
3746A2334904m36569k30038J29493M3553n1829l6631n171l17477r0975J9062m33645
3735A0924677l4199M4346p4836j81242l17107N5814K6799l55962n4538Q786J81777
$$ plain form
3724 10224315 10002790 9727989 9781626 9804281 9578552 9540722 9480459 9554057 9673333 9428506
3714 9428506 9133013 8945938 8782803 8969674 8956482 8905664 8846289 8822938 8757892 8702275 8782695
3703 8782695 8746557 8580067 8200842 8116340 8356864 8247854 8252522 8163787 8060070 8312838
3693 8312838 8376956 8024892 7716430 7971186 7743619 7458057 7700081 7738317 7632973 7736391
3683 7736391 7787924 7629056 7332313 7202987 7303939 7146936 6965324 7054969 7557551 7519075
3673 7519075 7139000 7184810 7031643 7231547 7104016 6885930 6745299 6586983 6653522 6806972
3663 6806972 6568332 6628406 6746416 6518748 6587429 6698356 6437760 6395107 6362969 6490415
3653 6490415 6601509 6495238 6336459 6113637 6073941 6091585 6205803 6349638 6372904 6075413
$$ packed form
3724A0224315k21525k74801N3637K2655k25729l7830o0263P3598J19276k44827
3714I428506k95493j87075j63135J86871j3192n0818n9375k3351o5046n5617Q0420
3703H782695l6138j66490l79225q4502K40524j09010M668q8735j03717K52768
3693H312838O4118l52064l08462K54756k27567k85562K42024L8236j05344J03418
3683G736391N1533j58868k96743j29326J00952j57003j81612Q9645N02582l8476
3673G519075l80075M5810j53167J99904j27531k18086j40631j58316O6539J53450
3663F806972k38640O0074J18010k27668O8681J10927k60596m2653l2138J27446
3653F490415J11094j06271j58779k22822l9696J7644J14218J43835K3266k97491
$$ plain form
3643 6075413 5953573 5817950 6007375 5913539 5740623 5675204 5471279 5605421 5617235 6082110
3633 6082110 5956186 5592243 5367746 5381789 5524007 5053950 5104489 5290250 5291642 5186793
3623 5186793 4975103 5270854 5450405 5399109 5099130 5082473 5184700 5268341 5133854 4949935
3613 4949935 4735477 4559191 4496254 4466563 4517254 4399240 4401587 4647417 4385256 4266263
3603 4266263 4418532 4325464 4147651 4130620 4146601 4135896 4119249 4062081 4208919 4038131 3967020
3592 3967020 3872746 3649347 3677085 3635199 3802420 3945688 3824509 3780233 3740737 3402578
3582 3402578 3209616 3293764 3400926 3372022 3458785 3786925 3815377 3519968 3456743 3327296
3572 3327296 3452269 3500213 3434346 3373782 3157406 3008236 2939346 2971662 2950990 2840535 2541706
$$ packed form
3643F075413j21840j35623J89425r3836j72916o5419k03925J34142J1814M64875
3633F082110j25924l63943k24497J4043J42218m70057N0539J85761J392j04849
3623E186793k11690K95751J79551n1296k99979j6657J02227Q3641j34487j83919
3613D949935k14458j76286o2937k9691N0691j18014K347K45830k62161j18993
3603D266263J52269r3068j77813j7031J5981j0705j6647n7168J46838j70788p1111
3592C967020r4274k23399K7738m1886J67221J43268j21179m4276l9496l38159
3582C402578j92962Q4148J07162k8904Q6763L28140K8452k95409o3225j29447
3572C327296J24973M7944o5867o0564k16376j49170o8890L2316k0672j10455k98829
$$ plain form
3561 2541706 2786183 3160593 2948056 2886436 2831775 2791947 2862548 2662846 2922899 2843479
3551 2843479 3020442 3072637 3064500 2730596 2554714 2702904 2352156 2351454 2622656 2439632 2319427
3540 2319427 2603834 2732427 2510973 2390963 2490352 2583202 2485623 2577453 2603872 2474024
3530 2474024 2504385 2656821 2893736 2580707 2507796 2309097 2297881 2477792 2315586 2467836
3520 2467836 2226523 2187715 2225563 2336687 2196596 2222754 2276929 2410476 2290311 2308216
3510 2308216 2458261 2504347 2258615 2213085 2148787 2129545 2127845 2058006 2042614 2220099 2345221
3499 2345221 2186407 2102088 2114971 2214532 2434719 2283491 2329138 2387570 2228988 2308005 2158660
3488 2158660 2074444 2017690 2037331 1953648 2047327 1994245 2042900 2090112 2065398 2057575 2206042
$$ packed form
3561B541706K44477L74410k12537o1620n4661l9828P0601j99702K60053p9420
3551B843479J76963N2195q137l33904j75882J48190l50748p02K71202j83024j20205
3540B319427K84407J28593k21454j20010R9389R2850r7579R1830K6419j29848
3530B474024L0361J52436K36915l13029p2911j98699j1216J79911j62206J52250
3520B467836k41313l8808L7848J11124j40091K6158N4175J33547j20165J7905
3510B308216J50045M6086k45732m5530o4298j9242j700o9839j5392J77485J25122
3499B345221j58814q4319J2883R9561K20187j51228M5647N8432j58582P9017j49345
3488B158660q4216n6754J9641q3683R3679n3082M8655M7212k4714p823J48467
$$ plain form
3477 2206042 2183589 2219891 2196367 2209982 2269530 2361161 2148090 2190906 2479714 2564562 2426458
3466 2426458 2490972 2591021 2376396 2060738 2234106 2540591 2489901 2460154 2276371 2478496
3456 2478496 2598798 2635000 2617749 2725159 2717626 2501379 2864252 2840526 2761599 2820780 2786598
3445 2786598 2962362 3199838 2839440 2689804 2858382 3114972 3155693 2992288 3025496 3078816
3435 3078816 3226175 3314246 3602620 3520862 3677191 3758879 3596292 3737750 3468791 3198443
3425 3198443 3477977 3580349 3701266 3713306 3671514 3842489 3862891 4139944 4055992 4014067
3415 4014067 3996136 4156203 3980273 4118783 4481094 4804163 4885499 4780379 4718742 4956762
3405 4956762 4910126 5050647 5034193 4977378 5188967 5409276 5074504 5105265 5025203 4956930 5131853
$$ packed form
3477B206042k2453L6302k3524J3615N9548R1631k13071M2816K88808Q4848j38104
3466B426458O4514J00049k14625l15658J73368L06485n0690k9747j83783K02125
3456B478496J20302L6202j7251J07410p533k16247L62873k3726p8927N9181l4182
3445B786598J75764K37476l60398j49636J68578K56590M0721j63405L3208N3320
3435C078816J47359Q8071K88374q1758J56329Q1688j62587J41458k68959k70348
3425C198443K79534J02372J20917J2040m1792J70975K0402K77053q3952m1925
3415D014067j7931J60067j75930J38510L62311L23069Q1336j05120o1637K38020
3405D956762m6636J40521j6454n6815K11589K20309l34772L0761q0062o8273J74923
$$ plain form
3394 5131853 5097559 5325033 5393053 5180892 4967389 5039293 5167545 5359176 5106235 4940188
3384 4940188 5070782 4884883 4651230 4657082 4696982 4802489 4569927 4410387 4285645 4388387
3374 4388387 4488167 4274350 3722003 3773140 3811342 3762603 3641893 3912372 3716042 3565464
3364 3565464 3582616 3683127 3427150 3443870 3575549 3366816 3488512 3065585 3187358 3042089
3354 3042089 2949908 2954905 2731388 2771814 2636034 2687816 2472116 2559476 2571234 2612245 2697979
3343 2697979 2151146 2138421 2284705 2395913 2335630 2050076 2158866 2102076 2004550 2030102
3333 2030102 2085183 2124927 2172072 2024343 1746103 1770527 1712127 1654358 1684222 1583842 1584393
3322 1584393 1455678 1321568 1494873 1484206 1391563 1518500 1692812 1618619 1574843 1505666
$$ packed form
3394E131853l4294K27474O8020k12161k13503P1904J28252J91631k52941j66047
3384D940188J30594j85899k33653N852L9900J05507k32562j59540j24742J02742
3374D388387R9780k13817n52347N1137L8202m8739j20710K70479j96330j50578
3364C565464J7152J00511k55977J6720J31679k08733J21696m22927J21773j45269
3354C042089r2181M997k23517M0426j35780N1782k15700Q7360J1758M1011Q5734
3343B697979n46833j2725J46284J11208o0283k85554J08790n6790r7526K5552
3333B030102N5081L9744M7145j47729k78240K4424n8400n7769K9864j00380N51
3322A584393j28715j34110J73305j0667r2643J26937J74312p4193m3776o9177
$$ plain form
3312 1505666 1237046 1196426 1254583 1396993 1504024 1943410 1533912 915440 1004916 1367028
3302 1367028 1489295 1538827 1617852 1608270 1268927 1203128 1500643 1595453 1385930 1276484 1455662
3291 1455662 1277641 1180038 1334588 1371717 1377230 1303072 1451010 1265175 1356632 1235965 1028283
3280 1028283 931504 867088 961927 1001315 963638 669819 850183 1114914 786781 632702
3270 632702 932907 1071928 856021 854138 1074650 1042718 1234377 1335931 1339404 1131582 1004619
3259 1004619 1027253 1099740 736410 783661 885465 1001477 1249776 1212862 1208120 994132 848457
3248 848457 1021980 1021706 1125534 917874 791251 821068 840783 832651 794801 727717 717533
3237 717533 482742 741313 789023 655224 788277 924729 543265 341008 455852 620011
$$ packed form
3312A505666k68620m0620N8157J42410J07031M39386m09498o18472Q9476L62112
3302A367028J22267M9532P9025r582l39343o5799K97515R4810k09523j09446J79178
3291A455662j78021r7603J54550L7129N513p4158J47938j85835R1457j20667k07682
3280A028283r6779o4416R4839L9388l7677k93819J80364K64731l28133j54079
3270F32702L00205J39021k15907j883K20512l1932J91659J01554L473k07822j26963
3259A004619K2634P2487l63330M7251J01804J16012K48299l6914m742k13988j45675
3248H48457J73523k74J03828k07660j26623K9817J9715q132l7850o7084j0184
3237G17533k34791K58571M7710j33799J33053J36452l81464k02257J14844J64159
$$ plain form
3227 620011 686627 803408 748805 432256 555448 576803 388157 608569 807827 832590
3217 832590 915796 693151 519897 497611 727649 680740 795949 861476 495381 244670
3207 244670 338666 599322 642085 677624 654088 493207 633561 713418 585955 730045 874528
3196 874528 1072923 849158 786066 786325 768818 695810 416568 67622 168676 342760 365354
3185 365354 243295 132986 237885 78602 387280 488126 400157 464346 553942 760585
3175 760585 601271 558125 639994 453214 170623 72947 319262 334132 238873 344954 547711
3164 547711 500208 473498 365647 596120 455340 674660 612906 581898 637965 733007 684681
3153 684681 318116 485965 306065 -112868 -18613 146400 191763 432061 441354 622949
$$ packed form
3227F20011O6616J16781n4603l16549J23192K1355j88646K20412J99258K4763
3217H32590Q3206k22645j73254k2286K30038m6909J15209O5527l66095k50711
3207B44670R3996K60656M2763L5539k3536j60881J40354P9857j27463J44090J44483
3196H74528J98395k23765o3092K59j7507p3008k79242l48946J01054J74084K2594
3185C65354j22059j10309J04899j59283L08678J00846q7969O4189Q9596K06643
3175G60585j59314m3146Q1869j86780k82591r7676K46315J4870r5259J06081K02757
3164E47711m7503k6710j07851K30473j40780K19320o1754l1008N6067R5042m8326
3153F84681l66565J67849j79900m18933R4255J65013M5363K40298R293J81595
$$ plain form
3143 622949 530148 289521 123710 113417 65791 183775 105871 155230 186445 490904 614570
3132 614570 371785 571840 496524 650754 709364 635106 533918 366484 434662 456661 479176
3121 479176 522942 680143 831718 636523 604371 573248 705526 728385 977115 964368 831055
3110 831055 879417 748589 720851 893922 721745 826187 893597 997990 811234 1070148
3100 1070148 1274857 1171577 1166000 1316358 1394090 1213346 1422953 1907423 1714020 1531719
3090 1531719 1307308 1523192 2039877 1835473 1887636 1618951 1325409 1174549 1498136 1606259
3080 1606259 1705068 2012066 1956847 1977028 2084924 2226717 2529909 2559714 2188413 2244290
3070 2244290 2442847 2212481 2161981 2171506 2210036 2008933 2106671 2302106 2378069 2439951 2484475
$$ packed form
3143F22949r2801k40627j65811j0293m7626J17984p7904M9359L1215L04459J23666
3132F14570k42785K00055p5316J54230N8610p4258j01188j67434O8178K1999K2515
3121D79176M3766J57201J51575j95195l2152l1123J32278K2859K48730j2747j33313
3110H31055M8362j30828k7738J73071j72177J04442O7410J04393j86756K58914
3100A070148K04709j03280n577J50358P7732j80744K09607M84470j93403j82301
3090A531719k24411K15884N16685k04404N2163k68685k93542j50860L23587J08123
3080A606259R8809L06998n5219K0181J07896J41793L03192K9805l71301N5877
3070B244290J98557k30366n0500R525L8530k01103R7738J95435P5963O1882M4524
$$ plain form
3059 2484475 2629497 2632824 2421102 2491687 2653850 2338087 2478304 2508582 2602160 2658150 2574063
3048 2574063 2655353 2647709 2572765 2348527 1892635 1721673 2100351 2143985 1958806 2022749 1984639
3037 1984639 1668283 2026558 1962353 2060573 1892221 1689436 1701678 1737060 1774105 1561312
3027 1561312 1386518 1570238 1645780 1684745 1557736 1974497 1903988 1650522 1513329 1317067
3017 1317067 1211583 1184349 1243489 1215439 1034371 1078693 984107 921186 1132603 702029 770986
3006 770986 735583 527614 543181 752924 767745 681942 751496 941038 1090764 617033 459625
2995 459625 481802 627610 589313 501363 533584 263827 456006 531723 444710 421543 548583
2984 548583 642985 712833 498783 251717 497117 531577 235311 83341 -28946 150824
$$ packed form
3059B484475J45022L327k11722P0585J62163l15763J40217L0278R3578N5990q4087
3048B574063Q1290p644p4944k24238m55892j70962L78678M3634j85179O3943l8110
3037A984639l16356L58275o4205R8220j68352k02785J2242L5382L7045k12793
3027A561312j74794J83720P5542L8965j27009M16761p0509k53466j37193j96262
3017A317067j05484k7234N9140k8050j81068M4322r4586o2921K11417m30574O8957
3006G70986l5403k07969J5567K09743J4821q5803O9554J89542J49726m73731j57408
2995D59625K2177J45808l8297q7950L2221k69757J92179P5717q7013k3167J27040
2984E48583R4402O9848k14050k47066K45400L4460k96266j51970j12287J79770
$$ plain form
2974 150824 314353 220171 249053 401698 407203 335924 471298 300019 268234 413372 174780
2963 174780 -106016 -11936 367522 478999 491670 207183 126189 282088 138541 171336
2953 171336 261493 40808 228491 197353 -18366 -41986 -157966 -172603 92663 149757 50261
2942 50261 -143640 868 -57931 -59938 51166 71881 -61640 89369 158733 168738 361704
2931 361704 381590 -133311 -229855 -196493 -289234 23377 110717 -55410 39031 -34250 63678
2920 63678 59040 -16164 68784 -125436 -64876 50009 -151431 -470682 -212637 -53381 33104
2909 33104 -207430 -407065 -269835 -511696 -253596 -17974 -223461 -285807 -224497 -359685
2899 -359685 -173997 142249 -216413 -358461 -347302 -208906 -346868 95070 177921 49366
$$ packed form
2974A50824J63529r4182K8882J52645N505p1279J35374j71279l1785J45138k38592
2963A74780k80796R4080L79458J11477J2671k84487q0994J55899j43547L2795
2953A71336R0157k20685J87683l1138k15719k3620j15980j4637K65266N7094r9496
2942E0261j93901J44508n8799k007J11104K0715j33521J51009O9364J0005J92966
2931C61704J9886n14901r6544L3362r2741L12611Q7340j66127R4441p3281R7928
2920F3678m638p5204Q4948j94220O0560J14885k01440l19251K58045J59256Q6485
2909C3104k40534j99635J37230k41861K58100K35622k05487o2346O1310j35188
2899c59685J85688L16246l58662j42048J1159J38396j37962M41938Q2851j28555
$$ plain form
2889 49366 -37528 24544 44782 -113517 -53157 -316177 -451953 -355699 -395548 -417612 -270051
2878 -270051 -58156 134492 62427 -163625 -93929 -58663 -87695 -196724 -387418 -247778
2868 -247778 -305528 -370080 -182111 -78329 -8281 114074 -17298 -37925 -248349 -258512 -367871
2857 -367871 -496803 -223904 -141039 -133964 -51586 -18156 -144835 -258122 -396268 -405845 -422577
2846 -422577 -467188 -286727 -170365 -446758 -373401 -449016 -348994 -283606 -316276 -290850 -274220
2835 -274220 -418539 -679579 -616528 -585783 -585465 -405261 -236132 -325206 -163655 -277130 -472735
2824 -472735 -675060 -733200 -393964 -178403 -391793 -599964 -483988 -281093 -73212 -217878
2814 -217878 -209081 -440380 -273843 -333367 -299197 -33021 -11773 163882 -197679 -280472 -357557
$$ packed form
2889D9366q6894O2072K0238j58299O0360k63020j35776R6254l9849k2064J47561
2878b70051K11895J92648p2065k26052O9696L5266k9032j09029j90694J39640
2868b47778n7750o4552J87969J03782P0048J22355j31372k0627k10424j0163j09359
2857c67871j28932K72899Q2865P075Q2378L3430j26679j13287j38146r577j6732
2846d22577m4611J80461J16362k76393P3357p5615J00022O5388l2670K5426J6630
2835b74220j44319k61040O3051L0745L18J80204J69129q9074J61551j13475j95605
2824d72735k02325n8140L39236K15561k13390k08171J15976K02895K07881j44666
2814b17878Q797k31299J66537n9524L4170K66176K1248J75655l61561q2793p7085
$$ plain form
2803 -357557 -471196 -304470 -375476 -383616 -32560 -322374 -272524 -273775 -631552 -543550 -389614
2792 -389614 -149266 -51373 -79244 -151170 -376722 -412377 -227697 -171106 -311361 -284282 -313288
2781 -313288 -385809 -221340 -183643 -82860 -242811 -590726 -709729 -569160 -552745 -428923
2771 -428923 -549417 -554100 -489171 -326551 -502445 -471389 -30222 -331948 -430666 -393828 -315384
2760 -315384 -149817 -326002 -535958 -199940 -188296 -539790 -745027 -373453 -280307 -432952
2750 -432952 -317477 -73869 -207795 -501720 -441685 -551553 -606200 -484770 -471297 -395697
2740 -395697 -196617 -439637 -402892 -213004 -176061 -293753 -488741 -267459 -392307 -378504
2730 -378504 -274985 -235098 -312136 -304667 -77421 -10159 -240691 -357837 -501967 -549444 -504348
$$ packed form
2803c57557j13639J66726p1006q140L51056k89814M9850j251l57777Q8002J53936
2792c89614K40348R7893k7871p1926k25552l5655J84680N6591j40255K7079k9006
2781c13288p2521J64469L7697J00783j59951l47915j19003J40569J6415J23822
2771d28923j20494m683O4929J62620j75894L1056M41167l01726r8718L6838P8444
2760c15384J65567j76185k09956L36018J1644l51494k05237L71574R3146j52645
2750d32952J15475K43608j33926k93925O0035j09868n4647J21430J3473P5600
2740c95697J99080k43020L6745J89888L6943j17692j94988K21282j24848J3803
2730c78504J03519L9887p7038P469K27246O7262k30532j17146j44130m7477M5096
$$ plain form
2719 -504348 -607855 -423928 -410555 -223168 -143444 -173301 -161864 -92095 -445114 -399591 -362677
2708 -362677 -490150 -499454 -283964 14424 -102910 -300751 -601749 -637313 -232816 -506183
2698 -506183 -567428 -236162 -63847 -121161 -272573 -426378 -479425 -293634 -390930 -451402 -235745
2687 -235745 -98540 -270467 -263631 -401117 -220774 38562 -213580 -686322 -537034 -364811
2677 -364811 -288307 -208029 -208545 -399133 -151757 -218331 -360355 -307261 -363705 -511507 -555184
2666 -555184 -220212 -259003 -460486 -454800 -715884 -619946 -655260 -734556 -519227 -337958 -299962
2655 -299962 -54785 -220256 -339587 -291389 21981 49740 -204028 -215133 -367689 -324116
2645 -324116 -292798 -335635 -440127 -523984 -712230 -446477 -496319 -460890 -184634 -191024 -30507
$$ packed form
2719e04348j03507J83927J3373J87387P9724k9857J1437O9769l53019M5523L6914
2708c62677j27473r304K15490K98388j17334j97841l00998l5564M04497k73367
2698e06183o1245L31266J72315n7314j51412j53805n3047J85791r7296o0472K15657
2687b35745J37205j71927O836j37486J80343K59336k52142m72742J49288J72223
2677c64811P6504Q0278n16j90588K47376o6574j42024N3094n6444j47802m3677
2666e55184L34972l8791k01483N686k61084R5938l5314p9296K15329J81269L7996
2655b99962K45177j65471j19331M8198L13370K7759k53768j1105j52556M3573
2645c24116L1318m2837j04492q3857j88246K65753m9842L5429K76256o390J60517
$$ plain form
2634 -30507 -118224 -376182 -694360 -728810 -335713 -491924 -444122 -480973 -474322 -371913 -315537
2623 -315537 -419850 -534618 -224582 -428953 -354919 61165 -187891 -259881 -112943 -70968
2613 -70968 -191636 -211997 -316843 -308402 -439887 -752502 -663247 -395117 -381066 -309549 -518485
2602 -518485 -310874 -208419 -550295 -582390 -478111 -559012 -329380 -491877 -590927 -473020
2592 -473020 -305038 -333362 -272222 -114802 -343511 -527457 -266765 -47110 -174980 -223033
2582 -223033 -448451 -640810 -608004 -334227 -145996 -330930 -374461 -450830 -272760 -230595
2572 -230595 -211312 -439723 -348605 32776 10444 181203 -60074 139275 79928 -72557
2562 -72557 -114929 135543 240658 -8271 9830 133547 -239912 -191431 -137889 -185926 -219048
$$ packed form
2634c0507q7717k57958l18178l4450L93097j56211M7802l6851O651J02409N6376
2623c15537j04313j14768L10036k04371P4034M16084k49056p1990J46938M1975
2613g0968j20668k0361j04846Q441j31485l12615Q9255K68130J4051P1517k08936
2602e18485K07611J02455l41876l2095J04279q0901K29632j62497r9050J17907
2592d73020J67982k8324O1140J57420k28709j83946K60692K19655j27870m8053
2582b23033k25418j92359L2806K73777J88231j84934m3531p6369J78070M2165
2572b30595J9283k28411R1118L81381k2332J70759k41277J99349n9347j52485
2562g2557m2372K50472J05115k48929J8101J23717l73459M8481N3542m8037l3122
$$ plain form
2551 -219048 -310528 -363782 -467609 -476030 -594956 -386817 -240542 84403 29081 -85680 -242237
2540 -242237 -609179 -484799 -612426 -419029 -273089 -526607 -381853 -364710 -424648 -424659 -316117
2529 -316117 -545974 -458706 -248378 52811 -118779 -250064 -259822 -424368 -398320 -354266 -127969
2518 -127969 -296617 55695 44587 19559 53639 151658 -95543 -447059 -395025 -367080 -464294
2507 -464294 -239501 -325269 -370127 -159357 -105506 -497430 -174266 -59700 -163713 -97944
2497 -97944 -188101 -269513 -184845 -224165 10396 32837 -365910 -397798 -99399 -103378 -106545 -68201
2485 -68201 -514615 -417018 -308761 -187626 -25847 120959 14226 -261222 -237121 -148269
2475 -148269 -278722 -120188 -126231 -299524 -408577 -210864 -138682 -226588 -107294 -125591 -411188
$$ packed form
2551b19048r1480n3254j03827q421j18926K08139J46275L24945n5322j14761j56557
2540b42237l66942J24380j27627J93397J45940k53518J44754J7143n9938j1J08542
2529c16117k29857Q7268K10328L01189j71590j31285r758j64546K6048M4054K26297
2518a27969j68648L52312j1108k5028L4080R8019k47201l51516N2034K7945r7214
2507d64294K24793q5768m4858K10770N3851l91924L23164J14566j04013O5769
2497i7944r0157q1412Q4668l9320K34561K2441l98747l1888K98399l979l167L8344
2485f8201m46414R7597J08257J21135J61779J46806j06733k75448K4101Q8852
2475a48269j30453J58534o043j73293j09053J97713P2182q7906J19294j8297k85597
$$ plain form
2464 -411188 -274116 -197190 -466535 -321146 -271494 -412833 -261431 -453598 -414989 -166099
2454 -166099 -263828 -390183 -493548 -433693 -164382 -260632 -334246 -335360 -415880 -248836 -234707
2443 -234707 -373553 -282862 -464292 -299078 -354701 -396498 -445414 -599263 -391339 -441963 -192372
2432 -192372 -148433 -334039 -437735 -462052 -430226 -172111 -221220 -432485 -350146 -184976 -27164
2421 -27164 -168439 -349646 -324736 -419341 -677592 -456058 -522951 -491410 -208479 -473013 -535857
2410 -535857 8988 -236721 -133961 -162563 -190174 -81116 -265709 -448358 -185671 -209504
2400 -209504 -378110 -186313 -176750 43972 -141237 -157141 -59587 -88974 -208447 -277444 -370332
2389 -370332 -540157 -586555 -139503 16295 38676 272311 149660 134563 9249 25492
$$ packed form
2464d11188J37072P6926k69345J45389M9652j41339J51402j92167L8609K48890
2454a66099r7729j26355j03365N9855K69311r6250p3614j114q0520J67044J4129
2443b34707j38846R0691j81430J65214n5623m1797m8916j53849K07924n0624K49591
2432a92372M3939j85606j03696k4317L1826K58115m9109k11265Q2339J65170J57812
2421b7164j41275j81207K4910r4605k58251K21534o6893L1541K82931k64534o2844
2410e35857N44845k45709J02760k8602k7611J09058j84593j82649K62687k3833
2400b09504j68606J91797R563K20722j85209j5904R7554k9387j19473o8997r2888
2389c70332j69825m6398M47052J55798K2381K33635j22651j5097j25314J6243
$$ plain form
2379 25492 46334 -13953 -76337 -157450 -136504 -22793 -43635 -77608 -270750 -282319 -319903
2368 -319903 -378783 -206582 -190977 -325680 -291209 29533 -34732 175692 66540 91394 207386
2357 207386 370356 423800 241051 190571 281186 139655 161794 245256 261950 -15895 -32348
2346 -32348 162486 258563 188921 273010 404845 447832 259472 101674 290097 377940 239189
2335 239189 154790 216705 514260 463008 375412 446872 687023 669936 846854 1019059 988645
2324 988645 1130415 1053411 928658 400909 559341 971813 1081818 1199786 1014312 837278
2314 837278 1071759 1464429 1481343 1448125 1684233 1679197 1762828 2228105 2331633 2417373 2266755
2303 2266755 2096315 2380304 2464059 2673913 3101627 3140515 2897144 3030964 3241502 3683260
$$ packed form
2379B5492K0842o0287o2384q1113K0946J13711k0842l3973j93142j1569l7584
2368c19903n8880J72201J5605j34703L4471L20742o4265K10424j09152K4854J15992
2357B07386J62970N3444j82749n0480R0615j41531K2139Q3462J6694k77845j6453
2346c2348J94834R6077o9642Q4089J31835M2987j88360j57798J88423Q7843j38751
2335B39189q4399O1915K97555n1252q7596P1460K40151j7087J76918J72205l0414
2324I88645J41770p7004j24753n27749J58432M12472J10005J17968j85474j77034
2314H37278K34481L92670J6914l3218K36108n036Q3631M65277J03528Q5740j50618
2303B266755j70440K83989Q3755K09854M27714L8888k43371J33820K10538M41758
$$ plain form
2293 3683260 3994238 4029341 4197849 4461458 4702000 4951249 4843448 5078680 5171276 5300943
2283 5300943 5546478 5453927 5462976 5556442 5522780 5365543 5183419 4976614 4737060 4692359 4341180
2272 4341180 4213907 4078304 3887797 3797593 3471497 3071882 2906589 2817746 2790077 2496832
2262 2496832 2329445 2242575 2416170 2441857 2268732 2315981 2078543 1790978 1714384 1837784
2252 1837784 1832758 1688268 1652036 1402441 1418555 1504749 1337064 1253648 1300816 1257977 1006834
2241 1006834 1008005 1043160 965705 811582 769911 896530 763743 709334 1003496 841358 517969
2230 517969 402540 553863 510785 586366 306604 265529 247747 -19708 -34614 367236 183982
2219 183982 190565 407252 557020 343355 232331 294955 55920 314916 370660 324655 372726
$$ packed form
2293C683260L10978L5103J68508K63609K40542K49249j07801K35232R2596J29667
2283E300943K45535r2551R049R3466l3662j57237j82124k06805k39554m4701l51179
2272D341180j27273j35603j90507r0204l26096l99615j65293q8843k7669k93245
2262B496832j67387q6870J73595K5687j73125M7249k37438k87565p6594J23400
2252A837784n026j44490l6232k49595J6114Q6194j67685q3416M7168m2839k51143
2241A006834J171L5155p7455j54123m1671J26619j32787n4409K94162j62138l23389
2230E17969j15429J51323m3078P5581k79762m1075j7782k67455j4906M01850j83254
2219A83982O583K16687J49768k13665j11024O2624k39035K58996N5744m6005M8071
$$ plain form
2208 372726 168447 111347 294862 357994 397248 392667 230824 118759 108873 -2059 216526
2197 216526 326368 396619 425758 404697 409647 159123 -31478 -230191 -290086 114627 359445
2186 359445 177314 -19279 21058 -38960 61765 -209900 9298 405271 205978 96757
2176 96757 23672 299163 421717 214730 287426 541264 101362 -289328 -207990 -2979
2166 -2979 114999 -98278 -458048 -282019 100153 195467 374086 128424 -697 68495
2156 68495 319724 169014 187265 207912 164732 353192 147088 102066 -42011 224458 13567
2145 13567 147733 361746 247802 61731 -281926 56692 168126 -13145 -23682 -108138
2135 -108138 -191071 -140421 -206895 1097 148245 46627 -79304 -78399 -69232 -124778 226478
$$ packed form
2208C72726k04279n7100J83515O3132L9254m581j61843j12065r886j10932K18585
2197B16526J09842P0251K9139k1061M950k50524j90601j98713n9895M04713K44818
2186C59445j82131j96593M0337o0018J00725k71665K19198L95973j99293j09221
2176I6757p3085K75491J22554k06987P2696K53838m39902l90690Q1338K05011
2166b979J17978k13277l59770J76029L82172R5314J78619k45662j29121O9192
2156F8495K51229j50710J8251K0647m3180J88460k06104m5022j44077K66469k10891
2145A3567J34166K14013j13944j86071l43657L38618J11434j81271j0537q4456
2135a08138q2933N0650o6474K07992J47148j01618j25931R05R167n5546L51256
$$ plain form
2124 226478 1562 -64532 194408 -121216 -79245 -15763 -68856 232489 -8017 -2675 87130
2113 87130 126678 -51744 -317155 -62374 -260005 75932 -24597 95440 128971 -23234
2103 -23234 -95755 37396 68282 49604 -36383 -279958 -386164 -337878 -103050 -226713 -279419
2092 -279419 -337119 -327774 -182578 196359 -51436 -125344 -111831 169841 170080 -43669 30954
2081 30954 68131 17383 26668 141476 65760 -227324 -150876 -28046 68530 32742 144463
2070 144463 -16475 -186566 63931 -23810 -76768 -278129 -379495 -239044 -176761 -185401 -351306
2059 -351306 -457498 -441195 -384133 -196014 -303606 -328100 -275793 -451724 -445452 -144326 3967
2048 3967 -50410 -311666 -329185 -236764 -146942 -52930 -96410 -201517 272012 43727 -98315
$$ packed form
2124B26478k24916o6094K58940l15624M1971O3482n3093L01345k40506N342Q9805
2113H7130L9548j78422k65411K54781j97631L35937j00529J20037L3531j52205
2103b3234p2521J33151L0886j8678q5987k43575j06206M8286K34828j23663n2706
2092b79419n7700R345J45196L78937k47795p3908J3513K81672K39k13749P4623
2081C0954L7177n0748R285J14808p5716k93084P6448J22830R6576l5788J11721
2070A44463j60938j70091K50497q7741n2958k01361j01366J40451O2283q640j65905
2059c51306j06192J6303N7062J88119j07592k4494N2307j75931O272L01126J48293
2048C967n4377k61256j7519R2421Q9822R4012m3480j05107M73529k28285j42042
$$ plain form
2037 -98315 -109083 -294508 -368447 -419605 -387763 -164135 -40756 -132375 -64783 -151603 -260264
2026 -260264 -70914 -150894 -62599 -15866 100718 358987 338682 292112 1500 -27083 239664
2015 239664 203907 171907 13513 -214645 -8488 121956 283864 -96627 -179514 -120406
2005 -120406 84681 146538 128093 -115509 -338512 92650 62726 -84530 -10061 51645 189460
1994 189460 70178 -79621 -83003 -151856 -273038 -266397 -566642 -325410 -323021 -362953 -277276
1983 -277276 -333760 -315584 -201675 -150424 -254801 -372280 -358694 -308702 -215253 -406415 -217945
1972 -217945 -48657 -142274 -189492 -442786 -261669 -100117 -189899 -98359 118057 -186623
1962 -186623 -317195 -287993 -209921 -468199 -285170 -84285 106155 -37109 -154935 -154867 -174296
$$ packed form
2037i8315j0768j85425p3939n1158L1842K23628J23379r1619O7592q6820j08661
2026b60264J89350p9980Q8295M6733J16584K58269k0305m6570k90612k8583K66747
2015B39664l5757l2000j58394k28158K06157J30444J61908l80491q2887N9108
2005a20406K05087O1857j8445k43602k23003M31162k9924j47256P4469O1706J37815
1994A89460j19282j49799l382o8853j21182O641l00245K41232K389l9932Q5677
1983b77276n6484J8176J13909N1251j04377j17479J3586M9992R3449j91162J88470
1972b17945J69288r3617m7218k53294J81117J61552q9782R1540K16416l04680
1962a86623j30572K9202P8072k58278J83029K00885J90440j43264j17826O8j9429
$$ plain form
1951 -174296 -245988 -160597 67288 -324414 -399142 -218697 -146945 -108096 -161437 3053 2700
1940 2700 -49082 -178393 116967 196932 90271 28636 -25182 -61875 -265363 -126601 -187446
1929 -187446 -189403 -127660 -206258 -72697 -17188 16968 77407 -124802 -10661 -118392 -29110
1918 -29110 13065 20321 -139889 -94057 -230411 -407600 -521991 -115896 962 -61374 -57104
1907 -57104 -190172 -151863 -138049 -74863 -53792 -173987 -209230 -274819 -269036 10553 16778 85682
1895 85682 158977 213435 -50642 -229602 -337532 -242342 -61975 54259 -81178 -162917 -45776
1884 -45776 1490 249274 149152 -181141 2950 68080 -76099 -261276 -496028 -626836
1874 -626836 -568720 -247164 -201705 -161797 -327995 -513522 -411035 -367911 -189501 -452397
$$ packed form
1951a74296p1692Q5391K27885l91702p4728J80445P1752L8849n3341J64490l53
1940B700n1782j29311K95360P9965j06661o1635n3818l6693k03488J38762o0845
1929a87446j957O1743p8598J33561N5509L4156O0439k02209J14141j07731Q9282
1918b9110M2175P256j60210M5832j36354j77189j14391M06095J16858o2336M270
1907e7104j33068L8309J3814O3186K1071j20195l5243o5589N783K79589O225O8904
1895H5682P3295N4458k64077j78960j07930R5190J80367J16234j35437q1739J17141
1884d5776M7266K47784j00122l30293J84091O5130j44179j85177k34752j30808
1874f26836N8116L21556M5459L9908j66198j85527J02487M3124J78410k62896
$$ plain form
1864 -452397 -185819 -108633 -257792 -201549 -177695 -201670 -179761 -301020 -291614 -74909 -175910
1853 -175910 -182779 -202357 27278 271710 -36889 -151890 -2013 88779 -92339 -216076
1843 -216076 -285489 -135705 -286577 -438308 -155062 -228426 -251756 29582 -65273 34597 -150820
1832 -150820 -161720 230246 483018 134982 -429117 -55731 102921 146036 114188 -20938
1822 -20938 -255899 -59777 257416 -44197 -193437 -128019 -405629 -455381 -429869 -683855
1812 -683855 -491936 -299312 -253260 -183063 -23852 -72923 -242506 -476145 -415208 -120385
1802 -120385 -225060 -111373 -323975 -294904 -93942 -73081 -35660 276996 175742 189258
1792 189258 62393 -61133 -147308 -166387 27961 -114562 142753 116496 -172315 -219542
$$ packed form
1864d52397K66578P7186j49159N6243K3854k3975K1909j21259R406K16705j01001
1853a75910o869j9578K29635K44432l08599j15001J49877R0792j81118j23737
1843b16076o9413J49784j50872j51731K83246p3364k3330K81338r4855R9870j85417
1832a50820j0900L91966K52772l48036n64099L73386J58652M3115l1848j35126
1822b0938k34961J96122L17193l01613j49240O5418k77610m9752K5512k53986
1812f83855J91919J92624M6052P0197J59211m9071j69583k33639O0937K94823
1802a20385j04675J13687k12602K9071K00962K0861L7421L12656j01254J3516
1792A89258j26865j23526q6175j9079J94348j42523K57315k6257k88811m7227
$$ plain form
1782 -219542 -124848 -189903 84032 130607 -900 47117 56263 4257 187580 68941 -128198
1771 -128198 -1933 -205211 -137323 -67649 -34970 -243692 -81816 -228434 -292858 -74468
1761 -74468 104446 150806 -82637 110032 89122 -348306 -354006 -391430 -371666 -78434 151517
1750 151517 20474 -87151 64153 59637 -57993 -10408 -126396 -136532 -131647 162863 82364
1739 82364 -106088 65739 -32566 -275151 -276547 -51463 -127426 -204110 -236534 3487 -125579
1728 -125579 -398448 -389013 -295923 -329264 -368674 -282249 -12102 274668 299140 215640 206619
1717 206619 288792 -48054 -221375 101094 -73598 -275118 39372 158991 97932 -85548
1707 -85548 -141619 52646 -76505 -207196 -276693 -310126 -114294 -206563 88868 -42764 -242578
$$ packed form
1782b19542R4694o5055K73935M6575j31507M8017R146n2006J83323j18639j97139
1771a28198J26265k03278O7888O9674L2679k08722J61876j46618o4424K18390
1761g4468J78914M6360k33443J92669k0910m37428n700l7424J9764K93232K29951
1750A51517j31043j07625J51304m516j17630M7585j15988j0136M885K94510q0499
1739H2364j88452J71827r8305k42585j396K25084p5963p6684l2424K40021j29066
1728a25579k72869R435R3090l3341l9410Q6425K70147K86770K4472q3500r021
1717B06619Q2173l36846j73321L22469j74692k01520L14490J19619o1059j83480
1707h5548n6071J94265j29151j30691o9497l3433J95832r2269K95431j31632j99814
$$ plain form
1696 -242578 -219726 -354710 -272734 -132778 -316204 -424241 -140868 -237886 -192908 -233254 -300035
1685 -300035 -381929 -212274 -71354 362695 325864 120116 -98099 -402833 -248005 267726
1675 267726 -3976 188185 269111 205415 240546 119954 137342 -83093 -111991 67502 -27554
1664 -27554 -96857 -133378 -82474 -174885 -323812 -303711 390412 484134 46741 -44878 204483
1653 204483 263830 140973 -54293 -148419 145392 128638 -11979 334906 283196 -296640
1643 -296640 -192319 -34015 32078 -22277 71550 428303 298422 154843 55672 -772 93276
1632 93276 169417 -128611 59898 246247 -126486 -84597 381214 614212 150612 47224
1622 47224 241423 203994 -190902 -158253 -353454 -14590 147588 163754 26441 -20978 -202723
$$ packed form
1696b42578K2852j34984Q1976J39956j83426j08037K83373r7018M4978m0346o6781
1685c00035q1894J69655J40920M34049l6831k05748k18215l04734J54828N15731
1675B67726k71702J92161Q0926o3696L5131j20592J7388k20435k8898J79493r5056
1664b7554o9303l6521N0904r2411j48927K0101O94123R3722m37393r1619K49361
1653B04483N9347j22857j95266r4126K93811j6754j40617L46885n1710n79836
1643b96640J04321J58304O6093n4355R3827L56753j29881j43579r9171n6444R4048
1632I3276P6141k98028J88509J86349l72733M1889M65811K32998m63600j03388
1622D7224J94199l7429l94896L2649j95201L38864J62178J6166j37313m7419j81745
$$ plain form
1611 -202723 -279029 66558 105684 -45027 -111396 -123576 344575 191787 112136 124171 119505
1600 119505 204394 175553 -1505 73564 56266 -95338 221590 140655 224161 -134461 -340137
1589 -340137 29897 23470 121617 114162 -34110 -262848 -161919 -12323 -187175 -384800 -83090
1578 -83090 -111539 -185752 -88028 17833 -169242 18551 223137 227982 212610 -13939 10360
1567 10360 114756 274374 345645 236369 119851 86698 139734 99089 115506 15071 -7234
1556 -7234 -133663 -12440 78183 -79733 -61373 -6580 102284 -27821 -213837 46978 148649
1545 148649 -144631 -212266 -152384 179556 29669 200313 12093 -220292 -516115 -435772
1535 -435772 -373773 -264056 -213633 -92533 -96156 -290191 -511182 -612609 -485080 -283515
$$ packed form
1611b02723p6306L45587L9126j50711o6369j2180M68151j52788p9651J2035m666
1600A19505Q4889k8841j77058P5069j7298j51604L16928q0935Q3506l58622k05676
1589c40137L70034o427R8147p455j48272k28738J00929J49596j74852j97625L01710
1578h3090k8449p4213R7724J05861j87075J87793K04586M845j5372k26549K4299
1567A0360J04396J59618P1271j09276j16518l3153N3036m0645J6417j00435k2305
1556g234j26429J21223R0623j57916J8360N4793J08864j30105j86016K60815J01671
1545A48649k93280o7635N9882L31940j49887J70644j88220k32385k95823Q0343
1535d35772O1999J09717N0423J21100l623j94035k20991j01427J27529K01565
$$ plain form
1525 -283515 -25651 -192135 -270812 -331433 -193154 107971 94101 101233 28635 6894 -134352
1514 -134352 18578 73190 -8759 -154295 -103331 -162047 -114166 -256520 -282361 -233266 -310981
1503 -310981 -183683 -9697 128766 95719 126373 256577 -160039 -120878 55506 128723
1493 128723 26185 1705 -31761 -125354 -74227 -154653 -176078 -41528 -16951 -150300 -31443
1482 -31443 -231413 -104202 82028 233227 -11586 -151709 18507 96013 84100 46991
1472 46991 -61533 -188703 -5765 -140442 -142409 -79266 43159 52603 62252 164234 186900
1461 186900 1880 -456558 -26689 90351 156504 170495 220752 -5541 -18562 78906 -44015
1450 -44015 -170096 -220612 -397615 -287542 26250 -144623 -54965 83340 -324057 -79654
$$ packed form
1525b83515K57864j66484p8677o0621J38279L01125j3870P132p2598k1741j41246
1514a34352J52930N4612q1949j45536N0964n8716M7881j42354k5841M9095p7715
1503c10981J27298J73986J38463l3047L0654J30204m16616L9161J76384P3217
1493A28723j02538k4480l3466r3593N1127q0426k1425J34550K4577j33349J18857
1482c1443j99970J27211J86230J51199k44813j40123J70216P7506j1913l7109
1472D6991j08524j27170J82938j34677j967O3143J22425R444R649J01982K2666
1461A86900j85020m58438M29869J17040O6153J3991N0257k26293j3021R7468j22921
1450d4015j26081n0516j77003J10073L13792j70873Q9658J38305m07397K44403
$$ plain form
1440 -79654 141018 79082 109695 -46433 -50362 57171 45648 -22590 130971 276841 372203
1429 372203 82577 74503 474229 68366 -269350 -181759 -99531 30975 205040 229791 277846
1418 277846 180636 56876 -152334 -106934 -180636 -217717 115629 74495 -37502 -65103 -102439
1407 -102439 47956 -266262 -287830 56191 146206 120207 159082 -55332 -318965 -44927
1397 -44927 130984 247105 1106 -25643 26631 -121450 42609 96979 76280 165210 45992
1386 45992 34640 76899 209112 288287 290015 92966 -3400 45135 86768 86654 118429 32930
1374 32930 216484 230984 4468 -162882 41522 46721 177563 152394 -52998 -47360 -74652
1363 -74652 -23712 -243925 -292418 -89605 181216 -22135 44828 70022 261460 163467 -51265
$$ packed form
1440g9654K20672o1936L0613j56128l929J07533j1523o8238J53561J45870R5362
1429C72203k89626q074L99726m05863l37716Q7591Q2228J30506J74065K4751M8055
1418B77846r7210j23760k09210M5400p3702l7081L33346m1134j11997k7601l7336
1407a02439J50395l14218k1568L44021R0015k5999L8875k14414k63633K74038
1397d4927J75911J16121k45999k6749N2274j48081J64059N4370k0699Q8930j19218
1386D5992j1352M2259J32213P9175J728j97049r6366M8535M1633j14L1775q5499
1374C2930J83554J4500k26516j67350K04404N199J30842k5169k05392N638k7292
1363g4652N0940k20213m8493K02813K70821k03351O6963K5194J91438r7993k14732
$$ plain form
1352 -51265 73852 73351 15390 -176662 111692 195128 4020 -27444 90423 -103794 -64927
1341 -64927 -60900 -107254 43627 117415 9985 90815 96582 -15862 28036 310208 199351
1330 199351 335803 457405 445545 422418 319919 245763 66076 -123853 -17768 -11924 -13956
1319 -13956 312731 218049 75853 -48019 196004 -14738 -161780 -8355 106274 19634
1309 19634 14422 108206 60141 91465 73113 31464 -42277 -66509 -60634 -15937 -139153 106750
1297 106750 230169 -194032 -145050 5079 2316 -9588 277562 352876 117195 119979 -65804
1286 -65804 -232082 -8895 175483 43972 -121773 -126153 -100457 -53188 -3648 76533 137242
1275 137242 277161 184711 -18179 -185670 -398726 -366042 -79654 -31724 110509 42739
$$ packed form
1352e1265J25117n01n7961j92052K88354Q3436j91108l1464J17867j94217L8867
1341f4927M027m6354J50881P3788j07430Q0830N767j12444M3898K82172j10857
1330A99351J36452J21602j1860k3127j02499p4156j79687j89929J06085N844k032
1319a3956L26687r4682j42196j23872K44023k10742j47042J53425J14629q6640
1309A9634n212R3784m8065L1324j8352m1649p3741k4232N875M4697j23216K45903
1297A06750J23419m24201M8982J50129k763j1904K87150P5314k35681K784j85783
1286f5804j66278K23187J84378j31511j65745m380K5696M7269M9540Q0181O0709
1275A37242J39919r2450k02890j67491k13056L2684K86388M7930J42233o7770
$$ plain form
1265 42739 209606 289517 -7137 -39475 -44045 -153771 26437 -158512 101630 116031 148895
1254 148895 237072 189120 81223 -15768 -30109 32263 -14141 246975 223856 50271 54024
1243 54024 -80495 22729 -181468 190561 50565 -126803 -270833 54631 24006 236968
1233 236968 222709 142385 357418 349586 186243 -46315 7512 -56527 10419 39254 20468
1222 20468 94269 132369 227369 300527 360896 338828 288335 231035 206014 17997 -188493
1211 -188493 -118344 50189 47393 67229 415068 368111 -22799 -45246 14846 -7588 -198751
1200 -198751 26381 139067 31034 335558 314804 363617 219656 420986 505586 98437
1190 98437 167606 217111 218017 262501 191964 59176 120127 110504 -66705 -117299 -31958 221410
$$ packed form
1265D2739J66867P9911k96654l2338m570j09726J80208j84949K60142J4401L2864
1254A48895Q8177m7952j07897r6991j4341O2372m6404K61116k3119j73585L753
1243E4024j34519J03224k04197L72029j39996j77368j44030L25464l0625K12962
1233B36968j4259q0324K15033p832j63343k32558N3827o4039O6946K8835j8786
1222B0468P3801L8100R5000P3158O0369k2068n0493n7300k5021j88017k06490
1211a88493P0149J68533k796J9836L47839m6957l90910k2447O0092k2434j91163
1200a98751K25132J12686j08033L04524k0754M8813j43961K01330Q4600m07149
1190I8437O9169M9505R06M4484p0537j32788O0951r623j77209n0594Q5341K53368
$$ plain form
1178 221410 492025 241530 71831 -14351 286519 123977 289670 174170 68965 -75787
1168 -75787 -226169 -168782 -98405 154070 17428 88110 69138 -60104 22935 8551 -248203
1157 -248203 -100626 57231 26345 225161 392550 296281 68923 114084 114793 -98703 -102307
1146 -102307 -146179 168390 38336 -5232 237726 344452 241307 60602 -189299 36819
1136 36819 -56503 200991 357921 141834 84228 81278 256392 345090 227347 429145 280547
1125 280547 310730 -1158 -119147 166408 157710 384761 606202 271630 245358 115294
1115 115294 -54324 124937 454519 536429 79213 76971 263332 233631 166350 189516 100056
1104 100056 -2019 -153637 -134984 86964 203735 153322 -9357 -133109 -59476 -25690
$$ packed form
1178B21410K70615k50495j69699q6182L00870j62542J65693j15500j05205j44752
1168g5787j50382N7387P0377K52475j36642P0682j8972j29242Q3039j4384k56754
1157b48203J47577J57857l0886J98816J67389r6269k27358M5161P09k13496l604
1146a02307m3872L14569j30054m3568K42958J06726j03145j80705k49901K26118
1136C6819r3322K57494J56930k16087n7606k950J75114Q8698j17743K01798j48598
1125B80547L0183l11888j17989K85555q698K27051K21441l34572k6272j30064
1115A15294j69618J79261L29582Q1910m57216k242J86361k9701o7281K3166q9460
1104A00056j02075j51618J8653K21948J16771n0413j62679j23752P3633L3786
$$ plain form
1094 -25690 -162711 -148498 64888 146805 252125 307060 328324 298996 246837 -62184 -167049
1083 -167049 -236829 -39196 90075 106687 184945 199031 50050 42358 13741 -240907 85064
1072 85064 428617 80446 -85179 432591 584896 318105 189560 197945 207661 46935 180067
1061 180067 300496 149185 -110105 48188 -29833 40045 86049 143266 136697 54272 -104226
1050 -104226 -79877 -83637 -9221 25721 81671 210602 160372 128735 -64978 86817 -150023
1039 -150023 -214640 55903 -60124 95722 139609 84008 -63761 -353992 -79110 271145
1029 271145 26838 121492 49850 152769 8049 -243108 -205433 -214058 -175903 -142259 -32586
1018 -32586 145695 274070 38326 -200289 -337767 -74059 -46481 67299 126546 146279
$$ packed form
1094b5690j37021J4213K13386Q1917J05320N4935K1264k9328n2159l09021j04865
1083a67049o9780J97633J29271J6612P8258J4086j48981p692k8617k54648L25971
1072H5064L43553l48171j65625N17770J52305k66791j28545Q385R716j60726J33132
1061A80067J20429j51311k59290J58293p8021O9878M6004N7217o569q2425j58498
1050a04226K4349l760P4416L4942N5950J28931n0230l1637j93713J51795k36840
1039a50023o4617K70543j16027J55846M3887n5601j47769k90231K74882L50255
1029B71145k44307R4654p1642J02919j44720k51157L7675q625L8155L3644J09673
1018c2586J78281J28375k35744k38615j37478K63708K7578J13780N9247J9733
$$ plain form
1008 146279 270442 100278 -71235 10142 28820 551763 547529 258656 264302 138304 29834
997 29834 -181980 -108889 114023 79956 -39412 102343 192796 77956 286842 -60141 -162821
986 -162821 -33662 188288 321064 -18563 -108090 194243 -40618 -121785 -120456 -132530 73505
975 73505 169509 45808 67336 236726 62403 129521 192102 -2518 100573 369571 449585
964 449585 457428 192884 56621 88719 -53323 154899 297389 99986 -32935 -120475 -46710
953 -46710 21399 -37117 24374 91800 160529 217305 13815 147265 -98378 201086 182995
942 182995 169994 161583 296784 344504 223383 252992 277352 -50794 -141309 -211475 -239632
931 -239632 189813 102226 -44956 -117214 39527 284724 174365 167828 185513 -10952 87204
$$ packed form
1008A46279J24163j70164j71513Q1377J8678N22943m234k88873N646j25998j08470
997B9834k11814P3091K22912l4067j19368J41755R0453j14840K08886l46983j02680
986a62821J29159K21950J32776l39627q9527L02333k34861q1167J329j2074K06035
975G3505R6004j23701K1528J69390j74323O7118O2581j94620J03091K68998Q0014
964D49585P843k64544j36263L2098j42042K08222J42490j97403j32921q7540P3765
953d6710O8109n8516O1491O7426O8729N6776k03490J33450k45643K99464j8091
942A82995j3001q411J35201M7720j21121K9609K4360l28146r0515p0166k8157
931b39632M29445q7587j47182p2258J56741K45197j10359o537J7685j96465R8156
$$ plain form
920 87204 103348 -25411 -11776 79509 239742 319497 35355 160226 105797 158739 -27329
909 -27329 179637 218143 243850 216812 18268 -19664 95976 139755 89792 -23425 79454
$$ packed form
920H7204J6144j28759J3635R1285J60233P9755k84142J24871n4429N2942j86068
909b7329K06966L8506K5707k7038j98544l7932J15640M3779m9963j13217J02879
$$ [...]
##END NTUPLES=NMR SPECTRUM
##END=
