##TITLE=1H_DE-80H_X3
 200.13MHz, d2o
 8 sc
 
 19ns.26.2.2025
##JCAMPDX= 6.0         $$ Bruker NMR JCAMP-DX V2.0
##DATA TYPE= NMR SPECTRUM
##DATA CLASS= NTUPLES
##ORIGIN= UXNMR, Bruker Analytische Messtechnik GmbH
##OWNER= pz
$$ XWIN-NMR		Version 3.5
$$ Tue Jun 24 11:58:33 2025 Russian Standard Time (UT+4h)  Yarkov@DPX200
##.OBSERVE FREQUENCY= 200.1313
##.OBSERVE NUCLEUS= ^1H
##.ACQUISITION MODE= SIMULTANEOUS
##.ACQUISITION SCHEME= undefined
##.AVERAGES= 8
##.DIGITISER RES= 18
##SPECTROMETER/DATA SYSTEM= spect
##.PULSE SEQUENCE= zg30
##.SOLVENT NAME= DMSO
##.SHIFT REFERENCE= (INTERNAL, DMSO, 0, 15.5034)
##AUDIT TRAIL= $$ (NUMBER, WHEN, WHO, WHERE, WHAT)
$$ ##TITLE= Audit trail, XWIN-NMR		Version 3.5
$$ ##JCAMPDX= 5.01
$$ ##ORIGIN= Bruker BioSpin GmbH
$$ ##OWNER= Yarkov
$$ C:/Bruker/XWIN-NMR/data/yarkov2/nmr/H-C/1/pdata/1/auditp.txt
$$ ##AUDIT TRAIL=  $$ (NUMBER, WHEN, WHO, WHERE, WHAT)
(   1,<2025-06-24 11:57:13.96 +0400>,<Yarkov>,<DPX200>,
      <created by zg, POWCHK disabled, PULCHK disabled
       configuration hash MD5:
       00 E9 B6 7A A2 85 ED C7 34 08 36 98 17 FE 4E 26
       data hash MD5: 16K
       36 9F BA 75 EE A2 96 E0 4A 5D 6F 6E CF E2 CC AB>)
(   2,<2025-06-24 11:57:19.14 +0400>,<Yarkov>,<DPX200>,
      <Start of raw data processing
       efp BC_mod = 2 LB = 0.25 FT_mod = 6 PKNL = 1 PHC0 = -1713.766 PHC1 = 10.1666 SI = 16K 
       data hash MD5: 16K
       47 14 1B 93 30 AA 82 8A 6A 19 C4 48 05 69 86 1E>)
(   3,<2025-06-24 11:57:25.00 +0400>,<Yarkov>,<DPX200>,
      <abs ABSG = 5 
       data hash MD5: 16K
       07 A9 A0 E5 81 BE 6E EF 75 2B F4 F5 9E E2 B3 F6>)
$$ ##END=
$$ 
$$ hash MD5
$$ 5B C0 79 EC 06 01 CC 07 AE 8A 51 69 E4 C2 6F BB
##$RELAX= 
##$RELAX= 
##$RELAX= 
##$RELAX= 
##$RELAX= 
##$RELAX= 
$$ Bruker specific parameters
$$ --------------------------
##$DU= <C:/Bruker/XWIN-NMR>
##$EXPNO= 1
##$NAME= <H-C>
##$PROCNO= 1
##$TYPE= <nmr>
##$USER= <yarkov2>
##$AMP= (0..31)
100 100 100 100 100 100 100 100 100 100 100 100 100 100 100 100 100 100 
100 100 100 100 100 100 100 100 100 100 100 100 100 100 
##$AQSEQ= 0
##$AQ_mod= 1
##$AUNM= <au_zg>
##$AUTOPOS= <>
##$BF1= 200.13
##$BF2= 200.13
##$BF3= 200.13
##$BF4= 200.13
##$BF5= 200.13
##$BF6= 200.13
##$BF7= 200.13
##$BF8= 200.13
##$BYTORDA= 1
##$CFDGTYP= 0
##$CFRGTYP= 5
##$CHEMSTR= <none>
##$CNST= (0..31)
1 1 145 1 1 1 1 1 1 1 1 1 1 1 1 1 1 1 1 1 1 1 1 1 1 1 1 1 1 1 1 1 
##$CPDPRG= <>
##$CPDPRG1= <>
##$CPDPRG2= <>
##$CPDPRG3= <>
##$CPDPRG4= <mlev>
##$CPDPRG5= <mlev>
##$CPDPRG6= <mlev>
##$CPDPRG7= <mlev>
##$CPDPRG8= <mlev>
##$CPDPRGB= <>
##$CPDPRGT= <>
##$D= (0..31)
0 0.7 0 0 0 0 0 0 0 0 0 0.03 0 0 0 0 0 0 0 0 0 0 0 0 0 0 0 0 0 0 0 0 
##$DATE= 1750751833
##$DBL= (0..7)
120 120 120 120 120 120 120 120 
##$DBP= (0..7)
150 150 150 150 150 150 150 150 
##$DBP07= 0
##$DBPNAM0= <>
##$DBPNAM1= <>
##$DBPNAM2= <>
##$DBPNAM3= <>
##$DBPNAM4= <>
##$DBPNAM5= <>
##$DBPNAM6= <>
##$DBPNAM7= <>
##$DBPOAL= (0..7)
0.5 0.5 0.5 0.5 0.5 0.5 0.5 0.5 
##$DBPOFFS= (0..7)
0 0 0 0 0 0 0 0 
##$DE= 6
$$ [...]
##$SUBNAM3= <"">
##$SUBNAM4= <"">
##$SUBNAM5= <"">
##$SUBNAM6= <"">
##$SUBNAM7= <"">
##$SUBNAM8= <"">
##$SUBNAM9= <"">
##$SW= 18.0517328524113
##$SWIBOX= (0..15)
0 0 2 0 0 0 0 0 0 0 0 0 0 0 0 0 
##$SW_h= 3612.71676300578
##$TD= 16384
##$TD0= 1
##$TE= 0
##$TE2= 300
##$TE3= 300
##$TEG= 300
##$TL= (0..7)
0 120 120 120 120 120 120 120 
##$TP= (0..7)
150 150 150 150 150 150 150 150 
##$TP07= 0
##$TPNAME0= <>
##$TPNAME1= <>
##$TPNAME2= <>
##$TPNAME3= <>
##$TPNAME4= <>
##$TPNAME5= <>
##$TPNAME6= <>
##$TPNAME7= <>
##$TPOAL= (0..7)
0.5 0.5 0.5 0.5 0.5 0.5 0.5 0.5 
##$TPOFFS= (0..7)
0 0 0 0 0 0 0 0 
##$TUNHIN= 0
##$TUNHOUT= 0
##$TUNXOUT= 0
##$USERA1= <user>
##$USERA2= <user>
##$USERA3= <user>
##$USERA4= <user>
##$USERA5= <user>
##$V9= 5
##$VALIST= <valist>
##$VCLIST= <CCCCCCCCCCCCCCC>
##$VD= 0
##$VDLIST= <DDDDDDDDDDDDDDD>
##$VPLIST= <PPPPPPPPPPPPPPP>
##$VTLIST= <TTTTTTTTTTTTTTT>
##$WBST= 1024
##$WBSW= 4
##$XGAIN= (0..3)
0 0 0 0 
##$XL= 0
##$YL= 0
##$YMAX_a= 115570
##$YMIN_a= -99642
##$ZGOPTNS= <>
##$ZL1= 120
##$ZL2= 120
##$ZL3= 120
##$ZL4= 120
##$ABSF1= 15.49348
##$ABSF2= -2.55837
##$ABSG= 5
##$ABSL= 3
##$ALPHA= 0
##$AQORDER= 0
##$ASSFAC= 0
##$ASSFACI= 0
##$ASSFACX= 0
##$ASSWID= 0
##$AUNMP= <proc_1d>
##$AZFE= 0.1
##$AZFW= 0.1
##$BCFW= 0
##$BC_mod= 2
##$BYTORDP= 0
##$COROFFS= 0
##$CY= -3
##$DATMOD= 1
##$DC= 0
##$DFILT= <>
##$DTYPP= 0
##$F1P= 0
##$F2P= 0
##$FCOR= 1
##$FTSIZE= 16384
##$FT_mod= 6
##$GAMMA= 0
##$GB= 0
##$INTBC= 1
##$INTSCL= 3.241238e-09
##$ISEN= 128
##$LB= 0.25
##$LEV0= 0
##$LPBIN= 0
##$MAXI= 10000
##$MC2= 0
##$MEAN= 0
##$ME_mod= 0
##$MI= 1.114404
##$NCOEF= 0
##$NC_proc= -8
##$NLEV= 6
##$NOISF1= 3.799351
##$NOISF2= 2.8
##$NSP= 0
##$NTH_PI= 0
##$NZP= 0
##$OFFSET= 15.50339
##$PC= 1
##$PHC0= -1713.766
##$PHC1= 10.1666
##$PH_mod= 1
##$PKNL= yes
##$PPARMOD= 0
##$PSCAL= 0
##$PSIGN= 0
##$REVERSE= no
##$SF= 200.130003664341
##$SI= 16384
##$SIGF1= 3
##$SIGF2= 2
##$SINO= 0.751879
##$SIOLD= 32768
##$SREGLST= <19F.Aceton>
##$SSB= 0
##$STSI= 16384
##$STSR= 0
##$SW_p= 3612.71676300578
##$SYMM= 0
##$S_DEV= 0
##$TDeff= 16384
##$TDoff= 0
##$TI= <>
##$TILT= no
##$TM1= 0
##$TM2= 0
##$TOPLEV= 0
##$USERP1= <user>
##$USERP2= <user>
##$USERP3= <user>
##$USERP4= <user>
##$USERP5= <user>
##$WDW= 1
##$XDIM= 16384
##$YMAX_p= 321102216
##$YMIN_p= -453298
$$ End of Bruker specific parameters
$$ ---------------------------------
##NTUPLES= NMR SPECTRUM
##VAR_NAME=  FREQUENCY,     SPECTRUM/REAL,   SPECTRUM/IMAG
##SYMBOL=    X,             R,               I
##VAR_TYPE=  INDEPENDENT,   DEPENDENT,       DEPENDENT
##VAR_FORM=  AFFN,          ASDF,            ASDF
##VAR_DIM=   16384,         16384,           16384
##UNITS=     HZ,            ARBITRARY UNITS, ARBITRARY UNITS
##FACTOR=    0.220516191357247, 1,           1
##FIRST=     3102.69355998926, 0,            0
##LAST=      -510.023203016522, 0,           0
##MIN=       -510.023203016522, -453298,     0
##MAX=       3102.69355998926, 321102216,    0
$$ Real data points
##PAGE= N=1
##DATA TABLE= (X++(R..R)), XYDATA
$$ [...]
8545A5837354j038260j015450p33321p53749o35461n74894m60743l92543l14006
8536I918927l12375j73916L8456j50209j84247Q049N9674J97809J82097L03992
8526I888257L79774M38815L79784N82511L42238K03031Q7448j32111l36142l03874
8516A1529731k08138j70348j67262L9739j9376n5456o7329k06660l46990n40871
8506I787040n24089n13674o45814o95305n83739m83976l77798l27029l60681j64735
8496E110200k43438k02061k19760j76825k38337l6069j79967k22973j26410j44942
8486C319418q2706j98136k1578j47147m5554k35585r5006k9936q3612k3412k8489
8475B328257p4534j24904O8251K332q3661k85820Q0375O4712k7183j12596r2599
$$ plain form
8545 15837354 14799094 13783644 13050323 12296574 11661113 11086219 10625476 10232933 9918927
8536 9918927 9606552 9432636 9471092 9320883 9136636 9144685 9204359 9402168 9584265 9888257
8526 9888257 10268031 10706846 11086630 11669141 12011379 12214410 12301858 12169747 11833605 11529731
8516 11529731 11321593 11151245 10983983 11023722 11004346 10948890 10881561 10674901 10327911 9787040
8506 9787040 9262951 8749277 8103463 7408158 6824419 6340443 5962645 5635616 5274935 5110200
8496 5110200 4866762 4664701 4444941 4268116 4029779 3993710 3813743 3590770 3464360 3319418
8486 3319418 3236712 3038576 3016998 2869851 2824297 2588712 2493706 2463770 2380158 2356746 2328257
8475 2328257 2253723 2128819 2197070 2199402 2115741 1829921 1910296 1975008 1947825 1835229 1742630
8464A742630J04262L2144q6807j62353q6447P4335o7129j59236M6596J9279k0370
8453A436904n1680R0394j11546o114O4140p1754O2024j17547R5898J4577o0706
8442A344590j3383k43870Q9752N7982J0481j27496k5132N9999K436K6015M784
8431A186158n718j28095j5249P0172M2111j16796J3080J01941j21001r9290M8387
8420I75700K9334K1279j11808j89786L3442J52927M7280j80137r0139O4078l9694
8409G12476l3517J1567M9434l0395q925K716O6306n4589q3122l820J11342K00142
8397I39615l2829q2203j36831P0282j46853Q5259n0227J6725l938j85862q9696
8386C83442k021O5822J46051J6045m3625O3380l5727J43920l1255q423k0912j29981
$$ plain form
8464 1742630 1846892 1879036 1792229 1629876 1543429 1617764 1550635 1391399 1437995 1457274 1436904
8453 1436904 1385224 1475618 1364072 1357958 1422098 1350344 1412368 1294821 1390719 1405296 1344590
8442 1344590 1331207 1087337 1177089 1235071 1245552 1118056 1092924 1152923 1155359 1181374 1186158
8431 1186158 1180440 1052345 1037096 1107268 1149379 1032583 1045663 1147604 1026603 927313 975700
8420 975700 1005034 1026313 914505 724719 758161 911088 958368 778231 688092 752170 712476
8409 712476 678959 690526 739960 709565 700640 703356 769662 715073 631951 628131 739473 939615
8397 939615 906786 824583 687752 758034 611181 696440 646213 662938 659000 473138 383442
8386 383442 381421 447243 593294 609339 565714 629094 593367 737287 706032 697609 676697 546716
8374E46716K8753J60814K1665n1081p8813q3734J2032K5442j63437J1379J21152
8363E50888o7193j49316P3566j8316j56942J9792J44833K0083K2827l8456J35890
8352E37656o9764r8984L4938P9177j81813M215l1850o8141J44621q2254j13615
8341A54186O4267J79050m774O8022K0510N1914j49226j5344P7602J00447j05084
8330D41570k8994k14907J06330q7668r0253R5110R5575P8756M630j02562j61560
8319A36027J0028m2504J63588Q3783j77668o5843J57922P0984j09562r559o1616
8308A55580N4790k9472R5501N8661j46651n4555r9072O2948R9224m6294O8596
8297B19256R6199j33333J69398k06688k6437m5372l0573K03922Q5989l2410O377
$$ plain form
8374 546716 575469 736283 757948 706867 628054 544320 556352 581794 418357 429736 550888
8363 550888 483695 334379 407945 389629 232687 252479 397312 417395 440222 401766 537656
8352 537656 467892 368908 403846 483023 301210 305425 273575 205434 350055 267801 154186
8341 154186 218453 397503 392729 460751 481261 533175 383949 368605 446207 546654 441570
8330 441570 412576 197669 303999 216331 126078 221188 316763 395519 400149 297587 136027
8319 136027 146055 103551 267139 350922 173254 107411 265333 336317 226755 217196 155580
8308 155580 210370 180898 276399 335060 188409 133854 34782 97730 196954 150660 219256
8297 219256 315455 182122 351520 144832 118395 73023 42450 246372 332361 299951 306328
8286C06328m2731l0745K7232l3570m3560k4921j74253O9993R2380L9173j8080
8275A67246M2224j7884r3056M3973O5814J85659L9203o2044j51167r6963J4670
8264A37675r3893R3468r585m5576j3352k0391M7144l7000J17266j3028M0172K0232
8252B23132n3565m262R4150l2411j09481N0727k5792M1289N6109L5737J2551j11470
8240A76714o3793m3056J07909m808o2109j691j39593K5O6371J08564N3400p7457
8228A20476O7631J29692j25393j00831J71240O5815j30254j41645O1874Q9906
8218B08511n3114j44133K46445R8358j39595o0159r89O2380O3535L5292j89008
8207A27523k2082N4650N834P7959k07708P637K0519j22572J47654q9828K71725
$$ plain form
8286 306328 263597 232852 260084 226514 182954 158033 -16220 53773 146153 185326 167246
8275 167246 209470 191586 98530 142503 208317 393976 433179 371135 219968 123005 137675
8264 137675 43782 137250 127665 82089 68737 48346 95490 58490 175756 162728 202900 223132
8252 223132 169567 165305 259455 227044 117563 168290 142498 183787 239896 275633 288184 176714
8240 176714 112921 69865 177774 172966 110857 109166 -30427 -30402 35969 144533 197933 120476
8228 120476 188107 317799 192406 91575 262815 328630 198376 56731 118605 208511
8218 208511 155397 11264 257709 356067 216472 156313 155324 217704 281239 316531 127523
8207 127523 105441 160091 165925 243884 36176 43813 64332 -58240 89414 -414 271311
8196B71311j22688m3253L20965L80411J030377r64419m06367J58574k56304k9788
8186C38819j95102J67116q7497q9161Q1515J14850j53335Q660o3465q2671q6613
8175d6884R9492K221R8725J34580j3336n2403l1430n4907r1391J2045K33220j8148
8163B71784O32o4614j13912j19683O093M8002k2494J37321j06079j8182Q0581
8152I9449p1631l3507J27835k3627L1717k0606M4980p948j54563J03123j5257
8141G9965q4519J0322M3231K4627O7079Q5842J7463j20372j55966r8005J63411
8130C3078O6880l1499M3972p4840J24736Q6695q1258j33767J9689N7752n6753
8119E4685R6258Q473p6381p564m9970L231N4209l5851r2841Q4757j12209M734
$$ plain form
8196 271311 148623 105370 426335 806746 1837123 872704 466337 624911 368607 338819
8186 338819 143717 310833 223336 134175 215690 330540 177205 185865 122400 39729 -46884
8175 -46884 52608 54829 153554 288134 274798 222395 190965 136058 44667 56712 289932 271784
8163 271784 272416 207802 93890 -25793 -19700 28302 5808 143129 37050 18868 99449
8152 99449 27818 -5689 122146 98519 130236 109630 154610 146662 -7901 95222 79965
8141 79965 -4554 5768 48999 73626 140705 226547 244010 123638 -32328 -130333 33078
8130 33078 99958 68459 112431 37591 162327 249022 167764 33997 53686 111438 54685
8119 54685 150943 159416 83035 75471 25501 28732 82941 47090 -45751 39006 -73203 -68469
8107f8469N8389m7060M6611J71174n9726p9382Q9170M9188j42336N0628M9326
8096A17513K6085k5983L6073O7239m7480j02681m8754j0043n1825J203M6120P585
8084A5052N6105j9367m8660j14469N1723j0150Q9K70923L9817j01406j64512L6726
8072A1871j09496o79J37622J1516j08156J65701J7620m3756J633n530l1185L6275
8060H3436K8266p756p4902k8832K0852J6536r2326n2571n1614M0340J41115J34675
8048A57219q9675r3545O6409N0917o2291k6514J3527J069O630O6722K9381p4661
8036D5188P683k8076k7968p795j07112P3152R5601o5800L7911n5855j2660O7023
8024B1292m9365k8772q4525Q433M1682q3941J58258J3854Q0382j00141J7302J02555
$$ plain form
8107 -68469 -10080 -57140 -10529 160645 100919 21537 110707 159895 17559 68187 117513
8096 117513 143598 117615 153688 220927 173447 70766 22012 11969 -39856 -38653 7467 15052
8084 15052 71157 51790 3130 -111339 -59616 -69766 -69677 201246 241063 139657 -24855 11871
8072 11871 -97625 -98304 39318 50834 -57322 108379 125999 82243 83876 78346 47161 83436
8060 83436 111702 103946 29044 212 21064 37600 -54726 -107297 -158911 -118571 22544 157219
8048 157219 67544 -26001 40408 91325 29034 2520 16047 17116 23746 90468 119849 45188
8036 45188 52871 24795 -3173 -10968 -118080 -44928 50673 -15127 22784 -33071 -45731 21292
8024 21292 -28073 -56845 -141370 -132937 -91255 -175196 -16938 -3084 77298 -22843 -5541 97014
8012I7014j19732j8759M2654M2708Q4263j05889r1897j19338R7569R0679M187
8001C459K8769k13121o645O1059J77412R834l0482k6238N8349n6844j95628q1697
7989b71773P3155J39436n7587L4037J11444J73030j58056J4744M9196n8248n0615
7978a237j68228R0932L995L2698J70738P3154k7983j53038K5129K0720J537j25182
7966e6765j3583O9813l9854m1663J09700j7350p8059O9732j390r8276q9581o063
7954a93339Q8048n0371J6269J88238P0634q5356j66671L698o9679O0018J02906
7943c5605J01492L8047l3825r3311J04453J06667j5586p314j37700r2866o8162
7932a33710n5041R3613J26350K1195j12924j03632L3125j5316K5968J93227K3440
$$ plain form
8012 97014 -22718 -41477 1177 43885 128148 22259 -69638 -188976 -91407 -728 3459
8001 3459 32228 -180893 -187538 -126479 50933 60767 30285 4047 62396 5552 -190076 -271773
7989 -271773 -198618 -59182 -116769 -82732 28712 201742 43686 58430 107626 49378 -1237
7978 -1237 -169465 -78533 -74538 -41840 128898 202052 174069 21031 46160 66880 68417 -56765
7966 -56765 -70348 -535 -40389 -82052 27648 10298 -67761 1971 581 -97695 -187276 -193339
7954 -193339 -105291 -155662 -139393 48845 119479 34123 -132548 -128850 -198529 -138511 -35605
7943 -35605 65887 103934 70109 -23202 81251 187918 172332 165018 27318 -65548 -133710
7932 -133710 -188751 -95138 31212 52407 -60517 -164149 -131024 -146340 -120372 72855 96295
7921I6295q3266m7785m4561P0445j36847M5319K21122o2231j0272j05192J4290
7910d2683M7340j3662r2974j28307J54619J53193o6582q0643J9697K4416m3434
7899f9020R47k3433L8586l3251j08557Q7733k3223l9473J74287m0080l4931P4885
7887D470n0802l8037o7125o760j7172J50611P1996n3007K090j3273J13875o6322
7875C0544l5130N743Q1875r2518q4122q8192j461j975J1896K22001M7230o1764
7863C4127j50992j1031M9804J7974q9457K8031J80750J43713j01566j84052P8537
7852d162J03313J5330m5288M8231N214j6119j0316k0685N3152j86080k4509L6990
7840d4929j0454j57791N6661J35080k6349j33564J44743K46875j02918j15897
$$ plain form
7921 96295 13029 -34756 -79317 -8872 -145719 -100400 120722 58491 48219 -56973 -42683
7910 -42683 4657 -9005 -101979 -230286 -75667 77526 10944 -69699 -50002 -25586 -69020
7899 -69020 -68073 -91506 -52920 -86171 -194728 -106995 -130218 -169691 4596 -35484 -70415 4470
7887 4470 -46332 -84369 -151494 -158254 -175426 -24815 47181 -5826 -3736 -17009 96866 30544
7875 30544 -4586 1157 83032 -9486 -93608 -181800 -183261 -185236 -173340 48661 95891 34127
7863 34127 -116865 -127896 -78092 -60118 -149575 -121544 59206 202919 101353 -82699 -4162
7852 -4162 99151 114481 69193 117424 122638 106519 96203 75518 128670 -57410 -81919 -44929
7840 -44929 -55383 -213174 -156513 -21433 -47782 -181346 -36603 210272 107354 -8543
7830h543K6521J3169M5387k6545N3967n4992Q0468Q9707j40381m8952j34699O6935
7818c7958J4545R0921N9473l3842M6049m9529P218n2508O435r6050n8110L3450
7806f9906J26399o0971o4045M00031l27522n9292O484J4751L7322j7639J7862
7795C474o050J23811n3257m8325j15984J1536o6702N9195J37794N0030p503M7906
7783A35925k229J05767P2709m2115j655j00556j58751K8424m1j01681K07877n7757
7771H5917J8145l6736o835P6608N261m5438j887j6721n7762j05678L0605O7564
7759A3043M9473P7147o2628L1972N9958M976j9177J84651j1082m8980m3711k1153
7747B14489P9808n5204o9423R5643n5111j7528n6832N2737J5458p6697m4951p712
$$ plain form
7830 -8543 17978 31147 76534 49989 103956 48964 129432 219139 78758 29806 -104893 -37958
7818 -37958 -23413 67508 126981 93139 139188 89659 96877 44369 50804 -45246 -103356 -69906
7806 -69906 56493 -4478 -68523 331508 3986 -55306 -48822 -34071 3251 -14388 3474
7795 3474 -2576 121235 67978 19653 -96331 -84795 -151497 -92302 45492 95522 88019 135925
7783 135925 133696 239463 312172 270057 268402 167846 9095 37519 37478 -64203 143674 85917
7771 85917 104062 67326 60491 137099 142360 96922 95035 78314 20552 -85126 -54521 13043
7759 13043 62516 139663 77035 109007 168965 173941 154764 339415 328333 279353 235642 214489
7747 214489 294297 239093 169670 265313 210202 192674 135842 188579 204037 127340 82389 74677
7735G4677l8218l6474o0031J17258J58251m4069M6653r3090M849j21007J6496
7724B5295P4183o6533j8477n1694J09683m9049O0362R9200K4349L9587J25146
7713C72052j21467j97727m9455j76K2794J6839J03501L9974M0390q1415J5480
7702A60790J58412O1253r0628j7246J15330j11337j07925M0314L6342j30350k3506
7691I1449j04760R6292K13661J5718K4345j6002J5205M997l1867R4181Q9179j00389
7679C92009L9142P5607P4528r8551j07344l4509M259r5721J43517P8687K3402
7668D95026j25133j3122J46332K6098p4857L5293o071K7761L18052q4480j07171
7657F37728O0724Q4989k9319J1048K4071m9969J1444j3920J75797l0559M3313
$$ plain form
7735 74677 36459 -15 -60046 57212 215463 171394 218047 124957 129806 8799 25295
7724 25295 99478 32945 14468 -37226 72457 23408 83770 182970 207319 246906 372052
7713 372052 250585 52858 3403 3227 26021 42860 146361 186335 226725 145310 160790
7702 160790 319202 380455 289827 272581 387911 276574 168649 208963 245305 114955 91449
7691 91449 -13311 82981 296642 312360 336705 320703 335908 340905 309038 403219 492398 392009
7679 392009 431151 506758 581286 482735 375391 340882 345141 249420 392937 471624 495026
7668 495026 369893 356771 503103 529201 454344 489637 483566 511327 829379 744899 637728
7657 637728 698452 783441 754122 765170 789241 739272 750716 736796 912593 882034 925347
7646I25347m5869k3895L4623R9459Q4923O4375O6466j8063k6533O3210P2755l1610
7634A265188J08109J08122M3300R0655P4946m9238R9337J48724K19396P7248J21590
7623B307377M330K18412R0226P2552J42313J79129P5613K02052L47681Q4874J74081
7612C898640J37103L01632K84372J20559K39191K84446L34041K85678L17731L77271
7602F580664M81455O55691K74357N46120N72541N24673N72579O95293O79252O71914
7592A2254539P09331O94897O43287P00999P26737P01019O72719N13894N13691
7583A8131113N24245N71706L93044L27585L24613K83720J58089J76461l2683O1388
7573B0919281L24063N4274M728J70300R4257Q1644l4648k97642j59312n6696k49021
$$ plain form
7646 925347 879478 855583 890206 989665 1074588 1138963 1205429 1187366 1160833 1224043 1296798 1265188
7634 1265188 1373297 1481419 1524719 1615374 1690320 1641082 1740419 1889143 2108539 2185787 2307377
7623 2307377 2311707 2530119 2620345 2692897 2835210 3014339 3089952 3292004 3639685 3724559 3898640
7612 3898640 4035743 4337375 4621747 4742306 4981497 5265943 5599984 5885662 6203393 6580664
7602 6580664 7062119 7717810 7992167 8538287 9110828 9635501 10208080 10903373 11582625 12254539
7592 12254539 12963870 13658767 14302054 15003053 15729790 16430809 17103528 17617422 18131113
7583 18131113 18655358 19227064 19620108 19947693 20272306 20556026 20714115 20890576 20857893 20919281
7573 20919281 21243344 21297618 21302346 21472646 21566903 21648547 21613899 21316257 21156945 21100249 20851228
7562B0851228k14957m08569l37776n19591n58326o12354n67273n18359o29915
7553A6484108m79141n78261m92694l63497o23947o19202q10349p65167o02550
7544A1149300n68508n24010m55441l98655m99122m24303m20786l12730k12840
7535G332905l02460k92969j95413m12437k47990j28224j15536k81451k81751p4154
7525E000520k28167j10422j95712j61509k11123q9838j12523j50057l5109k42895
7515C463165q0280K9404j8112l93548k90011J52765p5024p468K2159j29405J46066
7504B819711j69586j76418j02072l8494J02560j09955o7290J9656J9331k5697
7494B271746k613j10633j65294m4735m6440j27896j8154P3096q0666n8181j55446
$$ plain form
7562 20851228 20636271 20227702 19889926 19370335 18812009 18199655 17632382 17114023 16484108
7553 16484108 16004967 15426706 14934012 14570515 13946568 13327366 12517017 11751850 11149300
7544 11149300 10580792 10056782 9601341 9202686 8703564 8279261 7858475 7545745 7332905
7535 7332905 7030445 6737476 6542063 6129626 5881636 5753412 5637876 5356425 5074674 5000520
7525 5000520 4772353 4661931 4466219 4304710 4093587 4003749 3891226 3741169 3706060 3463165
7515 3463165 3382885 3412289 3394177 3000629 2710618 2863383 2788359 2780891 2803050 2673645 2819711
7504 2819711 2650125 2473707 2371635 2333141 2435701 2325746 2258456 2278112 2297443 2271746
7494 2271746 2269133 2158500 1993206 1948471 1902031 1774135 1755981 1829077 1748411 1690230 1534784
7483A534784M8286j2804m2782Q4682p8909M8684n967j68445p2755j08227J8204
7472A244751J1605l8975p3880o9059n28L2733r4980J25005J39003o1325Q8386
7461A302736r0990j72960m8308N5996J4263j00930l3761J00119q0620j02231l7608
7450H05706J26309j17708l7485P4008j08426J9584J4956M3105N5445j36719o5297
7439F73478Q8450l4078Q989n1185p518o0504R8886r149n4458N1847R063K3280
7427G37101k14814j03666Q2616P0295J31107m4404P169j6751k7066l4619j2512
7416E74456o6319m7320J4552l8146J79580j2102n5276k7982m8931m3241J36617
7405E65888R9340j04692L0130j0542J8769j11482j9144J18637l7798M718r8742
$$ plain form
7483 1534784 1583070 1570266 1527484 1612166 1533257 1581941 1575974 1407529 1334774 1226547 1244751
7472 1244751 1256356 1217381 1143501 1074442 1073914 1106647 1011667 1136672 1275675 1214350 1302736
7461 1302736 1211746 1038786 990478 1046474 1060737 959807 926046 1026165 945545 843314 805706
7450 805706 932015 814307 776822 850830 742404 761988 776944 820049 875494 738775 673478
7439 673478 761928 727850 736839 685654 678136 617632 716518 707369 652911 704758 713821 737101
7427 737101 522287 418621 501237 571532 702639 658235 665404 648653 621587 586968 574456
7416 574456 508137 460817 475369 437223 616803 604701 549425 521443 472512 429271 565888
7405 565888 665228 560536 590666 580124 598893 487411 468267 586904 549106 553824 455082
7394D55082p3298Q6852j03197r1929j078J18778L2075r2191J09839J8306j34806
7383C24433j26413o0915l5432J41154n6130N0196N0681J35292p6443j54539O0546
7372B52430O0679j4783J7342K4779K7651Q4266l8799j45494j8437J20592l206
7361C67020m8717j7536p9041j5842o8737R8268P3241q3184K2416J59323j06808
7350C00403j88329L4033m3127J11439j01281J1052K6559j12842N0789J3353P5751
7339A77800j9005r0508R5714N2250m9900k1205j51089P129J57797m5498P7404
7328A90889j22646p8088O7074j21689M1624J4407k330K0553L6855q4412M0125
7317B362q9503j11958K43797n3497j9691o1363O2884J3500j6369J83749r7000
$$ plain form
7394 455082 381784 468636 365439 273510 272432 391210 423285 331094 440933 459239 324433
7383 324433 198020 137105 101673 242827 186697 236893 287574 422866 346423 191884 252430
7372 252430 313109 298326 315668 340447 368098 452364 413565 268071 249634 370226 367020
7361 367020 318303 300767 221726 205884 137147 235415 308656 225472 247888 407211 300403
7350 300403 112074 146107 102980 214419 113138 124190 150749 37907 88696 102049 177800
7339 177800 158795 68287 164001 216251 166351 145146 -5943 1186 158983 113485 190889
7328 190889 68243 -9845 57229 -64460 -22836 -8429 -10759 9794 46649 -37763 2362
7317 2362 -87141 -199099 44698 -8799 -28490 -89853 -26969 -13469 -29838 153911 56911
7306E6911r3526k1868J64781m3214n4146J26170O332j35286n0090J09955J17994
7295A84013J24164j25392j06502j4348l4937n0932J63810L8091r8142J0573Q5444
7284A75842j96249M9300M0864n4976Q0721n208J4411l4325J4225o8625K03164
7273B19144J46257k22742p5851p0207j8427P0501m6274m5616M158Q1747M493p4926
7261b7743J33394R0485p1435l610O1717J3267j01825o2438J17004j64135j35164
7250a50483O2670M4915K9664J50588j01867o6814j01263O3929J28533j06772P6617
7239B9717N1822m8271j587L2324p6482n6189J23949L7483k7647M6803j08286l0736
7227b7100r0812J56159n8075J3693o3983q0000o9525R5863P4012o785j0216n6563
$$ plain form
7306 56911 -36615 -58483 106298 63084 8938 135108 141440 6154 -43936 66019 184013
7295 184013 308177 182785 76283 61935 26998 -23934 139876 177967 79825 90398 175842
7284 175842 -20407 28893 69757 14781 95502 90294 104705 70380 84605 15980 219144
7273 219144 365401 142659 66808 -3399 -21826 48675 2401 -43215 -39057 42690 47183 -27743
7261 -27743 105651 196136 124701 121091 182808 196075 94250 31812 148816 -15319 -150483
7250 -150483 -87813 -42898 -13234 137354 35487 -31327 -132590 -68661 59872 -46900 29717
7239 29717 81539 33268 31681 64005 -12477 -68666 55283 92766 65119 111922 3636 -27100
7227 -27100 -117912 38247 -19828 -6135 -70118 -150118 -219643 -123780 -49768 -56553 -66769 -123332
7215a23332j0390l3587n147r8710K20095m5993r0868o6047J36530M5495l4558
7204a06512m896K0740J15430n4323M5028p4555O7525J01962j10584j79478j10603
7193b90266J90675K0791j29267R5849O3501p6327l6532O5077k851R293N0325L3758
7181e974Q6536n5494M0175p2842j81018J4814J13029P4223k7658o1916j3629Q4825
7169d929l5634j0612q789J59708j02549r9168N3340K2006p6007K8524K995J01591
7157C0476O6085k6217j08666j9186j11121o2478L8654l5002O6267K0917L6150
7146a04121K8392j20715R1721j4063L3899P2007m3047r4129o2206N1487J46726
7135a4049r832j03776M3300O88J49395j97442P9744O440j01463O11p3163M2302
$$ plain form
7215 -123332 -133722 -167309 -172456 -271166 -51071 -97064 -187932 -253979 -117449 -71954 -106512
7204 -106512 -111408 -90668 24762 -29561 15467 -59088 8437 110399 -185 -179663 -290266
7193 -290266 -99591 -78800 -208067 -112218 -48717 -125044 -161576 -96499 -99350 -90057 -39732 -5974
7181 -5974 80562 25068 65243 -7599 -188617 -173803 -60774 13449 -14209 -76125 -89754 -4929
7169 -4929 -40563 -51175 -59964 99744 -2805 -101973 -48633 -26627 -102634 -74110 -71115 30476
7157 30476 96561 70344 -38322 -57508 -168629 -231107 -192453 -227455 -161188 -140271 -104121
7146 -104121 -75729 -196444 -104723 -118786 -84887 -12880 -55927 -150056 -212262 -160775 -14049
7135 -14049 -23881 -127657 -84357 -83669 65726 -131716 -51972 -45532 -146995 -146384 -219547 -177245
7123a77245L1294J47162L1109p5279K4464n8353l0462P1509P6284P767M8232o9766
7111B6716j24811M172j8141K1187P5620l5990N9671j4061K5199M4783j13631j2629
7099f1915r9991j40695J57575J38071R9815j05047k5385k6369M1750j0971K0133
7088a3029m1441l1940R673P1887j05507q5924J47526J1844j3354n4242j06115
7077b10622O3399Q5137J25997r0300k47796J58484J32063j32047r5546N6608L2477
7066a22146j3282o3315j1232O9911M6142n4224k1770J5514j38341J2124J40460
7055a40159r784L3094l5856L8930N1315R734r7944J06050P8510j8353M984L2340
7043E2861o6060j10277M5767L353k5542o0715o1476L9554j4050J78780m7143n0929
$$ plain form
7123 -177245 -145951 1211 32320 -42959 -18495 -76848 -107310 -35801 40483 48250 96482 26716
7111 26716 -98095 -93923 -112064 -90877 -15257 -51247 8424 -5637 19562 64345 -49286 -61915
7099 -61915 -161906 -302601 -145026 -6955 92860 -12187 -37572 -63941 -22191 -33162 -13029
7088 -13029 -54470 -86410 -76737 -4850 -110357 -196281 -48755 -36911 -50265 -104507 -210622
7077 -210622 -147223 -62086 63911 -26389 -274185 -115701 16362 -115685 -211231 -154623 -122146
7066 -122146 -135428 -198743 -209975 -140064 -93922 -148146 -169916 -154402 -292743 -280619 -140159
7055 -140159 -149943 -116849 -152705 -113775 -62460 -52726 -150670 -44620 33890 15537 20521 52861
7043 52861 -13199 -123476 -77709 -74356 -99898 -160613 -222089 -182535 -196585 -17805 -64948 -115877
7031a15877J58522o3085K1073r699r1098j921R3505M2363k3029l4392P4670j4799
7019C6233j55096m6822O919N919N5990k2112j24747n8597Q5105P6017J03110J09392
7007G1311j85318j38436J23378j10585R0695J5778m5333Q7969p1175r1294j0554
6996b63564L3165K9825R0154J14676p3835j68872N575j4107N0729M2266r2116
6985b46104J05495k749m208J03010K6341j772o5723r3344M4735L0903j2524N9888
6973e6052j02045q6322m6828J24052l3076j9674M926p951N8081N0057q4009M4837
6961a54004o3410Q1041k3470N0327P643r1654o6779J02459L7742q603M3493o8666
6949a53881l3581M5554N5854l4199O7235P694k16140r5241L8726N2091L1170L2029
$$ plain form
7031 -115877 42645 -20440 633 -9066 -100164 -102085 -8580 33783 10754 -23638 51032 36233
7019 36233 -118863 -165685 -158766 -152847 -96857 -118969 -243716 -302313 -217208 -141191 -38081 71311
7007 71311 -114007 -252443 -129065 -239650 -148955 -133177 -178510 -90541 -161716 -253010 -263564
6996 -263564 -230399 -200574 -110420 4256 -69579 -238451 -232876 -246983 -196254 -153988 -246104
6985 -246104 -140609 -143358 -147566 -44556 -18215 -19987 -85710 -179054 -134319 -103416 -115940 -56052
6973 -56052 -158097 -244419 -291247 -167195 -200271 -219945 -215019 -222970 -164889 -114832 -198841 -154004
6961 -154004 -217414 -136373 -159843 -109516 -101873 -193527 -260306 -157847 -120105 -128708 -85215 -153881
6949 -153881 -187462 -141908 -86054 -120253 -53018 -45324 -261464 -356705 -317979 -265888 -234718 -202689
6937b02689K1517M9128J03780l8481j23890m8441M7110J1143m0095n5292J07901
6926a68309M9242q6260j00458K00578N044k7246o97k0456j6276L3602j39759J21693
6914a49302J10627j17761L7231j25488O155N2639R2664L3150L0681P026k8270
6903e0648j52899r2863J48946K2182k4069q9269O5562M4983N5283M6547N07j60322
6891a86060j1418j34828R4673N5012L4730R8628N1448j54421n5532L8633o3441
6880b32576P8868L3596J7028j91460l3171k8952L8912m1575R2194J15869j02535
6869b53802j11928N0206M2349O3164Q9320o9124m4565l7411J01913L9533M5679
6858h4666q9801m1667O7416j53501K9139J69333K1000j94265R498j5920k2639
$$ plain form
6937 -202689 -181172 -132044 -28264 -66745 -190635 -239076 -191966 -180823 -220918 -276210 -168309
6926 -168309 -119067 -205327 -305785 -105207 -100163 -127409 -128106 -148562 -164838 -131236 -270995 -149302
6914 -149302 -38675 -156436 -119205 -244693 -238538 -185899 -93235 -60085 -29404 -22378 -50648
6903 -50648 -203547 -296410 -147464 -125282 -149351 -238620 -173058 -128075 -72792 -26245 -25738 -186060
6891 -186060 -197478 -332306 -237633 -182621 -147891 -49263 2185 -152236 -207768 -169135 -232576
6880 -232576 -153708 -120112 -103084 -294544 -327715 -356667 -317755 -359330 -267136 -151267 -253802
6869 -253802 -365730 -315524 -273175 -210011 -120691 -189815 -234380 -271791 -169878 -130345 -84666
6858 -84666 -174467 -216134 -148718 -302219 -273080 -103747 -82747 -277012 -267514 -283434 -306073
6847c06073Q30n854N5534o7667J06112M0271o2436R1795M9801q9528k1193K447
6835b05961k047n8893p578Q1855Q476r2200J24113k9251o3654R0853M4184l0524
6823a40627j48854l260M6193L4143p6158J52758J2956j2150p72j53794R2355N0454
6811a46756j86286N7923l5955K6565N9835p6064L9804o9103M1140P0280Q742k7486
6799b37361M9058l8034k3959j0246j8709M6293K411j03010R4368Q0937J9488m2725
6787a81489L3809m3199r8753k8762n9368L1105J39814J25456q6618j0904j03294
6776b82203K123o4290J19364K4942J6369J25045j39913p0964M3404k3149P708
6765b41564M7823k8255J1941J12955j32193k2049K0004Q7084j14016p5436J3332
$$ plain form
6847 -306073 -305243 -311097 -255563 -323230 -217118 -176847 -239283 -147488 -97687 -187215 -208408 -205961
6835 -205961 -208008 -266901 -274479 -192624 -184148 -276348 -152235 -181486 -245140 -154287 -110103 -140627
6823 -140627 -289481 -292741 -246548 -212405 -288563 -135805 -122849 -134999 -135771 -289565 -197210 -146756
6811 -146756 -333042 -275119 -311074 -284509 -224674 -300738 -260934 -330037 -288897 -218617 -209875 -237361
6799 -237361 -188303 -226337 -250296 -260542 -279251 -232958 -230547 -333557 -239189 -158252 -138764 -181489
6787 -181489 -147680 -190879 -289632 -318394 -377762 -346657 -206843 -81387 -168005 -178909 -282203
6776 -282203 -280080 -344370 -225006 -200064 -183695 -58650 -198563 -269527 -226123 -249272 -241564
6765 -241564 -193741 -221996 -210055 -97100 -229293 -251342 -231338 -144254 -258270 -333706 -320374
6754c20374N4004O1752L1484j09234K9686K5270m6762L971K9507J53894r3667
6743a80469r4845O3634N799J4085n8430r6083k9037K6354o1653Q8993J52443Q8684
6731h0525k0548j49777J62817q9009r3899K6186p6430k8828Q9268J09917L9630
6720a11198N1038r112n3776o8133j46978J18172R886J6697j8433j27224P1525
6709b67536K10656k1654o8023j43149m5165q4581K6854k0059L6544Q5503P453
6698b83157k8546n0938O4910M6809L7877m4719J6177n5290p2643P9656l8227P5396
6686b52695l4143m0831j314O6031L7261n890O88l7465j3901J14128J81468q4979
6674g1642o2447n0217M846O5843k377q4067j00177j3694J0947j2591R8098n81
$$ plain form
6754 -320374 -266370 -204618 -173134 -282368 -252682 -227412 -274174 -270203 -240696 -86802 -180469
6743 -180469 -275314 -211680 -205881 -191796 -250226 -346309 -375346 -348992 -410645 -321652 -169209 -80525
6731 -80525 -101073 -250850 -88033 -177042 -270941 -244755 -321185 -350013 -260745 -150828 -111198
6720 -111198 -60160 -69272 -123048 -191181 -338159 -219987 -210101 -193404 -211837 -339061 -267536
6709 -267536 -56880 -78534 -146557 -289706 -334871 -419452 -392598 -412657 -376113 -290610 -283157
6698 -283157 -311703 -362641 -297731 -250922 -213045 -257764 -241587 -296877 -369520 -289864 -328091 -252695
6686 -252695 -286838 -327669 -328983 -262952 -225691 -231581 -230893 -268358 -282259 -168131 13337 -71642
6674 -71642 -134089 -184306 -179460 -113617 -115994 -200061 -300238 -313932 -302985 -315576 -217478 -218059
6662b18059K2201N809r4633M4243Q9462j13723P4232O8021j04143k0111m8223
6651b94924J94186R3733j18967O9145q9372j30605q756L6653Q4733j4163n2203
6640b30540j6761j6941l428o0514K7876l7363J47255L6289m9322m2969l5406K1923
6628b59901r2161L7850L6894j5702m5258K04134K40l9964o3972j43953O4963q264
6616c25094n1622N2960m5562O0253J10612M3634r2823r1529l1862O7555k5759
6605c29237J05041O310J9421M0995L029Q185q9565N4879l3532J2182K1737Q6380
6593i4175l6592p9997l5822M9125r871r4797J5224j2889q1647J52652n1665p4411
6581c54865k4253R2716J9522j05978P1977J65117j11044l7762K6206o7611J5017
$$ plain form
6662 -218059 -195858 -190049 -284682 -240439 -150977 -264700 -190468 -122447 -226590 -246701 -294924
6651 -294924 -100738 -7005 -125972 -56827 -146199 -276804 -285560 -248907 -164174 -178337 -230540
6640 -230540 -247301 -264242 -267670 -328184 -300308 -337671 -190416 -154127 -203449 -246418 -281824 -259901
6628 -259901 -352062 -314212 -277318 -293020 -338278 -134144 -133904 -173868 -237840 -381793 -316830 -325094
6616 -325094 -376716 -323756 -369318 -309065 -198453 -154819 -247642 -339171 -371033 -303478 -329237
6605 -329237 -224196 -217886 -198465 -157470 -154441 -146256 -235821 -180942 -214474 -202292 -180555 -94175
6593 -94175 -130767 -210764 -246586 -197461 -207332 -302129 -286905 -299794 -381441 -228789 -280454 -354865
6581 -354865 -379118 -286402 -266880 -372858 -300881 -135764 -246808 -284570 -258364 -325975 -310958
6570c10958r772O8445N0712j5624N3332j5050j23594k2190J39834O3991p070N9854
6558f8090n9031k22286j03891K0611J64265k1163O0033j9723Q354q196O2935j2460
6546a98642m4610J04529o0985j09054o8992J25939M5594j20171p5776J08802N96
6535b92770K0347P843N7081J8295j15308N2321p0504j2429M742J53248Q3081j53088
6523b47141N703m0779P2142L8093j3742j06178j9313j0170P1303J92116K2150
6512c5816k22512q8016O9665Q3830O8649j7129j94017P0226n1573m8859k8052
6501c93604Q6045m5585O695J3562O9127J18360p6731K809J3278P8859p402o694
6489a41281o7226j14488J08890n1285O4015L384J0043J15488l081m068O439r491
$$ plain form
6570 -310958 -320730 -252285 -201573 -217197 -163865 -178915 -302509 -324699 -184865 -120874 -127944 -68090
6558 -68090 -127121 -349407 -453298 -432687 -268422 -289585 -229552 -249275 -240921 -249117 -186182 -198642
6546 -198642 -243252 -138723 -199708 -308762 -377754 -251815 -206221 -326392 -402168 -293366 -292770
6535 -292770 -272423 -264580 -207499 -189204 -304512 -252191 -322695 -335124 -330382 -177134 -94053 -247141
6523 -247141 -241438 -282217 -210075 -171982 -185724 -291902 -311215 -321385 -250082 -57966 -35816
6512 -35816 -258328 -346344 -276679 -192849 -124200 -141329 -335346 -265120 -316693 -365552 -393604
6501 -393604 -307559 -353144 -346449 -332887 -263760 -145400 -222131 -219322 -206044 -127185 -134587 -141281
6489 -141281 -208507 -322995 -214105 -265390 -201375 -197991 -187948 -72460 -75541 -79609 -73170 -82661
6477h2661o4230O1850o9004O0198Q4623O2183q6996N1942Q4774l7555N9597q9765
6465C4956q9742M7480M330N7667Q3183q8737j8862j4681q4381j14197K4791J55688
6453b505j34962q4307M5757J17466n7660N2139j31495M3126K08488P8733Q891
6442A43671j22372r8109n4059J01899N8112J06103p0609j07936q0495P1401P2611
6431B0217m9470r2679n9465K52886j04575r8245L1790L5408O1954P3098N2911
6420A23830l3594q2169n5765L3953p3002L4257Q0726r571q0420L6944J7758J22146
6408A15093j8624q6252o334j9186O0395M2521p0450j79158O5410J17402K4865
6397D5682L6020j77109j82050O7065P1830q795N0725L5704J28686J14554o4371
$$ plain form
6477 -82661 -146891 -85041 -154045 -93847 -9224 52959 -34037 17905 102679 65124 124721 34956
6465 34956 -54786 -7306 -2976 54691 137874 49137 30275 15594 -68787 -182984 -158193 -2505
6453 -2505 -137467 -221774 -176017 -58551 -116211 -64072 -195567 -152441 56047 134780 143671
6442 143671 21299 -76810 -130869 -28970 29142 135245 64636 -43300 -123795 -52394 20217
6431 20217 -29253 -121932 -181397 71489 -33086 -131331 -99541 -64133 -2179 70919 123830
6420 123830 90236 8067 -47698 -13745 -86747 -52490 28236 18665 -61755 -24811 -7053 115093
6408 115093 96469 10217 3883 -15303 45092 87613 17163 -161995 -96585 20817 45682
6397 45682 81702 -95407 -277457 -210392 -138562 -147357 -96632 -60928 67758 182312 117941
6386A17941Q479J4652j34609J63966l9078q8843k4184k2500P0097l7586P9786
6375A08121Q863N687k30274N6393Q5326q8054l4164m2663P2167r54Q4856M2817
6363F8121K074N119N1844R839K285m2183r2188P2543m4756L3950l2689r6094K8928
6350c3207Q3078J09551n5388j64376L1820J3550J5049J99414j20075o948l058
6339F9410j14087M1902m0260Q2560j04926p64J59722o9656K0805L049q1470R2186
6327E8471O4013p4520J24245n7544p8289N0555O5684R09N0267p982j60186p2861
6315c7238L5381J22696j1288m4764o668j5225N4764p42R1827m1943k0041l6427
6303I0332j42567r8243P0246J14818K8048Q2442j911l3084r2364Q3077R6049n8939
$$ plain form
6386 117941 126420 141072 6463 170429 131351 42508 18324 -4176 65921 28335 108121
6375 108121 116984 122671 -107603 -51210 34116 -53938 -88102 -130765 -58598 -59552 25304 68121
6363 68121 70195 75314 127158 136997 139282 97099 4911 77454 32698 66648 33959 -62135 -33207
6350 -33207 49871 159422 104034 -60342 -28522 -14972 77 199491 79416 72468 69410
6339 69410 -44677 -2775 -43035 39525 -65401 -66165 93557 23901 44706 47755 -33715 58471
6327 58471 122484 47964 172209 114665 36376 86931 152615 153524 203791 195809 35623 -37238
6315 -37238 -1857 120839 109551 64787 58119 42894 97658 96916 188743 146800 126759 90332
6303 90332 -52235 -150478 -80232 34586 62634 145076 143165 110081 17717 100794 196843 137904
6291A37904r1500l3242R349L1932J36778N3841l1534r480l0767n966p1998N0801
6279A46118L3622J25226m3470k9604K6090L717J4190N6844j28725p4304M0913
6268A70617N7313K3747L2270n8717q724Q4017j77230K7660O7921p5353j3396k2644
6256A07481J88120M5636o7199K0050k6064J24704j4294r9461M5031k0495p344
6245B96165J26674J30457M9716n8430n7655J4014l6169n1732L5427L7947m6307
6234D40107j7817j8701J30179N0995j36348Q9459K9424J08672Q3600K1840K1016
6223H02426o184o3243J44492N1526m3222j04405O5714J05780M7327N5022p711
6212A047522L9674l1279J1243K29987j2167J17273J65184j5931N4483P2775m7206
$$ plain form
6291 137904 46404 13162 22511 54443 191221 245062 213528 204048 173281 167315 95317 146118
6279 146118 179740 304966 261496 231892 257982 261699 275889 332733 204008 129704 170617
6268 170617 227930 251677 283947 225230 216506 300523 123293 150953 218874 143521 130125 107481
6256 107481 295601 341237 274038 294088 268024 392728 378434 278973 324004 303509 296165
6245 296165 422839 553296 603012 544582 486927 500941 464772 413040 448467 486414 440107
6234 440107 422290 403589 533768 584763 448415 537874 567298 675970 759570 781410 802426
6223 802426 796242 732999 877491 929017 885795 781390 847104 952884 1000211 1055233 1047522
6212 1047522 1087196 1055917 1067160 1297147 1284980 1402253 1567437 1551506 1605989 1678764 1631558
6201A631558k3216k9010J14706K57103J7416Q4531O9193P2031P2182J94756K5808
6190B487058R1926J98203J94704J23035K24388K85833K79815K26158P9115L79753
6180D569988L93491L30085J04268K89437M53771L25028L86505M47359M70261M71556
6170H241749J91828L71845L90344K81127K53873L06280J71369K75511L02453J52276
6160A0938655J39203J9648n1933k4590j86798l22988j83417k82595k49844k91298
6150I504043l63950m64740l81912j24784k19345l93435k4232j01571j56735L3294
6140G306633J03949o8160j5942J5832P479m9185M9411K98972J74179J44766J43886
6129H111820L41513M02354K83385L37154L44189M77861L31914M35966N90385N81642
$$ plain form
6201 1631558 1608342 1579332 1694038 1951141 1968557 2053088 2122281 2194312 2266494 2461250 2487058
6190 2487058 2578984 2777187 2971891 3094926 3319314 3605147 3884962 4111120 4190235 4569988
6180 4569988 4963479 5293564 5397832 5687269 6141040 6466068 6852573 7299932 7770193 8241749
6170 8241749 8433577 8805422 9195766 9476893 9730766 10037046 10208415 10483926 10786379 10938655
6160 10938655 11077858 11097506 11045573 11020983 10834185 10511197 10327780 10045185 9795341 9504043
6150 9504043 9140093 8675353 8293441 8168657 7949312 7555877 7531645 7430074 7273339 7306633
6140 7306633 7410582 7342422 7326480 7342312 7349791 7300606 7350017 7648989 7823168 7967934 8111820
6129 8111820 8453333 8855687 9139072 9476226 9820415 10298276 10630190 11066156 11656541 12238183
6119A2238183P99978P38999O01467P64005P30586Q49103P16208O34413O79104
6110A8752046P34014P30072O65972O33155N93792O51577L50294J86769J59948
6101B3457639J25868J46186L581J09073j25802k12129j62859j51063k87911j36724
6091B2765859j44459l70007k58391j35410j39872k47580o7473j97446k04626l4244
6081B0966351q9630p6268n2229p5913q1082j23081r2158J6579N7751R3273j11611
6070B0431982m3434J47934J13905R9767N1319o4213L1865Q6526J38533J29446
6060B1123630J99942N9219j8807J91844J68421j4524m8193N9155J0272J49832
6050B1880791J10415K9977M4666M8106q9096O0730Q9606J4457k3003Q2382J23866
$$ plain form
6119 12238183 13038161 13777160 14378627 15142632 15873218 16722321 17438529 18072942 18752046
6110 18752046 19486060 20216132 20882104 21515259 22109051 22760628 23110922 23297691 23457639
6101 23457639 23583507 23729693 23733274 23842347 23716545 23504416 23341557 23190494 22902583 22765859
6091 22765859 22621400 22251393 21993002 21857592 21717720 21470140 21402667 21205221 21000595 20966351
6081 20966351 20876721 20800453 20748224 20672311 20591229 20468148 20375990 20392569 20450320 20543593 20431982
6070 20431982 20388548 20536482 20650387 20750154 20801473 20737260 20769125 20855651 20994184 21123630
6060 21123630 21323572 21382791 21363984 21555828 21724249 21709725 21661532 21720687 21730959 21880791
6050 21880791 21991206 22021183 22065849 22113955 22024859 22085589 22175195 22189652 22166649 22249031 22372897
6039B2372897J30895O1507P9755J56926n976l0373J7678K49554K12274N6605N1969
6028B3353711N0009L04339J60353J07002q0040P8658J72513J39829P5185R2755
6018B4454314Q4424J0793P7652J44580Q1594N8345Q320J153L033j93812r0041
6007B4640355L5678m9211k10620k23938k37089m12273m94221l82917n23505o25068
5997B1517191m94059o55062n40482p18510o30292n55258n73443n29001m66748
5988A6354336m20027m26116m62784l89295k49634k93325l25724k22273j05557
5979A3459601j69738j71776m0355L1655p9911q8268q0546q3476k09073j46349
5969A2421764j49480j20814j02977k24953k27007m551k9171k43891j51987K1306
$$ plain form
6039 22372897 22503792 22565299 22645054 22801980 22796004 22765631 22783309 23032863 23245137 23301742 23353711
6028 23353711 23403720 23708059 23868412 23975414 23895374 23974032 24146545 24286374 24361559 24454314
6018 24454314 24538738 24549531 24627183 24771763 24853357 24911702 24920022 24921175 24924208 24730396 24640355
6007 24640355 24676033 24626822 24416202 24192264 23955175 23542902 23048681 22665764 22142259 21517191
5997 21517191 21023132 20368070 19827588 19109078 18478786 17923528 17350085 16821084 16354336
5988 16354336 15934309 15508193 15045409 14656114 14406480 14113155 13787431 13565158 13459601
5979 13459601 13289863 13118087 13077732 13109387 13029476 12941208 12860662 12777186 12568113 12421764
5969 12421764 12272284 12151470 12048493 11823540 11596533 11591982 11562811 11318920 11166933 11188239
5959A1188239o3837L0411R0932Q1318Q6625K38599J75794J37454J87864M5973
5949A2199372K41198R9062k0593p0786j39486l17325k59945k54196k69066l40479
5939A0867756m03465l82598m77228k67424l10877j94886j50883j74318k18845
5930H287232k35918j84308K0242j01701j93846j01987p5104j66360M9975j04925
5920G193300O6306l7416k15035J08066q1970j19562q6069j54811q6197k62222
5910F324390k3994j48355o4055k17405k39382l4748l3324j71759l07044j22539
5900D961785j12977j58171q1045j25781j37341j03055o5904k05477j71366j48749
5890C651919j09993k02228n9152m3693j29689m2755q1254r1807m7258q5306j47673
$$ plain form
5959 11188239 11124402 11154813 11245745 11327063 11413688 11652287 11828081 11965535 12153399 12199372
5949 12199372 12440570 12539632 12519039 12448253 12308767 11991442 11731497 11477301 11208235 10867756
5939 10867756 10464291 10081693 9604465 9337041 9026164 8831278 8680395 8506077 8287232
5930 8287232 8051314 7867006 7887248 7785547 7591701 7489714 7414610 7248250 7298225 7193300
5920 7193300 7259606 7222190 7007155 7115221 7033251 6913689 6827620 6672809 6586612 6324390
5910 6324390 6300396 6152041 6087986 5870581 5631199 5596451 5563127 5391368 5084324 4961785
5900 4961785 4848808 4690637 4609592 4483811 4346470 4243415 4177511 3972034 3800668 3651919
5890 3651919 3541926 3339698 3280546 3236853 3107164 3064409 2983155 2891348 2844090 2758784 2611111
5879B611111j2947p9047l2733m5121M104Q7766k18867m3435O3616k16872j1873
5868B105702k1503n3807k55218Q1437o1709o8144j45346J44834k7754K8203n7866
5857A668829p6424J02015j84147k5123M3127O056l1209k5908K5308j68787j2487
5846A321250k01965o2942L5576M0861J16626q7812j0815P3254j4036q8978r879
5835A111140O450N200l8509l8328J78759m8045o1206L3339j44916n5663P5074
5824A023295n3389o8583L7096J36047j08484m5994N88n1626M9212J71505j15641
5813I74026j70867J8023m94J27737j79053N450k4113P2025j47555J27925n0543
5802G52561m7854R6884j36188r0014Q9141J48198p3435m0193j30013K2772M1222
$$ plain form
5879 2611111 2598164 2519117 2486384 2441263 2445367 2533133 2314266 2270831 2334447 2117575 2105702
5868 2105702 2084199 2030392 1775174 1856611 1794902 1726758 1581412 1726246 1698492 1726695 1668829
5857 1668829 1592405 1694420 1510273 1485150 1528277 1534333 1503124 1477216 1502524 1333737 1321250
5846 1321250 1119285 1056343 1091919 1132780 1249406 1161594 1150779 1224033 1209997 1121019 1111140
5835 1111140 1117590 1122790 1084281 1045953 1224712 1176667 1115461 1148800 1003884 948221 1023295
5824 1023295 969906 901323 938419 1074466 965982 919988 920576 868950 918162 1089667 974026
5813 974026 803159 821182 820688 948425 769372 774822 750709 822734 675179 803104 752561
5802 752561 704707 801591 665403 575389 664530 812728 739293 699100 569087 591859 633081
5791F33081K3198j0715l3651J7963l4368k0891L74K9431q9320j27131n2087O7071
5779D02955L1593n9343N8703j5869p4900J87109q0321r5315L0201J50908m2138
5768D93583r7064K5157Q5318q6151o711l7296j29234J21902m7203l2359L0387
5757C20329p413L4939k2439K9817j1617j00085n7824O5508J36552m322q8900M2049
5745C36594l8755O574K5524J6414L4436p926j827q1870O5295l4932j35254M2168
5733B26441M3035M2876K7494N3579R2944m9455m53N6244n6665N5127p2732N5576
5721D74011P0069j05995J48314L7054o3868l4003M5195j03499L570n6075P7461
5710D92234r1013q0317l0150n8177l0818J71310J79689r0943j02677r132L6221
$$ plain form
5791 633081 656279 645564 611913 629876 595508 574617 574991 604422 515102 387971 335884 402955
5779 402955 434548 375205 433908 418039 343139 530248 449927 354612 384813 535721 493583
5768 493583 396519 421676 506994 420843 414132 376836 247602 369504 322301 289942 320329
5757 320329 312916 347855 325416 355233 343616 243531 185707 251215 387767 383445 294545 336594
5745 336594 297839 304413 329937 346351 380787 372861 371034 289164 354459 319527 184273 226441
5733 226441 269476 312352 339846 393425 486369 436914 436461 492705 436040 491167 418435 474011
5721 474011 544080 438085 586399 623453 559585 525582 570777 467278 470848 414773 492234
5710 492234 401221 320904 290754 232577 201759 373069 552758 461815 359138 350006 386227
5699C86227m2361N2764m8042N6204J28643p3837j11003N1546q0873P219K3552
5688C50039N9589J996K7661j480r0689O8432K325J0632N0056j4553j51378l3110
5676B79520J06569o475j29008Q9651K5835Q6909P7645J28383J9344j10126j34387
5665D33860J13333k0462p3294K2546O416J28116l079O679P0446P909m894n7883
5653F29693j02039R1764N7692p3417K230m8518o4709J01195J01528O3104L0558
5642G89081l7328p3725N091j1674N7879O1636M7376j0165l4042n2185r7630k1306
5630F23008M5844o0721K19146l4249k3621J5654L16N6472o9543n5472K04396j07992
5618H13238n9899M1449M3988K6166j4319J69498j10836J8770K7437M564J01237
$$ plain form
5699 386227 343866 396630 348588 404792 533435 459598 348595 400141 319268 326487 350039
5688 350039 409628 411624 439285 437805 347116 415548 417873 428505 478561 464008 312630 279520
5676 279520 386089 379614 250606 340257 366092 453001 530646 659029 678373 568247 433860
5665 433860 547193 526731 453437 475983 482399 610515 607436 614115 684561 692470 687576 629693
5653 629693 527654 619418 677110 603693 605923 557405 492696 593891 695419 758523 789081
5642 789081 751753 678028 683119 671445 729324 790960 838336 828171 794129 741944 644314 623008
5630 623008 668852 608131 827277 793028 769407 785061 785377 841849 772306 716834 921230 813238
5618 813238 753339 794788 838776 864942 850623 1020121 909285 928055 955492 960056 1061293
5607A061293R1324p7211J91738n3890j96406j35356R4182J25499l0076n6721j3295
5596A001081J13000n6075O5230M3027M2512j82239l0018M3318N0592l568k5791
5585A061069k7466n1641J9541J47617P279J7391L6257j46415k9377n1811N857
5574I88301Q0925J02199K5071j40279l0482P6759J21325L3380m4918M7786K9014
5563A289081K3736N0061N7269K7832J20431j67053J44233N8400l5851q317J12986
5552A672808l6255J5585J17618j36077J24664j0858l687J53367k7377L0916Q433
5541A909137n7025P7947J98059Q5759O3808N7600m1284K9853M0634Q5134N894
5530B455516Q5541O8677M4867J28467N6880K7636Q1140K30120J78578R9692j02519
$$ plain form
5607 1061293 1152617 1075406 1267144 1213254 1016848 881492 975674 1101173 1071097 1014376 1001081
5596 1001081 1114081 1058006 1123236 1166263 1208775 1026536 996518 1039836 1090428 1086860 1061069
5585 1061069 1033603 981962 1001503 1149120 1156399 1173790 1210047 1063632 1034255 982444 988301
5574 988301 1069226 1171425 1196496 1056217 1025735 1102494 1223819 1257199 1212281 1260067 1289081
5563 1289081 1312817 1362878 1420147 1447979 1568410 1401357 1545590 1603990 1568139 1559822 1672808
5552 1672808 1636553 1652138 1769756 1633679 1758343 1747485 1743798 1897165 1869788 1900704 1909137
5541 1909137 1852112 1930059 2128118 2213877 2277685 2335285 2294001 2323854 2364488 2449622 2455516
5530 2455516 2541057 2609734 2654601 2783068 2839948 2867584 2948724 3178844 3357422 3457114 3354595
5519C354595n3347L506N1169J54609R7842J82019J01827J30909J66170J68277
5509D357576P57J78698L7044Q7354J03423J98548K64746R9384L00252J22275J03374
5498E853431K24637J26433K35700L88473J58563K07019K14480L80697L84128J92256
5488H365817K59878L38827K56480L48323M32530L15042L90728M27567M51745M03538
5478A1990475N85055M11492M36707P04996O88828N54648P42912Q41508P18612
5469A7675233P70649R76509J130033J106359J109259J251223J296684J401766
5461B6717715J554440J554172J978309K054555K029837K383849K366691K445631
5453D3085199K827035K954334L037502L479761L894357M006999M625237N127196
$$ plain form
5519 3354595 3301248 3304754 3355923 3510532 3608374 3790393 3892220 4023129 4189299 4357576
5509 4357576 4358333 4537031 4574075 4661429 4764852 4963400 5228146 5327530 5627782 5750057 5853431
5498 5853431 6078068 6204501 6440201 6828674 6987237 7194256 7408736 7789433 8173561 8365817
5488 8365817 8625695 8964522 9221002 9569325 10001855 10316897 10707625 11135192 11586937 11990475
5478 11990475 12575530 12987022 13423729 14128725 14817553 15372201 16115113 16956621 17675233
5469 17675233 18445882 19422391 20552424 21658783 22768042 24019265 25315949 26717715
5461 26717715 28272155 29826327 31804636 33859191 35889028 38272877 40639568 43085199
5453 43085199 45912234 48866568 51904070 55383831 59278188 63285187 67910424 73037620
5445G3037620N431296O148877O886114P439507Q201073R009399R905790J0866638
5437A36926314J1918780J3037892J4022533J5493323J6837548J7584287J8513167
5430B44333844J8678253J7965951J6015726J2870137Q425623K812682l163489
5423C17938727q360709j2661164j5320485j6591529j6938355j6415349j5503539
5416B16147597j4328900j3236048j2202813j1363210j0360883r755815q553220
5409A36346708p996029p490309o908805o453510n936526n477042n155288m647172
5401H6282027m340277m050562l762114l371122l297449k972670k776743k697125
5393E9013965k411478k243822j953974k009918j813214j685764j783968j780737
$$ plain form
5445 73037620 78468916 84617793 91503907 98943414 107144487 116153886 126059676 136926314
5437 136926314 148845094 161882986 175905519 191398842 208236390 225820677 244333844
5430 244333844 263012097 280978048 296993774 309863911 318289534 321102216 317938727
5423 317938727 309578018 296916854 281596369 265004840 248066485 231651136 216147597
5416 216147597 201818697 188582649 176379836 165016626 154655743 144899928 136346708
5409 136346708 128350679 120860370 113951565 107498055 101561529 96084487 90929199 86282027
5401 86282027 81941750 77891188 74129074 70757952 67460503 64487833 61711090 59013965
5393 59013965 56602487 54358665 52404691 50394773 48581559 46895795 45111827 43331090
5385D3331090j592132j535059j435911j439025j233063j167066j199583j256021
5377C2473230j023273j006518r52756q04935p43573q66888q15563r10896p06428
5368B4642400o24800p00392o43974n74156n64277o13872l99506m55626m06553
5359A9659244m48429l86100m01612m24738l20589m14856k96521l91027k92443
5350A6282929k32943l89773l83854k53248k11314l85762m04042j76388j55419
5341A3690186m24282m4042j53429k96094k90870l43478j19895j14937l25473j06327
5331A1471359j18333k06230j75527k57311k13561j81957j51938r4248p1118k47277
5321I753859j62931j02235j90399r9252j55583r4371m6530m6175k80246j28339
$$ plain form
5385 43331090 41738958 40203899 38767988 37328963 36095900 34928834 33729251 32473230
5377 32473230 31449957 30443439 29490683 28685748 27942175 27075287 26259724 25348828 24642400
5368 24642400 24017600 23317208 22673234 22099078 21534801 20920929 20521423 20065797 19659244
5359 19659244 19210815 18824715 18423103 17998365 17677776 17262920 16966399 16575372 16282929
5350 16282929 16049986 15660213 15276359 15023111 14811797 14426035 14021993 13845605 13690186
5341 13690186 13265904 13221862 13068433 12772339 12481469 12137991 12018096 11903159 11577686 11471359
5331 11471359 11353026 11146796 10971269 10713958 10500397 10318440 10166502 10072254 10001136 9753859
5321 9753859 9590928 9488693 9298294 9199042 9043459 8949088 8902558 8856383 8576137 8447798
5311H447798l2683l4536n8073j47303n4287o7382j28419j71269o0542j86626l3162
5300G473516k02405j51589q5237Q9378q4925j71011k13231j34524k9373J51478
5290F642077m6792j03744j86032l0481K4005j87412n2478j40427P4189k7167j14061
5279E851677M5927o8967o9615o7596r8832l0193J6412o5666j32405k9592j14416
5268E236734j33566j35310r64O878J6185j18530L1816p4297q4310m7231n329n2067
5256D640009j4505q3470j38450o912J16875r4224k69m956P4135j30357n9874p8711
5244D219291j89193J56315j7793q0057p0011j940r4710J7981O6592N8114l0212
5233D034377P4868J10568j5026J33523M6830n9515O0733K6431R7135j39527K6559
$$ plain form
5311 8447798 8415115 8380579 8322506 8175203 8120916 8053534 7925115 7753846 7693304 7506678 7473516
5300 7473516 7271111 7119522 7034285 7123663 7038738 6867727 6654496 6519972 6490599 6642077
5290 6642077 6595285 6491541 6305509 6275028 6299033 6111621 6059143 5918716 5992905 5965738 5851677
5279 5851677 5897604 5828637 5759022 5691426 5592594 5562401 5578813 5513147 5380742 5351150 5236734
5268 5236734 5103168 4967858 4966894 4973772 4989957 4871427 4903243 4828946 4744636 4697405 4692076 4640009
5256 4640009 4625504 4542034 4403584 4396672 4513547 4419323 4419054 4414098 4488233 4357876 4298002 4219291
5244 4219291 4030098 4186413 4168620 4088563 4018552 4016612 3921902 3939883 4006475 4064589 4034377
5233 4034377 4109245 4219813 4204787 4338310 4385140 4325625 4386358 4412789 4509924 4370397 4396956
5222D396956J48555j24012J81252R4420J76617O4867q776K04536P6202J51230
5212E361847P8857j0754J79432K52684J52974J90857J59474J08045K5551Q7128
5202F586095J60917K65441J73688J69287J09714N5646Q0331J49918K94323N9108
5192H104468O2287J10200q71L18733L0050k2040K1931K6645R1690L7938J55414
5181H936445P1968Q3822K9551Q384n4875m375P2520J19064J57038J9227J69705
5170I608474R6152O850M2217K58149P7848Q827J34478J17307J90358K22390K53519
5159A1016569q260J06923M49030Q2288J11627K46474K12921K05238K47210K17852
5149A2887872M587M7721J82040J45289J36878L27764J18111K2142O0519J32961
$$ plain form
5222 4396956 4545511 4421499 4602751 4697171 4873788 4938655 4929879 5134415 5210617 5361847
5212 5361847 5440704 5429950 5609382 5862066 6015040 6205897 6365371 6473416 6498967 6586095
5202 6586095 6747012 7012453 7186141 7355428 7465142 7520788 7601119 7751037 8045360 8104468
5192 8104468 8166755 8276955 8276084 8594817 8624867 8602827 8624758 8651403 8743093 8781031 8936445
5181 8936445 9008413 9092235 9121786 9130170 9075295 9070920 9143440 9262504 9419542 9438769 9608474
5170 9608474 9704626 9711476 9753693 10011842 10089690 10098517 10232995 10350302 10540660 10763050 11016569
5159 11016569 11008309 11115232 11564262 11646550 11758177 12004651 12217572 12422810 12670020 12887872
5149 12887872 12892459 12940180 13122220 13267509 13404387 13732151 13850262 13872404 13932923 14065884
5139A4065884n8488J41687J20228J1130K1520l8027n8593J63634l4019P0610j48865
5128A4256701k30745j6308o8975L0899j80911m0945r056j582r9912k37570o8805
5117A3332791j04369k6881l2124k1038Q5529p5271p4226m097N3156j9688j44734
5106A2969048j1838P59j6196m6930m5988j53443m467r4788j03395N913j73130
5095A2325545n1559j52416j64899r4478j68856k86381k01804j96902k8421j35760
5085A0844069l62792k39204j60086k16136j61323j57574m08105k04415j67145
5076H767289k67742q3960n0859k14406k66658k33445k18097p8558j45911k13587
5066F994066k12930j9965m6236j48423J6976m7320j84580k6040j11056j82911
$$ plain form
5139 14065884 14007396 14149083 14269311 14280441 14301961 14263934 14205341 14368975 14334956 14405566 14256701
5128 14256701 14025956 14009648 13940673 13971572 13790661 13749716 13740660 13739078 13639166 13401596 13332791
5117 13332791 13228422 13201541 13169417 13148379 13233908 13158637 13084411 13080314 13133470 13113782 12969048
5106 12969048 12957210 12957969 12941773 12894843 12848855 12695412 12690945 12596157 12492762 12498675 12325545
5095 12325545 12273986 12121570 11956671 11862193 11693337 11406956 11205152 11008250 10979829 10844069
5085 10844069 10481277 10242073 10081987 9865851 9704528 9546954 9138849 8934434 8767289
5076 8767289 8499547 8415587 8364728 8150322 7883664 7650219 7432122 7353564 7207653 6994066
5066 6994066 6781136 6761171 6714935 6566512 6583488 6536168 6351588 6325548 6214492 6031581
5056F031581k2871n7996p4278n1850J35710o4536m1398j9667m0555J61780j0485
5045E945435n4452J67321J12596J92816J4626k2623Q1609J61562J01341M2294
5035F742525K2105M1514K70213J09005O0084J26K50731J70721O9730J72778J27605
5024H037137J46752J06255J11673K06753R5739M435J58749K80266P2278q6320
5014I133717L02823L38879o345J7668J56939N2982Q7881J40256j5429m308P9966
5003A0285029K33811J37029J45011R8505L21518J42293J73520Q1501J92783J10131
4993A1921131J68408J67104K13477J61919O6163K17573Q5014K3717J62776J76559
4983A3363841K10368P0641R4706J63017m5868R5372K7576K9888j4036L0501J42528
$$ plain form
5056 6031581 6008710 5950714 5876436 5824586 5960296 5895760 5854362 5834695 5794140 5955920 5945435
5045 5945435 5890983 6058304 6170900 6363716 6378342 6355719 6437328 6598890 6700231 6742525
5035 6742525 6764630 6806144 7076357 7185362 7245446 7245572 7496303 7667024 7736754 7909532 8037137
5024 8037137 8183889 8290144 8401817 8608570 8704309 8708744 8867493 9147759 9220037 9133717
5014 9133717 9436540 9775419 9769074 9786742 9943681 9996663 10084544 10224800 10209371 10205063 10285029
5003 10285029 10518840 10655869 10800880 10899385 11220903 11363196 11536716 11618217 11811000 11921131
4993 11921131 12089539 12256643 12470120 12632039 12698202 12915775 13000789 13024506 13187282 13363841
4983 13363841 13574209 13644850 13739556 13902573 13856705 13952077 13979653 14009541 13995505 14026006 14168534
4972A4168534J6683j3339M3037j17869J3206j2155M0403o0754q0648j15118J09861
4961A3991841J97410p3286j3597J00158J7272p995M9290j8220J46690J46813J01074
4950A4637450J80273n076N0014R2455J55394J88020K59108M15886L38320Q6302
4940A6398146K02527L54209L01922K18014J23067K00847k9075k68074l25488k67811
4930A6908284k90510l89046j46868k05289m6858N6447j4125n4302o0943j38645
4920A5618145j64626j82203j22951j26364n5462j77594k07522j04742j17166j58868
4910A4200647j95749k29232k07975j64671k44960j34788q4023l2376J7410k25099
4900A2699184m2300l0241p7755j51156q7995j55524J03065J26322r2567q3592
$$ plain form
4972 14168534 14185217 14171878 14214915 14097046 14110252 14098097 14138500 14077746 13997098 13881980 13991841
4961 13991841 14189251 14115965 14102368 14202526 14219798 14211803 14261093 14242873 14389563 14536376 14637450
4950 14637450 14817723 14812647 14862661 14955116 15110510 15298530 15557638 15973524 16311844 16398146
4940 16398146 16600673 16954882 17256804 17474818 17597885 17798732 17769657 17501583 17176095 16908284
4930 16908284 16617774 16228728 16081860 15876571 15829713 15886160 15872035 15817733 15756790 15618145
4920 15618145 15453519 15271316 15148365 15022001 14966539 14788945 14581423 14476681 14359515 14200647
4910 14200647 14004898 13775666 13567691 13403020 13158060 13023272 12939249 12906873 12924283 12699184
4900 12699184 12656884 12626643 12548888 12397732 12309737 12154213 12257278 12383600 12291033 12207441
4890A2207441j06970j9560M7768R4277j12247L8891J59254N1944k3328j5398P7916
4879A2399988J58900J08212o0158J05932K38126L01831J12014M9977R0992K67438
4869A3773252K71952K07224J44333J82684K89652J23021J13091m734K56513K42979
4859A5599967J81641J90446J16572J16487K00766L85682L25751K11727L82996
4850A7712035L38465K92547K47302L22499M19265M27756K41229J40775K30778
4841B0372651J70806m4134J78713j8396j41564k7854r3476k99359j68855p7656
4831A9850876j30000j728p0488j48412m679j58634M7735m9401l5841Q0460Q5661
4820A9465549J16872J62600j15363K79765K40359o3048Q4799N1990K9687P4801
$$ plain form
4890 12207441 12100471 12080911 12128679 12222956 12110709 12149600 12308854 12360798 12337470 12322072 12399988
4879 12399988 12558888 12667100 12606942 12712874 12951000 13252831 13364845 13414822 13505814 13773252
4869 13773252 14045204 14252428 14396761 14579445 14869097 14992118 15105209 15100475 15356988 15599967
4859 15599967 15781608 15972054 16088626 16205113 16405879 16791561 17117312 17329039 17712035
4850 17712035 18050500 18343047 18590349 18912848 19332113 19759869 20001098 20141873 20372651
4841 20372651 20543457 20499323 20678036 20659640 20518076 20490222 20396746 20097387 19928532 19850876
4831 19850876 19720876 19719148 19648660 19500248 19495569 19336935 19384670 19335269 19299428 19379888 19465549
4820 19465549 19582421 19745021 19629658 19909423 20149782 20086734 20171533 20223523 20253210 20328011
4810B0328011J90559J44113J8529l8570K2365R3949k9586J59338K14863L3659
4800B1137230K48458K71627K05099J98427L92210M15777L39569L88153K28859
4791B3825409Q8957L5943j27498k86712k57928k08344k04898k15787j81354l58925
4781B2108863l63016l35399n04470l02323k12433k93250m08696k65766l87098
4772A9036412k96329l94816k23391j64964k52349l23732j82428n1221j65406k67470
4762A6714306k38883k84636k07935j17212k10362l31087l05809j06314l48716
4753A4563352l21644j40135l20166j39774j02479k02986r6591k54200j98947j74291
4743A2612139j86449j31064j21919j0748n2464j04957o8524P9366R586N8506q8888
$$ plain form
4810 20328011 20518570 20662683 20681212 20642642 20665007 20758956 20729370 20888708 21103571 21137230
4800 21137230 21385688 21657315 21862414 22060841 22453051 22868828 23208397 23596550 23825409
4791 23825409 23914366 23950309 23822811 23536099 23278171 23069827 22864929 22649142 22467788 22108863
4781 22108863 21745847 21410448 20905978 20603655 20391222 20097972 19689276 19423510 19036412
4772 19036412 18740083 18345267 18121876 17956912 17704563 17380831 17198403 17147182 16981776 16714306
4762 16714306 16475423 16190787 15982852 15865640 15655278 15324191 15018382 14912068 14563352
4753 14563352 14241708 14101573 13781407 13641633 13539154 13336168 13239577 12985377 12786430 12612139
4743 12612139 12425690 12294626 12172707 12161959 12109495 12004538 11936014 12015380 12024966 12083472 11994584
4732A1994584R8986Q830M2650K890J31827K8206J19262K35278L11134K21029J27647
4721A3322323K45645L18944L51276K51793M08809M94841N50271L18274M09073
4712A6671249M34196N54390M68294N58595P15529N46351O42995N83955M99320
4703B1674874M40313N90776N22335O18472O92937P31431N87851M80375N47949
4694B6887313N85328O89734N30283M83135N99333O34685N01981N60293N82725
4685C2054810P45489O16373O75896P01689O54873P72019O36668Q50734Q27274
4676C8535825N90734Q30013Q27076O61040P80397N41406M51823M58857L52659
4667D4029830K19113r293m7243j61700k56521l05586l82252l29177m39983o64303
$$ plain form
4732 11994584 12093570 12102400 12145050 12147940 12279767 12307973 12427235 12662513 12973647 13194676 13322323
4721 13322323 13567968 13886912 14238188 14489981 14898790 15393631 15943902 16262176 16671249
4712 16671249 17105445 17659835 18128129 18686724 19402253 19948604 20591599 21175554 21674874
4703 21674874 22115187 22705963 23228298 23846770 24539707 25271138 25858989 26339364 26887313
4694 26887313 27472641 28162375 28692658 29175793 29775126 30409811 30911792 31472085 32054810
4685 32054810 32800299 33416672 34092568 34794257 35449130 36221149 36857817 37708551 38535825
4676 38535825 39126559 39956572 40783648 41444688 42225085 42766491 43218314 43677171 44029830
4667 44029830 44248943 44239650 44192407 44030707 43774186 43468600 43086348 42757171 42317188 41652885
4657D1652885n77363m19305m85121o10415m69976m96731m55174n53423m56311
4648C7129066n23743m82958k78402l38358n45165m99569m02134l62951m86919
4639C3208867m44479k48130k70280k04516j33502j31270L3415O8022K64092O84826
4629C2827045J073101J200150J574228J672224J337918K03558p83672j735399
4621C7369153k167218j767932j299575q02790o74550j74220K8056J19524N07069
4612C1137517P37730Q82089J224907J553336J819005J933238J696707J694501
4604D2679030J605561J702242J964366K291830K301858K569511K549199J902853
4596E9566450J493700J079719R08063J038459J350309J628343J375501Q40824
$$ plain form
4657 41652885 41075522 40656217 40171096 39560681 39090705 38593974 38138800 37585377 37129066
4648 37129066 36605323 36122365 35843963 35505605 34960440 34460871 34058737 33695786 33208867
4639 33208867 32764388 32516258 32245978 32041462 31907960 31776690 31810105 31878127 32142219 32827045
4629 32827045 33900146 35100296 36674524 38346748 39684666 39888224 39104552 37369153
4621 37369153 35201935 33434003 32134428 31331638 30657088 30482868 30510924 30630448 31137517
4612 31137517 31875247 32757336 33982243 35535579 37354584 39287822 40984529 42679030
4604 42679030 44284591 45986833 47951199 50243029 52544887 55114398 57663597 59566450
4596 59566450 61060150 62139869 63047932 64086391 65436700 67065043 68440544 69281368
4588F9281368L6046q09910j540736j680707j458300j265732r91235j225614j517887
4579E8827293k084003k653230k723143k667367k430008k049903k091140k008705
4571D0119794k139488k228371k315902k327256k116305j787573j746115j497935
4563B3960849j283832j151372r97898j015626r76824r33790q33433p38899o56731
4554A5372444m72447l42099n66707o01356m65051m08763l14442n02227m03149
4545A1296203m37750l68403k63894k33238k52389j95829k81826k00686k31372
4536H830816k30972l06743j13283o5134l53248j42828n2432j55971j86116k89523
4526F934566j45549m4223j35728n5434o4327j50407j53654l2152l01926l5604
$$ plain form
4588 69281368 69317414 68507504 66966768 65286061 63827761 62562029 61570794 60345180 58827293
4579 58827293 56743290 54090060 51366917 48699550 46269542 44219639 42128499 40119794
4571 40119794 37980306 35751935 33436033 31108777 28992472 27204899 25458784 23960849
4563 23960849 22677017 21525645 20527747 19512121 18535297 17601507 16768074 16029175 15372444
4554 15372444 14899997 14557898 13991191 13389835 12924784 12516021 12201579 11699352 11296203
4545 11296203 10858453 10490050 10226156 9992918 9740529 9544700 9262874 9062188 8830816
4536 8830816 8599844 8293101 8179818 8114684 7761436 7618608 7566176 7410205 7224089 6934566
4526 6934566 6789017 6744794 6609066 6553632 6489305 6338898 6185244 6153092 5851166 5815562
4516E815562j00919m2202j38579j36429M8506q5692j55018k18781o7286r6161
4506D823001Q0929r7219j08488l7830q2101m2959N5473m0096j15886p8295j27913
4495D228616k6013j3509q9157j02610p0011l6870j15459J50477m2223q9752m8556
4484C744933j41982J22414k1988n9340K3062n3081p2745j8260o4818k1552M2182
4473C478825j83602n2164Q6782J39362l9796j76138p8362j53836P8519M9983J4123
4462C163696k11380j50364L9098j9435N2109j76476k5440J9805k275J37012n7018
4451B769332L6380M3398j91476j3889K6431l6553J8981k4057M6806k51228k27598
4440B196527m0014M9851l5187J00732K9537j35960j5310M9968O0123r4637j33791
$$ plain form
4516 5815562 5714643 5672441 5533862 5397433 5445939 5360247 5205229 4986448 4919162 4823001
4506 4823001 4903930 4806711 4698223 4660393 4578292 4535333 4590806 4550710 4434824 4356529 4228616
4495 4228616 4202603 4189094 4099937 3997327 3927316 3890446 3774987 3925464 3883241 3793489 3744933
4484 3744933 3602951 3725365 3703377 3644037 3667099 3614018 3541273 3523013 3458195 3436643 3478825
4473 3478825 3295223 3243059 3329841 3469203 3429407 3253269 3174907 3021071 3099590 3149573 3163696
4462 3163696 2952316 2801952 2841050 2821615 2873724 2697248 2671808 2691613 2689338 2826350 2769332
4451 2769332 2805712 2849110 2657634 2643745 2670176 2633623 2652604 2628547 2675353 2424125 2196527
4440 2196527 2156513 2206364 2171177 2271909 2301446 2165486 2150176 2200144 2260267 2165630 2031839
4429B031839N5069q1008j0458J73390J306p3605N672k43306j09262N8203J88967
4418A996807L3042j35753q977R3434N7244j92555L721l4418L0760l9493j7707
4407A786105M3868n2522M4444L5637L2298j50832m2297L267J7188N1626L7519
4396A806301J1083O6603l4370J7319r2786j7291J3340J9917l2497Q124J7121j6221
4384A766643M2417j18794P8939j26718N9340J47297m3325o3690Q2668j22514L4981
4373A737244J56488k2281k0043O440N2616l5502j05344l7661J92420k5041J1381
4362A910717j5198J36466J09115j12980j02285R7386J26587r0649R1917l4800
4352B116276R0330o1593R5549K3193j14004K16123R7917J81466O2324j12869O0904
$$ plain form
4429 2031839 2086908 2005900 1995442 2168832 2170138 2096533 2102205 1858899 1749637 1807840 1996807
4418 1996807 2029849 1894096 1885119 1978553 2035797 1843242 1846963 1812545 1843305 1803812 1786105
4407 1786105 1829973 1777451 1821895 1857532 1889830 1738998 1696701 1699968 1717156 1768782 1806301
4396 1806301 1817384 1883987 1849617 1866936 1774150 1756859 1770199 1790116 1757619 1765743 1782864 1766643
4384 1766643 1809060 1690266 1769205 1642487 1701827 1849124 1805799 1742109 1824777 1702263 1737244
4373 1737244 1893732 1871451 1851408 1857848 1910464 1874962 1769618 1731957 1924377 1899336 1910717
4362 1910717 1895519 2031985 2141100 2028120 1925835 2023221 2149808 2059159 2151076 2116276
4352 2116276 2206606 2145013 2240562 2263755 2149751 2365874 2463791 2645257 2707581 2594712 2655616
4341B655616N3464J29372J51403K16212N9257q9623J71301K47333K37329l3974
4331C797690J12106J81982J46158K35052L26962J06560J59941K45978K53471L90911
4321E956811L96142L28889K29735L84822M26074N58779L52925L89426M96493N41093
4311A0061189L75157M58716N10825N87665N77433M87037N31990O98904O59203
4302A4948119N58465P02206O77414M73777N34717N97180N95568M52231O14096
4293B0153773O95460L39459M23951M93796L38473L32500L07295M42747K19291
4284B3746745K42341K77697L4113K3713j00198q1759R6415j76304k36405k21427
4274B3604931l04185k02439j70200k71064l05978m45064m30303m25224n78139
$$ plain form
4341 2655616 2709080 2838452 2989855 3206067 3265324 3175701 3347002 3594335 3831664 3797690
4331 3797690 3909796 4091778 4237936 4472988 4799950 4906510 5066451 5312429 5565900 5956811
4321 5956811 6352953 6681842 6911577 7296399 7722473 8281252 8634177 9023603 9520096 10061189
4311 10061189 10436346 10895062 11405887 11993552 12570985 13058022 13590012 14288916 14948119
4302 14948119 15506584 16208790 16886204 17359981 17894698 18491878 19087446 19539677 20153773
4293 20153773 20849233 21188692 21612643 22106439 22444912 22777412 23084707 23527454 23746745
4284 23746745 23989086 24266783 24300896 24324609 24224411 24142652 24239067 24062763 23826358 23604931
4274 23604931 23300746 23098307 22928107 22657043 22351065 21906001 21475698 21050474 20472335
4265B0472335l74116n41004l82243m87616o05939m26080n78938n18339m86391
4256A6071669p75546m52666n71835m73524m13732m51543m90281l79413m30245
4247A1632884n00489l67263l75680l94272l86093m16522k44935j42885l87112
4238H417633l82215l90571j09734j59956l61970j63810p6181j00111k97673j97696
4228F177716Q4405j57361j25303p2230j26615j1572O0906O5804L287J3630j4433
4217E898234J57002K21057J62989K22634K20215M58284O89808N56779O28836M18122
4207I633960O2702m85014r45969q72453o29106m54287m27472k19290k54620k35812
4197E172639l00109l13465j89348j13803q4602j35756p6885k9302j40434k05659
$$ plain form
4265 20472335 20098219 19557215 19174972 18687356 18081417 17655337 17076399 16558060 16071669
4256 16071669 15296123 14843457 14271622 13798098 13384366 12932823 12442542 12063129 11632884
4247 11632884 11132395 10765132 10389452 9995180 9609087 9192565 8947630 8804745 8417633
4238 8417633 8035418 7644847 7535113 7375157 7013187 6849377 6773196 6673085 6375412 6177716
4228 6177716 6262121 6104760 5979457 5907227 5780612 5769040 5829946 5895750 5899037 5912667 5898234
4217 5898234 6055236 6276293 6439282 6661916 6882131 7340415 8030223 8587002 9215838 9633960
4207 9633960 9696662 9211648 8265679 7393226 6764120 6309833 5882361 5663071 5408451 5172639
4197 5172639 4872530 4559065 4369717 4255914 4171312 4035556 3958671 3929369 3788935 3583276
4187C583276o0762r5710r8249p0392n4586K9965J6354j9096k08194q7166j7555
4176B917885O9826J19005N5022j11505r6385O1029j86751j0468J06915j8074J3390
4165B919889m5006J15290j0487j40973r0442K3944m9799j22306q1805m7134l714
4154B467457j02453M9289K7992o7148L5805l7731j66871M4403l1123k6425J44387
4143B337582l1167m7357O2615l5375K1809p5611q7440J6900l8786J116J25202
4132B249488k8745L083K6005j3898j67945q5964J39037p754n1071m0351J2963
4121B034848J02190K3047n045R6251O0946J2023M778M9388N4014j80141M0099
4110B292398P9172j6227L3054n8466J05876q3143Q284J02708o266n2700J21181
$$ plain form
4187 3583276 3522514 3426804 3328555 3258163 3203577 3233542 3249896 3230800 3022606 2935440 2917885
4176 2917885 2987711 3106716 3161738 3050233 2953848 3014877 2828126 2817658 2924573 2906499 2919889
4165 2919889 2874883 2990173 2979686 2838713 2748271 2772215 2722416 2600110 2518305 2471171 2467457
4154 2467457 2365004 2414293 2442285 2375137 2410942 2373211 2206340 2250743 2219620 2193195 2337582
4143 2337582 2306415 2259058 2321673 2286298 2308107 2232496 2145056 2161956 2123170 2124286 2249488
4132 2249488 2220743 2223826 2249831 2235933 2067988 1982024 2121061 2113307 2062236 2021885 2034848
4121 2034848 2137038 2160085 2155040 2251291 2312237 2324260 2329038 2378426 2432440 2252299 2292398
4110 2292398 2371570 2355343 2388397 2329931 2435807 2352664 2360948 2463656 2457390 2404690 2525871
4099B525871J07904J41259N8365m986k2791o9555L6837O4887N3354L1148J00912
4088C023205J20173P9969O7153J84174J16068J05196L7526O7518Q3617k7944J97258
4077D053913K49164J70210K29285J48814Q8226J59206L45172J56625K34491M08531
4067F243637L13311M08888L54689L71268N51075L99193O19545P74455P55393R23541
4057A1714995J058133J405162J473119J492996J364280R16891L65255n75798r99434
4048A8215599q55896p93745m36205m18310k07650p2233K05892J34064J42832R9608
4038A6013956J31101Q5011K45574J72352J74382L05877L46189L14773K60727J42356
4028A8192298J37768L72892L23538L04276J95427K21035L68475M71370M80959
$$ plain form
4099 2525871 2633775 2775034 2833399 2828413 2805622 2736067 2772904 2837791 2891145 2922293 3023205
4088 3023205 3143378 3223347 3290500 3474674 3590742 3695938 3733464 3800982 3884599 3856655 4053913
4077 4053913 4303077 4473287 4702572 4851386 4939612 5098818 5443990 5600615 5835106 6243637
4067 6243637 6556948 6965836 7320525 7691793 8242868 8642061 9261606 10036061 10791454 11714995
4057 11714995 12773128 14178290 15651409 17144405 18508685 19425576 19790831 19215033 18215599
4048 18215599 17359703 16565958 16129753 15711443 15503793 15431560 15637452 15771516 15914348 16013956
4038 16013956 16145057 16230068 16475642 16647994 16822376 17128253 17474442 17789215 18049942 18192298
4028 18192298 18330066 18702958 19026496 19330772 19526199 19747234 20115709 20587079 21068038
4019B1068038M84933M26793M52450L84867N52676M82393N01824N44384N78157
4010B5476515M97100M92297O16692N02701M35696M65859K97180M43640O84473
4001B9912153L87365K29026L37252M25706O48356K70659N15381N87241N45286
3992C3858425N61152N21356P21840N68420O25365P22302P02182O06363P89289
3983C9676694Q36683O03480Q95417O68316N59988Q63381O62806P06919N85351
3974D6059035M17247N56721O20986N85253N42456M34374L43259L66280N18644
3965E0444255N33387L06673L83424L80948K34008L99140L65624K95360K36170
3956E3578989L44173J79225J96240L48455K11860k9664J48494M09572J0580m8508
$$ plain form
4019 21068038 21552971 21979764 22432214 22817081 23369757 23852150 24353974 24898358 25476515
4010 25476515 25973615 26465912 27082604 27585305 28021001 28486860 28784040 29227680 29912153
4001 29912153 30299518 30528544 30865796 31291502 31939858 32210517 32725898 33313139 33858425
3992 33858425 34419577 34940933 35662773 36231193 36856558 37578860 38281042 38887405 39676694
3983 39676694 40513377 41116857 42012274 42680590 43240578 44103959 44766765 45473684 46059035
3974 46059035 46476282 47033003 47653989 48239242 48781698 49216072 49559331 49925611 50444255
3965 50444255 50977642 51284315 51667739 52048687 52282695 52681835 53047459 53342819 53578989
3956 53578989 53923162 54102387 54298627 54647082 54858942 54829278 54977772 55387344 55397924 55349416
3946E5349416P1956j20883l7208j8991M5245l6327k67138j13060k45174l75506
3936E4252330l86881m14336m97334m76091m93790n81914n28260o89458n19305
3927D9664961m90387m88590m68987n66538m05728k87881k46398k61885k96844
3918D6151723n5145j46241n6895Q4344J05266N2537P4016L19692L17225K98534
3908D7145056K89614M07760L89624M73031K13241K45650L71010L73138L64615
3899E0272739K12652K14745L73769J53296K27346N1674J22513J06158J28352J1898
3889E1875142k8034J27111o5405l144J0515j33985j51013k3198q1117k38011k14903
3878E1073958j96636k43853m02444l76637k63973k72350n70402m89495n10705
$$ plain form
3946 55349416 55421372 55300489 55263281 55244290 55289535 55253208 54986070 54873010 54627836 54252330
3936 54252330 53865449 53451113 52953779 52477688 51983898 51401984 50873724 50184266 49664961
3927 49664961 49174574 48685984 48216997 47650459 47244731 46956850 46710452 46448567 46151723
3918 46151723 46096578 45950337 45893442 45977786 46083052 46135589 46209605 46529297 46846522 47145056
3908 47145056 47434670 47842430 48232054 48705085 48918326 49163976 49534986 49908124 50272739
3899 50272739 50485391 50700136 51073905 51227201 51454547 51506221 51628734 51734892 51863244 51875142
3889 51875142 51847108 51974219 51908814 51905670 51916185 51782200 51631187 51607989 51526872 51288861 51073958
3878 51073958 50877322 50633469 50231025 49854388 49590415 49318065 48747663 48258168 47747463
3869D7747463o57545n24157n87928o20979p08820o35564n80736p00558q82933
3860D1848243p94786n88779o83966q72925r88470r74083r38392j087609r33373
3851C3985860r72451j019014j027604j064237r19374p17724r20902q66967q78985
3842B5598602o60102o96763p45777p86437o55280l48601n33366m93082l36073
3833B0343121m60473k78421k89267k55743k35630k92317l06005l0673l9718o7451
3823A8087423k37792j38864m6278N430j12850j40588p7714l0827p370r5769r1293
3812A7113508k00006j62237j01744q3540j48761J3435k04099j40401k27536j35604
3802A5723015L5911o0708p4321j34783r8304N8699o7068n6843r8813K5945P7839
$$ plain form
3869 47747463 47089918 46565761 45977833 45356854 44648034 44012470 43431734 42731176 41848243
3860 41848243 41053457 40464678 39780712 38907787 37919317 36945234 36006842 34919233 33985860
3851 33985860 33013409 31994395 30966791 29902554 28983180 28265456 27344554 26477587 25598602
3842 25598602 24938500 24241737 23495960 22709523 22054243 21705642 21172276 20679194 20343121
3833 20343121 19882648 19604227 19314960 19059217 18823587 18531270 18225265 18194592 18154874 18087423
3823 18087423 17849631 17710767 17664489 17669919 17557069 17416481 17338767 17307940 17300570 17204801 17113508
3812 17113508 16913502 16751265 16649521 16565981 16417220 16430655 16226556 16086155 15858619 15723015
3802 15723015 15758926 15698218 15623897 15489114 15390810 15449509 15382441 15325598 15226785 15252730 15330569
3791A5330569M0173N9718O5610K12904K55224K34472J17130P4107K00181M17377
3781A7007465L51821L68582K72418J21855K59573K12405J34566J37523K22468
3772A9088676J07126m1303J36288j90757q3082k05805j77153j17800j82631q9321
3762A8244238o5882q1819k01577o2617J48223R2474K555J06307J22753P6822J03124
3751A8484601K78142J15705K50682K41962J80924K14890M72629L29320M35529
3742B1004384N76825O30789O23776O39050P44024P43426Q33764Q87751J019129
3733B7702918J132008J111995J166123J256875J199526J258223J364872J309884
3725C7502424J273550J274197J299869J163797J125227J162776J166195J054099
$$ plain form
3791 15330569 15370742 15430460 15496070 15708974 15964198 16198670 16315800 16389907 16590088 17007465
3781 17007465 17359286 17727868 18000286 18122141 18381714 18594119 18728685 18866208 19088676
3772 19088676 19195802 19154499 19290787 19100030 19016948 18811143 18633990 18516190 18333559 18244238
3762 18244238 18178356 18096537 17894960 17832343 17980566 18073040 18075595 18181902 18304655 18381477 18484601
3751 18484601 18762743 18878448 19129130 19371092 19552016 19766906 20239535 20568855 21004384
3742 21004384 21581209 22211998 22835774 23474824 24218848 24962274 25796038 26683789 27702918
3733 27702918 28834926 29946921 31113044 32369919 33569445 34827668 36192540 37502424
3725 37502424 38775974 40050171 41350040 42513837 43639064 44801840 45968035 47022134
3717D7022134J047269R90685R58857J044719J217917J165208J031705J210964
3709E5689458J349165J331543J524565J546843J513385J490238J496039J387631
3701F7328867J284943J063933P94218N17901N15789K29328j38065m35241o76598
3692G0485075q33939j149477j327060j349754j490823j598340j670148j449918
3684E9615616j508846j542524j448086j206083r01101j216381r72630q09295p60044
3675D9250626p38777n57923n50046n57956k87475m08975m24508m44912n20323
3666D4759731m33291o07430o81187p12984o39719p54004q23183q77283j016066
3657C8214584j107616q66442q65513j060139r48130r82668j021648q68791r10346
$$ plain form
3717 47022134 48069403 49060088 50018945 51063664 52281581 53446789 54478494 55689458
3709 55689458 57038623 58370166 59894731 61441574 62954959 64445197 65941236 67328867
3701 67328867 68613810 69677743 70471961 70989862 71505651 71734979 71596914 71161673 70485075
3692 70485075 69651136 68501659 67174599 65824845 64334022 62735682 61065534 59615616
3684 59615616 58106770 56564246 55116160 53910077 53008976 51792595 50819965 50010670 49250626
3675 49250626 48511849 47953926 47403880 46845924 46558449 46149474 45724966 45280054 44759731
3666 44759731 44326440 43719010 43037823 42324839 41685120 40931116 40107933 39230650 38214584
3657 38214584 37106968 36240526 35375013 34314874 33366744 32384076 31362428 30493637 29583291
3648B9583291q61361p59821p41587p34079n32000n44312m49341p10724m27028
3639B3823038l64444m47694m79184n42087l67826l18187k72522j42934k18095
3630B0670065l00378j69095j42509K9962r5028k06580K067P0177r869k2681J4852
3619A9840983J00339K57703l7963K1204O7918j51410k6325k42675j47908m3667
3609A9638199m24080l26014k55138l93468l40364m97548m07036l17193l46984
3600A6330374m67083m13074l12690m42950l16165l60883l84921l43235k92593
3591A2996780l05015j67270k67221j05631r2718k31161k62084k54777j21574j90244
3581A0999085j10461j33462j07172j21328K5986k7772J205k95584l7311o3551
$$ plain form
3648 29583291 28721930 27962109 27220522 26486443 25954443 25410131 24960790 24250066 23823038
3639 23823038 23458594 23010900 22531716 21989629 21621803 21303616 21031094 20888160 20670065
3630 20670065 20369687 20200592 20058083 20088045 19993017 19786437 19788504 19858681 19848812 19826131 19840983
3619 19840983 19941322 20199025 20161062 20182266 20250184 20098774 20072449 19829774 19681866 19638199
3609 19638199 19214119 18888105 18632967 18239499 17899135 17401587 16994551 16677358 16330374
3600 16330374 15863291 15450217 15137527 14694577 14378412 14017529 13632608 13289373 12996780
3591 12996780 12691765 12524495 12257274 12151643 12058925 11827764 11565680 11310903 11189329 10999085
3581 10999085 10888624 10755162 10647990 10526662 10552648 10524876 10526081 10230497 10193186 10129635
3571A0129635q0351p3845p8808K4440M7860l6765j52705O4974P8674M4594r9881
3560I867822N5855q5763R3168N8717J13371m6040R3203R2325K9042L1858J40327
3549A0443885J16174J51862J50207k7267J59198K36206K63275J83982J45302Q9750
3539A1912574J22960K22255L27684K76499M89978K37708K75230K06698N74313
3530A4645899M89918L63488M48063N25332N38896N17743L89768O84480P10080
3521A9313667P50494Q46411R00641R48226Q99883J050860J002921J224022J398301
3512B8335426J396015J634878J601088J761160J884417J953684K097365K322353
3504D2986386K519802K564539K727884K889682L177452L223004L329390L348807
$$ plain form
3571 10129635 10049284 9975439 9896631 9921071 9968931 9932166 9779461 9844435 9923109 9967703 9867822
3560 9867822 9923677 9837914 9931082 9989799 10103170 10057130 10150333 10242658 10271700 10303558 10443885
3549 10443885 10560059 10711921 10862128 10834861 10994059 11230265 11493540 11677522 11822824 11912574
3539 11912574 12035534 12257789 12585473 12861972 13351950 13589658 13864888 14071586 14645899
3530 14645899 15135817 15499305 15947368 16472700 17011596 17529339 17919107 18603587 19313667
3521 19313667 20064161 20910572 21811213 22759439 23659322 24710182 25713103 26937125 28335426
3512 28335426 29731441 31366319 32967407 34728567 36612984 38566668 40664033 42986386
3504 42986386 45506188 48070727 50798611 53688293 56865745 60088749 63418139 66766946
3496F6766946L394181L747784L569738L322379L363340L360048L006190K813427
3488I3344033K708327K275851J852204J686870J213362R68842N14006K24670J16886
3479A04905051k41608k96407p49132j135166j336915j692103k103857k305948
3471I5043915k596115k753970l037675k981748l118643l185295l238862l038345
3463G1093262k923636k961655k890194k646795k521956k367113k382659k265797
3455E0133457k167438j839182j888112j843128j514507j532698j477981j311010
3447C6559401j328767j352430j151126j158116r87327q69767q70150p90692p88472
3438B7262554q10688o77759n35129q21294n21178m31477n35918o31988n35388
$$ plain form
3496 66766946 70161127 73908911 77478649 80801028 84164368 87524416 90530606 93344033
3488 93344033 96052360 98328211 100180415 101867285 103080647 104049489 104563495 104788165 104905051
3479 104905051 104663443 104367036 103617904 102482738 101145823 99453720 97349863 95043915
3471 95043915 92447800 89693830 86656155 83674407 80555764 77370469 74131607 71093262
3463 71093262 68169626 65207971 62317777 59670982 57149026 54781913 52399254 50133457
3455 50133457 47966019 46126837 44238725 42395597 40881090 39348392 37870411 36559401
3447 36559401 35230634 33878204 32727078 31568962 30581635 29711868 28841718 28051026 27262554
3438 27262554 26451866 25774107 25238978 24417684 23896506 23465029 22929111 22297123 21761735
3429B1761735m44281k97229l28644m16160m62232l35404k95039l61232k44111
3420A8577403j82520k42076k55750j46569r7984k64052j25661k8922j01257r6310
3410A7036302j51512K17628K25880J41876j9391J28547P7593K3913P8161M3225
3400A7802222N234P5854l9652j10371r0793r560j52374k08447j72785j34717l35848
3389A6628763k77793k48980k74245k10530r7327n6914p9340j40963K4653O6658
3379A5333982j6401j05629p8999J96589L02066J55727K5416J07613K66122M30728
3369A6617214Q6932K27970M17696M19831K82219L18811N98056M84996N51877N42770
3359B0548372N57439Q85809Q21993P61761P32655J081236J024755R28335J135119
$$ plain form
3429 21761735 21317454 21020225 20691581 20275421 19813189 19477785 19182746 18821514 18577403
3420 18577403 18394883 18152807 17897057 17750488 17652504 17388452 17262791 17233869 17132612 17036302
3410 17036302 16884790 17102418 17328298 17470174 17450783 17579330 17656923 17680836 17758997 17802222
3400 17802222 17807456 17883310 17843658 17733287 17642494 17632934 17480560 17272113 17099328 16964611 16628763
3389 16628763 16350970 16101990 15827745 15617215 15519888 15462974 15383634 15242671 15267324 15333982
3379 15333982 15317581 15211952 15132953 15329542 15631608 15787335 15812751 15920364 16186486 16617214
3369 16617214 16704146 16932116 17349812 17769643 18051862 18370673 18968729 19453725 20005602 20548372
3359 20548372 21105811 21991620 22813613 23575374 24308029 25389265 26414020 27342355 28477474
3350B8477474J179421J133014J239109J108214J085701J352508J003288P65724
3342C7344453Q72365Q40003N04208N87239K22778J05J52975J029k09931M3643
3332D0358867K5703r1779q7650r6464N2501k8175n166J49255J40938L09954N482
3321D0733466k5796K00490J21175j68762k81251m99409o48779o72364r24430p91918
3311C7042422r60563r22828j127037j142887j119872q94649j061251j163066j211514
3302B7438755j163857q88506r59093q78170r90635p16174p74627o93915n44669
3293A9829109q56555n67587n59388m41435l97823m30452m14029n06904j92515
3284A5462421k72809k05650k70168j11118j36786j90762k1038M8899J1326L22497
$$ plain form
3350 28477474 29656895 30789909 32029018 33137232 34222933 35575441 36578729 37344453
3342 37344453 38216818 39056821 39561029 40148268 40371046 40371151 40524126 40525155 40315224 40358867
3332 40358867 40384570 40292791 40205141 40108677 40161178 40133003 40127837 40277092 40418030 40727984 40733466
3321 40733466 40707670 40908160 41029335 40860573 40579322 40079913 39431134 38758770 37834340 37042422
3311 37042422 36081859 35159031 34031994 32889107 31769235 30874586 29813335 28650269 27438755
3302 27438755 26274898 25386392 24427299 23549129 22558494 21842320 21067693 20373778 19829109
3293 19829109 18972554 18404967 17845579 17404144 17006321 16575869 16161840 15654936 15462421
3284 15462421 15189612 14983962 14713794 14602676 14465890 14275128 14254090 14302989 14314315 14636812
3274A4636812J67814j28235l5144k71364m3686r9595r5881K8680o403K4996k6687
3263A4151307p6069K6326q746j74934j09624j14773k11072j90420k26924l16280
3253A2748791k90521k92398l87635k99398k27094l21329k34960p4995j16658j10457
3243A0393346j61510k25761k66843l50494k54902k24794k24165k85585p7551p7393
3233H244348l19552l5834j76975k20540q0544M1855j38139k36975J0236o9087
3223G018793j9029j92670k04568l512L4350P935J31026j26664j45859J06880j0824
3212F595858l5331j59427o1661n5573L3771P5166j08352N4374O3768j01056j0576
3201F290961m9113m218N0843K1384p934l3961O3829j10333J7704J47986L8692
$$ plain form
3274 14636812 14804626 14676391 14641247 14369883 14326197 14226602 14130721 14159401 14152998 14177994 14151307
3263 14151307 14075238 14101564 14092818 13917884 13808260 13693487 13482415 13291995 13065071 12748791
3253 12748791 12458270 12165872 11778237 11478839 11251745 10930416 10695456 10620461 10503803 10393346
3243 10393346 10231836 10006075 9739232 9388738 9133836 8909042 8684877 8399292 8321741 8244348
3233 8244348 7924796 7888962 7711987 7491447 7410903 7452758 7314619 7077644 7087880 7018793
3223 7018793 6999764 6807094 6602526 6599014 6633364 6641299 6772325 6645661 6499802 6606682 6595858
3212 6595858 6560527 6401100 6339439 6283866 6317637 6392803 6284451 6338825 6402593 6301537 6290961
3201 6290961 6241848 6237630 6288473 6309857 6301923 6267962 6331791 6221458 6239162 6387148 6425840
3190F425840q1699p0586J23853j7978M7657p3774j07071J14318J31932r0589k7015
3179F374888n924Q7535M8653J46555J18721l9075m7950n1585J24302K28963J14149
3168G099232P9773J12465o0911j2346J23332J21212J26106O2458Q1894P6305J40929
3157G950449K83341J60700J39356R6081L7536L43725K14264J78857L34028J9659
3147I757996J45061L54119M41861K98265L09260L79935L39768K43396M25042M64654
3137A3159357L50914L08842O46874P06761N28746N11619P81556Q02125P39299
3128A8536093P41333Q51076R36577J092367J124499J130930J454557J434143J399887
3119B8701462J622735J692394J788776K006998K158505K316059K494594K764873
$$ plain form
3190 6425840 6344141 6273555 6397408 6379430 6427087 6353313 6246242 6360560 6492492 6401903 6374888
3179 6374888 6368964 6456499 6505152 6651707 6770428 6731353 6683403 6631818 6756120 6985083 7099232
3168 7099232 7179005 7291470 7230559 7218213 7341545 7462757 7588863 7651321 7733215 7809520 7950449
3157 7950449 8233790 8394490 8533846 8629927 8667463 9011188 9225452 9404309 9738337 9757996
3147 9757996 9903057 10257176 10699037 10997302 11306562 11686497 12026265 12269661 12694703 13159357
3137 13159357 13510271 13819113 14465987 15172748 15701494 16213113 16994669 17796794 18536093
3128 18536093 19277426 20128502 21065079 22157446 23281945 24412875 25867432 27301575 28701462
3119 28701462 30324197 32016591 33805367 35812365 37970870 40286929 42781523 45546396
3111D5546396K899373L355139L639911L861543M238034M656858N013159N524443
3103G8734856O078269O618651P301669P981555Q433362R039357R942669J0577493
3095A44707881J1116094J1799955J2083960J1976120J1530689J0378807Q553332
3088B22146838N859158K784565o53581m037519o805515q802984j0165362j0636027
3080A89689573j0382144j0217632r919572r347664q813691q189313p632120p193076
3072A17994361o674389o282017n828991n554099n018743m537785m374191l923835
3064G5800311l623563l483205l331423k991528k781962k783308k570840k172288
3056E2062194k123449j962803j848099j729941j676939j561083j439902j439257
$$ plain form
3111 45546396 48445769 51800908 55440819 59302362 63540396 68197254 73210413 78734856
3103 78734856 84813125 91431776 98733445 106715000 115148362 124187719 134130388 144707881
3095 144707881 155823975 167623930 179707890 191684010 203214699 213593506 222146838
3088 222146838 228005996 230790561 230136980 226099461 219293946 210490962 200325600 189689573
3080 189689573 179307429 169089797 159170225 149822561 141008870 132819557 125187437 117994361
3072 117994361 111319972 105037955 99208964 93654865 88636122 84098337 79724146 75800311
3064 75800311 72176748 68693543 65362120 62370592 59588630 56805322 54234482 52062194
3056 52062194 49938745 47975942 46127843 44397902 42720963 41159880 39719978 38280721
3048C8280721j272251j355018j241993j119368j100318j124820j016134q91803
3040B9159016q01667q99718p00647p75894q10645n93886o44613o90483p02296
3031B2539167o98325m06339n44723o31100m22267m53578o14595l50839m01194
3022A8016207l89329l51471l55575k93666l11499l79566k64957l08080k98255
3013A5063809k23053k16498k05254m51419k56601k07630j24977k56161k25663
3004A2896553l07957l06136j12122j87521j27537o8360l35707k91609j00648k74280
2994A0784676j82844j46474j45070j37931j82687j904l25650r0299l2835j59568
2984I379414j27926l0083n0425n944o8143k83594j70048j12079k07095p8633k5751
$$ plain form
3048 38280721 37008470 35653452 34411459 33292091 32191773 31066953 30050819 29159016
3040 29159016 28357349 27457631 26756984 25981090 25170445 24576559 23931946 23241463 22539167
3031 22539167 21840842 21434503 20889780 20258680 19836413 19382835 18768240 18417401 18016207
3022 18016207 17626878 17275407 16919832 16626166 16314667 15935101 15670144 15362064 15063809
3013 15063809 14840756 14624258 14419004 13967585 13710984 13503354 13378377 13122216 12896553
3004 12896553 12588596 12282460 12170338 11982817 11855280 11786920 11451213 11159604 11058956 10784676
2994 10784676 10601832 10455358 10310288 10172357 9989670 9987766 9662116 9571817 9538982 9379414
2984 9379414 9251488 9221405 9170980 9165036 9096893 8813299 8643251 8531172 8324077 8245444 8219693
2973H219693j60828m7776L6898k34206j21438m7154o339k2871j32594o5825k07733
2962G209827j18476o9665o7011j44193m5890m322j63654l9944j08684N5325O8027
2951F571340j75647j2832j51016N1802J5114k97503n6770O1812j63147p4028J5751
2940E784876p9878j09330r2096l7937q6102p3844p8025O5234r6524j63627j98962
2929D833785n0772j3318j17590Q1266q450K6340j37751o7158P149m4704j13527
2918D395270J6336q4448j33786j51316k8074J00509Q5836J3741j97755j09279
2908C907034J35158L0799j19768M4294k46908j09843J07329n8289Q8289k20458
2898C557637o1220J44019P3739R522j02311m0757O326j8704j34202m5289j3948
$$ plain form
2973 8219693 8058865 8011089 8047987 7813781 7692343 7645189 7638850 7615979 7483385 7417560 7209827
2962 7209827 7091351 7021686 6954675 6810482 6764592 6760270 6596616 6556672 6447988 6503313 6571340
2951 6571340 6395693 6382861 6231845 6283647 6298761 6001258 5944488 6006300 5843153 5769125 5784876
2940 5784876 5704998 5595668 5503572 5465635 5379533 5305689 5227664 5292898 5196374 5032747 4833785
2929 4833785 4783013 4769695 4652105 4733371 4724921 4751261 4613510 4546352 4553501 4508797 4395270
2918 4395270 4411606 4327158 4193372 4042056 4013982 4114491 4200327 4214068 4016313 3907034
2908 3907034 4042192 4072991 3953223 3997517 3750609 3640766 3748095 3689806 3778095 3557637
2898 3557637 3496417 3640436 3714175 3723697 3621386 3580629 3586955 3568251 3434049 3388760 3374812
2887C374812L5417j28019m0404J08267J7271n4221m8904j31883l374P1631j15358
2876C085235m785m5684l4807N5588Q5199M7765j6629j13643M2974J7607k3382
2865C095438k7670n0328j30448j3735p6150J4915J03122p5697k3994j5241m6369
2854B753843k437M6504p6984J16850q3728M1491J5983O950l3427q6236N0059o6608
2842B682260J25197J1055N6639o3912j94979J7486j6936N8524k9053J02936l6603
2831B712614J644m2662L4355K472j26215J2426L4363J07645J06522P0358k47065
2820B666457K3749N2503j37431O3423Q0865P9309j3096Q5746Q5955J61000L6227
2809C184707n8298M092k6365K4222Q5397J30552m077K781j11805k5524n8299J3599
$$ plain form
2887 3374812 3410229 3282210 3241806 3350073 3367344 3313123 3264219 3132336 3128962 3200593 3085235
2876 3085235 3080450 3034766 2999959 3055547 3140746 3188511 3171882 3058239 3101213 3118820 3095438
2865 3095438 3067768 3017440 2886992 2873257 2797107 2812022 2915144 2839447 2815453 2800212 2753843
2854 2753843 2751406 2797910 2720926 2837776 2754048 2795539 2811522 2818472 2785045 2698809 2748868 2682260
2842 2682260 2807457 2818512 2875151 2811239 2616260 2633746 2616810 2675334 2646281 2749217 2712614
2831 2712614 2714258 2671596 2705951 2708423 2582208 2594634 2628997 2736642 2843164 2913522 2666457
2820 2666457 2690206 2742709 2605278 2668701 2749566 2828875 2815779 2901525 2987480 3148480 3184707
2809 3184707 3126409 3130501 3104136 3128358 3213755 3344307 3340230 3343011 3231206 3205682 3147383 3160982
2797C160982N258j98494j83974o755l4351q348j0709j1599n3542k1983l7855j09146
2785B489484K7206j30958o3346j04835M0441p7811l7161j86986J09826J14314
2775B180174l7477p825r2453q098q97P8091j9238m7374O6779l4265j67848J6785
2763A926354R6830J42206n8479j13934m0326L9906r9755l4227j80678J17791P1201
2752A866889o6541l3333m7683J35912l2214j6907R3073n302K4892j15883k914
2741A799989K6456o2042O683J907l1793j13041K3307l5713n875J16757j32500
2730A594135j6463O3379j4193Q39N4944o156j59739R035Q993Q6954l6989q2143
2718A502596Q7017K0000n0152N6769q1566k6706J9899J16492j13848j08262N1194
$$ plain form
2797 3160982 3166240 2967746 2783772 2777017 2742666 2734318 2723609 2712010 2658468 2636485 2598630 2489484
2785 2489484 2516690 2385732 2322386 2217551 2257992 2180181 2143020 1956034 2065860 2180174
2775 2180174 2142697 2134872 2042419 2034321 2033424 2111515 2092277 2044903 2111682 2077417 1909569 1926354
2763 1926354 2023184 2165390 2106911 1992977 1952651 1992557 1892802 1858575 1677897 1795688 1866889
2752 1866889 1800348 1767015 1719332 1855244 1823030 1806123 1899196 1893894 1918786 1802903 1799989
2741 1799989 1826445 1764403 1771086 1772993 1741200 1628159 1651466 1615753 1609878 1726635 1594135
2730 1594135 1577672 1641051 1626858 1627697 1682641 1676485 1516746 1525781 1534774 1621728 1584739 1502596
2718 1502596 1589613 1609613 1559461 1616230 1534664 1507958 1527857 1644349 1530501 1422239 1473433
2707A473433j17434K9881J36101K3865n4748N7539R2516o3896j2612j23068j01943
2696A339634J02103J926n335L2181q2357k5574J09804P0848j54342m1843J04719
2685A451764J2070j4674j43874N976J43720J9447j40002Q8465j4676j0546n6016
2674A341654J5781M1716o880r4765n6860J19339j27962L296J08622M0844l8395
2663A346390M717N8415j77710j08616q5546K18931K06549r2717l1032J1461m2997
2652A307845J02536p0987m8295n3256j00416M2565m0312N1544L139Q6726J1341
2641A292430Q7551j71034j095q466j67029R8911R4109l5326L9222R0757k6504
2630A293526J9411p8732k4741P274j8816p9898o1464J4714K4119O3529O5163K4596
$$ plain form
2707 1473433 1355999 1385880 1521981 1545846 1491098 1548637 1641153 1577257 1564645 1441577 1339634
2696 1339634 1441737 1443663 1438328 1470509 1388152 1362578 1472382 1543230 1388888 1347045 1451764
2685 1451764 1463834 1449160 1305286 1311262 1454982 1474429 1334427 1422892 1408216 1397670 1341654
2674 1341654 1357435 1399151 1392271 1297506 1240646 1359985 1232023 1235319 1343941 1384785 1346390
2663 1346390 1351107 1409522 1231812 1123196 1037650 1256581 1463130 1370413 1339381 1350842 1307845
2652 1307845 1410381 1339394 1291099 1237843 1137427 1179992 1139680 1191224 1194363 1281089 1292430
2641 1292430 1379981 1208947 1207852 1199386 1032357 1131268 1225377 1190051 1229273 1320030 1293526
2630 1293526 1312937 1234205 1209464 1216738 1197922 1118024 1056560 1071274 1095393 1158922 1224085 1248681
$$ [...]
##END NTUPLES=NMR SPECTRUM
##END=
