##TITLE=1H_DE-80H_X3
 200.13MHz, d2o
 8 sc
 
 19ns.26.2.2025
##JCAMPDX= 6.0         $$ Bruker NMR JCAMP-DX V2.0
##DATA TYPE= NMR SPECTRUM
##DATA CLASS= NTUPLES
##ORIGIN= UXNMR, Bruker Analytische Messtechnik GmbH
##OWNER= pz
$$ XWIN-NMR		Version 3.5
$$ Wed Jun 18 14:59:05 2025 Russian Standard Time (UT+4h)  Yarkov@DPX200
##.OBSERVE FREQUENCY= 200.1313
##.OBSERVE NUCLEUS= ^1H
##.ACQUISITION MODE= SIMULTANEOUS
##.ACQUISITION SCHEME= undefined
##.AVERAGES= 8
##.DIGITISER RES= 18
##SPECTROMETER/DATA SYSTEM= spect
##.PULSE SEQUENCE= zg30
##.SOLVENT NAME= DMSO
##.SHIFT REFERENCE= (INTERNAL, DMSO, 0, 15.5089)
##AUDIT TRAIL= $$ (NUMBER, WHEN, WHO, WHERE, WHAT)
$$ ##TITLE= Audit trail, XWIN-NMR		Version 3.5
$$ ##JCAMPDX= 5.01
$$ ##ORIGIN= Bruker BioSpin GmbH
$$ ##OWNER= Yarkov
$$ C:/Bruker/XWIN-NMR/data/yarkov2/nmr/H-C/1/pdata/1/auditp.txt
$$ ##AUDIT TRAIL=  $$ (NUMBER, WHEN, WHO, WHERE, WHAT)
(   1,<2025-06-18 14:57:43.29 +0400>,<Yarkov>,<DPX200>,
      <created by zg, POWCHK disabled, PULCHK disabled
       configuration hash MD5:
       00 E9 B6 7A A2 85 ED C7 34 08 36 98 17 FE 4E 26
       data hash MD5: 16K
       23 F1 DE 02 45 3F F6 52 B8 14 05 16 91 BC A8 68>)
(   2,<2025-06-18 14:58:14.93 +0400>,<Yarkov>,<DPX200>,
      <Start of raw data processing
       efp BC_mod = 2 LB = 0.25 FT_mod = 6 PKNL = 1 PHC0 = -1708.74 PHC1 = 3.166575 SI = 16K 
       data hash MD5: 16K
       07 D7 5C 91 0F 18 87 AB C5 A8 B9 F5 AF 38 C3 4E>)
(   3,<2025-06-18 14:58:29.68 +0400>,<Yarkov>,<DPX200>,
      <pk PHC0 = -4.4 PHC1 = 0 
       data hash MD5: 16K
       BE B3 7A 25 E9 7E A1 19 A3 B5 88 10 85 D3 6F 52>)
$$ ##END=
$$ 
$$ hash MD5
$$ 41 95 4B 5B 0C 96 B8 E6 90 73 2E 1F CF 8F 5E 1A
##$RELAX= 
##$RELAX= 
##$RELAX= 
##$RELAX= 
##$RELAX= 
##$RELAX= 
$$ Bruker specific parameters
$$ --------------------------
##$DU= <C:/Bruker/XWIN-NMR>
##$EXPNO= 1
##$NAME= <H-C>
##$PROCNO= 1
##$TYPE= <nmr>
##$USER= <yarkov2>
##$AMP= (0..31)
100 100 100 100 100 100 100 100 100 100 100 100 100 100 100 100 100 100 
100 100 100 100 100 100 100 100 100 100 100 100 100 100 
##$AQSEQ= 0
##$AQ_mod= 1
##$AUNM= <au_zg>
##$AUTOPOS= <>
##$BF1= 200.13
##$BF2= 200.13
##$BF3= 200.13
##$BF4= 200.13
##$BF5= 200.13
##$BF6= 200.13
##$BF7= 200.13
##$BF8= 200.13
##$BYTORDA= 1
##$CFDGTYP= 0
##$CFRGTYP= 5
##$CHEMSTR= <none>
##$CNST= (0..31)
1 1 145 1 1 1 1 1 1 1 1 1 1 1 1 1 1 1 1 1 1 1 1 1 1 1 1 1 1 1 1 1 
##$CPDPRG= <>
##$CPDPRG1= <>
##$CPDPRG2= <>
##$CPDPRG3= <>
##$CPDPRG4= <mlev>
##$CPDPRG5= <mlev>
##$CPDPRG6= <mlev>
##$CPDPRG7= <mlev>
##$CPDPRG8= <mlev>
##$CPDPRGB= <>
##$CPDPRGT= <>
##$D= (0..31)
0 0.7 0 0 0 0 0 0 0 0 0 0.03 0 0 0 0 0 0 0 0 0 0 0 0 0 0 0 0 0 0 0 0 
##$DATE= 1750244262
##$DBL= (0..7)
120 120 120 120 120 120 120 120 
##$DBP= (0..7)
150 150 150 150 150 150 150 150 
##$DBP07= 0
##$DBPNAM0= <>
##$DBPNAM1= <>
##$DBPNAM2= <>
##$DBPNAM3= <>
##$DBPNAM4= <>
##$DBPNAM5= <>
##$DBPNAM6= <>
##$DBPNAM7= <>
##$DBPOAL= (0..7)
0.5 0.5 0.5 0.5 0.5 0.5 0.5 0.5 
##$DBPOFFS= (0..7)
0 0 0 0 0 0 0 0 
$$ [...]
##$SUBNAM2= <"">
##$SUBNAM3= <"">
##$SUBNAM4= <"">
##$SUBNAM5= <"">
##$SUBNAM6= <"">
##$SUBNAM7= <"">
##$SUBNAM8= <"">
##$SUBNAM9= <"">
##$SW= 18.0517328524113
##$SWIBOX= (0..15)
0 0 2 0 0 0 0 0 0 0 0 0 0 0 0 0 
##$SW_h= 3612.71676300578
##$TD= 16384
##$TD0= 1
##$TE= 0
##$TE2= 300
##$TE3= 300
##$TEG= 300
##$TL= (0..7)
0 120 120 120 120 120 120 120 
##$TP= (0..7)
150 150 150 150 150 150 150 150 
##$TP07= 0
##$TPNAME0= <>
##$TPNAME1= <>
##$TPNAME2= <>
##$TPNAME3= <>
##$TPNAME4= <>
##$TPNAME5= <>
##$TPNAME6= <>
##$TPNAME7= <>
##$TPOAL= (0..7)
0.5 0.5 0.5 0.5 0.5 0.5 0.5 0.5 
##$TPOFFS= (0..7)
0 0 0 0 0 0 0 0 
##$TUNHIN= 0
##$TUNHOUT= 0
##$TUNXOUT= 0
##$USERA1= <user>
##$USERA2= <user>
##$USERA3= <user>
##$USERA4= <user>
##$USERA5= <user>
##$V9= 5
##$VALIST= <valist>
##$VCLIST= <CCCCCCCCCCCCCCC>
##$VD= 0
##$VDLIST= <DDDDDDDDDDDDDDD>
##$VPLIST= <PPPPPPPPPPPPPPP>
##$VTLIST= <TTTTTTTTTTTTTTT>
##$WBST= 1024
##$WBSW= 4
##$XGAIN= (0..3)
0 0 0 0 
##$XL= 0
##$YL= 0
##$YMAX_a= 101409
##$YMIN_a= -94687
##$ZGOPTNS= <>
##$ZL1= 120
##$ZL2= 120
##$ZL3= 120
##$ZL4= 120
##$ABSF1= 0
##$ABSF2= 0
##$ABSG= 0
##$ABSL= 0
##$ALPHA= 0
##$AQORDER= 0
##$ASSFAC= 0
##$ASSFACI= 0
##$ASSFACX= 0
##$ASSWID= 0
##$AUNMP= <proc_1d>
##$AZFE= 0.1
##$AZFW= 0.1
##$BCFW= 0
##$BC_mod= 2
##$BYTORDP= 0
##$COROFFS= 0
##$CY= -3
##$DATMOD= 1
##$DC= 0
##$DFILT= <>
##$DTYPP= 0
##$F1P= 0
##$F2P= 0
##$FCOR= 1
##$FTSIZE= 16384
##$FT_mod= 6
##$GAMMA= 0
##$GB= 0
##$INTBC= 1
##$INTSCL= 3.241238e-09
##$ISEN= 128
##$LB= 0.25
##$LEV0= 0
##$LPBIN= 0
##$MAXI= 10000
##$MC2= 0
##$MEAN= 0
##$ME_mod= 0
##$MI= 1.114404
##$NCOEF= 0
##$NC_proc= -8
##$NLEV= 6
##$NOISF1= 3.799351
##$NOISF2= 2.8
##$NSP= 0
##$NTH_PI= 0
##$NZP= 0
##$OFFSET= 15.5089
##$PC= 1
##$PHC0= -1713.14
##$PHC1= 3.166575
##$PH_mod= 1
##$PKNL= yes
##$PPARMOD= 0
##$PSCAL= 0
##$PSIGN= 0
##$REVERSE= no
##$SF= 200.130002561475
##$SI= 16384
##$SIGF1= 3
##$SIGF2= 2
##$SINO= 0.751879
##$SIOLD= 32768
##$SREGLST= <19F.Aceton>
##$SSB= 0
##$STSI= 16384
##$STSR= 0
##$SW_p= 3612.71676300578
##$SYMM= 0
##$S_DEV= 0
##$TDeff= 16384
##$TDoff= 0
##$TI= <>
##$TILT= no
##$TM1= 0
##$TM2= 0
##$TOPLEV= 0
##$USERP1= <user>
##$USERP2= <user>
##$USERP3= <user>
##$USERP4= <user>
##$USERP5= <user>
##$WDW= 1
##$XDIM= 16384
##$YMAX_p= 519611106
##$YMIN_p= -1382393
$$ End of Bruker specific parameters
$$ ---------------------------------
##NTUPLES= NMR SPECTRUM
##VAR_NAME=  FREQUENCY,     SPECTRUM/REAL,   SPECTRUM/IMAG
##SYMBOL=    X,             R,               I
##VAR_TYPE=  INDEPENDENT,   DEPENDENT,       DEPENDENT
##VAR_FORM=  AFFN,          ASDF,            ASDF
##VAR_DIM=   16384,         16384,           16384
##UNITS=     HZ,            ARBITRARY UNITS, ARBITRARY UNITS
##FACTOR=    0.220516191357247, 1,           1
##FIRST=     3103.79613442933, 0,            0
##LAST=      -508.920628576447, 0,           0
##MIN=       -508.920628576447, -1382393,    0
##MAX=       3103.79613442933, 519611106,    0
$$ Real data points
##PAGE= N=1
##DATA TABLE= (X++(R..R)), XYDATA
$$ [...]
10916 -208091 -226574 -134486 -97824 -94924 -197702 -118017 -69399 9844 77249 92569 -35942
10905 -35942 42387 -14336 -47258 -31281 -141614 -176664 -66415 -116688 -114209 126023 8510
10894 8510 73947 83528 21951 28326 -52976 1006 48266 97078 -7593 -158376 -229212 -133524
10882 -133524 -130579 -165389 -132021 -88001 94179 65606 84274 88567 -1510 -32194 -12239 30574
10870 30574 57412 30871 -81385 50683 -140758 -145368 -103814 -119451 -22579 148243 93867
10859 93867 -58445 -161136 -73836 -76723 -170655 -28543 -44963 -6409 61262 21589 25685
10848 25685 62815 19314 133672 29668 -68501 -118806 -10494 8926 37406 -51474 1815
10837 1815 133401 66225 36297 2858 18130 -41715 -73207 -25150 86271 82812 69006 80647
10825 80647 65821 96475 80328 73996 135498 171058 92527 73863 118745 101225 152645 89832
10813 89832 109964 258796 289281 235936 140447 210650 416310 380089 451861 420947 267980
10802 267980 360891 274747 349149 492444 432648 416403 426576 386787 452490 428752 385267
10791 385267 431939 522756 580974 671375 485146 347758 523880 474577 600275 594825 569506
10780 569506 710529 604238 662785 573777 705034 629485 640759 570620 510550 611973 559184
10769 559184 642263 685994 600191 651861 744663 673021 767463 774155 783004 852374 860434 770769
10757 770769 808721 776900 831527 829414 886794 940111 999750 1050734 1115862 981374 1021685
10746 1021685 1041112 1158234 1222958 1260866 1257898 1254417 1323064 1200960 1207575 1279898 1283368 1275004
10734 1275004 1266358 1251521 1451575 1397301 1317693 1306911 1204606 1233783 1348857 1419922 1366641
10723 1366641 1381777 1382593 1414305 1323356 1390834 1411137 1285976 1290276 1230320 1361779 1464601
10712 1464601 1531333 1475763 1409148 1309786 1318309 1450414 1483555 1453909 1541653 1693557 1690751
10701 1690751 1513388 1486737 1543081 1636223 1654804 1709748 1785194 1732056 1715740 1726510 1712035
10690 1712035 1778933 1885383 1944074 1923771 2017746 1944626 1824745 1819794 1865645 1957597 1723149
10679 1723149 1667678 1768344 1775237 1660992 1808999 1899729 1892215 1889853 1876225 1816547 1809564
10668 1809564 1787628 1793784 1743949 1669279 1714212 1788609 1690584 1729761 1620956 1597484 1577676
10657 1577676 1679495 1764651 1719212 1739035 1877978 1905264 1777383 1818033 1865435 2014951
10647 2014951 2034709 1817900 1912573 2069425 1880725 1742071 1871264 1970751 1850059 1911023
10637 1911023 1949320 1965070 1800545 1824447 1741214 1900548 1732370 1662164 1784888 1799653
10627 1799653 1607370 1620544 1742615 1734419 1689456 1647134 1636869 1644284 1638079 1642567 1716348 1623507
10615 1623507 1592512 1716776 1699006 1592380 1659358 1539874 1448793 1395669 1519450 1636657
10605 1636657 1544060 1650011 1576734 1575977 1495669 1404253 1474346 1387604 1420252 1502950 1446528
10594 1446528 1364689 1381624 1312457 1352433 1350209 1348875 1366749 1347857 1297113 1218298 1267784 1224756
10582 1224756 1221521 1081004 1071244 1024209 979661 962565 877510 898205 927294 922193 836132 969565
10570 969565 983889 875060 963290 885012 742843 638901 508957 510711 692146 679024 612281
10559 612281 695029 639198 688322 630001 557611 437811 508869 601767 688674 530176 434708
10548 434708 417773 526098 482051 337778 483866 436923 366072 530414 440855 322881
10538 322881 313783 341606 422495 500299 362977 287402 289135 345471 300794 314868 401388 419081
10526 419081 346461 202051 254991 346114 297880 203847 284335 249761 216204 247727 142528
10515 142528 268037 229783 260325 423719 273922 203997 244288 259132 118308 180286 202107
10504 202107 116058 120675 208569 287430 273251 261287 222298 148351 144132 110437 16283 80468
10492 80468 126724 186082 199512 146712 78688 10412 106125 104059 53543 59258 125961 225928
10480 225928 421344 221663 134975 39796 -361 97897 181671 143058 246884 409019 329281
10469 329281 163859 175333 130852 24647 63518 196275 368325 330942 213223 278615
10459 278615 411665 341874 243099 138994 287452 439802 400019 419524 290649 227055
10449 227055 283930 268108 267386 306117 337990 213358 240737 321810 331156 446265 439924 514924
10437 514924 646500 541419 369824 450719 589031 625550 623012 441610 434899 461365 463791
10426 463791 450929 487297 691037 849201 796909 740639 817095 776941 767061 797228 842143
10415 842143 939860 849272 804609 679909 687909 675739 780141 924199 1056692 1136686 990556
10404 990556 909274 892622 991036 1016331 984725 881941 879474 921361 926636 953686 1024245 939648
10392 939648 948461 1053431 1132060 1035483 1040629 1107361 1046238 1180875 1292056 1203864 1182809
10381 1182809 1249345 1105295 1125705 1251010 1200925 1269166 1294820 1377707 1403796 1370458 1420821
10370 1420821 1303024 1389735 1348124 1339292 1394700 1446412 1296907 1314708 1361899 1269645 1342538
10359 1342538 1285991 1222208 1375258 1416947 1474775 1547285 1468152 1383083 1360268 1307637 1348194
10348 1348194 1409255 1345872 1285672 1257579 1335397 1300699 1204460 1124591 1184829 1213702 1310594
10337 1310594 1271815 1270881 1250847 1245301 1293980 1316458 1389214 1355687 1220030 1175791 1128547 1219721
10325 1219721 1277677 1303397 1449542 1399318 1417177 1444438 1527145 1546349 1571614 1579373 1543557
10314 1543557 1555745 1559173 1597255 1491739 1612436 1715643 1593913 1651956 1788365 1627724
10304 1627724 1734103 1774210 1671319 1563598 1523959 1681203 1824273 1816245 1816849 1915647 1951532
10293 1951532 1826734 1833418 1731029 1702439 1740631 1720977 1713504 1656253 1790250 1804677 1844547
10282 1844547 1859224 1774941 1693408 1713330 1667738 1669341 1660009 1566459 1671032 1764695 1829542
10271 1829542 1887407 1797401 1905033 1915301 1780634 1716996 1839202 1958546 2052242 2043561 1981238
10260 1981238 1970040 1951415 1917126 2000161 1983231 1986653 1964037 2045067 2111533 2089676 2019674
10249 2019674 2012523 1872773 1923467 1921472 1776784 1917978 1967971 2008024 2005797 1955226 1971366
10238 1971366 1931345 1889110 1877174 1870001 1822226 1893868 1887383 1848752 1716486 1715570 1707381 1603044
10226 1603044 1538810 1505009 1612474 1522611 1484711 1382007 1450513 1438062 1419747 1435177 1404732
10215 1404732 1337355 1386973 1378818 1358006 1378175 1377325 1359728 1456937 1363173 1457569 1427697 1369557
10203 1369557 1327823 1212532 1259668 1272935 1332415 1289505 1146817 1092816 1129427 1084622 1113303
10192 1113303 1191915 1228518 999641 942320 1034858 1026514 939892 851632 811308 743714 868068
10181 868068 889117 885860 888559 971463 826386 709211 813941 827120 770206 629386 596916
10170 596916 584119 560613 597337 600897 646705 681064 676017 807511 673155 598988 502402
10159 502402 524490 430929 459336 419584 544618 570645 482302 477809 439878 315585 278017
10148 278017 309076 267024 425015 423541 422937 392577 354187 478801 635477 612603 498153
10137 498153 632107 488795 422063 478191 471731 507549 563182 496383 408812 352630 331957
10126 331957 509551 407813 426890 471237 496638 505153 464672 417680 482317 360483 362167
10115 362167 356627 379595 217978 281438 376572 388644 333990 316831 281990 359993 435669
10104 435669 604171 633964 555265 562235 515965 500927 443931 489717 575085 537147 363859
10093 363859 439449 482343 445650 499151 602074 439649 314125 345432 355370 387373 459645
10082 459645 456436 424811 292814 313671 484134 604939 610958 563718 513001 573084 542449
10071 542449 579194 451578 407617 462813 412033 451043 407697 419146 381335 425929 456932
10060 456932 421713 549436 566971 555867 467812 531859 549035 557650 605776 500476 549973
10049 549973 465970 455145 551313 603919 559258 609824 555306 551831 534085 504865 500863 435177
10037 435177 460462 436007 570553 619099 654675 754949 610062 664307 577118 653260 935776
10026 935776 786229 699272 691803 663380 632434 651246 713375 694471 821241 762431 769580
10015 769580 801598 907789 907873 957077 899258 792989 936518 898085 863757 811670 938029
10004 938029 877089 981638 987881 1036762 1031712 801398 690068 778295 847525 881784 894528
9993 894528 853870 798499 931111 897064 934045 1073991 1097029 959540 1026853 904988 970779
9982 970779 926595 923852 902091 1023848 1135007 1044725 1135694 1092014 1098994 1104772 1129340 1157497
9970 1157497 1228714 1247436 1192383 1172176 1213132 1292149 1296666 1201774 1174442 1180466 1363244 1273892
9958 1273892 1185863 1257830 1285082 1283041 1495569 1553301 1545979 1488606 1506340 1660156 1733425
9947 1733425 1649039 1659187 1636789 1666754 1682860 1818147 1726675 1742521 1817017 1917760 1858756
9936 1858756 2007685 1981764 1975650 2002254 1928692 1996065 1981390 2053070 2050729 2005806 2061363 1962821
9924 1962821 1986084 2071398 2171867 2261618 2178344 2193610 2261407 2395970 2275209 2433484 2535708
9913 2535708 2563144 2521884 2636598 2685154 2711391 2757568 2809052 2959826 2920914 2958431 3051539
9902 3051539 3004236 3028793 3160041 3090520 3111754 3225278 3352147 3482121 3468738 3549919 3556107
9891 3556107 3564395 3590321 3795791 3676475 3688837 3803387 3848557 3953171 4026532 3959948 4045483
9880 4045483 4246804 4424274 4494150 4514724 4752636 4809383 4925112 4988505 5064689 5163106 5307728
9869 5307728 5386078 5542526 5472941 5498477 5769117 6027812 6145461 6359673 6472792 6591700
9859 6591700 6683244 7034068 7259132 7296892 7525079 7622630 7707460 7998167 8177447 8318656
9849 8318656 8645305 8920723 9203724 9465655 9703044 9877943 10050119 10294619 10613008 10886506
9839 10886506 11067667 11436908 11910069 12253092 12619415 13000055 13418363 13807786 14194347
9830 14194347 14471699 14888995 15414591 15916848 16283786 16752508 17272835 17843006 18310205
9821 18310205 18941813 19692370 20243364 20866154 21535126 22170517 22816241 23523086 24263933
9812 24263933 24941979 25739544 26493406 27386637 28239894 29027669 29855831 30661959 31537967
9803 31537967 32529841 33418162 34192998 35097281 36051345 37053339 37935362 38743792 39471702
9794 39471702 40273292 40967315 41596970 42237463 42872348 43510236 43846291 44173681 44600218
9785 44600218 44799018 44990325 45045273 45004891 44815358 44644362 44620260 44408337 43967051 43441310
9775 43441310 42957495 42544010 41907635 41239502 40536100 39794414 39132814 38364838 37667939
9766 37667939 36831848 36134100 35254045 34399471 33482015 32669483 32003218 31226362 30473685
9757 30473685 29630210 28887115 28063910 27319004 26775719 26116503 25361800 24619548 24233828
9748 24233828 23544002 22887581 22320311 21753501 21172734 20508381 19987237 19567918 19214728
9739 19214728 18731361 18247037 17723396 17156257 16848566 16510877 16200880 15821714 15222620
9730 15222620 14792186 14518953 14150107 13883733 13622640 13304984 13019486 12802213 12530510
9721 12530510 12089510 11866865 11543707 11347466 11098231 10805081 10623482 10492994 10298494
9712 10298494 10070642 9836611 9653328 9425472 9256160 9119960 8931227 8848111 8755773 8573131
9702 8573131 8346940 8129265 7925695 7711286 7654787 7544437 7433527 7217676 7088716 7122025
9692 7122025 6967246 6910707 6787207 6558939 6562766 6372367 6257503 6070362 6159442 5956133
9682 5956133 5794972 5865382 5715477 5633424 5583694 5419397 5370808 5398772 5322427 5126646 5035053
9671 5035053 5003902 4885867 4895137 4869631 4829696 4567543 4476818 4523778 4348680 4404882 4330025
9660 4330025 4266155 4240314 4271134 4190929 4209984 3884233 3701540 3848113 3787940 3686678 3814874
9649 3814874 3843204 3750677 3653701 3511542 3568380 3471455 3482781 3500346 3473452 3464499 3339713
9638 3339713 3288182 3236685 3300025 3333215 3123519 3203755 3211105 3102369 2986726 2979297 2913452
9627 2913452 2885057 2906871 2905830 2983141 2985815 2805482 2710492 2691111 2744458 2747450 2679987 2693728
9615 2693728 2629910 2436724 2528701 2525667 2564576 2461754 2444289 2384518 2389126 2417041 2381545
9604 2381545 2464380 2436207 2271939 2322675 2175240 2085899 2033131 2021703 2000368 1985807 1868006
9593 1868006 1893055 1936775 2018164 2080382 2018902 1973793 1914390 1966560 2026328 1864654 1836723
9582 1836723 1857213 1626359 1596011 1654004 1546346 1548952 1619960 1625644 1656543 1581639 1465965
9571 1465965 1462775 1496403 1442755 1499474 1579715 1670502 1538094 1487154 1401481 1401893 1372620 1460344
9559 1460344 1440833 1341093 1371120 1341753 1356930 1317876 1385463 1363657 1362133 1305624 1323437 1256658
9547 1256658 1209339 1216719 1162588 1133172 1265553 1297915 1232557 1242547 1223466 1226394 1195412 1213333
9535 1213333 1161521 1046520 1088176 1173999 1104152 1070395 909830 903067 943168 1023782 1049896
9524 1049896 910210 913317 990107 941052 782354 844777 992157 809693 884173 951968 1039929
9513 1039929 1018827 942700 1009682 949409 930379 844922 852639 900193 873588 929493 888299 920100
9501 920100 873782 806738 821129 826107 774995 775877 634727 758423 752456 568724 629877 635358
9489 635358 614409 772202 912010 929581 803186 770284 745827 823924 846439 782647 743143
9478 743143 828094 784821 857699 925073 805456 817944 933167 886168 765431 782182 863712
9467 863712 895791 881861 922363 753521 687308 751489 717966 781709 642308 581747 659018
9456 659018 594415 670528 715966 679758 671647 641200 623410 529637 509682 556573 580699 524169
9444 524169 380879 610504 584118 631147 711920 667347 419615 365444 401176 530544 587285
9433 587285 591586 528725 473693 484582 565569 639295 441483 453263 498166 571015 556432 494864
9421 494864 484346 537528 624494 601212 571926 431269 414813 437059 438819 528863 471709 447219
9409 447219 516030 516218 418417 349307 416864 421252 313136 441193 498257 505738 446762 424650
9397 424650 506065 432534 495735 489833 476693 336652 319018 310511 376260 362291 473174 542428
9385 542428 595029 606938 528801 397932 536086 658694 553779 478850 492725 437793 583463
9374 583463 582853 573073 371792 380589 525982 403877 378163 260680 318211 361813 380333 343432
9362 343432 546832 536381 465202 455262 357129 226107 249397 218531 373280 503975 555150
9351 555150 514211 462249 474167 486785 480440 366553 375181 349783 410330 370468 375477 415172
9339 415172 453481 430525 300017 303821 336537 245338 284229 291315 370903 481423 576961 500155
9327 500155 523277 575120 439232 429101 450438 544235 474725 428455 370960 574343 548157
9316 548157 526138 610531 460911 328239 357127 415285 473280 468830 424969 467718 525450
9305 525450 408770 543805 545066 449860 295096 407346 358900 312284 238227 361840 328683
9294 328683 238363 303636 306551 319514 298096 368504 336543 325515 319923 430925 481921 383969
9282 383969 366644 371443 263009 228503 270196 365160 392921 306698 376865 362978 364236 388011
9270 388011 326889 357657 243034 215149 184315 245681 178965 275646 355669 322181 316370 290623
9258 290623 454466 417386 325460 354236 224658 159145 251980 218609 272081 398707 473576
9247 473576 472774 385877 338266 322380 439465 384983 333912 297412 301065 287575 290973 281290
9235 281290 291948 217033 268483 376029 318924 125339 90815 250923 422231 401696 281231
9224 281231 245356 192829 141876 123810 227879 324855 261321 222957 198209 200812 153460 148651
9212 148651 254309 203807 246506 399945 200527 122793 330168 353303 182171 238002 223946
9201 223946 322748 246717 163083 157684 206955 275688 276403 269959 295183 268420 194802 276548
9189 276548 242642 348964 263298 263552 326802 246364 179413 218587 283900 221823 347988 297127
9177 297127 294079 326941 312125 590196 500219 330867 274603 423634 470424 403037 485447
9166 485447 404551 406172 369467 242418 233695 352499 460292 444372 480250 591831 614650
9155 614650 528379 567320 704076 666239 678869 615561 573311 686473 826086 1070129 1062896
9144 1062896 988676 939812 1052457 1072920 1222622 1367456 1501779 1632101 1720929 1820039
9134 1820039 2116798 2427224 2607901 2710044 2725582 2672740 2645512 2424186 2217238 2107440
9124 2107440 2095487 2018377 1845746 1854741 1941724 2010449 2001729 2187107 2405522 2579189 2744910
9113 2744910 2931914 3004681 3140763 3237052 3168652 2976451 2791795 2721483 2623909 2494445
9103 2494445 2283221 2254603 2394281 2437505 2383709 2384714 2498895 2664953 2856453 2953690 3062131
9092 3062131 3239760 3372995 3532985 3461434 3320010 3167676 2871768 2674908 2611885 2482382
9082 2482382 2321800 2195206 2260021 2215363 2233359 2369078 2416568 2485861 2700464 2824710
9072 2824710 2918606 3257879 3177224 3009140 2996164 2829139 2600371 2416661 2102009 1966509
9062 1966509 1683221 1590670 1485414 1325212 1261763 1195005 1189718 946909 1071024 985966 961916
9051 961916 948025 1013798 908745 761976 776832 658250 699942 644590 604387 638671 649930
9040 649930 628922 543529 520226 557300 515054 469011 374188 438220 394447 595996 529743
9029 529743 497136 469134 419780 295187 353659 304564 337104 406874 492869 466907 479875
9018 479875 208415 278651 449609 305717 351850 248368 340018 441714 449049 339132 252998
9007 252998 285784 427935 328491 410856 422593 469764 581418 530705 401755 252257 167260
8996 167260 256062 301581 251283 384740 442783 423013 367874 332644 281815 285985 388540
8985 388540 402025 342044 201320 69428 156003 107167 193904 265124 246626 141029 195949
8974 195949 227411 269066 279814 252042 124610 30993 272766 284499 238943 147147 190872
8963 190872 215970 146267 58675 253910 252462 385184 368787 272172 275786 232156 150208 148109
8951 148109 154628 263133 100238 239740 299660 424087 416768 444354 567825 389250 108505
8940 108505 134273 201139 297474 457870 463589 374967 269345 143988 125130 -48724 -38130
8929 -38130 24465 146594 162944 182227 254833 297439 286748 206373 71331 61685 335840
8918 335840 270576 211741 219291 73091 61032 112847 110902 117928 239362 292354 295443 265508
8906 265508 111336 141956 15643 107193 136172 261759 208842 224864 271456 284499 229898
8895 229898 213197 193104 168380 249884 367657 315827 242515 185059 110521 83908 260221
8884 260221 227317 228846 216488 228120 204493 220855 237370 297066 408553 305829 332287
8873 332287 198638 19728 328139 284589 412191 385340 354719 294929 281883 349852 291682
8862 291682 254204 312973 340307 359453 408007 320021 295747 227823 427409 481170 441121
8851 441121 322119 247744 274063 408402 385811 389148 446733 368646 448637 306386 378033
8840 378033 311337 493091 560834 503528 461507 422096 273895 321792 316025 339412 357879
8829 357879 274925 409839 325798 380047 459455 565252 496855 509090 536804 533063 441602
8818 441602 530929 558388 513522 468695 710257 773805 628789 533539 675898 803098 844227
8807 844227 833650 838811 943643 952116 1094584 1117629 1224874 1393734 1392525 1578480 1705927
8796 1705927 2057035 2430531 2665364 2819856 3093787 3348497 3549622 3440953 3370912 3382393
8786 3382393 3100719 3018473 3044309 3192817 3363045 3538031 3777139 3717253 3635219 3489706
8776 3489706 3226597 2885643 2629349 2402165 2257856 2006146 1811360 1699569 1735678 1674526
8766 1674526 1631819 1497368 1452783 1510290 1585463 1622581 1672303 1581488 1498140 1686253 1822823
8755 1822823 1814746 1964562 1983313 2076170 2413342 2629675 2902062 3264580 3571664 3753333
8745 3753333 3691082 3487536 3454787 3299993 3295181 3183309 3075808 3267629 3432412 3619722
8735 3619722 3649600 3563355 3499988 3251657 3071261 2882119 2594499 2247371 2172526 1912491
8725 1912491 1676229 1561392 1465176 1397789 1388513 1226617 1202725 1115889 922616 822138 764369
8714 764369 709068 778495 879364 849431 782399 763489 634566 639961 649151 650087 718546 582815
8702 582815 568797 589661 612893 581082 525825 502497 426263 402824 557418 473371 462786
8691 462786 552019 366972 427053 461240 433545 349816 237488 384556 501838 466987 385973
8680 385973 372622 405634 429493 468362 349907 494332 436093 340940 338974 329514 359783 246386
8668 246386 309707 226890 119180 193781 320096 508213 426125 353911 319413 370735 449669
8657 449669 446741 459706 404006 403283 316579 287715 371576 406945 346198 455340 323656 317112
8645 317112 261388 302589 222790 127660 155290 113617 246928 348192 270109 150942 255568
8634 255568 346951 400958 339660 410836 362774 387512 477063 409359 434724 402090 467667 532900
8622 532900 497099 468141 476784 499261 471988 573518 535436 725489 715802 673565 596575 426812
8610 426812 507547 602443 722118 914126 973391 1003718 957469 1088515 1350657 1605920 1712805
8599 1712805 1730435 1865231 1970023 2004576 1925969 1861489 1823028 1811781 1775441 1702504 1719937
8588 1719937 1800615 1957642 2128038 2046293 1967154 1795871 1665809 1514280 1479534 1383136
8578 1383136 1075163 559300 915089 1365512 1319354 1295807 1327287 1427430 1316670 1409937
8568 1409937 1501819 1592096 1669177 1698907 1875907 2058523 2201448 2375709 2556569 2804363
8558 2804363 3033378 3183503 3303382 3287609 3377450 3320787 3136766 3173336 3172946 3195488 3181484
8547 3181484 3297627 3439738 3273129 3163809 3105095 2985411 2785456 2465355 2272578 2267640
8537 2267640 2102029 1826219 1708184 1682310 1532034 1485645 1606565 1640826 1442482 1418279
8527 1418279 1360313 1321893 1366996 1470179 1401684 1464255 1588577 1589395 1475618 1446488 1687979
8516 1687979 1893841 1886780 1942435 2022615 1907022 1834490 1773550 1659611 1634376 1803550 1887214
8505 1887214 1740924 1775095 1813879 1913105 1715197 1553506 1370908 1188252 1130276 1083526
8495 1083526 1006536 905971 946531 948642 915095 837289 805427 731529 683981 678229 678973 545934
8483 545934 637515 588426 559193 458831 357313 439926 489809 435850 508807 469577 509152
8472 509152 470533 289665 153050 218303 340068 360837 375910 344131 298320 229752 348013
8461 348013 272221 192296 254814 375459 323674 351809 298121 265359 202229 143700 194330
8450 194330 150982 136129 213427 264794 217855 358162 265339 266298 179388 355628 343054 381521
8438 381521 340549 262378 303002 238798 228743 167487 132845 214815 194563 236658 175071 86395
8426 86395 111502 114183 132291 319051 236836 229159 167284 105854 188919 185448 49099 41278
8414 41278 135448 158130 161870 182493 195101 222935 177160 134111 84553 104770 178347 224861
8402 224861 227398 192226 155105 155412 102645 68755 1596 76654 53792 20617 -69373 -62143
8390 -62143 -52209 -55512 83479 57408 115414 28543 -30722 -17375 69999 -17036 62164 160667
8378 160667 18498 -182547 -65704 -38853 44972 125387 122115 -48843 -54284 -73408 -124139
8367 -124139 -213689 -5648 148854 111320 39230 73076 77506 145714 146017 66935 -35417 14683
8355 14683 -39713 -26005 147971 308936 227469 38412 -19747 77930 56767 38701 -14211
8344 -14211 42866 106619 153884 -16599 61020 41934 -131775 -84061 9469 -19438 -91241
8333 -91241 -113408 -95689 -46371 -97267 -52919 -37978 -13363 38267 40970 -94382 -196318 -15529
8321 -15529 69983 68838 -24160 -65129 -71403 -34881 39393 37273 -66752 64526 93537 -74117
8309 -74117 4977 15458 113478 -90662 -160375 -100139 113183 89709 78819 -16242 -24802 -71271
8297 -71271 -17520 -37383 -18393 57656 117980 89124 74977 65422 -35826 -92671 -78240 -28057
8285 -28057 14863 97749 -21225 -65116 -13777 -5312 116099 77880 -41271 -23202 111854
8274 111854 40544 56956 54320 22208 21672 27713 -116813 -87989 -24702 9144 -61643 -70103
8262 -70103 -89278 24073 -36396 -140967 -77503 -97681 28986 93435 69475 -38268 9961
8251 9961 -16441 154072 256270 163875 180163 110971 202549 249429 126332 96430 23600
8240 23600 -13843 91109 126065 -12679 -48015 -156213 65739 21144 175795 125912 84543
8229 84543 183361 14098 -134233 -82933 -22851 71381 67318 9612 77013 121509 -28862
8218 -28862 39934 131956 106118 5138 -90479 39094 23985 -80205 -29393 201864 33106
8207 33106 87767 -24225 88152 121074 172732 249515 316259 242744 65745 124561 117030
8196 117030 -75698 -137351 -130765 -239348 -1382393 -1071536 -121174 -168206 -134272 46455
8186 46455 164217 116260 167054 24021 3499 -27668 -38495 -11718 29502 10453 54953
8175 54953 92656 116198 -10784 18910 -90753 -64244 -39004 -61178 51958 67215 -11376
8164 -11376 72150 61179 91945 150430 183056 273656 249045 64656 21809 -16299 34702 10086
8152 10086 38299 10049 -19422 52103 73778 46300 13940 145887 66976 78832 182314
8141 182314 100145 -101937 -52095 9368 -3311 3546 109006 126266 52117 240037 118217
8130 118217 21523 39976 69817 187294 202748 135768 70677 41524 25521 12867 -6425
8119 -6425 26274 -80799 -131777 -63724 -165866 -64479 -22520 -4250 -50562 12664 -3532
8108 -3532 -121623 -123891 87363 -86693 2448 -11299 -39772 -52685 -161942 -149596 -162562
8097 -162562 13571 -84027 -165728 -43722 -8663 16380 58645 51281 -19379 13856 22054 -5272
8085 -5272 5105 39565 255429 166147 29656 -34033 22249 43411 34019 -39282 69861 157835
8073 157835 22556 13874 101984 -53535 13303 -479 1945 87471 110016 85553 52114 15605
8061 15605 70217 164081 123191 148188 225052 320227 256367 147431 172888 162813 147930 61045
8049 61045 151642 99540 28912 187712 93273 43746 98965 84010 145159 151457 237522 133022
8037 133022 171593 105387 203955 205192 141911 37847 16453 41275 -79069 -110490 -11842
8026 -11842 21067 29921 102309 121101 44069 18127 125994 114020 52925 -13377 76773 155245
8014 155245 112819 34175 216030 206429 103326 252060 201841 59307 203588 203409 268987
8003 268987 202979 65665 22181 -41155 9322 41301 95879 120003 222018 209122 23938
7992 23938 35385 202548 295612 189342 275797 281863 178105 155293 231143 324735 285070
7981 285070 216367 422696 634984 505078 340074 203733 249944 353297 255704 335952
7971 335952 261020 300395 214889 265114 575977 604117 615596 561604 711820 730615 623678
7960 623678 665931 653227 539074 654428 761059 800892 744758 786138 863558 755022 677221
7949 677221 533213 632135 677283 626252 694963 837673 751755 838838 846151 946474 1009897
7938 1009897 893358 843318 847868 854410 748818 813966 815180 717341 679279 717201 791263 887842
7926 887842 924790 853950 775220 662278 524248 619317 669391 653489 672005 676279 723335
7915 723335 655373 676188 531462 562732 634920 463203 532574 567329 464606 443691 317184
7904 317184 331597 453138 461533 411541 295249 252081 456443 463201 341431 374219 347832
7893 347832 362542 339716 260686 272171 389801 448139 480751 364384 363409 164083 272080
7882 272080 276766 208134 149685 224618 173665 283347 402391 269200 131032 127399 190854
7871 190854 116403 86342 185758 199220 113611 219331 183944 31222 216486 139724 76791
7860 76791 86623 122477 79670 93487 97334 115930 110750 227752 259333 -47711 2877 191784
7848 191784 272170 100492 120387 183803 156073 30016 127313 155304 14298 18246 45748
7837 45748 26830 92860 23929 98553 129936 185765 127205 95237 75202 121077 159792 156198
7825 156198 299564 367418 207748 74747 135317 49901 137013 240157 235492 283768 179319
7814 179319 146010 41624 -59343 395 86166 129771 595825 -165329 -93020 191946 84975
7803 84975 61459 -73798 26207 134435 184097 210442 211835 208778 303976 337510 310242 329944
7791 329944 356532 234669 238456 310109 412433 244761 195291 86987 1141 -66534 -36897
7780 -36897 -185503 -128616 20475 155448 265343 344000 359116 433683 299157 408413 494211
7769 494211 430519 380131 233337 173041 128345 52386 3491 -23918 45480 15711 8347 101545
7757 101545 93066 107948 196530 93534 160009 108908 234028 123955 66809 75123 46897
7746 46897 80258 186462 228839 192677 133491 94553 35765 157382 97080 122260 158595
7735 158595 159257 223326 147545 150129 8464 7168 53982 41371 46388 106914 58219 116246
7723 116246 115929 155769 177180 128352 170991 155260 132686 119621 194961 330231 236417 151874
7711 151874 261470 268959 208060 178942 183552 224866 236634 86308 -41618 -51727 -51173 48590
7699 48590 140967 208131 140144 143405 106137 110110 73865 147609 120629 200743 215542 241618
7687 241618 209839 128815 239935 283217 426327 398419 236630 154821 150422 143419 90046
7676 90046 175687 293593 321807 273953 214299 125498 261446 219348 212965 235356 180266 179019
7664 179019 219482 194192 297313 271803 319202 305202 235445 371063 276027 348890 436974
7653 436974 411628 476117 470443 410872 436781 347736 299064 283042 397550 433093 264016
7642 264016 394458 489069 446054 458585 370390 256266 246102 162776 313963 515351 503474
7631 503474 518540 361823 365496 473929 416563 430927 546307 506408 440773 533738 525774
7620 525774 437689 416306 418661 602598 633040 602845 721049 689984 618051 621610 725234
7609 725234 762240 806829 756922 798878 695870 639649 678708 704079 831809 728536 711127
7598 711127 712675 751332 846377 878143 848489 850775 961718 1078765 1019194 950744 1039995 1109023
7586 1109023 1154665 1185384 1222001 1136721 1095952 1067204 1071708 1184612 1282528 1202264 1208245 1299385
7574 1299385 1276913 1314650 1307568 1256682 1322432 1300119 1426679 1535404 1497259 1558288 1474094
7563 1474094 1530071 1635961 1613923 1771228 1818007 1910515 1972050 1879003 1970672 2013799 2171325
7552 2171325 2192577 2370633 2834463 3024757 2898784 2698169 2480947 2294388 2137254 2041749
7542 2041749 1874026 1940569 1928923 1919853 1931540 1794751 1775927 1745614 1703595 1702008 1537113
7531 1537113 1445019 1468371 1534326 1408361 1377657 1460353 1451007 1502729 1470063 1329494 1286793
7520 1286793 1290658 1265503 1236900 1227010 1244214 1208877 1153166 1153271 1085351 1212874 1265494 1188165
7508 1188165 1200545 1223412 1184064 1217350 1087013 1104136 1104959 996997 990060 955640 850703
7497 850703 811480 816877 777664 671867 630595 632306 727915 854895 977551 951048 858446
7486 858446 862424 876168 778214 525663 495344 588424 592596 550459 530554 642736 623249 562158
7474 562158 614119 668748 574650 554647 512448 562179 608970 471318 474783 471826 523023 549425
7462 549425 553063 492691 521280 480181 531743 402302 489209 412920 390010 449927 469970 338043
7450 338043 352745 332896 330812 391356 387572 399002 317763 396685 422245 416511 320851 213741
7438 213741 288913 335931 307907 242955 272125 299186 268618 228031 282054 361750 334048 223356
7426 223356 307963 358324 356803 382085 322538 360871 407627 326240 319066 358168 405728 355928
7414 355928 382749 318959 335045 243470 229154 178679 223095 318547 271596 201052 275969 211197
7402 211197 221259 212335 214811 179759 241268 281789 312668 326421 191937 204527 231183 238202
7390 238202 267408 366139 229888 65129 151463 226429 71836 204490 160276 165809 219509
7379 219509 156132 209820 268276 257250 227009 267431 264273 157191 167465 145768 226303 201644
7367 201644 218384 199066 140785 128898 135382 245159 293596 168085 155922 122445 109504
7356 109504 40543 6222 89210 42670 -1310 -8383 28315 79420 124985 43489 52418 80340
7344 80340 60111 133622 71437 174827 34455 -33924 -43803 107304 98554 -36412 115345
7333 115345 189090 108174 116155 7273 -8600 53008 21937 -147738 16939 84558 136545
7322 136545 336461 242175 103924 128796 127920 142634 235357 260589 312702 347076 159491
7311 159491 45858 36518 93881 148215 -3445 -53345 61080 88950 -81167 -63189 -42852
7300 -42852 27314 123302 108632 64033 96865 119373 60030 96111 72276 91803 122163 74742
7288 74742 1574 96927 158335 87081 141555 130624 67730 82773 20415 30357 38649 38635 67683
7275 67683 23292 24427 135426 178873 182622 142003 210769 214462 268071 197022 40962 -43165
7263 -43165 69642 94752 -16149 43377 -55200 -42693 -55591 104336 57376 -18356 113033
7252 113033 106274 34139 5278 -31081 51162 34319 88179 25992 46022 19259 75337 83438
7240 83438 138637 228805 203547 105573 167989 160551 18738 19366 173184 60785 66882 84452
7228 84452 30401 -38770 -62162 31991 159941 137309 58198 95838 58865 32568 44337 101583
7216 101583 94219 5185 -25653 -11280 53984 49604 115275 63884 49335 -39461 -13383 94876
7204 94876 61822 2599 60722 63170 7978 -41824 -78558 -17085 41086 -119785 -34583 45181
7192 45181 76691 -50365 85607 43490 -131337 -70329 -35929 14753 -95058 -48629 -35497
7181 -35497 -27006 47099 129967 75740 4452 12731 178998 143030 58293 26529 129150 130235
7169 130235 193124 158536 173438 240337 224725 45461 94673 -82049 50814 169420 205293
7158 205293 185258 183785 84995 -19537 60370 109042 118927 13851 -3918 181236 248684
7147 248684 94 -148520 -8677 128527 166580 -23143 -164988 -219855 -143328 -90976
7137 -90976 14937 151853 115660 87280 2264 -81551 -157383 69039 109392 48413 67475
7126 67475 42744 -24095 56330 18655 67048 61931 -79256 -34571 -72681 10563 -102215 -21049
7114 -21049 -44293 132 82931 9054 3627 -14854 -3153 43614 12644 14543 79279 -71010
7102 -71010 -11320 -26504 28879 53690 -28381 28837 -54662 -113838 -26434 1538 -152307 -117474
7090 -117474 -80947 64730 132174 209173 162425 -39395 -116150 -33144 23456 86366 102226
7079 102226 164148 264827 148572 1483 75014 57301 -14375 47677 79992 152260 106154
7068 106154 178818 149887 166447 187940 147713 143312 113142 -53603 16394 69158 -70973
7057 -70973 -40622 59503 70950 -37550 -46841 -103448 -109446 -73238 -57003 -10215 -5643 -31533
7045 -31533 42122 2697 -94147 -37408 -18193 75010 127462 114960 81183 86502 129151 115384
7033 115384 116793 -82996 -137344 77445 43299 66403 -36133 -48613 -58739 -168862 -97838
7022 -97838 87173 14877 179755 -33786 -78452 -12126 6278 37952 44957 132004 92877
7011 92877 74201 54866 12272 58521 72911 3628 -80223 98912 -62959 25432 130727
7000 130727 -23852 -52013 -110422 -117802 40101 92020 14613 34603 43839 253472 111781
6989 111781 -80603 -139962 -42793 -4725 18715 64392 -7460 -36572 -91897 -146879 -102348
6978 -102348 -97335 -232024 -197457 -35511 -98064 18808 46821 -98020 37754 90618 67822
6967 67822 116543 84511 -69832 -18027 10506 -47798 -118870 -150788 -77567 -73764 37666 31189
6955 31189 13098 12548 18950 -158850 -58656 67240 103086 70866 30009 30913 14984 -24783
6943 -24783 -13208 -68895 -25171 5550 28517 40457 59058 -45174 49068 148995 140567 187748
6931 187748 238594 181168 206856 96346 65821 77011 106751 150141 -33612 -47871 16410
6920 16410 -6819 62740 170084 39158 -34143 85261 77323 -86613 -113020 -204325 -143964
6909 -143964 -42191 -35833 2797 6023 -23113 -38108 -186031 -43470 8271 -53988 15640
6898 15640 -43951 -63507 -37184 -82687 874 82006 32445 39739 -7709 -17674 -104635 -109957
6886 -109957 -26817 -3604 772 183896 227497 36532 -61212 102277 132674 86483 57084
6875 57084 -15881 73681 -16101 -94329 -58398 -77813 26937 48689 73170 123600 88928 63553
6863 63553 88855 200563 172655 62793 110566 168219 215514 52158 34153 -5489 7258
6852 7258 -7287 8689 150290 107214 108653 25824 17457 -126796 -137411 -64458 -26575 29583
6840 29583 -1034 60313 57115 -71189 33612 22158 3107 20389 -25017 69399 9738 -49108
6828 -49108 26350 121648 52920 96427 6408 -131339 -23673 -70397 95037 135489 27798
6817 27798 -26460 -22281 -181156 -200597 -161523 -24537 32172 15812 72235 122541 98642 71960
6805 71960 54073 127881 76585 -45689 18399 106820 134475 181448 151742 164698 -34013
6794 -34013 47670 44563 -29098 40326 27061 42905 82533 35471 -122851 -48704 -16841 -78355
6782 -78355 24090 104136 26903 63575 61190 61602 -7 -71751 -27941 -170990 -163610 23780
6770 23780 73106 121027 79481 -62633 -6018 -83094 -42297 69022 70825 69950 31046 83985
6758 83985 7772 39713 -8200 55280 -9366 -13856 17256 37025 -605 -16980 12542 19592
6746 19592 20890 21001 50061 13059 10205 64048 30958 48414 -41995 72717 24201 61755
6734 61755 144610 168670 267100 183167 117205 44623 -12397 55794 191914 185471 144898 129283
6722 129283 33309 32657 87480 185234 125032 -76824 -7659 41414 23527 54534 93428 203735
6710 203735 39311 5421 29520 4491 47587 -226 -34857 8598 6267 -116915 -21361
6699 -21361 80286 29433 -40128 67547 135854 114444 83567 149360 55761 31839 20371
6688 20371 108203 98648 32658 139369 236231 201227 26052 109212 6903 107341 110972
6677 110972 -72286 -73561 -76922 63971 19674 121033 79306 -63183 -51528 -70645 -14335
6666 -14335 -3748 72603 22667 -18808 44376 125713 179217 306067 192023 13595 57259
6655 57259 41180 106109 72421 -21219 -29210 -14203 -75861 -149407 -51657 -74337 35974 -15193
6643 -15193 58700 132958 80888 -62324 -31273 44109 107368 95966 61341 68245 -21891 6077
6631 6077 -44691 5371 62131 16172 107930 173815 84487 213813 146599 235450 242322 74369
6619 74369 -110845 -60265 2524 39699 98747 112343 71874 154047 104775 20090 -29359 -29601
6607 -29601 22724 784 -87556 5437 148938 180937 106221 -2246 25320 149457 181283
6596 181283 153976 13041 -75845 16156 91222 136368 47096 -12232 31659 33941 -41736 -1216
6584 -1216 -89224 12983 78763 261231 172935 -1468 -73291 -82911 24355 -6812 2931 71738
6572 71738 171116 76904 126362 65419 -46823 -132833 -160235 -138391 -98662 -136354 33760
6561 33760 170542 222487 248964 50022 25172 44863 67279 239699 185193 36702 -49149
6550 -49149 3547 -3955 -12086 204429 260420 220661 75408 -42114 39204 18615 50821 50324
6538 50324 6907 110404 194532 118334 112118 82199 -22945 11909 206237 331400 206679
6527 206679 161605 95544 18596 7281 72434 81378 127934 1019 20843 16653 59368 145933
6515 145933 168534 175851 148518 44817 -47716 -68667 165028 221998 155754 112600 170269
6504 170269 145349 43081 38877 124718 121410 38939 180078 342416 260626 50736 136101
6493 136101 245604 196796 157674 70642 137379 129487 62625 105962 71349 185311 154404
6482 154404 128434 1952 -8385 108154 32584 -32116 70221 157973 248155 345495 308698
6471 308698 225678 173371 152765 105068 74278 183466 337718 380955 139659 146786 210312
6460 210312 308106 227205 179293 65361 127639 430590 348144 258558 313525 388178 201023
6449 201023 98658 139956 197551 247991 240540 136909 141198 240606 225652 175146 229989 188765
6437 188765 172490 122875 76251 206757 122322 -18534 71049 281361 281540 290351 198736 209790
6425 209790 331671 205271 88058 103779 229088 197679 183951 148634 206674 88736 153592
6414 153592 117243 63687 91103 194764 208621 217671 183323 272140 390666 337612 310537
6403 310537 258672 210238 301913 219178 52891 88602 55673 143116 202325 103374 153161
6392 153161 159324 -579 81346 221637 339088 299048 309973 202999 321663 260715 234612
6381 234612 188134 51966 54260 106688 169461 113328 221316 125448 177566 197922 127267
6370 127267 163983 59822 109526 223230 284450 269931 251834 145873 353347 420998 352625
6359 352625 205373 208607 243905 211470 313269 345040 232310 293095 495575 520616 307496
6348 307496 252671 264092 226515 237183 309236 337497 142189 198629 262107 248077 181286
6337 181286 179314 180932 245607 187724 253172 320706 380972 296984 164316 133454 90325 176263
6325 176263 209547 276519 308536 325588 293517 414344 386293 384517 320749 205271 197917 255160
6313 255160 212315 288125 284289 391868 318584 226356 326574 236460 223873 152761 301466
6302 301466 397584 277606 220808 260539 306680 360088 372980 337054 318982 314354 322172 332700
6290 332700 316297 437571 367709 384774 419963 460042 525617 383064 304552 399702 263415
6279 263415 269556 294060 512463 550592 391658 323843 324772 283443 269840 375955 506833
6268 506833 330365 296959 407425 319125 288201 312707 386660 379070 438968 539862 402188
6257 402188 484893 412308 548260 737256 399373 421598 464831 409450 349100 276245 425074
6246 425074 495914 397050 253205 315056 521460 592797 617635 609972 612629 486090 566297
6235 566297 602199 461865 398454 443850 485253 558632 535067 633751 661326 690524 713277
6224 713277 688843 775240 786178 765638 639942 580754 567852 633077 747709 741839 818156
6213 818156 776542 771222 816210 956059 916083 914700 947993 953814 975915 1009524 1058702 968412
6201 968412 1021720 1049610 1058259 1068245 1044918 1106070 1135445 1165888 1165820 1172390 1232695 1316058 1309284
6188 1309284 1331957 1458328 1519499 1425319 1420146 1561125 1584914 1783099 1883109 1801397 1905007
6177 1905007 1999253 2169988 2296342 2275671 2436199 2396376 2496296 2706883 2769106 2836506 2863098
6166 2863098 2789905 2863975 2856159 2839029 2867808 2926127 2982993 3022077 2825322 2709133 2799326
6155 2799326 2731788 2620036 2565039 2572414 2343856 2251552 2185110 2133820 2135996 2141671 2062833 2090989
6143 2090989 2093491 2177940 2198733 2079521 1955843 1902458 1887229 1994002 2142280 1994032 2028902
6132 2028902 2211933 2183756 2225971 2202261 2246834 2289983 2454200 2620256 2529829 2615106 2666941
6121 2666941 2772357 2903858 2947692 3095019 3222711 3405932 3476525 3670325 3923859 4037130
6111 4037130 4008885 4111728 4263383 4242552 4437395 4531414 4516265 4472244 4650986 4624626 4604713
6100 4604713 4491141 4419166 4505131 4366146 4260289 4158517 4258318 4180251 4011499 3947715
6090 3947715 3773944 3712137 3630338 3537099 3485149 3488324 3440412 3467639 3568370 3492404 3467230
6079 3467230 3382703 3454401 3606011 3536154 3465742 3404007 3493487 3559171 3563764 3703871 3659807
6068 3659807 3597146 3648789 3671102 3616130 3570264 3686137 3775730 3577624 3466141 3720191 3547467
6057 3547467 3449047 3410473 3482844 3381869 3364196 3409107 3421353 3419618 3450618 3536720 3531923 3551257
6045 3551257 3472348 3563474 3405879 3445131 3494275 3547935 3491655 3462387 3649716 3571503 3652087
6034 3652087 3623938 3489123 3532271 3583230 3734310 3810750 3753970 3759251 3775306 3786529 3714782
6023 3714782 3641686 3693645 3809267 3879825 3849786 3795054 3770297 3804898 3815653 3807969 3661054
6012 3661054 3674824 3750535 3758513 3768768 3759740 3707693 3604764 3695321 3595609 3445052 3498433
6001 3498433 3528722 3525173 3403293 3353083 3399819 3273099 3157323 3077988 2863617 2850814 2793978
5990 2793978 2815016 2659600 2585047 2681178 2549646 2387766 2293156 2197613 2243373 2229802 2260768
5979 2260768 2355871 2250678 2157450 2105526 2095627 2114192 2174841 2116599 2097864 2096941 2040442 2108813
5967 2108813 2177360 2190314 2140759 2106445 2024496 2034779 2011650 1777432 1847241 1858339 1841526
5956 1841526 1911503 1916546 1959881 1946079 1966029 2018763 2049209 2135431 2131635 2147950 2240711 2171424
5944 2171424 2164312 2196398 2114102 2172718 2236623 2101735 2053490 1978214 1825026 1653660 1488619
5933 1488619 1481375 1483243 1480158 1480269 1386640 1368729 1431658 1359495 1400073 1418832 1438315 1454073
5921 1454073 1339274 1256384 1382325 1461256 1454654 1357156 1284648 1251834 1279571 1241993 1383250
5910 1383250 1461006 1226737 1273058 1195081 1172303 1100137 1113531 1125581 1152582 1082657 974548
5899 974548 842039 820987 851765 773156 1005083 943910 934670 894766 868225 878268 888254 1013663
5887 1013663 815813 766951 825188 667872 625789 726801 761009 709270 581357 484173 518071
5876 518071 630692 768727 838722 830377 769591 716453 696826 646345 601735 614681 705465
5865 705465 674529 593482 697909 601418 551010 680703 754039 687932 568236 610812 590305
5854 590305 599228 656377 523218 543879 581231 686143 774706 684854 801423 737277 791762
5843 791762 789715 738101 813254 785652 785839 776547 646444 715653 742424 747621 783469 790506 792648
5830 792648 811520 892850 877774 1030375 1163401 967060 811923 857200 904050 949097 795590
5819 795590 845154 881505 852710 739194 677394 872589 829336 912634 961598 934536 918740
5808 918740 957091 939648 858167 940526 1035276 935600 745927 770730 805055 728827 694463
5797 694463 714515 616049 597980 632162 795159 739048 752915 799232 841830 891853 802872
5786 802872 777066 730456 793143 798412 805467 857782 768432 679206 577113 717127 814692 763335
5774 763335 772722 792877 776881 741920 737831 726505 700281 682555 749280 812118 832826 771264
5762 771264 799276 797954 694505 762133 778397 799938 740814 624052 809666 778292 707115
5751 707115 692585 628073 665176 640185 567405 626606 695062 771468 753528 761717 776060 697748
5739 697748 713558 720454 632234 764193 848284 852156 817902 809690 671823 621683 915315 853826
5727 853826 851049 779774 688215 733038 775500 697392 736925 781348 775756 881704 951938 839258
5715 839258 680510 726831 716670 713402 739040 771111 713349 872432 866517 759716 743939
5704 743939 578505 615812 602375 731178 673214 553976 602395 488498 570900 593462 595503
5693 595503 551627 663770 788455 772396 615389 706763 776580 716185 785367 909411 903279
5682 903279 888705 970893 915908 925302 892022 894676 941547 848958 718914 787819 888819 970938
5670 970938 1010790 954782 899762 1006013 972252 1033208 1064924 967224 951227 810464 829728
5659 829728 924065 1019565 1134200 1138627 1078714 1086828 1211250 1214704 1127006 1337940 1281661 1302054
5647 1302054 1346982 1373785 1341116 1237983 1136318 1134104 1233501 1214880 1249227 1278723 1275975
5636 1275975 1278335 1500318 1398604 1474427 1739367 1772038 1769556 1796574 1780229 1724207 1578683
5625 1578683 1690384 1736375 1697759 1732906 1662751 1698878 1686398 1634213 1734528 1621966 1577738
5614 1577738 1613059 1460341 1454301 1457744 1477123 1558659 1628607 1668741 1674288 1693127 1741315 1711403
5602 1711403 1673643 1734183 1692704 1570237 1573702 1513597 1500952 1415331 1364305 1432015 1490556
5591 1490556 1372362 1388431 1487580 1461102 1517675 1491823 1495805 1585274 1729425 1784145 1652985
5580 1652985 1640614 1742480 1712724 1702881 1743598 1750786 1789658 1878413 1834292 1886109 2100051
5569 2100051 2185859 2180880 2128298 2150151 2332934 2334067 2323913 2429476 2439723 2481912 2618458
5558 2618458 2727342 2775256 2730718 2942299 2830023 2802859 2939748 2976549 2963534 2874456 2970221
5547 2970221 3058885 3178111 3373266 3304925 3177223 3317008 3398337 3429516 3605335 3589377
5537 3589377 3674177 3753206 3771942 3922268 3861323 3933476 4170155 4045619 4104714 4022163 4029044
5526 4029044 4208335 4307782 4527027 4676113 4768754 4870173 5003029 5063109 5201031 5303562
5516 5303562 5482207 5738771 5825241 5960525 6028856 6100468 6338973 6434205 6623436 6723411
5506 6723411 6914875 7000929 7119141 7284591 7576627 7801660 8062802 8248922 8403001 8645364
5496 8645364 8833742 9026261 9324322 9646345 9738461 9955261 10349108 10516466 10890184 11081005
5486 11081005 11447413 11975679 12553359 13041854 13571635 14062608 14513655 15133156 15770778
5477 15770778 16240602 17120141 17768971 18331123 19045645 19875389 21039258 21977866 23082966
5468 23082966 24295991 25433101 26748046 28228028 29838754 31497643 33244305 35164942
5460 35164942 37280257 39524028 41991172 44642613 47462985 50677286 53884029 57453822
5452 57453822 61496347 65903560 70769936 76240083 82247704 88840882 96239716 104546347
5444 104546347 113903122 124515008 136289402 149637336 164388240 181267882 200359910
5437 200359910 222511517 248239975 278030459 312628702 352044632 395716939 440987875
5430 440987875 482711829 512174954 519611106 501891057 464963713 419141725 372941655
5423 372941655 330606434 293746556 262347503 235945769 213499437 194219591 177564260
5416 177564260 163214406 150647953 139425307 129466076 120409026 112186332 104752394 97933806
5408 97933806 91797223 86189249 81044504 76376148 72128546 68202437 64505868 61121770
5400 61121770 58173986 55457582 52951994 50598346 48401527 46432038 44356894 42383568
5392 42383568 40576527 38837396 37188139 35701416 34281524 32906421 31567363 30443357
5384 30443357 29282759 28349080 27214014 26225221 25233457 24478328 23816192 23088687 22459391
5375 22459391 21806434 21036810 20197501 19699832 19289228 18763278 18356190 17688662 17149794
5366 17149794 16810839 16351607 15911070 15369383 14917569 14595045 14378519 13985713 13505404
5357 13505404 13227387 12875674 12548556 12309097 12065773 11847525 11578294 11435235 11025993
5348 11025993 10854948 10772830 10575865 10365782 10137586 9837389 9742427 9669531 9572431 9472999
5338 9472999 9302211 9080138 9078245 8980006 8891611 8737117 8698037 8489179 8311020 8228175 7990926
5327 7990926 7898303 7754535 7649662 7515339 7246543 7112856 7044527 7141562 7138549 7024041
5317 7024041 7011565 6839233 6709973 6573882 6469936 6385332 6354278 6303097 6253112 6107944
5307 6107944 6103093 6086492 6104819 5998933 5770835 5751252 5680691 5672087 5606493 5518520 5408102
5296 5408102 5397993 5387541 5144674 5073783 5134780 5260240 5241567 5274257 5191731 5037666 5035358
5285 5035358 4910700 4846403 4807504 4854074 4679737 4634728 4587220 4537800 4477986 4452297 4407873
5274 4407873 4339796 4404805 4358488 4429794 4589453 4480764 4456832 4482922 4477512 4344164 4298079
5263 4298079 4194184 4097057 4139933 4134666 4055005 3956577 3785020 3839781 3861849 3747104 3820611
5252 3820611 3822132 3650210 3779482 3805844 3665776 3828427 3759546 3730515 3721180 3579296 3430338
5241 3430338 3473110 3553839 3536715 3348950 3326898 3306860 3267258 3333129 3328153 3255302 3198890
5230 3198890 3082906 3124348 3099021 3122915 3114171 3086084 3148567 3051204 3035967 3069975 2959500
5219 2959500 3033669 3038770 3016600 3188347 3230034 3097803 3094599 3157461 3132123 3327763 3251671
5208 3251671 3189578 3305900 3331021 3329866 3209104 3231720 3363225 3411511 3347971 3406909 3471477
5197 3471477 3458968 3418672 3576718 3598319 3637388 3700722 3675323 3690256 3638277 3589460 3741652
5186 3741652 3754855 3759864 3725296 3808748 3825225 3655173 3541084 3626110 3708781 3693370 3766048
5175 3766048 3727787 3714772 3774630 3724457 3657617 3583142 3483968 3505788 3544839 3465479 3601845
5164 3601845 3655588 3601639 3535254 3535226 3529961 3604191 3746580 3756111 3752406 3762389 3854121 3782801 3807413
5151 3807413 3836989 3803695 3761111 3715045 3704723 3695736 3674606 3728647 3711590 3741484 3766235 3850049
5139 3850049 3883923 3833660 3738335 3815417 3925704 3919903 3905903 3850115 3819534 3870083 3889534
5128 3889534 3785435 3836725 3751219 3597153 3664952 3568290 3506394 3450936 3333943 3429544 3467892
5117 3467892 3442823 3460699 3450085 3340419 3262968 3289026 3306367 3173487 3064640 3184255 3234780
5106 3234780 3315770 3089827 3055026 2975761 2921389 2911821 2975657 3122984 3193377 3109223 3107455
5095 3107455 3085440 3054961 3142561 3032012 3001115 3148381 3138831 2976400 3012477 3126204 3049669
5084 3049669 3007390 2983215 2961450 2836715 2921746 2966535 2859693 2983750 3127510 3045496 3159926
5073 3159926 3112459 3044502 3185106 3022230 2777955 2665389 2568632 2539409 2499942 2357487
5063 2357487 2280225 2221761 2329497 2331312 2270921 2232224 2178126 2244104 2185010 2030393 1944342
5052 1944342 1934667 1928502 1940958 2038743 1980126 1882535 1941048 2143892 2171883 2177191 2150004 2275189
5040 2275189 2004149 1915012 1880908 1963268 2074454 2183710 2172893 2156647 2230702 2176742 2217347
5029 2217347 2212090 2238863 2328086 2470491 2451565 2513316 2519267 2536638 2617608 2713717 2807664 2838088
5017 2838088 2813669 2755280 2824554 2841150 2781411 2808399 2912860 2836806 2821065 2740403 2897380
5006 2897380 2959604 2974983 3041989 3095617 3034722 3009466 3151608 3168618 3124916 3083757 3111079
4995 3111079 3112327 3217270 3165194 3198906 3322193 3323422 3385102 3524134 3516331 3608406 3545983
4984 3545983 3545467 3570772 3623621 3766935 3784335 3809708 3774709 3875492 3939523 4047120 4074459
4973 4074459 4095776 4043222 3838281 3860022 3944963 3954387 3896592 4009331 4070110 4053146 4019478
4962 4019478 3979490 3836055 3707740 3744328 3826530 3905043 3975582 3939404 3903430 3796218 3792018
4951 3792018 3841085 3871199 3929045 3928676 3849968 3806222 3851536 3900876 3877017 3925908 3896081 3847431
4939 3847431 4013622 3950851 3897552 4015083 4149926 4090800 4122674 4084994 4036153 4032759 4039806
4928 4039806 3987089 3863091 3802518 3856439 3966488 3916798 3912435 3987673 3971734 3887928 3764866
4917 3764866 3832194 3950646 3799688 3728970 3737971 3713373 3721173 3698972 3626699 3676882 3740237
4906 3740237 3761864 3580526 3482885 3538505 3513407 3473068 3540919 3561393 3490215 3427710 3403413
4895 3403413 3400448 3333064 3306021 3278073 3395115 3361091 3241914 3230690 3230972 3301614 3146546
4884 3146546 3031118 3095598 3099214 3105370 3105661 3133102 3052698 3110255 3268005 3237354 3226818 3294171
4872 3294171 3299436 3310082 3273257 3174466 3169080 3210060 3220748 3124260 3208161 3212545 3182926 3214007
4860 3214007 3335427 3433873 3491198 3349234 3390234 3429117 3279391 3301899 3299763 3333716 3468784
4849 3468784 3529431 3441347 3459290 3627417 3760450 3843346 3999969 4012602 3933216 3942877 3940161
4838 3940161 4040943 3981029 3887747 4022599 3979127 3957963 4020242 4014649 3958890 3832501 3873473
4827 3873473 3877058 3784469 3766190 3845669 3864737 3870953 3890016 3800281 3624527 3695390 3841436
4816 3841436 3802479 3793450 3786479 3935807 3865324 3803678 3926148 3909691 3781817 3753484 3904477
4805 3904477 3943990 3849586 3844259 3897430 3979104 3920625 3961917 3962294 3944261 3954103 3927605 3924227
4793 3924227 4008636 4084032 4190133 4149598 4103814 4163490 4262721 4310041 4293216 4282197 4190544
4782 4190544 4193892 4165974 4133184 4071512 3907814 3915764 3908734 3834931 3804518 3710263 3640624 3370824
4770 3370824 3346295 3461136 3399555 3313381 3295903 3298112 3190392 3134987 3183010 3266202 3045689
4759 3045689 3081802 3155261 3090746 3072445 2977726 2743036 2835433 2837745 2791830 2814869 2751379
4748 2751379 2829012 2830484 2785785 2659603 2662468 2650347 2659057 2558738 2539652 2557982 2631147 2636691
4736 2636691 2589645 2577882 2602529 2674355 2683500 2660683 2555578 2594799 2756401 2661268 2595936
4725 2595936 2758209 2740357 2709668 2741705 2863077 2860579 2795017 2816591 2923994 3102074 3146222
4714 3146222 3245043 3289856 3414250 3590609 3618283 3693723 3754834 3854724 3854427 3887364 4063758
4703 4063758 4216592 4324479 4241363 4366168 4486512 4626989 4837780 4968964 5055645 5076134
4693 5076134 5161673 5414977 5497654 5607686 5699785 5762322 5762255 5879280 6095748 6138226 6375929
4682 6375929 6463899 6565021 6600660 6646832 6749456 6845451 7088896 7315480 7454173 7475034
4672 7475034 7644005 7730314 7887161 8006911 8155316 8319433 8245946 8473037 8691971 8769010
4662 8769010 8795932 8742693 8767921 8692537 8667753 8649308 8572944 8452910 8456416 8323313 8229433
4651 8229433 8223909 8212411 8134840 8063579 8038521 8040450 7960336 7886743 7949909 7971816 8003834 8064675
4639 8064675 8204099 8120701 7981115 8030726 8107794 8179388 8319221 8439677 8508139 8503095 8708934
4628 8708934 8894916 9176441 9414656 9665175 10000135 10382760 10809299 11216527 11737980 12331494
4618 12331494 13136004 13872721 14860088 15898110 17029508 18481508 20257716 22152679 24446051
4609 24446051 27204943 30059158 33152042 36139528 38787213 40856340 42882354 45161475
4601 45161475 48225863 51868077 56010131 60251272 63456337 64994895 65436139 65857100
4593 65857100 66938418 68947807 71846496 75108505 77373483 77127905 74651777 71065214
4585 71065214 67957465 65812676 64729709 64421892 64016558 62469798 59262148 55050386
4577 55050386 50670425 46910822 44192471 42168166 40255762 38256173 35661449 32697695
4569 32697695 29604244 26825457 24422888 22361814 20564302 18988883 17631725 16448475
4561 16448475 15377939 14482092 13526914 12885269 12175302 11502733 10853186 10427921 9983037
4552 9983037 9403382 9054752 8690434 8231334 7898659 7712060 7428234 7193556 6853037 6599322
4542 6599322 6381144 6100012 5792151 5631173 5578789 5473687 5283654 5183104 4891501 4674508
4532 4674508 4629745 4563427 4414381 4253480 4268876 4125307 4034161 4022188 3817440 3772301 3844552
4521 3844552 3659308 3463541 3276639 3152731 3117874 3021182 3122763 3131597 2923655 2878027
4511 2878027 2925053 2783249 2705725 2595727 2584132 2602187 2616365 2718538 2612424 2656820 2594016
4500 2594016 2598830 2513987 2503275 2572661 2523945 2395191 2359774 2411633 2361723 2344108 2318764
4489 2318764 2367322 2378657 2268073 2235111 2103568 1987624 2011047 1860294 1856769 1860128 1869655
4478 1869655 1901810 2072664 2026387 1973506 1914700 1961718 2043125 1970513 1884858 1844115 1793042
4467 1793042 1671249 1721736 1578234 1481443 1647013 1747695 1705846 1704625 1690010 1718529 1748744
4456 1748744 1627000 1429940 1470225 1586103 1554641 1595326 1553007 1650007 1527260 1537081 1531579
4445 1531579 1440501 1458671 1436058 1397436 1444886 1480052 1514328 1431813 1454013 1457649 1372125 1328558
4433 1328558 1388633 1413670 1303839 1294372 1147110 1324013 1420734 1415444 1350268 1314159 1290553
4422 1290553 1212981 1240312 1300643 1286703 1320956 1316769 1336213 1224342 1213860 1346424 1326454
4411 1326454 1365500 1394500 1250557 1275451 1270339 1329371 1308145 1341328 1300517 1325585 1226214
4400 1226214 1267096 1257222 1311210 1367355 1257010 1218989 1107278 1261741 1215957 1212269 1402985
4389 1402985 1333194 1205812 1238723 1269708 1232570 1197247 1150559 1200207 1225544 1317214 1354739
4378 1354739 1326196 1263073 1326099 1424606 1505237 1361511 1360382 1382217 1348877 1363224 1313645
4367 1313645 1257165 1333322 1395828 1375529 1422597 1281116 1396188 1474801 1648489 1545693 1505383
4356 1505383 1560944 1654683 1650579 1675658 1722326 1711431 1802955 1897260 1848416 1944215 1915098 1942217
4344 1942217 1993546 2042779 2150195 2298172 2384744 2323159 2377372 2458395 2455000 2554501 2581600
4333 2581600 2796763 2880247 3064781 3046612 3094534 3232917 3294409 3509069 3662165 3772099
4323 3772099 3793215 3982874 4152027 4176765 4478100 4746960 4954176 5216501 5393825 5582897
4313 5582897 5730356 5985460 6217209 6376328 6753809 7123961 7357956 7517617 7850840 8120878
4303 8120878 8482835 8890553 9135895 9433903 9788403 10224340 10648849 11083753 11303328 11733627
4293 11733627 12178683 12605049 12981613 13510283 13946541 14437435 15092197 15665112 16177133
4284 16177133 16758078 17199231 17807166 18417253 18836928 19260409 19749988 20281183 20828685
4275 20828685 21303399 21921444 22600804 23241784 23966038 24602923 25218413 25776470 26195503
4266 26195503 26441358 26542260 26749952 26875314 27188143 27433901 27743762 28156373 28545400
4257 28545400 28948064 29176379 29346914 29428396 29288268 29173136 28585003 27992440 27675318 27308743
4247 27308743 27162203 26857177 26547802 26576405 26424275 26316799 25856129 25361509 24799998 24019130
4237 24019130 23247059 22471139 21837375 20931778 20072451 19429846 18888920 18345427 17816148
4228 17816148 17206023 16657116 16285175 15959909 15586398 15187167 14846402 14456306 14430544 14490269
4218 14490269 14342357 14315874 14436204 14625545 15086326 15868092 16761295 17831629 19450084
4209 19450084 21668570 24299229 28148341 33812453 36474814 32323857 26159672 21282132
4201 21282132 17996321 15595330 13872758 12413365 11365436 10481545 9788319 9026005 8548294
4192 8548294 8106239 7706623 7381048 6894746 6429880 6069895 5816361 5565643 5397951 5172788
4182 5172788 4982290 4746200 4634849 4454471 4283688 4230424 4159966 3934929 3842164 3780154
4172 3780154 3826354 3711202 3644486 3393987 3462018 3450735 3277483 3220007 3066800 3017403 2826505
4161 2826505 2783938 2870422 2831617 2699681 2700496 2579431 2574668 2461333 2426117 2306213 2346466
4150 2346466 2340204 2425020 2382834 2205675 2350071 2250672 2140864 2085780 2012043 2067773 2075207
4139 2075207 2071982 2083546 2091617 2010271 2009109 2150135 2077360 2081771 2015602 1912007 1927750 1914820
4127 1914820 1900062 1915573 1935976 1931281 1987652 1907547 1925532 1845874 1813637 1829471 1946432
4116 1946432 2099355 2014577 1985995 1891565 1872863 1863768 1854928 1761296 1799316 1837212 1760829 1852859
4104 1852859 2093647 2114986 2099835 2160590 2054566 1918628 1929039 2003814 2104443 2011505 1936208
4093 1936208 1925618 1983557 1949303 1948957 1902944 1899309 2113379 2153879 2050814 2088636 2022969 2014036
4081 2014036 2103658 2039426 1925288 1925057 1857944 1973531 1897086 1864306 1997949 2057978 2100848
4070 2100848 2074114 2054418 1994783 1926276 1902614 1869546 2034601 2185600 2115748 2194025 2186441
4059 2186441 2133502 2207063 2252552 2519320 2522654 2425102 2367865 2571104 2770787 2685904 2865927
4048 2865927 2814685 2867684 3004598 3007272 2924095 2946549 3061642 3133035 3194903 3148032 3112645
4037 3112645 3292199 3407298 3451250 3350535 3341379 3537601 3785838 3924790 3981411 3948437
4027 3948437 3942880 3991009 3987657 4091226 4239907 4264434 4379417 4431843 4408666 4396417 4417420
4016 4417420 4617692 4770149 4933188 4977924 5113566 5109790 5261890 5321415 5418104 5602231
4006 5602231 5696926 5951312 6031868 6177415 6197704 6247856 6278778 6239753 6251687 6322381 6519488
3995 6519488 6711929 6830491 7131915 7283782 7297867 7258873 7287661 7345434 7402959 7551515
3985 7551515 7850743 7881677 7923387 8118633 8216571 8323614 8339984 8775075 8960380 8974299
3975 8974299 9139860 9202705 9459067 9604163 9608217 9724786 9968482 10002725 9909669 10117758
3965 10117758 10326769 10435627 10642618 10677233 10807065 10944692 10933490 11043631 11148566 11169058
3955 11169058 11181421 11267084 11431560 11569680 11689039 11651535 11662796 11713256 11842437 12035380
3945 12035380 12168777 12087555 12082525 12123785 12225220 12237120 12307143 12493730 12635785 12680320 12695840
3934 12695840 12800580 12792940 12969303 13051787 13077590 13051152 13127656 13168144 13161882 13305589 13278683
3923 13278683 13434586 13552964 13758206 13831137 14031606 14101555 14056373 14256083 14377214 14628144
3913 14628144 14797925 14896661 14836474 14835420 14979176 15020746 15145130 15165002 15198588 15239375 15253019
3902 15253019 15421251 15388067 15315572 15201271 15357932 15329489 15102196 14922079 14859345 14870394
3892 14870394 14846961 14744195 14633792 14473226 14376307 14364227 14268946 14111958 14030493 13866471
3882 13866471 13701134 13638793 13383724 13406831 13399029 13256700 13365560 13298248 13206053 13059441
3872 13059441 13019777 12765691 12596537 12621356 12673060 12680709 12748241 12699359 12660056 12598100 12538871
3861 12538871 12440975 12649292 12544938 12502289 12572407 12592455 12662139 12527929 12638904 12491381
3851 12491381 12443112 12515703 12716053 12891678 13017446 13272281 13440564 13599531 13976860 14439675
3841 14439675 14792965 15184648 15612125 16229854 16868732 17494406 18300298 19247631 20233174
3832 20233174 21193139 22218063 23620217 25026727 26778900 28559030 30573020 32897527
3824 32897527 35166408 37785052 40576153 43598455 46713463 49914931 53211022 56390177
3816 56390177 59292602 62092958 64271204 65904008 67194254 67789145 68184647 68402939 68332467
3807 68332467 68462064 68414968 68498097 68679504 68770133 68776280 68601776 68270593 67367487 65679370
3797 65679370 63538830 60951810 58198589 55063028 51948791 48861013 45906483 43022465
3789 43022465 40397037 38023267 35892948 33932137 32288305 30556480 29122900 27640191
3781 27640191 26467000 25419653 24443370 23554277 22691726 22037605 21192469 20546826 19977003
3772 19977003 19359580 18917520 18591950 18204628 17834308 17389310 16932980 16624988 16542364 16355598
3762 16355598 16157803 16071840 15899725 15751524 15632352 15743468 15595165 15484221 15541329 15580000
3752 15580000 15698223 15796845 16049917 16335911 16211780 16306256 16605823 16561837 16777910 17097798
3742 17097798 17266093 17514804 17728190 17885730 18117874 18466114 18710945 19000027 19340209
3733 19340209 19597159 19918644 20341041 20684819 20921281 21359518 21660710 22049291 22230823
3724 22230823 22412650 22417429 22540089 22792247 22831419 22792496 22890760 22812728 22931482 22964977 23018031
3713 23018031 23090871 23220969 23382735 23661246 23874776 24109906 24197887 24546807 24882234 25278596
3703 25278596 25716937 26030259 26307888 26887744 27360747 27720173 28239319 28742206 29161308
3694 29161308 29425845 29846075 30171911 30407117 30444218 30466312 30487418 30091566 29592085 29123483
3684 29123483 28783670 28148063 27554060 26918565 26248366 25791303 25404308 25095763 24965622
3675 24965622 24885810 24888181 24852718 24848984 25092829 25167009 25360593 25584331 26021020 26516518 26978411
3664 26978411 27355131 28027744 28785802 29620407 30343348 31303507 32305247 33490518 34888574
3655 34888574 36294968 37763026 39606478 41765133 44068556 46634338 49582991 52799158
3647 52799158 56410291 60463714 64830157 69522783 74546546 79553882 84629250 89663549
3639 89663549 94473835 99021273 102907580 106273478 109070569 111266046 112939191 114125343
3631 114125343 114697192 114855536 114858411 114664621 114392731 114035766 113408164 112918887 112221672 110999049
3621 110999049 109688439 107803001 105538284 102698463 99432122 95844209 91704644 87235996
3613 87235996 82712904 78168785 73505364 69004435 64946344 61102097 57443020 53952216
3605 53952216 50755753 47738226 45021132 42613395 40472871 38446168 36655847 34840766
3597 34840766 33231944 31912141 30571372 29326343 28131597 27102229 26296602 25427416
3589 25427416 24709583 24135873 23599491 22975215 22585142 22121953 21627087 21447897 21196720
3580 21196720 21052476 21095179 21313105 21367590 21537686 21815578 22075576 22465601 22804187 22974855
3570 22974855 23301409 23499522 23939792 24116662 23984698 23758790 23430826 22906214 22601038
3561 22601038 22033426 21392447 20810703 20439905 19895706 19147126 18711198 18278620 17927329
3552 17927329 17575097 17380293 17169070 16855197 16788162 16690919 16574770 16533858 16540642 16533874 16492782
3541 16492782 16482102 16623542 16707194 16721702 16807800 16893670 17092113 17272148 17506837 17755990
3531 17755990 18007032 18317997 18606217 18944134 19266171 19772117 20252282 20707887 21250077
3522 21250077 21923898 22640892 23269975 23905233 24679235 25635570 26526957 27615499 28665991
3513 28665991 29658508 31017518 32674444 34153247 35696066 37393374 39294717 41173528
3505 41173528 43331749 45566804 47921640 50607010 53524400 56561333 59752473 63184181
3497 63184181 66904721 70858797 75103079 79703709 84620857 89815779 95393430 101276744
3489 101276744 107556661 114050538 120618263 127085801 133335805 139206299 144351195 148594867
3481 148594867 151674171 153747421 154701134 154998161 154680598 153682933 152749560 151850582 150737064
3472 150737064 149771635 148668604 147164428 145148873 142440009 138834167 134379243 129192730
3464 129192730 123176957 116577179 109670819 102643860 95943761 89645118 83552839 77953263
3456 77953263 72803060 68051156 63797893 59947318 56364704 53106497 50268604 47507865
3448 47507865 44928675 42646738 40531148 38568923 36819755 35239349 33694583 32229854
3440 32229854 30854802 29708191 28552046 27553712 26649292 25780081 24974380 24118401 23360186
3431 23360186 22706831 22173868 21679644 21061589 20481713 19956232 19603433 19289183 18879935
3422 18879935 18632341 18242324 17842734 17638037 17466298 17255691 17053903 16863788 16682605
3413 16682605 16707777 16538464 16348303 16487925 16517609 16447310 16384109 16549844 16586068 16688557
3403 16688557 16687500 16874948 17152770 17325790 17534898 17689474 17915171 18258102 18519091 18739818
3393 18739818 18875232 18926353 18926882 18892100 18864299 18633392 18375233 18044225 17689912 17502398
3383 17502398 17168447 16654990 16315384 16049994 15752887 15563951 15486329 15448606 15452604 15551893
3373 15551893 15593865 15630465 15785285 16140034 16425057 16811233 17074832 17471025 17990139 18450447
3363 18450447 19043488 19618698 20261612 20825572 21680013 22622154 23370198 24197366 25200816
3354 25200816 26060909 27103436 28257557 29374333 30563036 31813365 33176335 34799076
3346 34799076 36427176 38174092 40122890 42067241 43870605 45756546 47728172 49308876
3338 49308876 50932123 52435709 53697794 54714090 55536069 56077317 56167542 56154745 55397307
3329 55397307 54525641 53468601 52481050 51380041 50375063 49564984 48629541 47935819 47455327
3320 47455327 47111463 47159279 47488574 47927080 48401515 48977427 49891281 50696915 51454552 51963597
3310 51963597 52193099 52121781 51672707 50938163 49647106 48062439 46256939 44165442 41911821
3301 41911821 39799861 37515008 35232000 33160879 31207933 29381318 27647941 25990946
3293 25990946 24634274 23369508 22178881 21104388 19982252 19169912 18432763 17769103 16932267
3284 16932267 16302852 15761290 15299278 15009200 14662187 14245008 13983866 13821093 13696630
3275 13696630 13450372 13254660 13222483 13201936 13063906 13196439 13227835 13367025 13652431 13879524
3265 13879524 14266252 14426412 14381042 14186238 13953775 14061598 14151240 14131907 14246981 14446683
3255 14446683 14532521 14766364 14883508 14832345 14668626 14360613 14136957 13787530 13285521 12917096
3245 12917096 12409259 11972500 11564303 11154867 10892948 10582363 10412160 10393354 10383781 10028106
3235 10028106 9514642 9069956 8667494 8252813 7906443 7737649 7536299 7346715 7228587
3226 7228587 6954788 6747360 6629824 6616143 6476169 6431138 6308550 6191393 6154646 6111791
3216 6111791 6017394 6036792 6057783 5932686 5998986 5994224 6034613 6038464 6081765 6105553 5987135
3205 5987135 6000764 6041727 6122623 6129574 6098842 6175767 6160076 6207375 6229758 6147057 6320659
3194 6320659 6244633 6270993 6350400 6544391 6624275 6657258 6611712 6533761 6605754 6699815 6666678
3183 6666678 6699605 6622116 6623193 6784832 6791767 6826811 6805409 6829512 6915026 7036141 7094296
3172 7094296 7048406 7058127 7215299 7253755 7351606 7376457 7506241 7536310 7603284 7827027 8015016
3161 8015016 8102861 8208057 8231212 8376133 8446506 8527140 8691739 8936233 9050591 9224099
3151 9224099 9400695 9592091 9807533 10000430 10267872 10495367 10788693 10839764 10988918 11302827
3141 11302827 11789335 12028762 12313663 12622347 12966889 13342804 13613690 14191594 14902357
3132 14902357 15365263 15681408 16200747 16849032 17512913 18240307 19106714 19724445 20493013
3123 20493013 21265341 22157182 23175745 24208754 25387095 26733434 28002572 29401967
3115 29401967 30874625 32601423 34507735 36353373 38432048 40603021 43252027 45983054
3107 45983054 48741392 51914516 55325410 59010100 63113562 67754109 72680030 77890599
3099 77890599 83372518 89332412 95719647 102328411 109425750 116791897 124482746 132190510
3091 132190510 140176666 148411675 157209371 166433357 176116349 186400401 197389621 209221351
3083 209221351 222458763 237517281 254633534 274295444 295946515 318353280 339266734
3076 339266734 354510669 359278231 351057876 331394986 304745684 276073845 248608592
3069 248608592 223833455 202311740 183869407 167852714 153894570 141621537 130705839
3062 130705839 121005363 112207103 104346212 97201269 90734231 84599989 79211979 74369550
3054 74369550 69849915 65802681 62147044 58540409 55347669 52468297 49674227 47210164
3046 47210164 45101900 43114029 41120323 39405873 37781079 36100490 34676468 33220730
3038 33220730 31748207 30417656 29185169 28075943 27005878 25986881 24930761 24174581
3030 24174581 23413177 22762227 21775210 21049835 20378168 19766316 19110454 18492295 17914479
3021 17914479 17488877 17050536 16595078 16131016 15593912 15094842 14663017 14290249 13978824
3012 13978824 13483947 13033154 12802026 12415322 12007688 11705593 11418065 11117946 10932068
3003 10932068 10734669 10519727 10226757 10040267 9843490 9536418 9386338 9221208 8892617
2994 8892617 8771739 8655018 8654679 8514897 8339214 8101801 7951416 7782403 7797955 7655907
2984 7655907 7462336 7317303 7287098 7124276 7027445 6876265 6801794 6780195 6607357 6512766
2974 6512766 6345115 6110156 5998232 5892937 5788621 5758724 5765073 5800912 5547715 5464385
2964 5464385 5460481 5280187 5137005 5085190 5145707 5073817 5028852 5004274 5134021 4993051 4879317
2953 4879317 4758150 4761735 4728830 4555443 4480260 4377972 4249202 4089028 4148629 4037803
2943 4037803 3952939 3985712 3941343 3760497 3721008 3800956 3802166 3793649 3869036 3746309 3664671
2932 3664671 3600416 3477303 3631934 3603092 3522159 3548000 3415196 3316332 3199902 3091764
2922 3091764 2973992 2991242 3183274 3252702 3073182 2895250 2926767 2996742 2860139 2869023 2914210
2911 2914210 2835010 2785860 2787214 2817282 2844196 2694502 2558003 2511993 2453971 2268636 2274018
2900 2274018 2168017 2074394 2224869 2188397 2123472 2037846 1892944 1881568 2045170 2108076 2025562
2889 2025562 2042021 1845346 1730326 1678115 1797902 1802715 1739571 1642890 1649305 1635723 1556097
2878 1556097 1575574 1510726 1410788 1466399 1533972 1593092 1491733 1426108 1442763 1366948 1419599
2867 1419599 1346148 1358019 1323614 1281650 1335932 1276989 1056248 1274971 1412892 1447498 1355947
2856 1355947 1297108 1248878 1213725 1203679 1215698 1126970 1197765 1142312 1126154 1120150 1208550 1131375
2844 1131375 1083974 1142743 1122347 1202128 1100129 1044748 1041247 1205142 1118613 1175486 1095292
2833 1095292 1192336 1188583 1063144 1050911 1084797 1206629 1085043 994695 1062216 1148012 1116386
2822 1116386 1056292 1171952 1208666 1282415 1233801 1263571 1229593 1144012 1275628 1204669 1231822
2811 1231822 1438223 1340765 1328457 1373031 1505718 1460495 1520779 1660220 1572091 1677053 1877135
2800 1877135 1936144 1875709 1912476 2085533 2159455 2145376 2148522 2167842 2331885 2308538 2124557
2789 2124557 2036216 2087275 1964702 1794767 1578789 1603267 1550460 1461147 1300551 1212651 1211301
2778 1211301 1116203 1084180 1009631 1048227 1176373 1112104 914461 895341 836571 745536 767442
2767 767442 670669 641566 650120 687893 762915 795878 699238 629844 687531 743338 708926 714230
2755 714230 726566 648955 614554 436318 449195 461656 519373 547076 613153 584366 469352
2744 469352 401517 453951 461775 410594 444278 524050 468760 268214 285898 450418 467727
2733 467727 394595 354050 328503 417582 330052 329873 122919 202806 320007 271758 183298 290355
2721 290355 404724 386098 448312 478216 424330 305126 306711 349929 269243 230436 143333
2710 143333 175538 205039 334463 425952 312864 250868 267080 218189 215448 306005 319441
2699 319441 260754 291324 318495 306036 248452 197980 93730 202262 251701 93959 53963
2688 53963 167476 144090 126526 151636 143828 153357 159451 258883 229070 294282 192689 227124
2676 227124 252185 278217 344633 146472 136740 161855 128249 238089 108134 181543 108493
2665 108493 168625 138488 75534 74104 61299 195784 249132 240127 143426 208809 313616 316405
2653 316405 304800 277971 312357 358763 190768 159772 110492 -11310 64224 111541 215110
2642 215110 167926 154526 187788 288086 195217 170702 280978 221706 115230 140712 69825
2631 69825 102168 102903 212806 195792 128057 100656 154629 60388 -77385 120914 220731 231239
2619 231239 139945 -73665 -9357 65095 147481 153041 21726 -52360 -3150 226259 205012
2608 205012 157948 132630 54335 72786 47523 25786 67334 88976 46390 5006 83076 27018
2596 27018 -81887 -43320 -44665 55578 79994 71900 139307 24089 38515 143220 97434
2585 97434 45550 60627 83051 -46012 75116 114488 -29982 110472 151006 124114 62063
2574 62063 104084 2133 -14083 -43642 -58181 -32330 -27490 135653 198112 170428 83731 -109187
2562 -109187 -130128 -110943 -124348 -116405 -76804 -116623 -124914 -210359 -35372 -112806 -57535 -145621
2550 -145621 -141366 60359 119553 48221 58454 69567 33988 -37439 -19510 22259 50719 195039
2538 195039 76579 -3065 -71788 -183529 -139165 -27576 -74637 -97387 69026 -84663 -213910
2527 -213910 -2795 46545 102455 133136 78959 11647 86059 78434 -2763 92345 195376
2516 195376 133863 20668 -44405 -4783 134051 -22385 -221820 -272976 -204227 -58621 -78710
2505 -78710 -86245 -5477 -24129 -140335 -134510 -134252 -141610 -57128 -44569 39427 27212 -104321
2493 -104321 -113422 -125883 -106037 2464 9640 -14313 76041 -99909 -99657 -95128 -152604 -78928
2481 -78928 214 15106 -100826 -125396 -125884 -135803 -109585 -63248 -9139 -38685 24183 -95562
2469 -95562 -125547 8325 -40004 -6299 -106971 -141531 -21987 59359 55964 24757 -120854
2458 -120854 -15018 37225 -19920 -178812 -156002 -97965 30285 -14335 -99247 57935 143073
2447 143073 -40634 -159932 15122 -8439 -23423 -82548 -38165 -99701 71297 -24042 36930
2436 36930 -35787 -152891 -126021 -103322 -12254 -37195 -55035 -33969 7984 -38217 -121865 -243618
2424 -243618 -122475 -51692 -150413 -1547 -61039 57523 48907 -8083 -172764 -61075 44500
2413 44500 8428 64028 -374 -129597 -125264 -185259 -93607 -150207 -116401 43853 82222 47835
2401 47835 8987 -65656 -156637 -76965 29213 36004 19903 12787 -12196 16582 -185068 -116024
2389 -116024 -71257 -18008 -7912 -52325 38473 33288 37148 -33717 -86352 22396 -2177 -136354
2377 -136354 -95799 -113368 -75448 -43559 -40289 54561 -16591 -68683 -123657 -70395 -78219 4382
2365 4382 28261 -31880 -84274 -33128 -80760 -56767 -57169 75544 19851 116212 151465 143618
2353 143618 153772 37886 -51912 100269 124350 178295 184030 200213 177230 128880 320753
2342 320753 213230 204952 202772 137565 94021 177821 219737 296658 397137 454053 439722 506076
2330 506076 482702 428817 625714 695912 821187 889734 986967 1003220 1090525 1088239 1214225
2319 1214225 1360347 1408936 1591144 1757168 2148710 2679726 3146196 3686543 4388318 5494627
2309 5494627 6583760 6565449 5426394 4155947 3347362 2901284 2467664 2028593 1837751
2300 1837751 1707948 1542555 1358756 1196601 1125500 981767 888247 739931 809627 720556
2290 720556 542803 483010 486819 535752 534773 551621 629424 497194 312063 300404 266848 243430
2278 243430 277211 219339 60911 6027 53745 209148 205966 76696 80676 207452 244777
2267 244777 110530 42179 130756 128325 81356 -41689 -76270 -84015 59352 -65673 -111161
2256 -111161 -94914 -66165 -138008 -211948 -33868 89335 105179 102407 -4453 -45635 -57813
2245 -57813 -50469 -36027 -34327 -3871 54384 92604 56687 -18778 -103893 8479 17895 61625
2233 61625 72654 -181725 -295362 -259659 -162614 -112009 -65087 -37490 -38774 -32518 -7943 -68753
2221 -68753 -42172 -66817 -42954 -74417 -13620 52718 159833 50886 -54639 -35404 -156194
2210 -156194 -100894 -32703 -51331 -49643 -55637 -136198 -288699 -159480 -152179 -200167 -95992 -68109
2198 -68109 -32815 -39202 -33198 -43807 -77661 -181879 -172950 -59177 -51028 27582 127655 66517
2186 66517 -102908 -68198 -30845 -126278 -281092 -147285 -87787 -52359 -85199 -81434 -3969
2175 -3969 -99548 -24042 30904 -32479 -23113 97664 -19307 -42893 53720 -141418 -104011 -96438
2163 -96438 -52299 54979 24778 -57848 -113215 -13785 78285 130034 -73605 -184578 -142156
2152 -142156 -116589 -137083 -132308 -30117 -92384 -67668 -96580 -176259 -151607 -193238 10512
2141 10512 15112 -28368 28998 99883 -137653 -20084 27357 44364 109461 9720 7711 65872
2129 65872 23614 -27626 -153992 -152892 -41990 -163084 -195569 -115816 -100602 24818 -21742
2118 -21742 53598 -117344 -176966 -162603 -160416 -273975 -198611 -154018 -183211 -89642 -4117 -56905
2106 -56905 -127480 -138611 -169724 -124389 -55715 56913 -34129 -45768 -94894 -236795 -148092
2095 -148092 -119563 36733 50824 44904 -62057 -234142 -272247 -333169 -262181 -191215 -91551
2084 -91551 -59811 -235678 -150243 -51264 -165540 -12199 1515 -59243 -80090 -158704 -211382
2073 -211382 -216371 -193871 -56824 6312 25854 -96510 -96133 -11308 -103031 -140654 -95571 -255742
2061 -255742 -141948 -17288 -133058 -92116 -129196 -257163 -165377 11917 20545 -40870 -30900
2050 -30900 -64011 -77800 -45387 -147792 -191456 -161191 -250423 -221254 -148618 -220454 -254003 -211610
2038 -211610 -108823 -10166 -105833 23442 -8325 -6300 6296 114033 21421 -267699 -287817
2027 -287817 -77201 -63775 -106327 -41252 2794 -79842 -89601 -157473 -131389 -228708 -193151 -199211
2015 -199211 -57678 -19368 -59495 -240101 -297993 -175276 -132673 -129840 -187878 -218223 -119956
2004 -119956 -23451 -24523 38667 -27998 29941 64314 33600 -79327 -189553 -90066 -5754
1993 -5754 25779 -76555 -109235 1876 -59305 -111156 -47077 -133183 -55589 8900 -74914 -124727
1981 -124727 -262707 -214566 -156581 -160672 -203942 -97707 -59792 -61193 -84888 -165060 -162229 -108207
1969 -108207 -99583 -87873 -130936 -173237 -106663 39617 -31496 -118734 -129472 -223060 -254676 -55265
1957 -55265 -207149 -333674 -201603 -205376 -218465 -152863 -231317 -169372 -237961 -237877 -152520 -177804
1945 -177804 -106152 -134667 -112842 -58244 -19182 -105758 -206254 -165171 -59160 -60522 -165395
1934 -165395 -292267 -338515 -36654 -201200 -73231 -89250 -162302 -101080 -95855 -136452 -164385
1923 -164385 -4073 -42418 -85778 -110361 -153700 -141959 -111253 -110717 -86152 -133224 -87683 -29138
1911 -29138 -65908 -104847 -156092 -26696 -195038 -299998 -269647 -275604 -197356 -195937 -194735 -142209
1899 -142209 46104 29148 9479 -78674 -76467 -440 -36824 -114898 -119464 -43298 -132872 -102337
1887 -102337 -21382 -72129 -83465 -75138 -144689 -140672 -154307 -232542 -234482 -272769 -302754 -128535
1875 -128535 -113022 -218581 -299609 -237052 -112384 -137186 -179623 -208185 -248626 -186042 -112845
1864 -112845 -36310 -45596 -67824 -167191 -225960 -58854 -94304 -157724 -266735 -237642 -190266
1853 -190266 -76570 -73906 -130296 -122822 -18660 -15695 -102354 -166043 -152012 -98889 -224985 -227525
1841 -227525 -109411 -158756 -163307 -138389 -125319 -31224 -54414 -118830 -144088 -272179 -188569
1830 -188569 -191861 -178526 -306110 -211759 -130377 -208837 -249375 -183656 -188075 -272602 -184274 -175923
1818 -175923 -144436 -124872 -199787 -264231 -285930 -129754 -91014 -194002 -104128 -53151 -92828
1807 -92828 -250299 -198813 -45695 -146206 -48779 -74302 -20948 -82841 -54950 -150573 -161366
1796 -161366 -63445 -95952 -119227 -155979 -169066 -127830 -134008 -140665 -94151 -103056 -341602 -391476
1784 -391476 -277818 -137150 -134166 -196811 -116279 -155809 -115043 -57963 -152381 -203024 -227982
1773 -227982 -110428 32839 -36364 -36791 -170309 -110801 -139351 -158349 -249264 -297637 -244120
1762 -244120 -176631 -209419 -61782 -93556 -17115 -31830 -202077 -107235 -19145 -55436 4961
1751 4961 26508 -75954 -233214 -131039 -133124 -303119 -449756 -218999 -37500 46115 -81906
1740 -81906 -121366 -175898 1934 50931 -163923 -228935 -152680 -217131 -161274 -71892 -198102
1729 -198102 -284212 -239522 -217744 -336329 -126562 -187907 -246693 -242717 -235118 -96947 -71210
1718 -71210 -88209 -6895 13928 -29695 -168866 -46909 -52427 -137389 -212818 -230240 -183100 -192740
1706 -192740 -108807 -122203 -139882 -124737 -86874 -197788 -215715 -132089 -80368 -55780 -156822
1695 -156822 -114021 -79943 -112301 -42764 -89692 -169194 -72310 -85497 -27460 -65638 -69313 -197849
1683 -197849 -119937 -92251 -72248 -11984 -23559 -44949 -96663 -34885 -89775 -148605 -84449 -57509
1671 -57509 -20745 -56573 -153697 -169581 -134018 -125678 -293996 -294557 -260756 -322256 -284512 -309945
1659 -309945 -199511 -112523 -109812 -112775 -151696 -14201 -28727 -120504 -274791 -204396 -175910
1648 -175910 -197498 -202305 -87166 58280 30329 -23841 -49876 21147 -10893 -35494 -28907 -111787
1636 -111787 -126743 -203763 -214981 -33592 -121200 -72498 -145324 -140138 -212459 -268334 -195048 -180254
1624 -180254 -114664 -99562 -194058 -238758 -218212 -144677 -34772 -61728 -98790 -238699 -249488
1613 -249488 -295451 -122354 -135331 -142989 -169375 -238547 -134859 -188400 -245665 -292683 -235177
1602 -235177 -120606 -132191 -212996 -177028 -162089 -179110 -185565 -99071 -110980 19113 -39642
1591 -39642 -216002 -180652 -107126 -115932 -42000 -67394 -101651 -157870 -84512 -91381 -35657 -110774
1579 -110774 -73083 108148 -11943 48579 46636 34446 26234 -51083 -170690 -184726 -177308 -52993
1567 -52993 -96994 -116043 36173 95553 40519 4231 -118412 -189364 -120672 -106282 -100281 -72320
1555 -72320 -73310 -103484 -111433 -137247 -145362 3096 -16613 -43402 -11001 44189 -37556 -142435
1543 -142435 -112411 -38903 -249327 -155626 -19149 -84615 -128670 -139947 -164401 -140782 -138407
1532 -138407 -125710 -10246 94733 115883 57128 -94213 -168636 -150228 -186459 -190496 -204900
1521 -204900 -149483 -94244 40340 74094 -63625 -286808 -188413 -88153 -139945 -169599 -105002
1510 -105002 -160950 -167902 2960 88204 -104052 -138150 -159782 -163779 -104163 -58092 -39369 -25804
1498 -25804 -102887 -105731 18518 -5710 -115051 -128128 -251546 -258642 -147501 -208988 -209066 -178133
1486 -178133 -242476 -281442 -230843 -218866 -142924 -215529 -106583 -110302 -144159 -103170 -86627 -198765
1474 -198765 -205692 -123386 -194208 -105343 -89806 -96197 -41508 -43609 -42267 -47669 -4881 -26846 -42858
1461 -42858 -52759 -116488 -172664 -161833 -154981 -64065 -9787 -32439 -16079 -36289 -52370 -59217
1449 -59217 -83563 -120607 -97841 -127262 -162106 -132933 -201729 -236653 -160126 -134418 -229275 -275875
1437 -275875 -154621 -317640 -272494 -172576 -147881 -179181 -273448 -272594 -194241 -265292 -325933 -286225
1425 -286225 -152113 -99011 -167174 -224707 -425108 -286755 -305154 -205076 -140301 -112906 -180590
1414 -180590 -201580 -131686 -144697 -11662 49492 -78889 -43274 55861 -69077 -112255 -179190
1403 -179190 -44075 -110595 -127706 -82961 37775 4156 -143366 -165167 -196928 -242483 -141979
1392 -141979 -84050 -97360 -158700 -126403 -120116 -167354 -220248 -290433 -203042 -181401 -95460 -27706
1380 -27706 -117297 -188229 -202383 -72287 -35686 -254313 -192505 -96627 -204862 -363196 -329023
1369 -329023 -324400 -376028 -531636 -485116 -345649 -305646 -204321 -167152 -180429 -141384 -103923
1358 -103923 -138023 -230897 -134567 -180667 -211189 -180262 -214023 -147025 -176289 -180307 -70727 -100776
1346 -100776 -220699 -275415 -114763 -109763 -151489 -233653 -224206 -177153 -86894 6772 -107376
1335 -107376 -54296 -65962 -33529 -96781 -24020 -16354 -119842 -208177 -30126 63681 -28389
1324 -28389 -229387 -277386 -222267 -138558 -104422 -198689 -39767 -164603 -245878 -289123 -262234
1313 -262234 -177725 -203013 -74858 -14784 -69761 -212447 -120626 -121080 -186549 -272105 -267538 -152456
1301 -152456 -59056 -130699 -51549 -32879 -199140 -218839 -202424 -66163 -17308 10614 -18052
1290 -18052 -9493 -86003 -105623 -65493 -133529 -330408 -246331 -131189 -113671 -74646 -121374 -169224
1278 -169224 -136941 -21431 -39774 -69379 -94114 -148669 -10655 31476 -102713 -156663 -204266
1267 -204266 -197592 -94379 -38689 -11846 -93081 -82869 -31020 -132484 -223871 -156902 -71925
1256 -71925 -25992 -94824 -56077 -29296 860 -36883 -90049 -195549 -268346 -193763 -101590 -12467
1244 -12467 -67857 -4938 -73434 -70277 -119157 -32087 -30496 -46857 24984 -123676 -243189 -315459
1232 -315459 -229974 -188695 -216577 -194299 -85661 -138203 -110353 -205431 -267193 -61207 23555
1221 23555 -112140 -55343 -74885 -142041 -26336 -1860 -25866 -99488 6783 15377 -104206
1210 -104206 -79216 -54205 -122096 -165291 -196708 -114790 -182607 -186547 -41523 22376 -53922 19275
1198 19275 18609 66287 -46331 -115749 -113036 -239648 -206228 -189808 -71299 -98261 -169089 -59031
1186 -59031 -166102 -144759 -186621 -195031 -111707 -216280 -208448 -253707 -3769 -3451 32279 73497
1174 73497 -10327 -40636 -25519 60653 -81459 -89500 -176966 -80178 -12067 -36526 -83362 -184321
1162 -184321 -224474 -123103 -81145 -98008 -94302 -110318 -212126 -188283 -87911 -137561 -162573
1151 -162573 15836 -96119 -150579 -55305 -37250 -16034 8 -36909 -171520 -33836 4590
1140 4590 58160 89672 36751 -13492 -68757 -106214 -81425 69423 7554 -25331 19545 -7311
1128 -7311 -7312 37748 3290 36089 26316 -14984 37989 68217 100950 55071 31739 -20987 -69768
1115 -69768 -209871 -143759 -47583 -36552 -62171 -160046 -197363 -196926 -202908 -169770 -103768 -70129
1103 -70129 -114757 -124617 -168794 -98871 -189431 -97487 -86770 -264597 -302246 -188586 -273016 -189641
1091 -189641 -77681 -36693 -135315 -165116 -120114 -126663 -124300 -160646 -121472 -32078 -157142 -176238
1079 -176238 -113374 50001 -100192 -122993 -74265 -203173 -164802 -98559 52813 -149364 -226707
1068 -226707 -204979 -199772 -247734 -168138 -139841 -133576 64792 -11813 -311139 -274076 -185552 -101723
1056 -101723 -213035 -376273 -172201 -82341 -53285 26091 -83139 -268334 -290918 -156404
1046 -156404 -62740 48552 -21572 8006 -14918 -184345 -181281 -145410 -115414 -163341 -167132 -163971
1034 -163971 -225956 -146889 -171690 -96367 -73121 5080 -93309 -276743 -191501 -187170 -269044 -229710
1022 -229710 -216227 -219440 -227221 -89322 -126457 -140416 -37849 -130570 -44717 -56646 -144474 -176965
1010 -176965 -210296 -166189 -245304 -193370 -160701 -127026 -172268 -234359 -233739 -181150 -208111 -93187
998 -93187 -121983 -111119 -141668 -233561 -41453 30649 -53617 -114145 -34896 -16562 -74271 -56481
986 -56481 -52228 36090 -154831 -194941 -212551 -75595 -74808 -173649 -33130 -131319 -109529 -77047
974 -77047 -108496 -113540 -157933 -175082 -54959 -82240 -1508 -30990 -138721 -219466 -215198 -87500
962 -87500 -21650 -202366 -96885 -118648 -169804 -217146 -213261 -33402 -123349 -160871 -196165 -45322
950 -45322 49592 -92261 -209812 -138579 -211887 -255018 -186929 -234620 -125059 -139967 -228411
939 -228411 -85571 -135229 -332380 -246632 -261948 -155791 -153141 -245208 -189047 -249833 -281742
928 -281742 -206676 -285335 -186353 -100609 -119627 -187151 -94381 -182890 -175265 -186240 -150058 -156684
916 -156684 -1425 -93385 -41411 -16846 -86847 -50031 -43355 121657 28515 -16403 -41546 -121180
904 -121180 -82648 -75264 -141474 -191996 -196523 -130059 -99573 -67412 -84626 -75782 -146801 -130567
892 -130567 -168644 -145853 -139778 -110519 1098 -14098 -110691 -139962 -216481 -203561 -171095 -201725
880 -201725 -203041 -141007 -100120 -139575 -74559 -69008 -111323 -208884 -214553 -93479 -80089 -45867
868 -45867 -206981 -219580 -301746 -371556 -305552 -282732 -248845 -61952 -61558 -134436 -139277 -223224
856 -223224 -170762 -92892 -49615 -237127 -236477 -233519 -208689 -78326 -125705 -54693 -176723 -197285
844 -197285 -172218 -108886 -72621 -105949 -219708 -145256 -76360 -195308 -140083 -56538 -82812
833 -82812 -71401 19054 -84499 20469 75809 -124252 -202968 -242253 -215681 -199704 -141913
822 -141913 -201618 -88209 -117117 -170871 -119084 -124148 -223745 -219588 -204560 -304256 -208498 -167907
810 -167907 -313272 -142396 -15515 -4602 29719 -41334 -192364 -287886 -317261 -169938 -134557
799 -134557 -207557 -209699 -211133 -21803 -12210 -43762 -341131 -279856 -287925 -249516 -164435 -155544
787 -155544 -31373 -28689 -119155 -67233 -32853 -99793 -50234 -238827 -354142 -183109 -263202
776 -263202 -367048 -250878 -125074 -94597 -81396 -80213 -40995 -33973 15824 -26208 -113957 -113135
764 -113135 -232823 -221404 -43906 -88656 -194491 -158766 -80455 -174563 -113436 7248 -103629
753 -103629 -256946 -121091 -130400 -192428 -107626 -39635 -70111 -209090 -221770 -87324 -152776
742 -152776 -314968 -132687 -174512 -156535 -84703 5783 32772 -217020 -52959 -11230 -103814
731 -103814 -4861 77653 117922 45496 122917 107672 19485 -88883 -42095 -123816 -180459 -183260
719 -183260 -115048 -51205 15145 -50659 -28771 7633 -112901 -154822 -21574 -109971 -165470
708 -165470 -188732 -142923 -153687 -128647 -120547 -128140 -120241 -196620 -269136 -300901 -189226 -255865
696 -255865 -193973 -165396 -51989 -32442 -123200 -168720 -104151 -72304 66068 25699 -77712
685 -77712 -142453 -249087 -238758 -122529 -177167 -262612 -204540 -228532 -151254 -53338 -134863 -121137
673 -121137 -41136 -99751 -54302 -90017 -194410 -129829 -73064 -56037 -131861 -196843 -277558 6904
661 6904 -75842 -104672 118319 -154257 -284089 -110159 -60079 -67867 -87364 -108536 -134795 -181693
649 -181693 -215229 -171739 -159327 -345838 -234203 -123673 -119941 -128919 -71716 -36098 -91026 -106041
637 -106041 -24663 -44596 -64019 40197 -28930 -50277 -152361 -7255 -50590 -182575 -164364
626 -164364 -131251 -12200 -29348 -31374 -87653 -65029 -94816 -214314 -282837 -218138 -131198 -193347
614 -193347 -254175 -130742 -56825 -83278 2765 -121612 -199350 -68666 -169306 -201364 -152514
603 -152514 -90188 -122516 -90029 -126277 -66855 -31979 33022 -43219 -266913 -256258 -198008 -65629
591 -65629 -68742 -57314 -161489 -124358 -61324 -107410 -44650 -93375 -75983 -89608 -28134 37691
579 37691 -62064 -144044 -38572 -122178 -51863 -35158 -25158 -30511 -112703 -88356 -115046 -100100
567 -100100 -247858 -250095 -13776 113939 82196 1188 -260555 -176016 -110270 -104077 -100883 -144507
555 -144507 -188563 -160496 -87204 -170630 -193234 -305346 -196624 -186369 -187919 -247453 -219355 -115314
543 -115314 -151996 -163494 -218431 -66956 17749 -84407 -182213 -163312 -209159 -256795 -95113
532 -95113 -73155 -33902 -108196 -106818 -40022 -62719 -109382 -154466 -143979 -162781 -210447 -216728
520 -216728 -141966 -199059 -273412 -139677 -167177 -127869 -31793 -161297 -221405 -263573 -346130
509 -346130 -239992 -92010 -150528 -362357 -252636 -127542 -122943 -190319 -134074 -192805 -222697
498 -222697 -59559 -14431 -109984 -170318 -177019 -233314 -185323 -264847 -144684 -71745 -110582 -124958
486 -124958 27143 48969 -74534 -50921 33296 -92549 -108054 -92664 -69557 -74135 -37016
475 -37016 -181046 -138783 -97190 -85876 -190626 -167320 -190084 -269684 -391415 -238286 -75973
464 -75973 -234805 -160756 -153899 -167249 -44894 -21509 -149005 -91990 -126074 -146931 -106466 -137721
452 -137721 -173435 -113987 45594 -945 -110082 -257896 -149630 66819 65965 -745 -262263
441 -262263 -194991 -107308 -155095 -217206 -216359 -167812 -93784 -39171 -197814 -173656 -198733 -240231
429 -240231 -275632 -221892 -123275 -104636 -110446 -148447 -133059 19454 -76734 -129071 -104373 -136773
417 -136773 -116999 -129489 -143088 -78193 -133655 -120980 -106248 -70337 -34517 -57126 -186041 -263590
405 -263590 -140509 29800 51936 -163902 -282402 -249182 -88438 -93334 -76336 -244998 -126076
394 -126076 -290642 -229818 -213780 -224084 -152068 -86836 -16490 -47948 -34139 -86128 -18500 23082
382 23082 -108068 -189239 -240148 -186041 -243350 -229777 -153101 -132867 -200841 -125885 -94607 -74970
370 -74970 81285 46247 103434 -25867 -60725 -70416 -62643 -54995 -130537 -48599 -147535 -186058
358 -186058 -81678 30264 -117850 -84894 -122027 -54368 20507 -45357 -96424 -103039 -136630
347 -136630 -255717 -211235 -185509 -187623 -276419 -255976 -121999 -249431 -353440 -238856 -66029
336 -66029 -27226 -127462 -209103 -154326 -30153 -150080 -91231 -282121 -311553 -224435 -246871
325 -246871 -193263 -133285 -93574 -120452 -118223 -80390 -44284 -125262 -126135 -106433 -80620 -107638
313 -107638 -116725 -28699 -165804 -162307 -154869 -198861 -117157 -93892 -162652 -183478 -155697 -68199
301 -68199 -69060 -90844 -183993 -43945 16483 -140719 -161650 -166759 -215307 -102814 -142589 -123141
289 -123141 -203522 -47928 -91901 -186433 -124844 -136390 -137967 -104491 -228639 -211731 -197632 -294364
277 -294364 -91772 -288235 -259981 -164974 -213615 -72188 -88915 -205333 -364250 -331582 -121996
266 -121996 -26379 -26025 -157609 -183913 -166840 -117177 -49276 -2709 -42053 -80446 -141345 -63744
254 -63744 -208268 -257486 -173431 -305225 -323768 -159826 -112831 -381 67474 -177072 -232680
243 -232680 -223153 -79327 -55080 -105631 -163673 -220141 -188005 -198037 -124146 -151231 -114054 -136411
231 -136411 -185427 -91778 -84630 -7064 -111525 -112680 -59103 -138691 -115094 -172068 -160899 -129895
219 -129895 -220669 -327831 -212147 -140257 -132768 -132657 -119395 -40811 12206 -335 -68422 -93750
207 -93750 -9314 -57244 -107581 -102753 -45266 -88297 -137139 -127040 -149293 -111139 -102742 -167210
195 -167210 -109365 -10549 -158845 -206837 -94817 -135616 -157857 -185044 -208836 -138123 -69266
184 -69266 -41502 -31962 -62456 -71740 -108263 -70619 -196753 -120891 -59390 -115431 -203502 -146619
172 -146619 -24509 -127682 -156446 -110215 -163171 -180484 -90879 -73626 -82191 -183282 -148253
161 -148253 -100422 54680 -117858 -106571 -115510 -54814 37140 -94273 -71272 -129495 -220013
150 -220013 -205911 -156396 -129633 -139753 -155924 -217209 -165255 -49039 -64425 -174012 -268819
$$ [...]
##END NTUPLES=NMR SPECTRUM
##END=
