##TITLE=1H_DE-80H_X3
 200.13MHz, d2o
 8 sc
 
 19ns.26.2.2025
##JCAMPDX= 6.0         $$ Bruker NMR JCAMP-DX V2.0
##DATA TYPE= NMR SPECTRUM
##DATA CLASS= NTUPLES
##ORIGIN= UXNMR, Bruker Analytische Messtechnik GmbH
##OWNER= pz
$$ XWIN-NMR		Version 3.5
$$ Tue Jun 24 12:04:22 2025 Russian Standard Time (UT+4h)  Yarkov@DPX200
##.OBSERVE FREQUENCY= 200.1313
##.OBSERVE NUCLEUS= ^1H
##.ACQUISITION MODE= SIMULTANEOUS
##.ACQUISITION SCHEME= undefined
##.AVERAGES= 8
##.DIGITISER RES= 18
##SPECTROMETER/DATA SYSTEM= spect
##.PULSE SEQUENCE= zg30
##.SOLVENT NAME= DMSO
##.SHIFT REFERENCE= (INTERNAL, DMSO, 0, 15.51)
##AUDIT TRAIL= $$ (NUMBER, WHEN, WHO, WHERE, WHAT)
$$ ##TITLE= Audit trail, XWIN-NMR		Version 3.5
$$ ##JCAMPDX= 5.01
$$ ##ORIGIN= Bruker BioSpin GmbH
$$ ##OWNER= Yarkov
$$ C:/Bruker/XWIN-NMR/data/yarkov2/nmr/H-C/1/pdata/1/auditp.txt
$$ ##AUDIT TRAIL=  $$ (NUMBER, WHEN, WHO, WHERE, WHAT)
(   1,<2025-06-24 12:03:24.00 +0400>,<Yarkov>,<DPX200>,
      <created by zg, POWCHK disabled, PULCHK disabled
       configuration hash MD5:
       00 E9 B6 7A A2 85 ED C7 34 08 36 98 17 FE 4E 26
       data hash MD5: 16K
       83 C0 17 4C DB 0F AA 26 2A 1E 4F 9C F8 B2 9C 15>)
(   2,<2025-06-24 12:03:31.21 +0400>,<Yarkov>,<DPX200>,
      <Start of raw data processing
       efp BC_mod = 2 LB = 0.25 FT_mod = 6 PKNL = 1 PHC0 = -1713.766 PHC1 = 10.1666 SI = 16K 
       data hash MD5: 16K
       F0 26 14 A0 8A BE 04 B8 17 F5 14 8F 49 F7 44 5F>)
(   3,<2025-06-24 12:03:38.07 +0400>,<Yarkov>,<DPX200>,
      <abs ABSG = 5 
       data hash MD5: 16K
       50 09 BC AB 4C 68 8F C9 F1 AB 9E F4 45 C3 16 CB>)
$$ ##END=
$$ 
$$ hash MD5
$$ 0E E7 6B AC BB FC 5D EE 75 22 04 13 32 D1 3F A9
##$RELAX= 
##$RELAX= 
##$RELAX= 
##$RELAX= 
##$RELAX= 
##$RELAX= 
$$ Bruker specific parameters
$$ --------------------------
##$DU= <C:/Bruker/XWIN-NMR>
##$EXPNO= 1
##$NAME= <H-C>
##$PROCNO= 1
##$TYPE= <nmr>
##$USER= <yarkov2>
##$AMP= (0..31)
100 100 100 100 100 100 100 100 100 100 100 100 100 100 100 100 100 100 
100 100 100 100 100 100 100 100 100 100 100 100 100 100 
##$AQSEQ= 0
##$AQ_mod= 1
##$AUNM= <au_zg>
##$AUTOPOS= <>
##$BF1= 200.13
##$BF2= 200.13
##$BF3= 200.13
##$BF4= 200.13
##$BF5= 200.13
##$BF6= 200.13
##$BF7= 200.13
##$BF8= 200.13
##$BYTORDA= 1
##$CFDGTYP= 0
##$CFRGTYP= 5
##$CHEMSTR= <none>
##$CNST= (0..31)
1 1 145 1 1 1 1 1 1 1 1 1 1 1 1 1 1 1 1 1 1 1 1 1 1 1 1 1 1 1 1 1 
##$CPDPRG= <>
##$CPDPRG1= <>
##$CPDPRG2= <>
##$CPDPRG3= <>
##$CPDPRG4= <mlev>
##$CPDPRG5= <mlev>
##$CPDPRG6= <mlev>
##$CPDPRG7= <mlev>
##$CPDPRG8= <mlev>
##$CPDPRGB= <>
##$CPDPRGT= <>
##$D= (0..31)
0 0.7 0 0 0 0 0 0 0 0 0 0.03 0 0 0 0 0 0 0 0 0 0 0 0 0 0 0 0 0 0 0 0 
##$DATE= 1750752203
##$DBL= (0..7)
120 120 120 120 120 120 120 120 
##$DBP= (0..7)
150 150 150 150 150 150 150 150 
##$DBP07= 0
##$DBPNAM0= <>
##$DBPNAM1= <>
##$DBPNAM2= <>
##$DBPNAM3= <>
##$DBPNAM4= <>
##$DBPNAM5= <>
##$DBPNAM6= <>
##$DBPNAM7= <>
##$DBPOAL= (0..7)
0.5 0.5 0.5 0.5 0.5 0.5 0.5 0.5 
##$DBPOFFS= (0..7)
0 0 0 0 0 0 0 0 
##$DE= 6
$$ [...]
##$SUBNAM3= <"">
##$SUBNAM4= <"">
##$SUBNAM5= <"">
##$SUBNAM6= <"">
##$SUBNAM7= <"">
##$SUBNAM8= <"">
##$SUBNAM9= <"">
##$SW= 18.0517328524113
##$SWIBOX= (0..15)
0 0 2 0 0 0 0 0 0 0 0 0 0 0 0 0 
##$SW_h= 3612.71676300578
##$TD= 16384
##$TD0= 1
##$TE= 0
##$TE2= 300
##$TE3= 300
##$TEG= 300
##$TL= (0..7)
0 120 120 120 120 120 120 120 
##$TP= (0..7)
150 150 150 150 150 150 150 150 
##$TP07= 0
##$TPNAME0= <>
##$TPNAME1= <>
##$TPNAME2= <>
##$TPNAME3= <>
##$TPNAME4= <>
##$TPNAME5= <>
##$TPNAME6= <>
##$TPNAME7= <>
##$TPOAL= (0..7)
0.5 0.5 0.5 0.5 0.5 0.5 0.5 0.5 
##$TPOFFS= (0..7)
0 0 0 0 0 0 0 0 
##$TUNHIN= 0
##$TUNHOUT= 0
##$TUNXOUT= 0
##$USERA1= <user>
##$USERA2= <user>
##$USERA3= <user>
##$USERA4= <user>
##$USERA5= <user>
##$V9= 5
##$VALIST= <valist>
##$VCLIST= <CCCCCCCCCCCCCCC>
##$VD= 0
##$VDLIST= <DDDDDDDDDDDDDDD>
##$VPLIST= <PPPPPPPPPPPPPPP>
##$VTLIST= <TTTTTTTTTTTTTTT>
##$WBST= 1024
##$WBSW= 4
##$XGAIN= (0..3)
0 0 0 0 
##$XL= 0
##$YL= 0
##$YMAX_a= 123984
##$YMIN_a= -92684
##$ZGOPTNS= <>
##$ZL1= 120
##$ZL2= 120
##$ZL3= 120
##$ZL4= 120
##$ABSF1= 15.50339
##$ABSF2= -2.548459
##$ABSG= 5
##$ABSL= 3
##$ALPHA= 0
##$AQORDER= 0
##$ASSFAC= 0
##$ASSFACI= 0
##$ASSFACX= 0
##$ASSWID= 0
##$AUNMP= <proc_1d>
##$AZFE= 0.1
##$AZFW= 0.1
##$BCFW= 0
##$BC_mod= 2
##$BYTORDP= 0
##$COROFFS= 0
##$CY= -3
##$DATMOD= 1
##$DC= 0
##$DFILT= <>
##$DTYPP= 0
##$F1P= 0
##$F2P= 0
##$FCOR= 1
##$FTSIZE= 16384
##$FT_mod= 6
##$GAMMA= 0
##$GB= 0
##$INTBC= 1
##$INTSCL= 3.241238e-09
##$ISEN= 128
##$LB= 0.25
##$LEV0= 0
##$LPBIN= 0
##$MAXI= 10000
##$MC2= 0
##$MEAN= 0
##$ME_mod= 0
##$MI= 1.114404
##$NCOEF= 0
##$NC_proc= -9
##$NLEV= 6
##$NOISF1= 3.799351
##$NOISF2= 2.8
##$NSP= 0
##$NTH_PI= 0
##$NZP= 0
##$OFFSET= 15.51
##$PC= 1
##$PHC0= -1713.766
##$PHC1= 10.1666
##$PH_mod= 1
##$PKNL= yes
##$PPARMOD= 0
##$PSCAL= 0
##$PSIGN= 0
##$REVERSE= no
##$SF= 200.130002340941
##$SI= 16384
##$SIGF1= 3
##$SIGF2= 2
##$SINO= 0.751879
##$SIOLD= 32768
##$SREGLST= <19F.Aceton>
##$SSB= 0
##$STSI= 16384
##$STSR= 0
##$SW_p= 3612.71676300578
##$SYMM= 0
##$S_DEV= 0
##$TDeff= 16384
##$TDoff= 0
##$TI= <>
##$TILT= no
##$TM1= 0
##$TM2= 0
##$TOPLEV= 0
##$USERP1= <user>
##$USERP2= <user>
##$USERP3= <user>
##$USERP4= <user>
##$USERP5= <user>
##$WDW= 1
##$XDIM= 16384
##$YMAX_p= 351192697
##$YMIN_p= -1645495
$$ End of Bruker specific parameters
$$ ---------------------------------
##NTUPLES= NMR SPECTRUM
##VAR_NAME=  FREQUENCY,     SPECTRUM/REAL,   SPECTRUM/IMAG
##SYMBOL=    X,             R,               I
##VAR_TYPE=  INDEPENDENT,   DEPENDENT,       DEPENDENT
##VAR_FORM=  AFFN,          ASDF,            ASDF
##VAR_DIM=   16384,         16384,           16384
##UNITS=     HZ,            ARBITRARY UNITS, ARBITRARY UNITS
##FACTOR=    0.220516191357247, 1,           1
##FIRST=     3104.01638211412, 0,            0
##LAST=      -508.700380891663, 0,           0
##MIN=       -508.700380891663, -1645495,    0
##MAX=       3104.01638211412, 351192697,    0
$$ Real data points
##PAGE= N=1
##DATA TABLE= (X++(R..R)), XYDATA
$$ [...]
8571A3991514O9393N29735J002544N75165P35528R73133R83830P21972O72490
8562B0255304J118811Q14286O77346Q27020J23388L74892J05982j53514L39050
8553B4482565k746l1070K16220j21686j69526l59778r30349p49878n76457q66046
8543B0891249o47500q96351r21483o23262m60967p27449p47612m87624n52895
8534A4826106l07062m58014j19849l95071j19454l29711j29161K03840J73732
8525A3345356J23979J83374J21636L65925L83894L25099M65943k45691M2394n5943
8515A5055966j46880J2385k9578j12436l40765L9133K4216k95855m73452M1793
8505A3774527n30013q29921l62282m22699k42176o84029n56383l13484n74323
$$ y = [13991514, 14060907, 14590642, 15593186, 16168351, 16903879, 17877012, 18860842, 19582814, 20255304, 21374115, 22188401, 22865747, 23692767, 23816155, 24191047, 24297029, 24143515, 24482565, 24479819, 24448749, 24664969, 24543283, 24373757, 24013979, 23083630, 22333752, 21757295, 20891249, 20243749, 19347398, 18425915, 17802653, 17341686, 16614237, 15866625, 15379001, 14826106, 14519044, 14061030, 13941181, 13546110, 13426656, 13096945, 12967784, 13171624, 13345356, 13469335, 13652709, 13774345, 14140270, 14524164, 14849263, 15315206, 15069515, 15111909, 15055966, 14909086, 14921471, 14891893, 14779457, 14438692, 14477825, 14502041, 14206186, 13732734, 13774527, 13244514, 12414593, 12052311, 11629612, 11387436, 10703407, 10147024, 9833540, 9259217]
8496I259217n97067l23687p51655l19652r9110j29326n69492l91755n8335j1895
8486F007243k17561m73219m31706q3724J28223j03584K01301j94411p7832N9829
8476D814559K8240l30471k36172j56908L3064K33922J03794q1482m66666j24618
8466C817262k37560Q6481J2692j97288j79453k45232j45289M3755J50967j16755
8456B989580k65215m20386k23697K97357J24308k74015J32430j12767j88533J17909
8446B176971k44493j7742L08582n4686l00557j6826P26N95K99702k2563j25602
8435B004107j435P6600K9595j20136P385O3800j70315j05378j20462J83364p3813
8424A773312n676K5736j33600J02393n9591m09991J69022J79098M6649m57269
$$ y = [9259217, 8662150, 8338463, 7586808, 7267156, 7168046, 7038720, 6469228, 6077473, 6019138, 6007243, 5789682, 5316463, 4884757, 4801033, 4929256, 4825672, 5026973, 4832562, 4754730, 4814559, 4842799, 4512328, 4276156, 4119248, 4152312, 4386234, 4490028, 4408546, 3941880, 3817262, 3579702, 3666183, 3678875, 3481587, 3302134, 3056902, 2911613, 2955368, 3106335, 2989580, 2724365, 2303979, 2080282, 2377639, 2501947, 2227932, 2360362, 2247595, 2059062, 2176971, 1932478, 1914736, 2223318, 2168632, 1868075, 1851249, 1851975, 1852570, 2152272, 2129709, 2004107, 2002672, 2079272, 2108867, 1988731, 1996116, 2059916, 1889601, 1784223, 1663761, 1847125, 1773312, 1767636, 1793372, 1659772, 1762165, 1702574, 1292583, 1461605, 1640703, 1687352, 1230083]
8414A230083K43429J55020k92907l46216j08179J56613k3333J54913l9495k79069
8404H50859j07818L8896k28898O0966J94384J01223j85657M5969l48788J52497
8394E73633K50375k59637k28136R4304K27593r6338K9287J19451j31374K2392
8384F01550p3576n4503J3273J7309J50082k52045k47348K99209L37309M0153k65540
8373E65873Q9955m9928k94980K62847l2652p9954J78774l5280k67768l3142J11809
8362D15554J80314J25909j13952J20080n5370l09553q3574m863J43968k5881K076
8351C94708l071j35269K58300R9375j58718n6523m4873j59200J84710j10367L37280
8340F06352l71560l25955K37496m1478K1877J16248N2749J14718m4104k88693
$$ y = [1230083, 1473512, 1628532, 1335625, 989409, 881230, 1037843, 1014510, 1169423, 1129928, 850859, 743041, 781937, 553039, 614005, 808389, 909612, 723955, 769924, 421136, 573633, 824008, 564371, 336235, 430539, 658132, 561794, 591081, 710532, 579158, 601550, 527974, 473471, 486744, 504053, 654135, 402090, 154742, 453951, 791260, 831413, 565873, 655828, 605900, 310920, 573767, 541115, 461161, 639935, 604655, 336887, 303745, 415554, 595868, 721777, 607825, 727905, 672535, 362982, 279408, 274545, 418513, 392632, 394708, 391637, 256368, 514668, 614043, 455325, 398802, 353929, 194729, 379439, 269072, 606352, 234792, -91163, 146333, 104855, 126732, 242980, 295729, 410447, 366343, 77650]
8330G7650k35523M5348o5837j40858L07886P0200L2988k36005J2264q8414K37841
8319A7540L7956J14600R078K17853k1319l58758q1962R4805J04079k26396R1187
8308a337K77852O522k08269P9688k876J7203J0503l22179J6953j51570K89889
8297A2379o8336m84431J11499K73080L99399j4340k28561p1637J29680j92943
8287a34211J9786j90583M45949J05547j75649o5819k01745J26380R212k10482
8277b71615Q1672J84178k600J313J24653k02568m4260J12713k54963L3287K25752
8266a2438j52850k27286p4263K92313K21483l28655n8077p6439l33082L6412J46800
8255e66082J65683M1480K96211N4530n2605K28186j9558j64726j00866j29422
$$ y = [77650, -157873, -112525, -178362, -319220, -11334, 58866, 91854, -144151, -131887, -220301, 17540, 55496, 170096, 179174, 397027, 375708, 16950, -65012, 29793, 133872, -92524, -1337, 276515, 283037, 74768, 154456, 151580, 168783, 179286, -142893, -125940, -277510, 12379, -55957, -540388, -428889, -155809, 243590, 229250, 689, -70948, 58732, -134211, -114425, -305008, 140941, 246488, 70839, 5020, -196725, -70345, -61133, -271615, -189943, -5765, -8365, -7052, 117601, -84967, -129227, -16514, -271477, -238190, -12438, -165288, -392574, -466837, -174524, 46959, -281696, -339773, -416212, -749294, -712882, -566082, -400399, -358919, -62708, -8178, -60783, 167403, 147845, -16881, -117747, -247169]
8245b47169j63522k2644K34801J53650j78154j81669L5588R0459r8429P3259q8878
8234c92708K0613K10420q7722l44403O5973K6154K6796O4492J10388j2337P4412
8223b37922j905N11Q0106j10591m6063J12824j25558o3180m1826J96753p2008
8212c08859j22331J98211r7671K03679M07770j16887k13277N7817K0037l38139
8202c09650j2899J23483M3338l85638J9764j32335K12431l2662J07484j278811
8192a645495J398662K145833n56334l22963o07068L00976k55958R7164j46133
8183D08684J02010k50800M3146N982q9580q4137j17199p2479Q4118k2005P6319
8172H4059k9159k09396k46963k0417K13459q6240K26125R034J06213l34839k89867
$$ y = [-247169, -410691, -433335, -198534, -44884, -223038, -404707, -369119, -278660, -377089, -303830, -392708, -372095, -161675, -249397, -593800, -527827, -501673, -474877, -410385, -299997, -312334, -237922, -239827, -239316, -159210, -269801, -315864, -203040, -328598, -391778, -433604, -236851, -308859, -431190, -232979, -330650, -126971, 280799, 163912, -49365, 8452, 28489, -309650, -322549, -199066, -155728, -541366, -521602, -653937, -441506, -474168, -366684, -1645495, -246833, 1899000, 1342666, 1019703, 412635, 713611, 457653, 554817, 408684, 510694, 259894, 303040, 309022, 219442, 135305, 18106, -54373, 29745, 7740, 84059, 54900, -154496, -401459, -421876, -208417, -294657, -68532, -59498, 46715, -288124, -577991]
8161e77991j75628M92540M13721j5950j02785j5876j01603k74030L05963J40321
8151H8682P9687M5369K51o4748J42377l04526j25873j80101r609O7611n6424J01555
8139b15749O0801O685L6701K15212K71905K1025k18928l9136l37280J87414r4387
8128a05737m96142M6834P6617J05568J21950J83855O1679j11798J82987l1626
8118C4187j99454j00631k77882L6665Q2173o0458J33806L1568o8183Q3906p012
8107c11315K14344L6634R8511o9138j59986k40082Q7627l1764l453P0853j22982
8096d30751J93990p3466J33997j39651j17671m9083l3480O4578J78219L5042J30539
8085a07737k22418l9429J09576k7259J44943k28201K03807J98561j78561K2394
$$ y = [-577991, -753619, -261079, 152642, 136692, 33907, 18031, -83572, -357602, -51639, 88682, 168369, 213738, 213989, 149241, 291618, -12908, -138781, -318882, -328491, -260880, -317304, -215749, -154948, -148263, -111562, 103650, 375555, 396580, 177652, 138516, -198764, -11350, -105737, -601879, -555045, -478428, -372860, -250910, -67055, -5376, -117174, 65813, 34187, -165267, -265898, -543780, -507115, -424942, -485400, -351594, -320026, -388209, -304303, -311315, -96971, -60337, 38174, -30964, -190950, -431032, -343405, -375169, -378622, -307769, -430751, -236761, -310227, -176230, -315881, -433552, -482635, -516115, -451537, -273318, -238276, -107737, -330155, -369584, -260008, -287267, -142324, -370525, -166718, 31843, -146718, -124324]
8075a24324j83614o8287j32645k3083K88490J61715K4312o9973k07535J11840
8065b23104O6317j4941K62869j92807k17024J19791J51743q6300m5728J80742
8055A558L4968L0869J14932m6657m5020o6846L7668m2921l39188j56230N8761
8044d18106J91498l0720k05558K12732n8622O6445P7451j85068k46323M4880n851
8033e57242L72504J21603K15425J10905j5758k05632k12183j23209k07612J35957
8023c65242J50514L27579k32079k15930L33327j36640N3554r4574j98357O0408
8013c17440N5779L5899r297O2823K71511l4400m59991J34414r8279j10447J13955
8002c55473J46369j00483N2655j05107J7059j64203K80263N452Q1364j68386j36098
$$ y = [-124324, -307938, -376225, -508870, -531953, -243463, -81748, -57436, -127409, -334944, -223104, -156787, -171728, 91141, -101666, -318690, -198899, -47156, -133456, -179184, 1558, 36526, 67395, 182327, 135670, 90650, 23804, 61472, 18551, -320637, -476867, -418106, -226608, -257328, -462886, -250154, -308776, -242331, -164880, -349948, -596271, -551391, -557242, -184738, -63135, 152290, 263195, 247437, 41805, -170378, -293587, -501199, -365242, -214728, 112851, -119228, -335158, -1831, -138471, -84917, -179491, -377848, -317440, -261661, -225762, -235059, -172236, 99275, 64875, -395116, -260702, -358981, -469428, -355473, -209104, -309587, -256932, -362039, -344980, -509183, -228920, -223468, -142104, -310490, -446588]
7991d46588J27774n2010J0729r392r3554J87928j26659J02510K5878M2829n5075
7980b85630m1531K60527J36190k31463l9623j52463n73169m5362L00933M37342
7970b34249L60722k04604l01234K27725r3181O4758k30972k3470J58785P4150
7960b01570l6051j5627Q0110k3476m8209k14173L1724M75885J8832j44185j32649
7949b09389J30412m1746L8546k43838O979q7603J9166J54446r8417j12305j92376
7938f36125L12879J19578Q8297J59918j86487j58250o6708M25448j65001k07420
7928c13871N3077J87276k4651n5509J39660m7533j87329K74K00796j48570n3168
7917b49548J60161K05029M8574r9149j46261M8578m7301q1999L0335j51275k0747
$$ y = [-446588, -318814, -370824, -360095, -369487, -463041, -275113, -401772, -299262, -273384, -230555, -285630, -327161, -66634, 69556, -161907, -201530, -353993, -927162, -972524, -671591, -234249, 126473, -78131, -379365, -151640, -244821, -180063, -411035, -434505, -275720, -201570, -237621, -253248, -173138, -196614, -244823, -458996, -427272, 48613, 67445, -76740, -209389, -78977, -120723, -82177, -326015, -319036, -406639, -387473, -233027, -331444, -443749, -636125, -323246, -203668, -115371, 44547, -141940, -300190, -366898, 58550, -106451, -313871, -260794, -73518, -98169, -153678, -14018, -61551, -248880, -248606, -47810, -196380, -249548, -89387, 115642, 164216, 65067, -81194, -32616, -79917, -161916, -131581, -282856, -303603]
7906c03603m2043K6113O291K565L80977J22691j41965j39288J29498L17518j24232
7895B34522m01644Q0035k0281j15J1650J1178m7006k71625L8605J86376R685m9758
7883b18378m743j07864k9693J29421K41432k3738K6430J1713j21840L9881r4037
7872a51416Q2924j62291n5535j47751K78295j12702m8079J8331K10946N2905k35754
7861b70127o3433r7312j85121L28666J82835J58165j10566J89681L08228m7110
7851C93906m13861l0654o0578k08666K77642o161J05131j90064m4533Q360k17178
7840c86656m4201J81055J58675J09618o8007m5991m1446J43080o6705j55942M5500
7829a71020j11542o0158j2183L3686J92151K5527N9992K43718l9959m9903r8256
$$ y = [-303603, -345646, -319533, -313242, -310677, 70300, 192991, 51026, -88262, 41236, 358754, 234522, -167122, -87087, -107368, -107483, -95833, -84655, -131661, -403286, -364681, -178305, -168620, -218378, -223121, -330985, -360678, -231257, 10175, -13563, 12867, 24580, -97260, -57379, -151416, -68492, -230783, -286318, -434069, -155774, -268476, -316555, -298224, -87278, -34373, -270127, -333560, -430872, -615993, -287327, -104492, 53673, -56893, 132788, 441016, 393906, -19955, -50609, -111187, -319853, -42211, -48372, 56759, -133305, -177838, -169478, -386656, -430857, -249802, -91127, 18491, -49516, -95507, -136953, 6127, -60578, -216520, -171020, -282562, -342720, -354903, -321217, -129066, -103539, -43547, 200171, 160212, 110309, 12053]
7818A2053l01483J4923J52766J96595j82517J24211j58206k3285M4260P1674p5859
7807a24868L28684j92119k2866k8713R23151j371164k99681O50073j30342J21786
7797a46059j17413L30033k37869l11181N8486K50514N5997m6814J07809R0605
7787C4108j66947j00486j38439K76193j53959Q8310j0363J16400l30379j54194
7777e39756L48049q6426k94950M5651J75357J37179P079M16302j04893l3100n6901
7766A3591r2235q5119L03104l9446r8477k86333J07317M3770j19617L406J00843
7755a49196K58808l45518j59180K5410J08512J69194J12917j74114J00809J79926
7745A27568r6003J54543P8613J03394j83524l42591J8130r4733k9376j3268J14381
$$ y = [12053, -289430, -274507, -121741, 74854, -107663, 16548, -141658, -164943, -120683, -49009, -124868, 203816, 11697, -11169, -39882, 883269, -487895, -787576, -137503, -267845, -146059, -263472, 66561, -171308, -482489, -424003, -173489, -117492, -164306, -56497, 34108, -132839, -233325, -371764, -95571, -249530, -161220, -171583, -55183, -385562, -539756, -191707, -278133, -573083, -527432, -352075, -214896, -207817, 208485, 103592, 70492, 13591, -78644, -163763, 139341, 99895, 1418, -284915, -177598, -133828, -253445, -250039, -149196, 109612, -235906, -395086, -369676, -261164, -91970, 20947, -153167, -52358, 127568, 31565, 186108, 264721, 368115, 184591, -158000, -139870, -234603, -263979, -277247, -162866]
7734a62866j06940L9853J60482J80988Q708j81515k42073R0360K57170M969l9015
7723A0121J4167K07197o0142j04487m16127O7520K38681K1285j84914q1567J20481
7712a67785J47867o8920O3565K8870j4243j32084l4416R1657k07748p94K4030
7701b70001J75899P9180m7686m5011R6429p7749k04197J60355J52050P5141k93697
7690a99287l504j82620K23495M53210L886o6085k40895M9050j55909N487j65664
7679b78836L6129Q0767R3213n9613k9258J61229j89026o5054J13501L18052K2079
7668B03183l57280j51722K09425P8550j98158m608M07069j8359J13286j0018j66470
7657A04898n9839K6509L65898k8653M9088j23511j58963K21879J03460p3151j50700
$$ y = [-162866, -269806, -229953, -69471, 111517, 120225, -61290, -303363, -213003, 44167, 49136, 10121, 24288, 231485, 171343, 66856, -349271, -281751, -43070, -21785, -206699, -288266, -167785, -19918, -88838, -25273, 3597, -10646, -142730, -177146, -85489, -293237, -294031, -270001, -94102, -14922, -62608, -107619, -11190, -88939, -293136, -132781, 19269, 94410, -199287, -202791, -385411, -161916, 291294, 295180, 229095, -11800, 37250, -118659, -113172, -278836, -242707, -161940, -68727, -128340, -157598, 3631, -185395, -250449, -136948, 181104, 203183, -154097, -305819, -96394, -17844, -216002, -220610, 186459, 168100, 281386, 271368, 104898, 45059, 71568, 437466, 408813, 457901, 334390, 175427, 397306, 500766, 427615, 276915]
7646B76915o9777J64740k06889j83239m4799K02617J7474j5876j72283j46977
7636a78094J39652J43564J62419K0111j20510J96678r6523j41402K49132N2397
7626D27424n27986J24842O0546l2302k9234n3573O5685k793J2496K63618j35429
7615A73294k77485J97012J00224n1873J2196k35568r4422K96111m3903L6955K78331
7604C90872k8770J3571j77308j73705j18319o4082K75361j31240j55258K82237
7594A13359K77767Q7368j39823j6654j61583j26623J55562q6692j18545K084J09730
7583I5950N0135q1734l29271J84313K49446n0873r5728Q6256N3848j06806Q7188
7572A42724J86959n6958K38730k06900J19019J19021l42430j46651Q9406L86839
$$ y = [276915, 207138, 371878, 164989, -18250, -63049, 139568, 157042, 141166, -31117, -178094, -38442, 105122, 267541, 287652, 167142, 363820, 267297, 125895, 375027, 427424, -100562, 24280, 84826, 52524, 23290, -30283, 35402, 32609, 45105, 308723, 173294, -104191, 92821, 193045, 141172, 153368, -82200, -176622, 119489, 75586, 112541, 390872, 362102, 375673, 198365, 24660, -93659, -157741, 117620, -13620, -168878, 113359, 391126, 478494, 338671, 322017, 160434, 33811, 189373, 102681, -15864, -13780, 95950, 146085, 64351, -264920, -80607, 168839, 117966, 22238, 108494, 162342, 55536, 142724, 329683, 272725, 511455, 304555, 423574, 542595, 200165, 53514, 142920, 529759]
7562E29759k79199j40909J40839O5371J35187j49598k2383K63389J32973k3166
7552F52263M5522K4824N2109k26116J62617L72471J36224p1068J01255N1073j19722
7541A181452K30487J27174L9741j59230k67223k4491j869L9n7054l08060N2889
7530H13855k994j29440o2051k25757K96087m6575N2776O2420l72809J62553L49109
7519H97174l95377k53130o378q5325k6611M60819R0749m71187k40387K39987j9728
7508A90606j05346l26696L46482K8872R4966P4051m0368L3847j5325j46934k20034
7497h5879K11749P8312j31493k46798J28235j2J39535K7697N170r0348j72875
7486a36707J88438J24160j2891k15627K75238K9678l95847K34080J2035Q1554
$$ y = [529759, 250560, 109651, 250490, 315861, 451048, 301450, 279067, 542456, 675429, 652263, 697785, 722609, 774718, 548602, 711219, 1083690, 1219914, 1148846, 1250101, 1301174, 1181452, 1411939, 1539113, 1578854, 1419624, 1152401, 1127910, 1126041, 1126080, 1069026, 760966, 813855, 810861, 681421, 619370, 393613, 689700, 643125, 695901, 758321, 385512, 548065, 897174, 501797, 248667, 242289, 156964, 130353, 591172, 681921, 210734, -29653, 210334, 190606, 85260, -241436, 105046, 133918, 228884, 302935, 262567, 296414, 281089, 134155, -85879, 125870, 204182, 72689, -174109, -45874, -45886, 93649, 121346, 126516, 36168, -136707, 51731, 175891, 163000, -52627, 222611, 252289, -143558, 90522, 102557, 184111]
7476A84111k33997J22962L44160r206j92490m5402J5263J35644j22003K09669
7466D08711q5525J57929O7562k08835j79350k730K6790k84757L2898K14107R0961
7455B37761k08275j2995l3021l47580K46646l7428K83819J88427j39390l7930
7445A40034r6051j00049m6986K07088P9535j76880L26150j19061k49910J74129
7435A37999P9962K05818m36395J4672Q3587k47133K0346j33240K15790K10543
7425A51949K13126J3960r4104l30235K81284j90182p5674J2676R4088J96037o5679
7414B07246N2867j22566N3338o4614J25892p0308R9282j81032M9266K13520K10520
7403E73411k08214j53022o4578J00728m3125j26964l3110o1193j03964Q5225J83383
$$ y = [184111, -49886, 73076, 417236, 408030, 215540, 170138, 185401, 321045, 199042, 408711, 323186, 481115, 548677, 339842, 160492, 157762, 184552, -100205, -67307, 146800, 237761, 29486, 16491, -16530, -364110, -117464, -154892, 128927, 317354, 177964, 140034, 43983, -56066, -103052, 104036, 183571, 6691, 332841, 213780, -36130, 137999, 217961, 423779, -12616, 2056, 85643, -161490, -141144, -274384, -58594, 151949, 365075, 379035, 284931, -45304, 235980, 45798, -29876, -17200, 76888, 272925, 207246, 260113, 137547, 190885, 126271, 252163, 181855, 281137, 100105, 149371, 362891, 573411, 365197, 212175, 147597, 248325, 205200, 78236, 45126, -16067, -120031, -34806, 148577]
7392A48577R4293p0620j30790j04556n6998q3549K191K73703N0144K00516K7682
7381C50593j24641Q8191j75891M5814l00575K3567L39373L88792j17007o7538
7371D50678k07236k07210K0805m2460K06638P841l9219j08860k09567J05142L62041
7360C38593P3851m69356j00896R528K17449L79424j20693j32693Q1985j11535
7350A65657j26207r7805l0376Q5236J84139M6039M1464j08309K92991Q9245l52507
7339A89567k09962J9480J53247p9424N2592J85664r8722j97382l3536j2526K00249
7328A69247O7095P8303k22455n1479k2154J66252K15003J30719q2829k17801R1311
7317C21212j85128j38873J81755j03632J16243j09800J7192j6797K64872M3940
$$ y = [148577, 242870, 172250, 41460, -63096, -120094, -203643, -201452, 72251, 122395, 322911, 350593, 225952, 314143, 138252, 184066, -116509, -92942, 246431, 635223, 518216, 450678, 243442, 36232, 57037, 14577, 221215, 229056, 189837, 80977, -128590, -23448, 338593, 412444, -56912, -157808, -148280, 69169, 448593, 327900, 195207, 277192, 165657, 39450, -58355, -88731, -3495, 180644, 226683, 268147, 159838, 452829, 542074, 189567, -20395, -915, 152332, 72908, 125500, 311164, 212442, 15060, -18476, -31002, 169247, 236342, 314645, 92190, 40711, 18557, 184809, 399812, 530531, 447702, 229901, 321212, 136084, -2789, 178966, 75334, 191577, 81777, 98969, 82172, 347044, 390984]
7307C90984j35624O9591J0147M7916J30601k95466j33773j25333k2909N0941J86928
7296A74003p5570q5132j57864M00899J2363j51151j14825J43381J47308k62145
7286C1267K07332k07025j60382J47307K2339K45828J9146n3157j43316k77418
7276a68079L59000J00378R8683j01849k10631K5075J90258L6408j0961j68502
7266A49780j92623M1875L02368j67221p5755o9048R1236p4983o0938Q2763K08584
7255B36038l7138N2673m4439k3470J03355j07753k08235N5324k7059J85950J60984
7244C46230k54911j91841J4311p6514J82494L09957j2244l10656J8143K7758j90776
7233a38049k9809O7748K85733j38094R6241J63182k06350p7755J5329J53937R1846
$$ y = [390984, 255360, 324951, 335098, 383014, 513615, 218149, 84376, -40957, -63866, -12925, 174003, 98433, 13301, -144563, 256336, 268699, 117548, 2723, 146104, 293412, 31267, 238599, 31574, -128808, 18499, 40838, 286666, 305812, 252655, 109339, -168079, 190921, 291299, 389982, 288133, 77502, 102577, 292835, 329243, 318282, 149780, -42843, -968, 301400, 134179, 58424, -10624, 80612, 5629, -55309, 27454, 236038, 198900, 251573, 207134, 183664, 287019, 179266, -28969, 26355, -704, 185246, 346230, 91319, -100522, -86211, -162725, 19769, 329726, 317482, 6826, 24969, 52727, -138049, -167858, -100110, 185623, 47529, 143770, 306952, 100602, 22847, 38176, 192113, 283959]
7222B83959j39934k4817Q8923l84701J91264J20335k0762J942q1593P3058j55940
7211d8266j65085j38188J94675Q3083J42968j90702L916L23594Q6740p3161k4105
7200A95469K4964k62915n4983k630k03840Q5386L68427j1035k64727j21466j69113
7189d16463L50101K76114R9521l6022o4869Q5095m8739j82093M6900k4414J08629
7178A93760j1746k8569m8386J1843J80562j46616P733K93783j50971q8854J20199
7167C32738j24241L4533J08145k71311J13150j73884n6135q554j70507j4559N7398
7156a73227K32082o2320j35297L19349J06138r0902O4476k03340J40154J98878
7146C95991m1351j01427j111k03849k45549k82942K24026J83570k9523J53509
$$ y = [283959, 144025, 119208, 208131, -176570, 14694, 135029, 114267, 116209, 34616, 107674, -48266, -213351, -351539, -156864, -73781, 69187, -121515, -117599, 205995, 292735, 219574, 195469, 220433, -42482, -97465, -100095, -303935, -218549, 149878, 138843, -125884, -247350, -416463, -66362, 209752, 309273, 273251, 208382, 293477, 244738, 62645, 109545, 85131, 193760, 182014, 153445, 105059, 116902, 297464, 150848, 158581, 452364, 301393, 212539, 332738, 208497, 243030, 351175, 79864, 193014, 19130, -37005, -45559, -216066, -230625, -173227, 58855, -3465, -138762, 180587, 286725, 195823, 260299, 56959, 197113, 395991, 354640, 253213, 252102, 48253, -197296, -480238, -256212, -72642, -102165, 51344]
7136E1344J6982q2288m8055n2377K8800L32107p3052j32413Q1379k0629l06140
7125b04342J07964N5859J90798Q6434L7728m2869k25575J18243j76635p1766K35810
7114A11649K13818P3236k30916j33306O0730O5432o8468j04507k2016J69918J70103
7103C05673k10499n5701L9816j35253l7347j7450k18538M2552K5320N00313j3813
7092B25073l24301o0212J33308J2417p7054Q3695k36744J98726J11724o8864q172
7081a0404K19572J64129k54756j9253K34405J01677l12314k81909J5591J49824
7071F562Q6036p2821J53743K12178j58670q457k94309n6307k2698Q9741J51367
7060H6365K13582j11291k96579L08551k51990k09122K27672k92707j22867N860
$$ y = [51344, 68326, -13962, -62017, -114394, -85594, 246513, 173461, 41048, 122427, 101798, -204342, -96378, -40519, 150279, 236713, 274441, 231572, 5997, 124240, -52395, -124161, 111649, 325467, 398703, 167787, 34481, 95211, 160643, 92175, -12332, -34348, 135570, 305673, 95174, 39473, 79289, -55964, -93311, -110761, -329299, -286747, -261427, 238886, 225073, -99228, -159440, -26132, -13715, -90769, -7074, -243818, -45092, 66632, -2232, -10404, 209168, 373297, 118541, 99288, 333693, 435370, 123056, -158853, -143262, 6562, 92598, 19777, 173520, 385698, 227028, 218571, -75738, -132045, -154743, -65002, 86365, 299947, 188656, -107923, 200628, -51362, -260484, -32812, -325519, -448386, -442526]
7050d42526R7084J73476M42546j27409r8482j53561n6181K38051M8558K60008
7040C81564m5574l13437R994N5j92024O6457L01270J22396l44528k38992J7238
7029b35581K29379J77211k5848k85730n9277m8116J62702n6753K03657M2689p0788
7018C3545j57182K6321j56868l0749m9388j05446J00169K4821L29666J42015O0660
7007B17564k75404M0299J16974L8840k49581p7207Q621K20126j96612j47219L27212
6996B3613j22137J05352K35366l01929j17720J64911O9879r7859j9491K15697
6986A55682j77843k8310q7960J25179o3420j08767J09621L2153n5943n2326L04752
6975A52818N4002j48275P9478p5542k23191k25710L62450J6414L1849j90420J10677
$$ y = [-442526, -345442, -171966, 270580, 143171, 44689, -108872, -165053, 72998, 121556, 381564, 335990, 22553, 32547, 32602, -159422, -92965, 208305, 330701, -13827, -252819, -235581, -6202, 171009, 145161, -140569, -199846, -247962, -85260, -142013, 61644, 104333, 33545, -123637, -97316, -254184, -284933, -334321, -439767, -339598, -314777, 14889, 156904, 217564, -57840, -17541, 99433, 138273, -111308, -188515, -179894, 40232, -156380, -303599, 23613, -98524, 6828, 242194, -59735, -177455, -12544, 57335, -40524, -60015, 155682, -22161, -50471, -138431, -13252, -76672, -185439, -75818, -43665, -99608, -151934, 152818, 206820, 58545, 138023, 62481, -160710, -386420, -23970, -7556, 24293, -166127, -55450]
6964e5450J58755m59560j7722K51360j96770R4935K07019K3379J76041L2906O1390
6953B76283J2629j59800J28707n996j88233l9308J96858n5494l4497K34979j58958
6942B07170k01168j5548L3077k0277p8451o8787m0184q3521L66595o8319J66356
6931A96943q7190k6731j96098R3944o5740j22920N0588j72497K1078k2161o562
6920c37346M4157K68593J29365K3666k53297J17596P1730J41818j53762Q0890
6910A33410Q2129j88237j82239j5805q4857J91077J91681j15767J29179l06372
6900a65801L8022J05503J00289p3755j24088J28844N355j88667K66807J42990
6890B35499k55375q6133L23797r8672n3856j1682o4986J0310j83058l5162O6953
$$ y = [-55450, 103305, -356255, -373977, -122617, -319387, -224452, -17433, 5946, 181987, 214893, 276283, 288912, 129112, 257819, 251823, 63590, 24282, 221140, 165646, 131149, 366128, 207170, 6002, -9546, 23531, 3254, -75197, -143984, -184168, -267689, 98906, 30587, 196943, 109753, 83022, -113076, -19132, -84872, -207792, -157204, -329701, -308623, -330784, -337346, -293189, -24596, 104769, 128435, -124862, -7266, 64464, 206282, 52520, 133410, 215539, 27302, -154937, -170742, -255599, -64522, 127159, 11392, 140571, -165801, -127779, -22276, 78013, 4258, -119830, 9014, 14369, -174298, 92509, 235499, -19876, -106009, 217788, 119116, 65260, 53578, -11408, -1098, -184156, -219318, -152365]
6879a52365K21841j83955j1129J70017N5753J97454k09779j58068J03754M0481
6869G4004P701j845J93821j24095j32159k14995m0459L08878J5535j19221K42137
6858B09302J62572k3361m29569Q196K10619K68248l98523j90404J87191M8828
6848E3099L9289J55456j10963j09787J39232k41823q0774k6657J19674J3024k48825
6837b99055j87718L39493j10664K90845K33985j11067N3944P1221k48957K09262
6827B41289l9901j25451k21514L15821J05048k47027k9004M5091k27192j5410
6817a98250J52368K13642J32134j29690j91248n2249j09422j52089L85790Q8054
6807A39040J3482j07744r5938k2836P7640P8225j06635l19321J1275M7104J99316
$$ y = [-152365, 69476, -114479, -125608, 44409, 100162, 297616, 87837, -70231, 33523, 74004, 81705, 79860, 273681, 149586, 17427, -197568, -238027, 70851, 86386, -32835, 209302, 371874, 348513, -81056, -72860, 137759, 406007, 7484, -182920, 4271, 53099, 92388, 247844, 136881, 27094, 166326, -75497, -156271, -182928, -63254, -50230, -299055, -486773, -147280, -257944, 32901, 266886, 155819, 209763, 280984, 32027, 241289, 201388, 75937, -145577, 170244, 275292, 28265, -739, 44352, -182840, -198250, -45882, 167760, 299894, 170204, -21044, -73293, -182715, -334804, 50986, 139040, 152522, 44778, -51160, -73996, 3644, 81869, -24766, -344087, -332812, -285708, -86392]
6796h6392K59030K22822j93879j834k71145K77538o2099m37157K58290J89673
6786A54847o5350j01078J32009J51045j57597J0875J93679j43661J10105j36076
6776A48798J24247j2139o7482O1517P7255o4075k46957l46128L19K16335q1766
6765a90076J78122Q2124M6532j00505R7205P8900k3405k3137k01974J33259K66006
6754C43051p1450J31736J44334j74850k6670j06880n8603j66429j50221L0610
6744a05372o8808K58442J26597K1277j54425R5535K94253l25721l88733K59411
6734A2456K90541j66329k43538K13574O9501j8539m7747j27500m2337K75461p5058
6723A40485n480K26653j92794j02062P3084k76069K62846J19180l4544J67448
$$ y = [-86392, 172638, 395460, 201581, 199747, -71398, 206140, 144041, -293116, -34826, 154847, 89497, -11581, 120428, 271473, 113876, 124751, 318430, 174769, 284874, 148798, 273045, 260906, 193424, 254941, 332196, 268121, 21164, -324964, -324645, -108310, -190076, -11954, 70170, 116702, 16197, 113402, 192302, 168897, 145760, -56214, 77045, 343051, 271601, 403337, 547671, 372821, 346151, 239271, 180668, 14239, -135982, -105372, -174180, 84262, 210859, 232136, 77711, 173246, 467499, 141778, -246955, 12456, 302997, 136668, -106870, 106704, 176205, 157666, 109919, -17581, -59918, 215543, 140485, 135005, 361658, 168864, 66802, 139886, -136183, 126663, 245843, 211299, 378747]
6713C78747p0437J36436j10213k27658k65030J82726M3862J5975L11874k30733
6703A65549j17852J54180j13625J40899l08189K83633J14919J57172k75310j66906
6693C4470K4152o1706K44656k32295L9032M5295J33830J90599m1633j37769j74291
6682F4340j15095R7420N5J41379L344r3941r0067r3923K14491M6793j85228p393
6670a7825Q1231j04298j4739M22747J40564j18791k66850Q5021J97693n1964j42640
6659B10149j35032J08227M999r5166L26405P243m68774K88963K13903k45856j24168
6648I0893K39730K35744M1192j81304m9869j18550l9513j16390M4250K30969k5789
6637C51363j96313J20815j92212j89168L65011J19777K8744j58227k51717j51962
$$ y = [378747, 308310, 444746, 334533, 106875, -158155, 24571, 68433, 84408, 396282, 165549, 47697, 201877, 88252, 229151, -79038, 204595, 319514, 476686, 201376, 34470, 58622, -3084, 241572, 9277, 48309, 93604, 227434, 418033, 376400, 238631, 64340, -50755, 46665, 46720, 188099, 191443, 97502, 7435, -86488, 128003, 174796, -10432, -17825, 63406, -40892, -55631, 367116, 507680, 388889, 122039, 207060, 404753, 352789, 210149, 75117, 183344, 188343, 93177, 419582, 426825, -41949, 247014, 460917, 215061, 90893, 330623, 566367, 607559, 426255, 376386, 257836, 218323, 101933, 146183, 377152, 351363, 155050, 275865, 83653, -105515, 259496, 379273, 408017, 249790, -1927, -153889]
6627a53889K61855K65641k04767J16502L20484k30271j31217J34439k5264k30550
6617A22963M9715J09414r3548M945q213K49370K40137l31784k72253J46497J11934
6606C29177p049J66822p5945M7228q3754j79100J33346O0586k1960O8303m456
6595D33198Q6265k6897K5526r9328j01479l3752n545K0300R9056l1746j2081K62811
6583F16328K6742p7630l10380M9662O9401M8286O3414j60535J43376m5805K7206
6572D50065M6657j34779j41797l0990O2747J7271J86817m045k59314L1562J79398
6561D03592O7103N3714N8999j5080j25600j8337l6546O6699k92927J58480j74651
6550A45446q4150J74722j05652J07743K45155q5218k06998J48918M09337k37223
$$ y = [-153889, 107966, 373607, 168840, 285342, 605826, 375555, 244338, 378777, 353513, 122963, 172678, 282092, 188544, 193489, 185276, 434646, 674783, 342999, 70746, 217243, 329177, 322128, 488950, 413005, 460233, 376479, 197379, 330725, 391311, 369351, 437654, 433198, 519463, 492566, 518092, 418764, 317285, 283533, 277988, 298288, 397344, 365598, 353517, 616328, 643070, 565440, 255060, 304722, 374123, 422409, 485823, 325288, 468664, 422859, 450065, 496722, 361943, 220146, 189156, 251903, 269174, 455991, 451946, 192632, 224194, 403592, 470695, 524409, 583408, 568328, 442728, 424391, 387845, 454544, 161617, 320097, 145446, 61296, 236018, 130366, 238109, 483264, 398046, 191048, 339966, 749303, 512080]
6540E12080j66088K26964r1704M6252R8860r3603k80214J12932K18528N2637r8796
6529E37848l98753K30436J56098P9924K3j22047n1479J38903k27867J59792Q4111
6518E86989j56840J63234q8422R2686L1007r1116n2732K80434k66196J70672Q6881
6507G56597m0878j35170k3167m6367m7066q5569M24959p6258r897k43833N8720
6496E32071M65517k10095J44991l3290Q130N4641j29167j37638q249N6660m9737
6485F93834k206j4202J56052J0055l0727K1085J09451L8127j44956r6941Q079
6474G47651M7618j57977J73019p1279j24990L47255r685m18987j5955K78568M5978
6463H41216k15591N967q7034j46928P7138J46047o1311k3020K4041Q7618m9801
$$ y = [512080, 345992, 572956, 481252, 527504, 626364, 532761, 252547, 365479, 584007, 636644, 537848, 139095, 369531, 525629, 605553, 605576, 483529, 432050, 570953, 343086, 502878, 586989, 430149, 593383, 504961, 597647, 628654, 537538, 484806, 765240, 499044, 669716, 756597, 715719, 580549, 557382, 511015, 463949, 378380, 803339, 727081, 717184, 473351, 532071, 997588, 787493, 932484, 899194, 907324, 961965, 832798, 695160, 686911, 743571, 693834, 691628, 677426, 833478, 843533, 812806, 833891, 943342, 981469, 836513, 739572, 747651, 795269, 637292, 810311, 739032, 614042, 961297, 951612, 532625, 516670, 795238, 841216, 625625, 631592, 544558, 397630, 474768, 620815, 559504, 536484, 560525, 648143, 598342]
6452E98342n9652M2825K2298L16306o089j15209k0243R591R5358K90656p9032
6441A095151j14469p2639J81036p5839j3310P5384J11094p6276q7363l24749l8668
6430F59352L19560J24503K13519n1299M9250k77682j01891J79348O6169j01374
6420A079455J44350J20412k30690j46797L14277M5661k82731j30348L71712K4197
6410A309498K0995k26185P0030Q7800L5837K7275N8975j35303M9131j79129J60747
6399A279671N0459J5935k75030l1967K59026j65369K6547Q7871R4096M6541K14466
6388A602246q8437j72086l7347k25428P005J57567J01053m3908J70198J07323
6378A578186L97270P2828k57319r301j20285K03568n3322K2408j7616k3926j79942
$$ y = [598342, 538690, 581515, 603813, 920119, 914030, 798821, 778578, 788169, 883527, 1174183, 1095151, 980682, 908043, 1089079, 1013240, 999930, 1075314, 1186408, 1110132, 1022769, 698020, 659352, 978912, 1103415, 1316934, 1265635, 1314885, 1037203, 935312, 1114660, 1180829, 1079455, 1223805, 1344217, 1113527, 966730, 1281007, 1326668, 1043937, 913589, 1285301, 1309498, 1330493, 1104308, 1174338, 1262138, 1297975, 1325250, 1384225, 1248922, 1298053, 1118924, 1279671, 1330130, 1346065, 1071035, 1039068, 1298094, 1132725, 1159272, 1247143, 1341239, 1387780, 1602246, 1513809, 1341723, 1304376, 1078948, 1085953, 1243520, 1344573, 1300665, 1470863, 1578186, 1975456, 2048284, 1790965, 1781664, 1661379, 1864947, 1811625, 1834033, 1816417, 1792491, 1612549]
6367A612549K27279J30998r3372j12946j9643K48020J44682k43103j04326p0366
6357A719772L23497M8631K5212q7201j71817M89523l0j52028M2327m5850J07340
6346B299376p1653P1927j07231K9460J3423N1988L9892Q5933j22180j94156R7610
6335B194389L01242j3875m4182J68675J00002P5734l9747r8777K50014N6215J04491
6324C054181J04934j9644l3324k99772j19206K72507l82422j29657L12710K16756
6314B977063m041j94636o0905k20745J38488J83105K6811j46980J29014Q1245
6304B908419j30656J8819K3789J71149J60686k04808K9602J68627k8236r3359
6294C024032K7737m8271R4593j25272K93240J80565k0561r6174p8820k18995J82392
$$ y = [1612549, 1839828, 1970826, 1877454, 1764508, 1744865, 1992885, 2137567, 1894464, 1790138, 1719772, 2043269, 2091900, 2117112, 2029911, 1858094, 2347617, 2347587, 2195559, 2237886, 2192036, 2299376, 2227723, 2299650, 2192419, 2221879, 2235302, 2287290, 2327182, 2413115, 2290935, 2096779, 2194389, 2495631, 2481756, 2437574, 2606249, 2706251, 2781985, 2742238, 2643461, 2893475, 2949690, 3054181, 3159115, 3139471, 3106147, 2806375, 2687169, 2959676, 2577254, 2447597, 2760307, 2977063, 2973022, 2778386, 2717481, 2496736, 2635224, 2818329, 2845140, 2698160, 2827174, 2908419, 2777763, 2796582, 2820371, 2991520, 3152206, 2947398, 2977000, 3145627, 3117391, 3024032, 3051769, 3003498, 3098091, 2972819, 3266059, 3446624, 3426063, 3329889, 3251069, 3032074, 3214466]
6283C214466Q7571p3602K24760J98516k40753L0719j34231j38145R0530l6658
6273C223173J75006J76092J25611j12126K2538J43217r8027r2638m7221N1239
6263C566864j22881o2630J99778k4265k8527K06447L30411m0059m03259J6495
6253C638374K43107n3110j689j40165j84555L57029K2006l87688M18432J62688
6243D074429K37903k03433K0763Q3410j16124K37927k14606j70325J00869J78558
6233D229371J35166K03252K82983q8656k41065j53054K25359Q9629l300R3132
6223D772817M1629J53548J0021M11900P1960q1919j14515q2900J80762n833J24597
6212E482067K9847Q4599J819j1047M0601J41630K55821N2110r5670J12911j52686
$$ y = [3214466, 3302037, 3228435, 3453195, 3651711, 3410958, 3441677, 3307446, 3169301, 3259831, 3223173, 3398179, 3574271, 3699882, 3587756, 3610294, 3753511, 3655484, 3562846, 3515625, 3566864, 3443983, 3381353, 3581131, 3556866, 3528339, 3734786, 4065197, 4025138, 3621879, 3638374, 3881481, 3828371, 3826682, 3686517, 3501962, 3858991, 3880997, 3493309, 3911741, 4074429, 4312332, 4108899, 4129662, 4213072, 4096948, 4334875, 4120269, 3949944, 4050813, 4229371, 4364537, 4567789, 4850772, 4762116, 4521051, 4367997, 4593356, 4682985, 4679685, 4772817, 4814446, 4967994, 4978015, 5389915, 5461875, 5379956, 5265441, 5182541, 5363303, 5357470, 5482067, 5511914, 5596513, 5598332, 5587285, 5627886, 5769516, 6025337, 6077447, 5981777, 6094688, 5942002]
6201E942002L21125O00753M7983q9124Q9716j81776q5166J73843K66556K00409
6191G286321K97117J27498L70636K83913J89516k23678o3310M950M23509J36041
6181H832513L69995L70853M1042L75613J70559M14605K28965M71138M87707L94732
6171A2157722P6373L28692N69509K11966K39316R31045N39303L12983M26765M30500
6161A6224174J41501N68358N41125L71147J93870K89405j25612P148M79412K02248
6151A8892776j84744J04434l87442k27707P0464q8087n20475j26510j71306j771
6141A7359632n65343k70340p1732j11201j39679j66161o0784j89266K18199L56908
6131A6360233J09219P7766J32866K06018J96851M36948M49793K9091L45568R4847
$$ y = [5942002, 6263127, 6863880, 6911863, 6822739, 6912455, 6730679, 6645513, 6819356, 7085912, 7286321, 7583438, 7710936, 8081572, 8365485, 8555001, 8331323, 8268013, 8272963, 8696472, 8832513, 9202508, 9573361, 9614403, 9990016, 10160575, 10575180, 10804145, 11275283, 11762990, 12157722, 12234095, 12562787, 13132296, 13344262, 13583578, 14514623, 15053926, 15366909, 15793674, 16224174, 16365675, 16934033, 17475158, 17846305, 18040175, 18329580, 18203968, 18211116, 18690528, 18892776, 18708032, 18812466, 18425024, 18197317, 18267781, 18179694, 17659219, 17532709, 17361403, 17359632, 16794289, 16523949, 16452217, 16341016, 16201337, 16035176, 15974392, 15785126, 16003325, 16360233, 16469452, 16547218, 16680084, 16886102, 17082953, 17519901, 17969694, 17998785, 18344353, 18439200]
6121A8439200K48882M43042P81944L64580M83412N08893P25520L81821O93867
6112B3071161P25484P95070R97914Q87152Q44530O99445P26861J040327P42653
6103C0530597P44533P02710R63574N57078L56105O56939P03626J24767k26L19447
6093C5659150K61554J48605j91085q4693P5395j33564P350l38348k55852j29340
6083C5019172j62437n10125m60181j51186k81969r9768k47754j76796n0114o433
6073C2872409L27534J36660J52865K34724m4272L70879J74976J52620J27210O0127
6063C4565732J40088M64968M30782K35652K25177K11047l5272J37402n499K13175
6053C6583252j39024N3336J14201R7535N8486k29912j83435O8551K92293k13670
$$ y = [18439200, 18688082, 19131124, 19913068, 20277648, 20761060, 21269953, 21995473, 22377294, 23071161, 23796645, 24591715, 25589629, 26476781, 27321311, 28020756, 28747617, 29787944, 30530597, 31275130, 31977840, 32941414, 33498492, 33854597, 34511536, 35215162, 35339929, 35339703, 35659150, 35920704, 36069309, 35878224, 35793531, 35868926, 35735362, 35742712, 35404364, 35148512, 35019172, 34856735, 34346610, 33886429, 33735243, 33453274, 33353506, 33105752, 32928956, 32878842, 32872409, 33199943, 33336603, 33489468, 33724192, 33679920, 34050799, 34225775, 34378395, 34505605, 34565732, 34705820, 35170788, 35601570, 35837222, 36062399, 36273446, 36238174, 36375576, 36370077, 36583252, 36444228, 36497564, 36611765, 36709300, 36767786, 36537874, 36354439, 36422990, 36715283, 36501613]
6043C6501613M7141o815r8774r5467J46582N2296j54176J88926O311J55653M36209
6032C7179499j59860K33095M09452L46994J25820J30185J98925L36255L29591
6023C9129956K22705J40053L03192K09547J27334O9583K60922Q4548j76132o5306
6013D0306402K90336K7275n50072J17875j08218P8603J19927q7032m45172l18649
6003C9431275l17855j98213l11953l72215l69264m66909m61426m02144n01724
5994C6029572n25910l72976p37341o71323o34910l65610n85698p45592n8674n26442
5984C0805096o93498n12684l18845k21746l80003m55441j48098K5079J25457j46301
5974B8079016p1065m6782m36801j52533L0088j03267l06721J48424N6823q7222
$$ y = [36501613, 36548754, 36541939, 36443165, 36347698, 36494280, 36546576, 36392400, 36581326, 36587637, 36743290, 37179499, 37019639, 37252734, 37662186, 38009180, 38135000, 38265185, 38464110, 38800365, 39129956, 39352661, 39492714, 39795906, 40005453, 40132787, 40202370, 40463292, 40547840, 40371708, 40306402, 40596738, 40624013, 40073941, 40191816, 40083598, 40162201, 40282128, 40195096, 39749924, 39431275, 39113420, 38915207, 38603254, 38231039, 37861775, 37394866, 36933440, 36531296, 36029572, 35503662, 35130686, 34393345, 33722022, 33087112, 32721502, 32135804, 31390212, 31331538, 30805096, 30111598, 29598914, 29280069, 29058323, 28678320, 28222879, 28074781, 28099860, 28225317, 28079016, 28007951, 27961169, 27524368, 27371835, 27401923, 27298656, 26991935, 27140359, 27197182, 27109960]
5964B7109960j26409j12489j90928k34742j71228j74808j40494j12425J72754
5955B6019191j27222K35974l5737O7642J83460K36218J12116j73170J96839r9706
5945B6615605J53385j2535j76728j15314J78142L6450k07050l08797l10477l08896
5935B5543785n71584k01354m7707L079j51726m17061K9011L9192m46010m61080
5925B3318545m253n8217J94992J55461k72310R7507J44419P3238j45081k75733
5915B3228568J61941j3599K02667R5272k91979J8677J87230k47071j6390o9160
5905B3256156r2030K64511l9793j16887j67101j54370J93998j8885k42930j9356
5895B2863313n8393J05834l07782m2059L15749J32598k8756j31103j75758j8159
$$ y = [27109960, 26983551, 26871062, 26680134, 26445392, 26274164, 26099356, 25958862, 25846437, 26019191, 25891969, 26127943, 26092206, 26159848, 26343308, 26579526, 26691642, 26518472, 26715311, 26615605, 26768990, 26756455, 26579727, 26464413, 26642555, 26679005, 26471955, 26163158, 25852681, 25543785, 24972201, 24770847, 24723140, 24726219, 24574493, 24157432, 24186443, 24225635, 23779625, 23318545, 23314292, 23256075, 23451067, 23606528, 23334218, 23431725, 23576144, 23649382, 23504301, 23228568, 23390509, 23376910, 23579577, 23674849, 23382870, 23401547, 23588777, 23341706, 23325316, 23256156, 23164126, 23428637, 23388844, 23271957, 23104856, 22950486, 23144484, 23125599, 22882669, 22863313, 22804920, 22910754, 22602972, 22560913, 22876662, 23009260, 22980504, 22849401, 22673643, 22655484]
5885B2655484K08598J54112K15254m65685J61737K18585l42834L84473K05933
5876B3395657j71689R8155K6748k25424k8725K53969N1710N09053M68122m3335
5866B4334241K16163p5931J81832K43217M3182J920J0617L00311K22136J56492
5856B5634180K91888J31647Q7289J23046K91237K25546K78501R2609J8593J32373
5846B7306909L59374K97277K73015M51008k6559n4345N50150J86955j6994N99958
5836B9926748J90059n7674J99688L6474L28316J42603L40152K56193q3327L68495
5826C1647727K11472O65074L32839L3031L72037K51053L11809N19453L53371M0054
5816C4737920O61148M76911K26643K27186J41775K42409L14876L51597Q5688J52149
$$ y = [22655484, 22864082, 23018194, 23233448, 22767763, 22929500, 23148085, 22805251, 23189724, 23395657, 23223968, 23322123, 23348871, 23123447, 23094722, 23348691, 23400401, 23909454, 24377576, 24334241, 24550404, 24474473, 24656305, 24899522, 24942704, 24944624, 24955241, 25255552, 25477688, 25634180, 25926068, 26057715, 26145004, 26268050, 26559287, 26784833, 27063334, 27155943, 27174536, 27306909, 27666283, 27963560, 28236575, 28687583, 28661024, 28606679, 29156829, 29343784, 29326790, 29926748, 30116807, 30059133, 30258821, 30295295, 30623611, 30766214, 31106366, 31362559, 31279232, 31647727, 31859199, 32524273, 32857112, 32890143, 33262180, 33513233, 33825042, 34344495, 34697866, 34737920, 35399068, 35875979, 36102622, 36329808, 36471583, 36713992, 37028868, 37380465, 37466153, 37618302]
5806C7618302M14144M19477M35625L95200M9756L73004K98645K64715J89131N35592
5796D0993591K64509N04544N50137L79095N25398K87281N29206O01084J57287
5787D4792132L76514M55310L53962N63937N24257K34585M93870O28199O5597N48515
5777D9036878R30674M75463O35113O16410N22853N48355M31891M33966N13879
5768E4145482N81552O07807M74796R00566R84360N01915M11102N88255R58242
5759F0154077R55317P01861O97087O67395Q60151R61509P53051P72677Q48367
5750F7371492P88367R14534J208856P63675J022540P40360J032570J147976R88815
5741G5979185Q77280J147292J034742J324565J056733J165558J081549J024158
$$ y = [37618302, 38032446, 38451923, 38887548, 39282748, 39332504, 39705508, 40004153, 40268868, 40457999, 40993591, 41258100, 41762644, 42312781, 42691876, 43217274, 43504555, 44033761, 44634845, 44792132, 45168646, 45623956, 45977918, 46541855, 47066112, 47300697, 47794567, 48422766, 48488363, 49036878, 49967552, 50443015, 51078128, 51694538, 52217391, 52765746, 53197637, 53631603, 54145482, 54727034, 55334841, 55809637, 56710203, 57694563, 58196478, 58607580, 59195835, 60154077, 61109394, 61811255, 62508342, 63175737, 64035888, 64997397, 65750448, 66523125, 67371492, 68159859, 69074393, 70283249, 71046924, 72069464, 72809824, 73842394, 74990370, 75979185, 76856465, 78003757, 79038499, 80363064, 81419797, 82585355, 83666904, 84691062]
5733H4691062J490988J287062J069840J248221J165959J488171J376573J478954
5725I5296830J445594J544538J403817J580964J849581J356920J436813J511747
5717A07426804J493704J606918J991420J701726J673501J720647K092781K031202
5709A21738703J767655K243117K367638J744212J997755K337910K315352K289160
5701A38801502K004589K491841K643947K393686K453784K357419K672531K602173
5693A58421472K639928K620190K954946K763983K663118K808882L039378L002826
5685A80914723L138336L130435L138586L294293L408141L145501L135968L397185
5677B06703168L633903L419795L463543L572455L841924L934381L547455L769748
$$ y = [84691062, 86182050, 87469112, 88538952, 89787173, 90953132, 92441303, 93817876, 95296830, 96742424, 98286962, 99690779, 101271743, 103121324, 104478244, 105915057, 107426804, 108920508, 110527426, 112518846, 114220572, 115894073, 117614720, 119707501, 121738703, 123506358, 125749475, 128117113, 129861325, 131859080, 134196990, 136512342, 138801502, 140806091, 143297932, 145941879, 148335565, 150789349, 153146768, 155819299, 158421472, 161061400, 163681590, 166636536, 169400519, 172063637, 174872519, 177911897, 180914723, 184053059, 187183494, 190322080, 193616373, 197024514, 200170015, 203305983, 206703168, 210337071, 213756866, 217220409, 220792864, 224634788, 228569169, 232116624, 235886372]
5669B35886372L716716L607598M057568L888165L838793L820241L936855L920191
5661B66672499L621411M018895L850536L813655L907110L786063L797072L680781
5653B97148022L694356L709249L366954L104148L363997L179075L024751L184462
5645C23775014K835388K749839K966565K557911K246801K328144J850731J718496
5637C43028889J937066J488172J367518J099650P65853O10264L20074M20926J54285
5628C51192697k86374m21505m37813p47021j345397j271006j338536j393973j588569
5619C42362503k151942j920017k275117k526188k724745k882142k877200k856294
5611C22148858k832385l374510l235354l291077l483970l693647l504072l510618
$$ y = [235886372, 239603088, 243210686, 247268254, 251156419, 254995212, 258815453, 262752308, 266672499, 270293910, 274312805, 278163341, 281976996, 285884106, 289670169, 293467241, 297148022, 300842378, 304551627, 307918581, 311022729, 314386726, 317565801, 320590552, 323775014, 326610402, 329360241, 332326806, 334884717, 337131518, 339459662, 341310393, 343028889, 344965955, 346454127, 347821645, 348921295, 349687148, 350297412, 350617486, 351038412, 351192697, 350906323, 350484818, 350047005, 349299984, 347954587, 346683581, 345345045, 343951072, 342362503, 340210561, 338290544, 336015427, 333489239, 330764494, 327882352, 325005152, 322148858, 319316473, 315941963, 312706609, 309415532, 305931562, 302237915, 298733843, 295223225]
5603B95223225m015689l710491l847748l657513l649040l663054l991402m177294
5595B64510994l654731l880405l843833l628643l645006l885429l900825l604115
5587B34468007l529247l522202l837183l324411l390349l440902l518281l694367
5579B06211065l235697k946385k967952l222715l483333l080444k872263k988495
5571A81413781l070788k730052k777089k785637k821481k988336k532984k519407
5563A59188007k242763k268202k592413k041798k364126k220050k248308k132639
5555A41077708k220354k264439k146550k317647k120406j721249j841246j966602
5547A24479215j662289j918635j615056j436711j814814j698489j697440j717259
$$ y = [295223225, 291207536, 287497045, 283649297, 279991784, 276342744, 272679690, 268688288, 264510994, 260856263, 256975858, 253132025, 249503382, 245858376, 241972947, 238072122, 234468007, 230938760, 227416558, 223579375, 220254964, 216864615, 213423713, 209905432, 206211065, 202975368, 200028983, 197061031, 193838316, 190354983, 187274539, 184402276, 181413781, 178342993, 175612941, 172835852, 170050215, 167228734, 164240398, 161707414, 159188007, 156945244, 154677042, 152084629, 150042831, 147678705, 145458655, 143210347, 141077708, 138857354, 136592915, 134446365, 132128718, 130008312, 128287063, 126445817, 124479215, 122816926, 120898291, 119283235, 117846524, 116031710, 114333221, 112635781, 110918522]
5539A10918522j440980j357996j688539j522405j464778j845063j383408j309082
5531I8906271j100800j207673j398161j176148j283544j253587j123292j221148
5523H9141918j304323j288370j081614q99246j253906r98305o65251j328207r91020
5514G9331676j238490j126104j130376n63531p23608j029572o31406j177612r21742
5505G0789235n60606j040377n27293p38355p78497j047130j002084m53274o20645
5496F4020974q56707q53136m76056p42227m12608q46344o99883m71322q91169
5487E7771522o40613m96144o17733o44678n10887l69010n12735q71889n27124
5478E2580709k31690p89070o01605k58091n46848m07034p29902q27459n07774
$$ y = [110918522, 109477542, 108119546, 106431007, 104908602, 103443824, 101598761, 100215353, 98906271, 97805471, 96597798, 95199637, 94023489, 92739945, 91486358, 90363066, 89141918, 87837595, 86549225, 85467611, 84568365, 83314459, 82316154, 81650903, 80322696, 79331676, 78093186, 76967082, 75836706, 75273175, 74549567, 73519995, 72888589, 71710977, 70789235, 70228629, 69188252, 68660959, 67922604, 67144107, 66096977, 65094893, 64641619, 64020974, 63164267, 62311131, 61835075, 61092848, 60680240, 59833896, 59134013, 58662691, 57771522, 57130909, 56634765, 56017032, 55372354, 54861467, 54492457, 53979722, 53107833, 52580709, 52349019, 51559949, 50958344, 50700253, 50153405, 49746371, 49016469, 48189010, 47681236]
5469D7681236m99710l40901n66131o31933k3329l87839o62071r3275l52570q94269
5459D3229208r7918n1066m86002l18633k35510l12801l34548l67268j71886j83595
5449D0669981m59127r02428n61914m36299k41053j34833m08576m66772l75325
5440C6683654k23848k86438n06306l74405m74390j62452k49352m23228j41215
5431C3842020l72260j32950l40487k56631k34715o2361l00147l42075L1226n6301
5421C1775319m40111J52802k73878l42061k02876l41584k88126m43498m43821
5412B9152166m02706k70019p9287k20789r1376l97222r9043l08264l80152J0826
5402B6914134j32902m06705l21414l58436k29275j64615k09625k9309k26206j48285
$$ y = [47681236, 47181526, 46840625, 46274494, 45642561, 45619232, 45231393, 44569322, 44476047, 44123477, 43229208, 43131290, 43080224, 42594222, 42275589, 42040079, 41727278, 41392730, 41025462, 40853576, 40669981, 40210854, 39308426, 38746512, 38310213, 38069160, 37934327, 37525751, 37058979, 36683654, 36459806, 36173368, 35667062, 35292657, 34818267, 34655815, 34406463, 33983235, 33842020, 33469760, 33336810, 32996323, 32739692, 32504977, 32442616, 32142469, 31800394, 31831620, 31775319, 31335208, 31488010, 31214132, 30872071, 30669195, 30327611, 30039485, 29595987, 29152166, 28749460, 28479441, 28400154, 28179365, 28087989, 27690767, 27591724, 27283460, 26903308, 26914134, 26781232, 26374527, 26053113, 25694677, 25465402, 25300787, 25091162, 25061853, 24835647, 24687362]
5392B4687362k32623j74207m54792n8854R1208j58794k7640j69086l75814l47271
5382B2779489q7956l89399j22366k14320n36491q4521K13442p0617j36988k12045
5372B1138228m24880k53636J22818j06430j29748j73008j13151m1949k80421k43368
5362A9494455j87579p7311m5546j80779r2855l86903j08048P7990j32868l17624
5352A8042932l48858J03674M6515L617P2834k09496m48920m4839p3213m0838N574
5341A7108982k70151o1157o289m80712K65950J55854j99081l14779J17230m09828
5331A5906019K1184j16813k03529j06710j23727m5989j64904J06698Q5950J5892
5321A5374071l30798j85578k87391N1015N7612J57787l0489q7171j04021k18800
$$ y = [24687362, 24454739, 24280532, 23825740, 23766886, 23858094, 23699300, 23671660, 23502574, 23126760, 22779489, 22691533, 22302134, 22179768, 21965448, 21428957, 21344436, 21557878, 21487261, 21350273, 21138228, 20713348, 20459712, 20582530, 20476100, 20346352, 20173344, 20060193, 20018244, 19737823, 19494455, 19306876, 19229565, 19184019, 19003240, 18910385, 18523482, 18415434, 18493424, 18360556, 18042932, 17694074, 17797748, 17844263, 17847880, 17920714, 17711218, 17262298, 17217459, 17144246, 17103408, 17108982, 16838831, 16777674, 16771385, 16290673, 16556623, 16712477, 16513396, 16198617, 16315847, 15906019, 15927203, 15810390, 15606861, 15500151, 15376424, 15330435, 15165531, 15272229, 15358179, 15374071, 15043273, 14857695, 14570304, 14621319, 14678931, 14836718, 14806229, 14719058, 14615037, 14396237]
5311A4396237k28587J26068j05990k38757J19532l50695l30147n1083L32288O2429
5301A3731295m5734k64413l9459o0268o0329k03079n3011J33791k21153j01962
5291A2815678l4192J71063k46422j46283J09889P6166Q7091k08754k60663J23511
5281A2487084J75473k14624o1592j0553k62480l01802Q7376J62409L73096k42172
5271A2192215m1198k67409k36301M549j7056K07831j70093O5016j66839n3125
5261A1517590j43724l1996J58664l8667j94137P0075o4766l6686K29829j64713
5251A1301469k3376K12940l19314j01657K11797J42730L3158k48194J9641O5398
5241A1294592J53287L2959k15151J48019j68333J048K42582K2480j36503q7938
$$ y = [14396237, 14167650, 14293718, 14187728, 13948971, 14068503, 13717808, 13387661, 13336578, 13668866, 13731295, 13685561, 13421148, 13381689, 13321421, 13261092, 13058013, 13005002, 13138793, 12917640, 12815678, 12781486, 12952549, 12706127, 12559844, 12669733, 12745899, 12832990, 12624236, 12363573, 12487084, 12662557, 12447933, 12386341, 12375788, 12113308, 11811506, 11898882, 12061291, 12434387, 12192215, 12151017, 11883608, 11647307, 11651856, 11634800, 11842631, 11672538, 11737554, 11570715, 11517590, 11373866, 11341870, 11500534, 11461867, 11267730, 11337805, 11273039, 11236353, 11466182, 11301469, 11278093, 11491033, 11171719, 11070062, 11281859, 11424589, 11457747, 11209553, 11229194, 11294592, 11447879, 11480838, 11265687, 11413706, 11245373, 11246421, 11489003, 11511483, 11374980, 11287042]
5231A1287042O5625J38127q1247J07567J15560j3975r669K06443P878N9665l00316
5220A1582700M928j2812J07319M5006J60371J88730J45346j3235j3106k56303
5210A1938944J79935M44683M9279J48802K22601J32037J56613L0071K02380K50899
5200A3756244j26583J52623L5470L33000N758M975K58635L55615m6298K70463
5190A4999902J61767m2970J43964L50143N6053R7179L99842j50010r4480L7407
5180A5958797o5015M29439K72585O3227m0186K92499K8429p4672J63303K16596
5170A7245002k09306L3224L49362K3802R8143o7200R2560k65436K45039K13388
5160A7758578m26720K07688L58714R5844L97617J51065K06315K18314K49941K24314
$$ y = [11287042, 11352667, 11490794, 11409547, 11517114, 11632674, 11618699, 11609030, 11815473, 11823351, 11883016, 11582700, 11587628, 11574816, 11682135, 11727141, 11887512, 12076242, 12221588, 12208353, 12195247, 11938944, 12118879, 12563562, 12612841, 12761643, 12984244, 13116281, 13272894, 13302965, 13505345, 13756244, 13629661, 13782284, 13817754, 14150754, 14156512, 14161487, 14420122, 14775737, 14729439, 14999902, 15161669, 15118699, 15262663, 15612806, 15668859, 15766038, 16165880, 16015870, 15921390, 15958797, 15893782, 16323221, 16595806, 16659033, 16618847, 16911346, 16939775, 16865103, 17028406, 17245002, 17035696, 17068920, 17418282, 17442084, 17540227, 17473027, 17565587, 17300151, 17545190, 17758578, 17331858, 17539546, 17898260, 17994104, 18391721, 18542786, 18749101, 18967415, 19217356, 19441670]
5150A9441670j51359J25983K69992L96179J09770L28134L35598n465O2101K13615
5140B1126218n048M6970N8078O1657L63509J24216l3078M27554P4121J21348J08624
5129B2474169j96370l3246p9806p2854j08743J71163j02955k14696J10394j00313
5119B1846743j34799j7545j03613Q5435l3962k45709j40356J78478n35764m97923
5109B0400985K52703m2232j75682N8654j7611J47544j17609j42712K93111l5100
5099B0622051P6938j73325l10214J59795j42422j8977j11363m9051r6192l7624
5089A9919616j84729l02614k11909l11359J25674j03087j85814J274k89384k88725
5079A8168943N8354k54673l10115k19963k99434l21476k77137r2549j78253m39695
$$ y = [19441670, 19290311, 19416294, 19686286, 20082465, 20192235, 20520369, 20855967, 20850502, 20912603, 21126218, 21121170, 21168140, 21226218, 21287875, 21651384, 21775600, 21742522, 22170076, 22244197, 22365545, 22474169, 22277799, 22244553, 22164747, 22091893, 21983150, 22154313, 22051358, 21836662, 21947056, 21846743, 21711944, 21694399, 21590786, 21676221, 21642259, 21396550, 21256194, 21434672, 20898908, 20400985, 20653688, 20611456, 20435774, 20494428, 20476817, 20624361, 20506752, 20364040, 20657151, 20622051, 20698989, 20525664, 20215450, 20375245, 20232823, 20213846, 20102483, 20053432, 19957240, 19919616, 19734887, 19432273, 19220364, 18909005, 19034679, 18931592, 18745778, 18747052, 18457668, 18168943, 18227297, 17972624, 17662509, 17442546, 17143112, 16821636, 16544499, 16451950, 16273697, 15834002]
5069A5834002k80689k79470k03982m4795j94829j26701m5473l00814j65834L9552
5059A4230967K823n05335k81872j77207j22320p8010j40896N2504l85026q7773
5049A2507855J1397J8411n5901j06170K55624k8868P5023o5394j90185J2120j551
5038A2432361n0741J39037L39374J63621J55317L72678N3607O3706J17896p9731
5028A3707125J19782j26716K51159M4372K02189K34301J50779J32323O7284K10188
5018A4992786K82179O6608j00219J46383N65520J52456J35846K75121j26940O4580
5008A6454320J86936J37841l06672K68407L00635j01614J94351J82013J46269
4999A7462486K39908J26777L42807J20016M7162K29920J93604K17102R5235m2716
$$ y = [15834002, 15553313, 15273843, 15069861, 15025066, 14830237, 14703536, 14658063, 14357249, 14191415, 14230967, 14233790, 13728455, 13446583, 13269376, 13147056, 13069046, 12928150, 12980654, 12595628, 12507855, 12519252, 12537663, 12481762, 12375592, 12631216, 12602348, 12677371, 12611977, 12421792, 12433912, 12432361, 12381620, 12520657, 12860031, 13023652, 13178969, 13551647, 13605254, 13668960, 13786856, 13707125, 13826907, 13700191, 13951350, 13995722, 14197911, 14432212, 14582991, 14715314, 14782598, 14992786, 15274965, 15341573, 15241354, 15387737, 15953257, 16105713, 16241559, 16516680, 16389740, 16454320, 16641256, 16779097, 16472425, 16740832, 17041467, 16939853, 17134204, 17316217, 17462486, 17702394, 17829171, 18171978, 18291994, 18339156, 18569076, 18762680, 18979782, 19075017, 19032301]
4989A9032301K22703K98823K70001J85371m1527L16295L5175O1220N21902M17427
4979B1319691l0027K14651J91101j32432k47263K82598K25110O2533J19466L12553
4969B2317981L5010j86554o5952r8066K60630K28906O9683O1001j7958o1688M6617
4958B2589610k33835L72526J92174m7202k9620J3261K03342J23233O6566K90976
4948B3541031J77260j27647n5688J89898L23034M09442K98690M12601N68060L83890
4938B6120571N80127P02029P60081L09454l5702r8740P2831j11832l84069o01347
4928B7313403j31134m4636l37479j87531j56843l95614o93728l6566m4542l52015
4918B4933315l86560Q5133n8333j50497l59459k96080k35757m44025K6574j38251
$$ y = [19032301, 19255004, 19553827, 19823828, 20009199, 19967672, 20283967, 20319142, 20380362, 20902264, 21319691, 21289664, 21504315, 21695416, 21562984, 21315721, 21598319, 21823429, 21885962, 22005428, 22317981, 22352991, 22166437, 22100485, 22002419, 22263049, 22491955, 22561638, 22622639, 22604681, 22542993, 22589610, 22355775, 22728301, 22920475, 22873273, 22843653, 22856914, 23060256, 23183489, 23250055, 23541031, 23718291, 23590644, 23534956, 23724854, 24047888, 24457330, 24756020, 25168621, 25736681, 26120571, 26700698, 27402727, 28162808, 28472262, 28436560, 28337820, 28410651, 28298819, 27914750, 27313403, 27182269, 27137633, 26800154, 26612623, 26455780, 26060166, 25366438, 25329872, 25285330, 24933315, 24546755, 24631888, 24573555, 24423058, 24063599, 23767519, 23531762, 23087737, 23114311, 22976060]
4908B2976060l07555j87528j60777k0651m9016l56830j3035j34511k89796j30847
4898B1325514m61341j10496L1682J81225l50478l27119r2018Q7634Q5645j21741
4888B0248507J22205k36316Q2492M6609M6030n8320k64120k84989K6508M72000
4878B0200606J73355M6684R7015J70426J79176m8673k7804L89863K97192O2634
4868B1540474R4471K17360N3328L13854K16579R8551M52811K47970J78240L02515
4858B3716153L15714J17968L64805K05311O2524K02202K50591K64303L33569L57852
4848B6190992N33303n46O18247J91765R3012N66984L53450R4103M37312M71388
4838B9550010J55405M53524j1586k15607J25746J77030j05625K00105J06526m0197
$$ y = [22976060, 22668505, 22480977, 22320200, 22299549, 22250533, 21893703, 21880668, 21746157, 21456361, 21325514, 20864173, 20753677, 20785359, 20966584, 20616106, 20288987, 20196969, 20284603, 20370248, 20248507, 20370712, 20134396, 20216888, 20263497, 20309527, 20251207, 19987087, 19702098, 19728606, 20200606, 20373961, 20420645, 20517660, 20688086, 20867262, 20818589, 20790785, 21180648, 21477840, 21540474, 21634945, 21852305, 21905633, 22219487, 22436066, 22534617, 22987428, 23235398, 23413638, 23716153, 24031867, 24149835, 24514640, 24719951, 24782475, 24984677, 25235268, 25499571, 25833140, 26190992, 26724295, 26723749, 27341996, 27533761, 27626773, 28193757, 28547207, 28641310, 29078622, 29550010, 29705415, 30158939, 30147353, 29931746, 30057492, 30234522, 30128897, 30329002, 30435528, 30395331]
4828C0395331m6266K431j33032k36410q7063K57064J26032l38212m1316j24777
4818B9773782L6275K93358J17332J76332Q2410m5565K68694J82273j74280K82453
4808C0993064L76379L16063J01315j60889K66434M04229K41947J28860J19935
4799C2787337K67302M30257J82748L69865N18514M55036P12562K95536L26902
4790C6346059N65373Q4270q9220k811m7231j90918k05861j40973j64846l29426
4780C5824416l63083n89448m36230k10270l85753l6141p19064m38145l74593l89810
4770C1881879n06296l41964l84852j02740k31727l95072k38618l87186j49269
4761B9144155M4087m05768k08327j20809l49123k54922n12812l1846j49395l35385
$$ y = [30395331, 30349065, 30351496, 30218464, 29982054, 29894991, 30152055, 30278087, 29939875, 29898559, 29773782, 29810057, 30103415, 30220747, 30397079, 30479489, 30433924, 30702618, 30884891, 30710611, 30993064, 31369443, 31685506, 31786821, 31625932, 31892366, 32296595, 32538542, 32667402, 32787337, 33054639, 33484896, 33667644, 34037509, 34556023, 35011059, 35723621, 36019157, 36346059, 36911432, 36995702, 36906482, 36903671, 36856440, 36665522, 36459661, 36318688, 36153842, 35824416, 35461333, 34871885, 34435655, 34225385, 33839632, 33803491, 33084427, 32646282, 32271689, 31881879, 31375583, 31033619, 30648767, 30546027, 30314300, 29919228, 29680610, 29293424, 29144155, 29188242, 28782474, 28574147, 28453338, 28104215, 27849293, 27336481, 27304635, 27155240, 26819855]
4751B6819855J1562k83241k31283r8471l4232l85112m70444j45094l41959L1777
4741B4873358k4357j67194j66926J12193r1051m60358M2891J8132R2927j89402
4731B4040213Q235j09527J8177K72537o6498j21865P6100O1199N41540L84615
4721B5104726j56355L20071M66063L69820K76557K03345J01995O80593O83898
4712B8050713N51198M37200M19650N03053O52538M83343P90037L35025M06455
4703C2629212O44518O18171Q45212O41053O07147O65706P04928Q24346P45128
4694C8925421P21822P41920O45422N87023J093739O95160Q26648O12612R05576
4685D5755343R60338P35051P47316O76185O68940P00332O62702R83540Q95173
$$ y = [26819855, 26831417, 26548176, 26316893, 26218422, 26184190, 25799078, 25328634, 25183540, 24841581, 24873358, 24849001, 24681807, 24514881, 24627074, 24536023, 24075665, 24118556, 24136688, 24229615, 24040213, 24048448, 23938921, 23957098, 24229635, 24163137, 24041272, 24117372, 24178571, 24720111, 25104726, 24948371, 25268442, 25734505, 26104325, 26380882, 26584227, 26686222, 27366815, 28050713, 28601911, 29039111, 29458761, 29961814, 30614352, 31097695, 31887732, 32222757, 32629212, 33273730, 33891901, 34737113, 35378166, 35985313, 36651019, 37355947, 38180293, 38925421, 39647243, 40389163, 41034585, 41621608, 42715347, 43410507, 44237155, 44849767, 45755343, 46715681, 47450732, 48198048, 48874233, 49543173, 50243505, 50906207, 51889747, 52784920]
4676E2784920R40379R56968O48751Q96743P36631J088197J150965M46988Q40119
4667F0490661Q18559O31957N47768M86668M21250N44780p8335o7881J02703J32875
4657F4031005P7636j83300j02280j81692l65531l81635j40918m51869l71796j72863
4647F1756757k28928k68075j73775m36797n0811O0988l19987j54352j50435k53780
4637E9780805p4087j42649Q7252O10223P30812K90874J012197R09219J326348
4628F4530994J654188J762339J809783J331876n42580j054363j410553j174166
4620F6907518r94010n86471J88342O7089j15420k26807P1390M11261M91500J019889
4610F7234281J018688J323287K057784K285969K347939J875243K230937K282163
$$ y = [52784920, 53725299, 54682267, 55331018, 56227761, 56964392, 58052589, 59203554, 59650542, 60490661, 61309220, 61941177, 62488945, 62975613, 63396863, 63941643, 63863308, 63795427, 63898130, 64031005, 64108641, 63925341, 63823061, 63641369, 63275838, 62894203, 62753285, 62301416, 61929620, 61756757, 61527829, 61259754, 61085979, 60649182, 60598371, 60659359, 60339372, 60185020, 60034585, 59780805, 59706718, 59564069, 59651321, 60261544, 60992356, 61283230, 62295427, 63204646, 64530994, 66185182, 67947521, 69757304, 71089180, 70546600, 69492237, 68081684, 66907518, 65913508, 65327037, 65515379, 65582468, 65467048, 65240241, 65311631, 65722892, 66214392, 67234281, 68252969, 69576256, 71634040, 73920009, 76267948, 78143191, 80374128, 82656291]
4602H2656291K762276L266344L198197L303710L060568K481407J911319K002905
4594A04643017J667677J712937K129789K370208J748353N28451n21498j282253
4586A12996681j643154j453330j308929j155588j245148j891662k970510l646829
4578I7681531l619631l562721l284525l164319l211051l286088l496214l632308
4570G0424674l905503l916159l423549l289054k971860l063956k537234k425040
4562D4892319k266607k151676j995045j976388j739007j236811j759225j411542
4554C0356018j019201j232771r15794q53405r23112q41018j095678o25402n89368
4545B2260269o46888p34057n68176m23089m97111p03139o28356l93430p14384
$$ y = [82656291, 85418567, 88684911, 91883108, 95186818, 98247386, 100728793, 102640112, 104643017, 106310694, 108023631, 110153420, 112523628, 114271981, 114800432, 114278934, 112996681, 111353527, 109900197, 108591268, 107435680, 106190532, 104298870, 101328360, 97681531, 94061900, 90499179, 87214654, 84050335, 80839284, 77553196, 74056982, 70424674, 66519171, 62603012, 59179463, 55890409, 52918549, 49854593, 47317359, 44892319, 42625712, 40474036, 38478991, 36502603, 34763596, 33526785, 31767560, 30356018, 29336817, 28104046, 27188252, 26334847, 25411735, 24570717, 23475039, 22849637, 22260269, 21613381, 20879324, 20311148, 19888059, 19390948, 18687809, 18059453, 17666023, 16951639]
4536A6951639k14683l54563j77716k96049m29115j42213n61853k46884j11053
4527A4417510l36526k42473m08282l38616k22075n9308j80113q2375k26310o6639
4517A2254793m24470l19430N263r3127l40140p2088M2851j91909k99559P6779
4507A0638963P7319j45829m05226q01j58163k42674j04143j93892k01951j76363
4497I087240K18379j22338j67693O6768m48129k83080m1893Q0142j68377m9151
4487H171868K30500m8196q3866l74325J8183K96985j93128k47099j10043j21165
4477G539714j0294Q468l3599j40937m7733j5458l5303l70032k45369J46296j65727
4466F630026P0421N7134O105J30085m47423j87053J12204K69619P1769l38476
$$ y = [16951639, 16736956, 16382393, 16204677, 15908628, 15479513, 15337300, 14775447, 14528563, 14417510, 14080984, 13838511, 13430229, 13091613, 12869538, 12810230, 12630117, 12547742, 12321432, 12254793, 11830323, 11510893, 11516156, 11423029, 11082889, 11010801, 11053652, 10861743, 10562184, 10638963, 10716282, 10570453, 10165227, 10164426, 10006263, 9763589, 9659446, 9465554, 9263603, 9087240, 9305619, 9183281, 9015588, 9082356, 8634227, 8351147, 8309254, 8389396, 8221019, 8171868, 8402368, 8354172, 8270306, 7895981, 7914164, 8211149, 8018021, 7770922, 7660879, 7539714, 7529420, 7537888, 7504289, 7363352, 7315619, 7300161, 7264858, 6894826, 6649457, 6795753, 6630026, 6700447, 6757581, 6763686, 6893771, 6446348, 6259295, 6371499, 6641118, 6712887, 6374411]
4456F374411n2140N2487j18161L4023j18566l47590r9864Q868o3789Q5748j55326
4445E600101l4020j6242R5812k46296j65472J33292j10957l2799l4749R3059J84092
4434E465821k67637k74886N7993Q7168o5607R4719n0687j91833k87896J09686
4424D676841J97100M820O2782j38861J10233J78096l80567k57332r6495J28952
4414D485569K62352o3156o3564j8092K0155J6687Q4258p3559j22783l344P9275
4403D603798M8607r3672j59573J32882Q2346j00384J57697k7289q3162J27911
4393D689161r6441J7442M80543m36962J8721R1355l88450J13617Q5558P6687J91582
4382D842813J03666M5802k55537j49268J69584M00522p8111r4697k9180j91744
$$ y = [6374411, 6322271, 6374758, 6256597, 6290620, 6172054, 5824464, 5724600, 5733468, 5669679, 5755427, 5600101, 5566081, 5549839, 5645651, 5399355, 5233883, 5367175, 5256218, 5223419, 5188670, 5281729, 5465821, 5198184, 4923298, 4981291, 5068459, 5002852, 5097571, 5046884, 4855051, 4567155, 4676841, 4873941, 4878761, 4941543, 4802682, 4912915, 5091011, 4710444, 4453112, 4356617, 4485569, 4747921, 4684765, 4621201, 4603109, 4623264, 4639951, 4724209, 4650650, 4527867, 4524523, 4603798, 4652405, 4558733, 4399160, 4532042, 4614388, 4514004, 4671701, 4644412, 4561250, 4689161, 4592720, 4610162, 5090705, 4653743, 4672464, 4763819, 4375369, 4488986, 4574544, 4651231, 4842813, 4946479, 4992281, 4736744, 4587476, 4757060, 5157582, 5079471, 4984774, 4955594, 4763850]
4372D763850J04658l6745K09844J13201J0953k52402l9781K03189k03483J22354
4362D995638K16995l0633K22906Q9938k6268N3960q0825r2788J48199K19045J16624
4351E832791J87997K8691j26084J2040R7516m3818K07870J89778L35152r7029
4341F624904p9355L99943K76533k6437R1331K83857r848M92650L00189J09679
4331H463446K42003J07405K53551K16330K14265M99523J17311L03619M98887O71502
4321A1587842L76768K11396J88226L87105K32874M44995L48701L95463P23800
4312A4897170L47682N54436P59336P10212P48153M82451L51960P26014R48993
4303B0526407Q59824M33050M34616J018243O79010P38322P53984N24801L79196
$$ y = [4763850, 4868508, 4831763, 5041607, 5154808, 5165761, 4913359, 4873578, 5076767, 4873284, 4995638, 5212633, 5182000, 5404906, 5494844, 5468576, 5522536, 5441711, 5348923, 5497122, 5716167, 5832791, 6020788, 6049479, 5923395, 5935435, 6032951, 5989133, 6197003, 6386781, 6721933, 6624904, 6545549, 6945492, 7222025, 7195588, 7286919, 7570776, 7560928, 8053578, 8353767, 8463446, 8705449, 8812854, 9066405, 9282735, 9497000, 9996523, 10113834, 10417453, 10916340, 11587842, 11964610, 12176006, 12364232, 12751337, 12984211, 13429206, 13777907, 14173370, 14897170, 15244852, 15799288, 16558624, 17268836, 18016989, 18499440, 18851400, 19577414, 20526407, 21386231, 21819281, 22253897, 23272140, 23951150, 24689472, 25443456, 25968257, 26347453]
4294B6347453M14817N26925J057723N60004M79301L22521N47749N33694L06768
4285C1096955L51059L23508N46099L33220M41156J85720J23794l865j53321Q235
4275C3252560K172j16998l84628l11627J01732m58534l19761l75109l01314m08755
4265C0679738l62385k44990l84636l90497o38921p39638q00388l74971k64944
4256B6478368p26434r17820p48177n10855m90198l62381k39664r06234p88354
4247B0788251n40728q04080n97470j66371n7697m99415n56519n16451l55567m37434
4237A6256519n35774l89584j8020p6242m23561n01105k09422j07839m52846j60241
4227A3381885k4922j94385P8630J5161m02549k57945k1105j36433K70556K69338
$$ y = [26347453, 26762270, 27289195, 28346918, 28906922, 29386223, 29708744, 30256493, 30790187, 31096955, 31448014, 31771522, 32317621, 32650841, 33091997, 33277717, 33401511, 33397646, 33244325, 33252560, 33254732, 33137734, 32753106, 32441479, 32543211, 32084677, 31764916, 31389807, 31088493, 30679738, 30317353, 30072363, 29687727, 29297230, 28658309, 27918671, 27118283, 26743312, 26478368, 25751934, 24834114, 24085937, 23575082, 23084884, 22722503, 22482839, 21576605, 20788251, 20247523, 19443443, 18845973, 18679602, 18621905, 18122490, 17565971, 17049520, 16693953, 16256519, 15720745, 15331161, 15313141, 15236899, 14813338, 14312233, 14102811, 13994972, 13542126, 13381885, 13356963, 13162578, 13241208, 13256369, 12853820, 12595875, 12574770, 12438337, 12708893, 12978231]
4217A2978231J93158N44556L34735N01880K50696P70556J126214P95433P71252
4208A8266711Q82050J557991J127938K55001j318985q44086q65604j017842p43158
4199A7300016l73576p3181o49395j209826p45610q12033n68194l14073m61845
4190A2092283p14374o16993m62776m82467j56153m29702k17880j11468k40406
4181H660064l72371j39137j00764k5950j42737j41258j94295p4726J36506k2092
4171G583240j15639j04313n6111j02744L27210j57106k94088k11069M2934p8197
4161F834117k56679j30811r2236n5011k95473K37987J60815k44077M594K48492
4151F411718j23071k24946m8050m6486N9193j51675l05072M8922R4408P2229k12551
$$ y = [12978231, 13171389, 13715945, 14050680, 14552560, 14803256, 15573812, 16700026, 17495459, 18266711, 19148761, 20706752, 21834690, 22089691, 20770706, 19926620, 19061016, 18043174, 17300016, 16926440, 16853259, 16203864, 14994038, 14248428, 13436395, 12868201, 12554128, 12092283, 11377909, 10760916, 10298140, 9815673, 9659520, 9229818, 9011938, 8900470, 8660064, 8287693, 8148556, 8047792, 8021842, 7879105, 7737847, 7543552, 7468826, 7605332, 7583240, 7467601, 7363288, 7307177, 7204433, 7531643, 7374537, 7080449, 6869380, 6912314, 6834117, 6577438, 6446627, 6354391, 6299380, 6003907, 6241894, 6402709, 6158632, 6163226, 6411718, 6288647, 6063701, 6015651, 5969165, 6028358, 5876683, 5571611, 5620533, 5714941, 5787170, 5574619]
4140E574619q731J45J64402q9417K4977p8763K03085N8598K34552M3237k37940
4129E888764k58937R8847J88731j17032k20581J16927J01757j02996L46015K4024
4119F065519j444k27652j15748K24006L9371L10616k49672l33672K31326K35202
4109F177852J06176L9731m8213k5331Q6511o2422Q5243L89963L24402N7629j32684
4098F998857J48581L41281l71106l075L96488O0757K58677M10369k85198K12654
4088H168285J15106J734K57877K52298L3967M9869M34966J63145j49083L71614
4078I699778N39026J73188R6266j8171J21307K01955L92133N08682L39697K25713
4068A2279574J95233J82132N45770O75858L55833M87411O93384Q90213P69558
$$ y = [5574619, 5565888, 5566033, 5730435, 5641018, 5665995, 5587232, 5790317, 5848915, 6083467, 6126704, 5888764, 5629827, 5728674, 5917405, 5800373, 5579792, 5696719, 5798476, 5695480, 6041495, 6065519, 6064075, 5836423, 5720675, 5944681, 5984052, 6294668, 6044996, 5711324, 5942650, 6177852, 6284028, 6323759, 6275546, 6250215, 6336726, 6274304, 6359547, 6749510, 7073912, 7131541, 6998857, 7147438, 7488719, 7117613, 7114538, 7511026, 7571783, 7830460, 8240829, 7955631, 8168285, 8283391, 8285125, 8543002, 8795300, 8829267, 8879136, 9314102, 9477247, 9328164, 9699778, 10238804, 10411992, 10508258, 10490087, 10611394, 10813349, 11205482, 11714164, 12053861, 12279574, 12474807, 12656939, 13202709, 13878567, 14234400, 14721811, 15415195, 16305408, 17074966]
4059A7074966Q55389R28938Q13045Q55487J324892J634942J135653J708007J550513
4050B7881832J478944J322070K13479l99370n81236k20553m9600o1961P3121K4149
4040B9680875j36297n865k9258k48754m4769j05591R2337j39969L06769l606j92642
4029B9173230N36171L93782O3781M14940L42650L43869N44244L10456K34163M49675
4019C2806961P33412M53829K70256N44729O14239O68470L01605M10509Q41971
4010C7645981M53656O54420P29857N47959N40264R34481O08309P39811M93585
4001D3348323O14259P15440P01960M09689N85006P74253Q22687P26030N14075
3992D9211722R50997N34202L90780P32126N87877R43766P49048Q84801P65413
$$ y = [17074966, 17930355, 18859293, 19672338, 20527825, 21852717, 23487659, 24623312, 26331319, 27881832, 29360776, 30682846, 30896325, 30496955, 29915719, 29695166, 29645566, 29583605, 29656726, 29680875, 29544578, 29538713, 29509455, 29260701, 29215932, 29110341, 29202678, 29062709, 29369478, 29365872, 29173230, 29709401, 30103183, 30166964, 30581904, 30924554, 31268423, 31812667, 32123123, 32357286, 32806961, 33540373, 33994202, 34264458, 34809187, 35423426, 36091896, 36393501, 36804010, 37645981, 38099637, 38754057, 39483914, 40031873, 40572137, 41506618, 42114927, 42854738, 43348323, 43962582, 44678022, 45379982, 45789671, 46374677, 47148930, 47971617, 48697647, 49211722, 50162719, 50696921, 51087701, 51819827, 52407704, 53351470, 54100518, 54985319, 55750732]
3983E5750732J013664J009260O46463Q82317Q72844J131946P76352N15728R02428
3974F3501734J045163Q30662N74103Q03472Q28241R66600Q77568N96898Q06960
3965G0831401O15691Q86196L86614L19782O32942M93110N23983O56541P88519
3956G6134779M18981L99450M49282M24789N35377K99611K94391K07684K89754
3947G9454098L98965K77754Q0251K23427J54235J84601k2652j69016R0064K0133
3937H0691860p4587j10326k40406j43716k81715n13634j66954j28780o53106n44245
3927G7834391o36149n91331n71127l37984n50076o20624o66217p19612l69913
3918G2771358o35997l35250k75363n38227k72763l37530j12135j48701o7251J78198
$$ y = [55750732, 56764396, 57773656, 58420119, 59302436, 60175280, 61307226, 62083578, 62599306, 63501734, 64546897, 65377559, 65951662, 66755134, 67583375, 68549975, 69427543, 70024441, 70831401, 71447092, 72333288, 72719902, 73039684, 73672626, 74165736, 74689719, 75346260, 76134779, 76553760, 76953210, 77402492, 77827281, 78362658, 78662269, 78956660, 79164344, 79454098, 79853063, 80130817, 80211068, 80434495, 80588730, 80773331, 80750679, 80581663, 80671727, 80691860, 80617273, 80506947, 80266541, 80122825, 79841110, 79327476, 79160522, 79031742, 78378636, 77834391, 77198242, 76606911, 76035784, 75697800, 75147724, 74527100, 73860883, 73141271, 72771358, 72135361, 71800111, 71524748, 70986521, 70713758, 70376228, 70264093, 70115392, 70048141, 70226339]
3908G0226339j42007n8517j02930M06957j53010M8499L91959K43689L69322R7384
3898G1327685J49417J85073N2472Q0668J12334J45235J17682J37906l52103p4600
3888G1881769J4961r3487p8182J1471K7281L3037k91760l33824o4722j21026m38592
3877G0546926o22236k66469l22722q7490n56079n97468k96228m40636p16237p91548
3867F5849813m94989q19020j068053m84875r34815o64797m45595r20260q57846
3858E9159563n89206r33002j200477q92050p47760j170024j127626p31360n55646
3849E1212412j187917j148756j190735j085004r20820j253798j098808j111587
3841D2214987r21820j073620j105839o37881m35904p86306r83638p58292p64772
$$ y = [70226339, 70084332, 70025815, 69922885, 70329842, 70176832, 70225331, 70617290, 70860979, 71230301, 71327685, 71477102, 71662175, 71714647, 71795315, 71907649, 72052884, 72170566, 72308472, 71956369, 71881769, 71896730, 71803243, 71725061, 71736532, 71763813, 71796850, 71505090, 71171266, 71106544, 70985518, 70546926, 69924690, 69658221, 69335499, 69248009, 68691930, 68094462, 67798234, 67357598, 66641361, 65849813, 65354824, 64535804, 63467751, 62982876, 62048061, 61383264, 60937669, 60017409, 59159563, 58570357, 57637355, 56436878, 55544828, 54797068, 53627044, 52499418, 51768058, 51212412, 50024495, 48875739, 47685004, 46600000, 45679180, 44425382, 43326574, 42214987, 41293167, 40219547, 39113708, 38475827, 38039923, 37253617, 36269979, 35511687, 34746915]
3832C4746915p15655n99378m86253l04023k79695m91150j61842k70238l25448
3823C1113233l09209j61243r3997j22882Q9247K01379l2616J53332Q1475m0147
3813C0878572L4392L17138J82485k85998J66761j00723k58093K49345L25377j78445
3803C1330811j83936L13041k5212j80277K14299m10580q0208K29194j53541L8190
3793C1091781J04972k71290J4497k87223K53815j17995k4322J0222q7875L3487
3783C0720069L84184P5759j5378L16760N28061p1980K09375L27662J79493M29211
3773C3083216K40736L07724J98321j1300L1661K99588r0052O1038O1806K18238
3763C4400976l6964o4983k77740j87126K51154j2685O4349j57483j59146R3939
$$ y = [34746915, 34031260, 33431882, 32945629, 32641606, 32361911, 31870761, 31708919, 31438681, 31113233, 30804024, 30642781, 30548784, 30425902, 30515149, 30716528, 30683912, 30837244, 30918719, 30878572, 30912964, 31230102, 31412587, 31126589, 31293350, 31192627, 30934534, 31183879, 31509256, 31330811, 31146875, 31459916, 31434704, 31254427, 31468726, 31058146, 30977938, 31207132, 31053591, 31091781, 31196753, 30925463, 30939960, 30652737, 30906552, 30788557, 30764235, 30774457, 30686582, 30720069, 31104253, 31180012, 31164634, 31481394, 32009455, 31937475, 32146850, 32474512, 32654005, 33083216, 33323952, 33631676, 33829997, 33818697, 33850358, 34149946, 34059894, 34120932, 34182738, 34400976, 34364012, 34299029, 34021289, 33834163, 34085317, 34072632, 34136981, 33979498, 33820352, 33914291]
3753C3914291n4377K96428J31607n6548K56312P9933L02910M14829J49462M85064
3743C5919911M81230M02754L98533N27853O31900Q01714K59681P61330J137043
3734D1321949J149223N91543N39977J273534J432611J075006J121202J231883
3726D9736928J585839J401360J357329J079867J481007J586708J000858J316515
3718F0546411J292372J588246J165547J252724J171454P68447J267755J132380
3710G0185336R00252R31453J070134J397753J727839J097771R09006J201908R12041
3701H0333493J670187J607506J361255J031696J090518J190621P40141R05346
3693H9930763L81864L53885J66407l90918l78686l58881n42532j275901j235631
$$ y = [33914291, 33859914, 34156342, 34287949, 34231401, 34487713, 34567646, 34870556, 35285385, 35434847, 35919911, 36401141, 36803895, 37202428, 37730281, 38362181, 39163895, 39423576, 40184906, 41321949, 42471172, 43062715, 43602692, 44876226, 46308837, 47383843, 48505045, 49736928, 51322767, 52724127, 54081456, 55161323, 56642330, 58229038, 59229896, 60546411, 61838783, 63427029, 64592576, 65845300, 67016754, 67785201, 69052956, 70185336, 71085588, 72017041, 73087175, 74484928, 76212767, 77310538, 78219544, 79421452, 80333493, 82003680, 83611186, 84972441, 86004137, 87094655, 88285276, 89025417, 89930763, 90312627, 90666512, 90832919, 90442001, 90063315, 89704434, 89161902, 87886001, 86650370]
3684H6650370j462811j231272j345326j514498j870337j686649j225894j351763
3676G4961820j460746j541022j433657j399571r33025p91187j091644j128975
3668F5181993q23829n67342o28354p99533o80662n87949m54527p21884o56859
3659E9261054m84268n96003p28780q08996r65800q09773n23546p21851j049092
3650E2572945r74331p54544r08208j070160j061044p64827o19351p00549o43650
3641D5076281l21058m65330p33339m83723n73151n44547o1617p0779n35113l48165
3631D0939459l99973l46030p2920k19667k69254j84582k36717k68053J7589r2159
3621C8867693O6342R2694L6988l53492l02987J51629K10119l52018Q050J48476
$$ y = [86650370, 85187559, 83956287, 82610961, 81096463, 79226126, 77539477, 76313583, 74961820, 73501074, 71960052, 70526395, 69126824, 68193799, 67402612, 66310968, 65181993, 64358164, 63790822, 63162468, 62362935, 61682273, 61094324, 60639797, 59917913, 59261054, 58776786, 58180783, 57452003, 56643007, 55677207, 54867434, 54343888, 53622037, 52572945, 51598614, 50844070, 49935862, 48865702, 47804658, 47039831, 46420480, 45719931, 45076281, 44755223, 44289893, 43556554, 43072831, 42499680, 41955133, 41893516, 41822737, 41287624, 40939459, 40539486, 40193456, 40120536, 39900869, 39631615, 39447033, 39210316, 38942263, 38959852, 38867693, 38934035, 39026729, 39063717, 38710225, 38407238, 38558867, 38768986, 38416968, 38425018, 38573494]
3611C8573494J04775p2624J744k53305l74597j27145p30902k68035k09484m40709
3601C6203212o23877m63070n83463o32864l30462n15035n36299l10858m16037
3592C1791247q20533r27015q38148l49772j27639n15977m34849m26946l49752
3583B7000616l05432n61564p06871l71567m07356j34141k63269j75841l36922
3574B3737653j89820O2423l17123k12631j65268j96349k09345O6969M25790R1235
3564B3093534l47556j91048J35656J37298K72032J9608k1120k82133j21364M64023
3554B3158930K35154j22096K19169L12412M06120L02049K0657L21924k0240L85017
3544B5219096L11040L37955M99278J80884K92096M07084K03452M63572O63779
$$ y = [38573494, 38678269, 38605645, 38607389, 38354084, 37979487, 37852342, 37121440, 36853405, 36643921, 36203212, 35579335, 35116265, 34532802, 33899938, 33569476, 33054441, 32518142, 32207284, 31791247, 30970714, 30043699, 29205551, 28855779, 28728140, 28212163, 27777314, 27350368, 27000616, 26695184, 26133620, 25426749, 25055182, 24647826, 24513685, 24250416, 24074575, 23737653, 23547833, 23610256, 23293133, 23080502, 22915234, 22718885, 22509540, 22576509, 23002299, 23093534, 22745978, 22554930, 22690586, 22827884, 23099916, 23119524, 23098404, 22816271, 22694907, 23158930, 23394084, 23271988, 23491157, 23803569, 24209689, 24511738, 24532395, 24854319, 24834079, 25219096, 25530136, 25868091, 26367369, 26548253, 26840349, 27247433, 27450885, 27914457, 28578236]
3535B8578236K56853J56085N13749O54630N48731O84381R04064O33008N69439
3526C3499176L14656Q52391R96716Q30751Q13675J007658J313032J134393J124651
3517D1887099J020875J092370J443591J506416J443785J641077J823921J842070
3509E3701204J656315J928597K106859K323311K653574K661037K744733K764286
3501G2539916K648354L213994L442135L405384L408820L680638L835109L774049
3493I9948399L667680L699782L900550L847714L630303L515181L324808K932905
3485A28467322K964788K625965K275566J713754J523690J388259P71292N91667
3477A42322303R0158n01801p96364r98037j195512j585716k205033k416618k448912
$$ y = [28578236, 28835089, 28991174, 29504923, 30159553, 30708284, 31392665, 32296729, 32929737, 33499176, 33813832, 34666223, 35662939, 36493690, 37307365, 38315023, 39628055, 40762448, 41887099, 42907974, 44000344, 45443935, 46950351, 48394136, 50035213, 51859134, 53701204, 55357519, 57286116, 59392975, 61716286, 64369860, 67030897, 69775630, 72539916, 75188270, 78402264, 81844399, 85249783, 88658603, 92339241, 96174350, 99948399, 103616079, 107315861, 111216411, 115064125, 118694428, 122209609, 125534417, 128467322, 131432110, 134058075, 136333641, 138047395, 139571085, 140959344, 141730636, 142322303, 142412461, 141910660, 141114296, 140116259, 138920747, 137335031, 135129998, 132713380, 130264468]
3468A30264468k747285l260844l558351l152822l377867l803516l959263l559007
3460A02845513l780329l944167l600767l333972l088110l432721l147801l049655
3452G5467991l156138k503443k536299k294399k181661k406375j932705j780279
3444E6676692j701956j755685j871595j521181j293479j561841j433254r45810
3436D4591891r91798j044632r63548q24093p56684j144302o82162m64315q45650
3427C6874707n65476m27447n84544r27632m60670p8965m48371p40070l77058j57335
3417C2107139j78214m88452l61259L4652m52377j31535j55360j0414p1846l59535
3407B9932799j270K30445j69004J9398j28403P4595K00246P0338K18493k02405
$$ y = [130264468, 127517183, 124256339, 120697988, 117545166, 114167299, 110363783, 106404520, 102845513, 99065184, 95121017, 91520250, 88186278, 85098168, 81665447, 78517646, 75467991, 72311853, 69808410, 67272111, 64977712, 62796051, 60389676, 58456971, 56676692, 54974736, 53219051, 51347456, 49826275, 48532796, 46970955, 45537701, 44591891, 43600093, 42555461, 41591913, 40767820, 40011136, 38866834, 38184672, 37720357, 36874707, 36309231, 35881784, 35297240, 34369608, 33908938, 33829973, 33381602, 32641532, 32264474, 32107139, 31928925, 31440473, 31079214, 31113866, 30661489, 30529954, 30374594, 30364180, 30292334, 29932799, 29931529, 30161974, 29992970, 30012368, 29883965, 29958560, 30158806, 30229144, 30447637, 30245232]
3397C0245232O8073Q0800K5932K50575j05k32414m1434L87411n53955j52389J20402
3386C0198128n82562K12593k09042j41542J21536R7046k88809j19451m0788j9725
3376B9227384J75039N439K62426k8137J31813L46178L09007L51114L94611O8182
3366C1243056L70121K99567M97917P98709M63652N93260P43669Q70033M46875
3357C6326859O82938R57354O88368Q40304J132593J174991J037425J170789J257844
3348D5269465J038938J063877J258130J280545J239907J403647J118004J089201
3340E4761714J422013Q94628Q80299R10389R51480N82993O77315L07555q9231
3331F1299155j9461l3696J58400j23336k75583k41115K6447K38806M5837m45937
$$ y = [30245232, 30313305, 30394105, 30420037, 30670612, 30670507, 30438093, 30396659, 30784070, 30230115, 30077726, 30198128, 29615566, 29828159, 29619117, 29477575, 29599111, 29696157, 29407348, 29287897, 29247109, 29227384, 29402423, 29407862, 29670288, 29642151, 29773964, 30120142, 30429149, 30780263, 31174874, 31243056, 31613177, 31912744, 32410661, 33209370, 33673022, 34266282, 35009951, 35879984, 36326859, 37009797, 37967151, 38655519, 39495823, 40628416, 41803407, 42840832, 44011621, 45269465, 46308403, 47372280, 48630410, 49910955, 51150862, 52554509, 53672513, 54761714, 56183727, 57078355, 57958654, 58869043, 59820523, 60403516, 61080831, 61388386, 61299155, 61279694, 61245998, 61404398, 61281062, 61005479, 60764364, 60790811, 61029617, 61075454, 60629517]
3321F0629517J09701k52199o47649r9538j79989o43472o10941o08931m54423q41405
3311E6400671p18488o77974j069403j023603j269029j089278j335911j262135
3303D7954850j025317j244433j289342j597142j363815j363514j353736j116015
3295C7601536j061947j228606j154250r57006j035668p29520p07477j031194q54826
3286B8841042m73672p23175n75808n85490n35212k81724l56208j20082q9537l62271
3276B4737863k11930n7956J0776K45967J99558j91410l79556k10596j13672k2413
3266B4006631k91750k08575M26657P7327l05400k86795K2394k93729m85361l36657
3256B2324742k86549j6016k68996k65983k03576m31798l79640j28946l06913m59390
$$ y = [60629517, 60739218, 60487019, 59839370, 59739832, 59559843, 58916371, 58305430, 57696499, 57242076, 56400671, 55682183, 55004209, 53934806, 52911203, 51642174, 50552896, 49216985, 47954850, 46929533, 45685100, 44395758, 42798616, 41434801, 40071287, 38717551, 37601536, 36539589, 35310983, 34156733, 33199727, 32164059, 31434539, 30727062, 29695868, 28841042, 28367370, 27644195, 27068387, 26482897, 25947685, 25665961, 25309753, 25189671, 25100134, 24737863, 24525933, 24467977, 24478753, 24724720, 24924278, 24732868, 24353312, 24142716, 24029044, 24006631, 23714881, 23506306, 23932963, 24010290, 23704890, 23418095, 23440489, 23146760, 22661399, 22324742, 22038193, 22022177, 21753181, 21487198, 21283622, 20851824, 20472184, 20343238, 20036325, 19576935]
3246A9576935Q5547k30173n42888k03268j50782Q2973q0331m58863m25104j75830
3236A7478216j40703m58399l09146p0297k70466j51601l47406n66517l19303O9764
3226A4914142J99317j04570l66688o1219J7183k29732m28146k39337k59173J09190
3216A3550967J22773j8770j66171J3621m0205l73839K10289J91974K1401o4958
3206A3447082k42125k46377L1160K91796L2610j16751j10232L37763j9816j47861
3196A3257249M07106k10142k09575K35802L51736K00996J50969k464n8769l9167
3186A4083741K77092K9947O7435R213k74M25208L18709M3028J40720j19867N8378
3175A5333330J88033J69266o5474L08764M58880p2774L30530O0794L19695J49086
$$ y = [19576935, 19662482, 19432309, 18889421, 18686153, 18535371, 18618344, 18538013, 18079150, 17654046, 17478216, 17337513, 16879114, 16569968, 16499671, 16229205, 16077604, 15730198, 15163681, 14844378, 14914142, 15113459, 15008889, 14642201, 14580982, 14598165, 14368433, 13940287, 13700950, 13441777, 13550967, 13673740, 13654970, 13488799, 13502420, 13462215, 13088376, 13298665, 13490639, 13512040, 13447082, 13204957, 12958580, 12989740, 13281536, 13314146, 13197395, 13087163, 13424926, 13405110, 13257249, 13664355, 13454213, 13244638, 13480440, 13832176, 14033172, 14184141, 14181677, 14122908, 14083741, 14360833, 14390780, 14458215, 14467428, 14467154, 14892362, 15211071, 15254099, 15394819, 15274952, 15333330, 15521363, 15690629, 15625155, 15933919, 16392799, 16320025, 16650555, 16711349, 17031044, 17180130]
3165A7180130K69985L37504K29702L82084M68472K43835K45594M06643J55750
3156A9919699L65055O47106L76020L68275L35801M20634M92639J73182N74871
3147B3673282P69478R25431O23802L65722K45512N25867R27520P55928P21659
3138B9534201P47681R12327Q95808Q10869R10635R56379J133992J233760J106975
3129C8242627J081460J307150J028242J136890J363534J336624J781417J610130
3121D8888074K054825J976237J891550K042373K330803K414828K557367K869415
3113F7025472K741482K781219L188869L460997L897405M258349L931108M340957
3105I5625858M677614N307986O026568O196468O292325O919299P348178Q095142
$$ y = [17180130, 17450115, 17787619, 18017321, 18399405, 18867877, 19111712, 19357306, 19763949, 19919699, 20284754, 20931860, 21307880, 21676155, 22011956, 22432590, 22925229, 23098411, 23673282, 24442760, 25368191, 25991993, 26357715, 26603227, 27129094, 28056614, 28812542, 29534201, 30281882, 31194209, 32090017, 32900886, 33811521, 34767900, 35901892, 37135652, 38242627, 39324087, 40631237, 41659479, 42796369, 44159903, 45496527, 47277944, 48888074, 50942899, 52919136, 54810686, 56853059, 59183862, 61598690, 64156057, 67025472, 69766954, 72548173, 75737042, 79198039, 83095444, 87353793, 91284901, 95625858, 100303472, 105611458, 111638026, 117834494, 124126819, 131046118, 138394296, 146489438]
3097A46489438Q580622Q897641R316488R645431R943200J0474498J0851584J0854038
3089B25052940J0123348J0071507R194027P455554N777394L455693J091403j200332
3081B71021534l145932m094902n551941o072330o814323p706652q150040q755186
3073B20730228r114219r864108r477813r544116r427098q876104q384193q233447
3065A47809130p783741p178149o908708o556856n874467n556491n003317n027107
3057I7920294m468224l927806m085425l649491l670549l241474k507698k726586
3049F9643041k828531k424094k421298k256184k081379j791457j720416j977831
3041E2141851j571461j656399j386036j445253j397212j068525j106600j199010
$$ y = [146489438, 155070060, 163967701, 173284189, 182929620, 192872820, 203347318, 214198902, 225052940, 235176288, 245247795, 254441822, 261897376, 267674770, 271130463, 272221866, 271021534, 267875602, 263780700, 258228759, 252156429, 245342106, 237635454, 229485414, 220730228, 211616009, 201751901, 192274088, 182729972, 173302874, 164426770, 156042577, 147809130, 140025389, 132847240, 125938532, 119381676, 113507209, 107950718, 102947401, 97920294, 93452070, 89524264, 85438839, 81789348, 78118799, 74877325, 72369627, 69643041, 66814510, 64390416, 61969118, 59712934, 57631555, 55840098, 54119682, 52141851, 50570390, 48913991, 47527955, 46082702, 44685490, 43616965, 42510365, 41311355]
3033D1311355j125515j095559q89043n13146r08386p77635p44215r09038r89984
3024C3358834n59885n45735r83217p02091o75058n53338n29594m33476r29543
3015B7446897m56944j22281k02171n98949n31942m34016o47563m90931m05702
3006B3556398j22340k46542n86318q6279k094n99102m86442m90673m5444k32155
2996B0659009m84593l40676m20894j37433k35607q0635j41090R9429k67297m73747
2986A8176466n12274k88365M5623k52721K5276Q5394n10949o45614k34206j11435
2976A5777195q7398k0438k38695j41308k85258n36828k65100k74380K98697k38440
2966A3988047l40550m63149j92893M0604K2774j37839l07025l25793q5377p9172
$$ y = [41311355, 40185840, 39090281, 38201238, 37688092, 36779706, 36002071, 35257856, 34348818, 33358834, 32798949, 32253214, 31269997, 30567906, 29892848, 29339510, 28809916, 28376440, 27446897, 26989953, 26867672, 26665501, 26066552, 25534610, 25100594, 24453031, 23962100, 23556398, 23434058, 23187516, 22601198, 22514919, 22512825, 21913723, 21427281, 20936608, 20891164, 20659009, 20174416, 19833740, 19412846, 19275413, 19039806, 18959171, 18818081, 18917510, 18650213, 18176466, 17664192, 17375827, 17421450, 17168729, 17194005, 17279399, 16768450, 16122836, 15888630, 15777195, 15689797, 15669359, 15430664, 15289356, 15004098, 14467270, 14202170, 13927790, 14226487, 13988047, 13647497, 13184348, 12991455, 13032059, 13054833, 12916994, 12609969, 12284176, 12198799, 12119627]
2956A2119627l37854m50033J0878m5187l2100j47831j76818j20425j04796n8579
2946A0656882K0325j04068j79043p6806n7011j61903j71106m0260l3020k24663
2936I629327j80215j75577J20999R702j71802k08454l36290j42629l8590m8681
2926H457790j36462L8295j18041n5987k69638k69098Q030j0778l0363K8068K242
$$ y = [12119627, 11781773, 11331740, 11342618, 11297431, 11265331, 11117500, 10940682, 10820257, 10715461, 10656882, 10677207, 10573139, 10394096, 10317290, 10260279, 10098376, 9927270, 9887010, 9853990, 9629327, 9449112, 9273535, 9394534, 9404236, 9232434, 9023980, 8687690, 8545061, 8506471, 8457790, 8321328, 8359623, 8241582, 8185595, 7915957, 7646859, 7654889, 7644111, 7613748, 7641816, 7644058]
$$ [...]
##END NTUPLES=NMR SPECTRUM
##END=
