##TITLE=1H_DE-80H_X3
 200.13MHz, d2o
 8 sc
 
 19ns.26.2.2025
##JCAMPDX= 6.0         $$ Bruker NMR JCAMP-DX V2.0
##DATA TYPE= NMR SPECTRUM
##DATA CLASS= NTUPLES
##ORIGIN= UXNMR, Bruker Analytische Messtechnik GmbH
##OWNER= pz
$$ XWIN-NMR		Version 3.5
$$ Tue Jun 17 14:56:06 2025 Russian Standard Time (UT+4h)  Yarkov@DPX200
##.OBSERVE FREQUENCY= 200.1313
##.OBSERVE NUCLEUS= ^1H
##.ACQUISITION MODE= SIMULTANEOUS
##.ACQUISITION SCHEME= undefined
##.AVERAGES= 8
##.DIGITISER RES= 18
##SPECTROMETER/DATA SYSTEM= spect
##.PULSE SEQUENCE= zg30
##.SOLVENT NAME= DMSO
##.SHIFT REFERENCE= (INTERNAL, DMSO, 0, 15.5056)
##AUDIT TRAIL= $$ (NUMBER, WHEN, WHO, WHERE, WHAT)
$$ ##TITLE= Audit trail, XWIN-NMR		Version 3.5
$$ ##JCAMPDX= 5.01
$$ ##ORIGIN= Bruker BioSpin GmbH
$$ ##OWNER= Yarkov
$$ C:/Bruker/XWIN-NMR/data/yarkov2/nmr/H-C/1/pdata/1/auditp.txt
$$ ##AUDIT TRAIL=  $$ (NUMBER, WHEN, WHO, WHERE, WHAT)
(   1,<2025-06-17 14:54:45.15 +0400>,<Yarkov>,<DPX200>,
      <created by zg, POWCHK disabled, PULCHK disabled
       configuration hash MD5:
       00 E9 B6 7A A2 85 ED C7 34 08 36 98 17 FE 4E 26
       data hash MD5: 16K
       FA C0 76 8C BA E4 9C 54 D4 96 6E 0B 36 D9 3C D0>)
(   2,<2025-06-17 14:55:11.45 +0400>,<Yarkov>,<DPX200>,
      <Start of raw data processing
       efp BC_mod = 2 LB = 0.25 FT_mod = 6 PKNL = 1 PHC0 = -1705.834 PHC1 = -1.633423 SI = 16K 
       data hash MD5: 16K
       34 48 FE FC 5D 38 8F BF A6 6C 3A 49 32 05 DB BE>)
(   3,<2025-06-17 14:55:27.70 +0400>,<Yarkov>,<DPX200>,
      <pk PHC0 = -3.4 PHC1 = 0 
       data hash MD5: 16K
       EE 79 9D 64 41 43 A7 05 CD DD B6 4A 07 4D 08 C0>)
(   4,<2025-06-17 14:55:31.87 +0400>,<Yarkov>,<DPX200>,
      <abs ABSG = 5 
       data hash MD5: 16K
       2E 5D 6D EA 50 74 5D F4 F4 1B 30 B5 9F 7A A4 67>)
$$ ##END=
$$ 
$$ hash MD5
$$ 02 31 41 E1 45 14 73 C4 41 EB 9B 87 81 AC 32 74
##$RELAX= 
##$RELAX= 
##$RELAX= 
##$RELAX= 
##$RELAX= 
##$RELAX= 
$$ Bruker specific parameters
$$ --------------------------
##$DU= <C:/Bruker/XWIN-NMR>
##$EXPNO= 1
##$NAME= <H-C>
##$PROCNO= 1
##$TYPE= <nmr>
##$USER= <yarkov2>
##$AMP= (0..31)
100 100 100 100 100 100 100 100 100 100 100 100 100 100 100 100 100 100 
100 100 100 100 100 100 100 100 100 100 100 100 100 100 
##$AQSEQ= 0
##$AQ_mod= 1
##$AUNM= <au_zg>
##$AUTOPOS= <>
##$BF1= 200.13
##$BF2= 200.13
##$BF3= 200.13
##$BF4= 200.13
##$BF5= 200.13
##$BF6= 200.13
##$BF7= 200.13
##$BF8= 200.13
##$BYTORDA= 1
##$CFDGTYP= 0
##$CFRGTYP= 5
##$CHEMSTR= <none>
##$CNST= (0..31)
1 1 145 1 1 1 1 1 1 1 1 1 1 1 1 1 1 1 1 1 1 1 1 1 1 1 1 1 1 1 1 1 
##$CPDPRG= <>
##$CPDPRG1= <>
##$CPDPRG2= <>
##$CPDPRG3= <>
##$CPDPRG4= <mlev>
##$CPDPRG5= <mlev>
##$CPDPRG6= <mlev>
##$CPDPRG7= <mlev>
##$CPDPRG8= <mlev>
##$CPDPRGB= <>
##$CPDPRGT= <>
##$D= (0..31)
0 0.7 0 0 0 0 0 0 0 0 0 0.03 0 0 0 0 0 0 0 0 0 0 0 0 0 0 0 0 0 0 0 0 
##$DATE= 1750157684
##$DBL= (0..7)
120 120 120 120 120 120 120 120 
##$DBP= (0..7)
150 150 150 150 150 150 150 150 
##$DBP07= 0
##$DBPNAM0= <>
##$DBPNAM1= <>
##$DBPNAM2= <>
$$ [...]
##$SUBNAM3= <"">
##$SUBNAM4= <"">
##$SUBNAM5= <"">
##$SUBNAM6= <"">
##$SUBNAM7= <"">
##$SUBNAM8= <"">
##$SUBNAM9= <"">
##$SW= 18.0517328524113
##$SWIBOX= (0..15)
0 0 2 0 0 0 0 0 0 0 0 0 0 0 0 0 
##$SW_h= 3612.71676300578
##$TD= 16384
##$TD0= 1
##$TE= 0
##$TE2= 300
##$TE3= 300
##$TEG= 300
##$TL= (0..7)
0 120 120 120 120 120 120 120 
##$TP= (0..7)
150 150 150 150 150 150 150 150 
##$TP07= 0
##$TPNAME0= <>
##$TPNAME1= <>
##$TPNAME2= <>
##$TPNAME3= <>
##$TPNAME4= <>
##$TPNAME5= <>
##$TPNAME6= <>
##$TPNAME7= <>
##$TPOAL= (0..7)
0.5 0.5 0.5 0.5 0.5 0.5 0.5 0.5 
##$TPOFFS= (0..7)
0 0 0 0 0 0 0 0 
##$TUNHIN= 0
##$TUNHOUT= 0
##$TUNXOUT= 0
##$USERA1= <user>
##$USERA2= <user>
##$USERA3= <user>
##$USERA4= <user>
##$USERA5= <user>
##$V9= 5
##$VALIST= <valist>
##$VCLIST= <CCCCCCCCCCCCCCC>
##$VD= 0
##$VDLIST= <DDDDDDDDDDDDDDD>
##$VPLIST= <PPPPPPPPPPPPPPP>
##$VTLIST= <TTTTTTTTTTTTTTT>
##$WBST= 1024
##$WBSW= 4
##$XGAIN= (0..3)
0 0 0 0 
##$XL= 0
##$YL= 0
##$YMAX_a= 144177
##$YMIN_a= -114747
##$ZGOPTNS= <>
##$ZL1= 120
##$ZL2= 120
##$ZL3= 120
##$ZL4= 120
##$ABSF1= 15.5111
##$ABSF2= -2.54075
##$ABSG= 5
##$ABSL= 3
##$ALPHA= 0
##$AQORDER= 0
##$ASSFAC= 0
##$ASSFACI= 0
##$ASSFACX= 0
##$ASSWID= 0
##$AUNMP= <proc_1d>
##$AZFE= 0.1
##$AZFW= 0.1
##$BCFW= 0
##$BC_mod= 2
##$BYTORDP= 0
##$COROFFS= 0
##$CY= -3
##$DATMOD= 1
##$DC= 0
##$DFILT= <>
##$DTYPP= 0
##$F1P= 0
##$F2P= 0
##$FCOR= 1
##$FTSIZE= 16384
##$FT_mod= 6
##$GAMMA= 0
##$GB= 0
##$INTBC= 1
##$INTSCL= 3.241238e-09
##$ISEN= 128
##$LB= 0.25
##$LEV0= 0
##$LPBIN= 0
##$MAXI= 10000
##$MC2= 0
##$MEAN= 0
##$ME_mod= 0
##$MI= 1.114404
##$NCOEF= 0
##$NC_proc= -7
##$NLEV= 6
##$NOISF1= 3.799351
##$NOISF2= 2.8
##$NSP= 0
##$NTH_PI= 0
##$NZP= 0
##$OFFSET= 15.5056
##$PC= 1
##$PHC0= -1709.234
##$PHC1= -1.633423
##$PH_mod= 1
##$PKNL= yes
##$PPARMOD= 0
##$PSCAL= 0
##$PSIGN= 0
##$REVERSE= no
##$SF= 200.130003222593
##$SI= 16384
##$SIGF1= 3
##$SIGF2= 2
##$SINO= 0.751879
##$SIOLD= 32768
##$SREGLST= <19F.Aceton>
##$SSB= 0
##$STSI= 16384
##$STSR= 0
##$SW_p= 3612.71676300578
##$SYMM= 0
##$S_DEV= 0
##$TDeff= 16384
##$TDoff= 0
##$TI= <>
##$TILT= no
##$TM1= 0
##$TM2= 0
##$TOPLEV= 0
##$USERP1= <user>
##$USERP2= <user>
##$USERP3= <user>
##$USERP4= <user>
##$USERP5= <user>
##$WDW= 1
##$XDIM= 16384
##$YMAX_p= 280369932
##$YMIN_p= -236269
$$ End of Bruker specific parameters
$$ ---------------------------------
##NTUPLES= NMR SPECTRUM
##VAR_NAME=  FREQUENCY,     SPECTRUM/REAL,   SPECTRUM/IMAG
##SYMBOL=    X,             R,               I
##VAR_TYPE=  INDEPENDENT,   DEPENDENT,       DEPENDENT
##VAR_FORM=  AFFN,          ASDF,            ASDF
##VAR_DIM=   16384,         16384,           16384
##UNITS=     HZ,            ARBITRARY UNITS, ARBITRARY UNITS
##FACTOR=    0.220516191357247, 1,           1
##FIRST=     3103.13577308225, 0,            0
##LAST=      -509.580989923529, 0,           0
##MIN=       -509.580989923529, -236269,     0
##MAX=       3103.13577308225, 280369932,    0
$$ Real data points
##PAGE= N=1
##DATA TABLE= (X++(R..R)), XYDATA
$$ [...]
11229 -66190 -82240 -66048 -102525 -56246 -100892 -121619 -126476 -151948 -149413 -177213 -118489 -108460
11217 -108460 -112706 -93439 -129932 -90989 -131276 -159979 -157534 -129179 -146718 -143181 -105372 -134259
11205 -134259 -110609 -134538 -203485 -142792 -113255 -128464 -105063 -57090 -23622 -68160 -60721 -61897
11193 -61897 -68736 -50721 -91504 -69807 -61822 3819 -58049 -94063 -64357 -106521 -85786 -113551
11181 -113551 -24410 -97675 -78235 -53496 -134345 -89743 -61938 -69467 -71309 8103 -17258 5875
11169 5875 -9659 -89580 -61481 -31373 -62650 -139665 -133544 -173412 -139155 -153581 -149288 -113714
11157 -113714 -164836 -188746 -166844 -144908 -99964 -88570 -159437 -112735 -77399 -49672 -88393
11146 -88393 -193326 -106989 -107608 -103309 -38442 -71115 -123727 -61469 -56640 -36422 -63502 -51667
11134 -51667 -34876 -17787 -32009 3459 -2688 -1028 -68452 -86542 -63916 -116869 -110176 -23522
11122 -23522 -4200 -50299 -110544 -16340 39201 -87841 -67786 -81241 -79564 -93716 -101084 -96113
11110 -96113 -128260 -154695 -130025 -106676 -83128 -142780 -130409 -99902 -56603 -56327 -69982 -41802
11098 -41802 -15366 -1754 -5640 -6890 -119276 -74250 -141950 -156217 -75620 -58143 -20777 -12257
11086 -12257 -25733 -53259 -43801 -79638 -79029 -53830 4310 -58926 -51159 -41262 -145671 -99278
11074 -99278 -90591 -124425 -162552 -187753 -210503 -202718 -101222 -71115 -49205 -121080 -88976 -55788
11062 -55788 -23484 -51382 -111203 -109220 -50184 -72354 -67662 -111995 -148807 -100206 -127040 -89780
11050 -89780 -97390 -138651 -148888 -142030 -129158 -183712 -172308 -112671 -51982 -25614 -15377 -17772
11038 -17772 -39983 -114716 -113780 -106789 -118203 -34512 -69816 -96734 -86019 -98617 -122683 -79541
11026 -79541 -50752 -61078 -63606 -77647 -66243 -61554 -115873 -113987 -54831 -31548 -8906 -71192
11014 -71192 -117209 -119543 -124585 -106786 -50149 -62223 -92179 -69360 -139890 -147575 -86252 -90444
11002 -90444 -58253 -78792 -72273 -49663 -31456 -56921 -91910 -59453 -72835 -126299 -146941 -183759
10990 -183759 -191775 -126264 -93332 -52578 -43834 -85983 -114447 -60452 -56540 -36602 -38417 -107465
10978 -107465 -155545 -66570 -114025 -126476 -92097 -48842 -84080 -130879 -105308 -63388 -59580 -90545
10966 -90545 -105865 -124650 -112257 -35524 -14499 -72153 -59071 -100405 -67491 -59189 -82509 -120684
10954 -120684 -84714 -69888 -120791 -95974 -144504 -158899 -122917 -65771 -77509 -79416 -93670 12153
10942 12153 -7119 -69957 -56433 -71959 -46199 -48069 -29324 -47803 -90146 -126113 -69287 -107158
10930 -107158 -76107 -1077 -6212 -36185 -102879 -84917 -109288 -108692 -62019 -99717 -73105 -53395
10918 -53395 1800 41168 -17408 -81331 -92447 -37335 9073 -28284 -19743 -49193 -45881 -73296
10906 -73296 -80519 -75748 -63296 -65036 -90859 -119880 -120791 -159332 -182548 -110041 -103812 -96172 -56795
10893 -56795 -60315 -72070 -40170 -37642 -40288 -98035 -101841 -41466 -100968 -103073 -126203 -53127 39034
10880 39034 -1246 22963 9262 -43509 -72663 -89779 -123048 -111173 -115740 -131666 -152082 -139134
10868 -139134 -133131 -92343 -16436 -55330 -64493 -36220 -25924 -44689 -20575 14148 -5416 -67986
10856 -67986 -43190 -95121 -170549 -131686 -130937 -91022 -106893 -72654 -59787 6266 13943 -21420
10844 -21420 -91271 -143238 -110069 -30827 -1055 -75699 -112474 -40772 -59976 -51973 -60763 -49542
10832 -49542 -55219 -18014 11396 -32804 -33882 -38729 -45257 -81211 -63581 -70540 -39514 -21110 -19878
10819 -19878 32614 -44056 -91786 -81459 -95209 -129899 -147541 -135620 -112048 -95184 -85045 -51609
10807 -51609 -82312 -59548 -10029 -38423 -42033 -37923 -46219 -62097 -86786 -51477 -84998 22249
10795 22249 -15137 -21117 -2567 -81355 -83351 -61366 -102709 -89194 -82337 -152706 -143445 -90480
10783 -90480 -74126 -61318 -13229 -11759 -8595 -123729 -126117 -53844 -64729 -88461 -60260 6577
10771 6577 -3541 -78658 -130049 -113003 -60671 -44678 -96356 -50023 -127457 -118202 7099 72541
10759 72541 51860 17321 30786 -31662 -1117 45280 -26632 -11995 17817 47983 86739 -12514
10747 -12514 -53694 -38263 -11326 -21040 -43839 8792 -22693 -78761 -128386 -70584 -10604 65453
10735 65453 108229 25483 -15301 -78625 -70117 -49003 -29771 26249 -1724 -5473 -71279 -41713
10723 -41713 17229 58420 39591 71464 81025 43152 105464 102107 42224 14283 25022 12722
10711 12722 50965 5 12 3834 33936 -11227 22620 18537 34073 39124 35274 116221 95569
10698 95569 37085 108806 51206 68561 93988 135811 129188 81285 43014 13509 84362 31716
10686 31716 103131 126635 162833 121083 121302 103635 130319 121015 99530 133455 161630 90001
10674 90001 102217 180345 138963 116753 114156 168994 161294 201695 171069 142767 180791 194797
10662 194797 162605 208350 231005 232231 192973 222440 278228 272152 237061 268416 276897 237766
10650 237766 272158 323658 266726 223705 212447 267820 326135 304437 333742 314391 326958
10639 326958 296787 320933 286647 317529 349247 287151 369691 445000 389859 286820 364649
10628 364649 442936 425423 416926 469623 575601 651028 692031 719085 710310 678016 689081 697491
10616 697491 673984 656111 672926 735825 785314 834793 869736 838741 919321 944673 1033275
10605 1033275 1115629 1165745 1193248 1211493 1253455 1263288 1335162 1317935 1317818 1345119 1440844 1565476
10593 1565476 1684794 1823004 1810117 1844943 1853482 1905894 1931745 1998514 2063744 2081261 2087924
10582 2087924 2080447 2113591 2294240 2350690 2402700 2464394 2536580 2618112 2690793 2743029 2754661
10571 2754661 2815297 2782079 2831570 2831111 2887355 2903969 2905858 2863325 2994671 3112217 3131617
10560 3131617 3162091 3181511 3238988 3246325 3294757 3316841 3398568 3456552 3478134 3530414 3614857
10549 3614857 3677637 3677116 3714895 3755291 3754671 3773235 3891858 3966712 3999886 4070247 4140359 4159689
10537 4159689 4137225 4144645 4295257 4354886 4374680 4367595 4399249 4401554 4477541 4477546 4410322 4539907
10525 4539907 4506495 4481893 4576688 4509427 4485909 4473465 4468685 4442216 4400555 4436056 4486420
10514 4486420 4452211 4463183 4485140 4394560 4317765 4301948 4215676 4218724 4291684 4190401 4169166
10503 4169166 4159649 4130428 4039244 4016595 4043723 4029174 3976361 3967117 3953855 4023709 3931073 3919301
10491 3919301 3979750 3913864 3874776 3821902 3810305 3769867 3773568 3791675 3756797 3701748 3669609
10480 3669609 3651948 3621778 3581150 3479571 3479868 3433056 3310445 3302814 3272765 3209480 3174333
10469 3174333 3079052 3014553 2941889 2942616 2869051 2730898 2682032 2605257 2534627 2455005 2405816
10458 2405816 2355088 2277803 2218236 2162997 2112898 2044767 1962300 1989815 1929769 1876082 1774777
10447 1774777 1696518 1689306 1644177 1582049 1605388 1649203 1558876 1465944 1377267 1398392 1374600
10436 1374600 1348284 1280889 1274214 1210836 1209331 1249952 1167171 1209836 1202902 1134863 1112848 1060133
10424 1060133 1028892 1015705 951694 948668 939579 972273 998948 914308 884120 835585 761139 774343
10412 774343 713756 803559 787699 778126 759618 742065 770272 703410 675659 653708 697912 710371
10400 710371 702735 675461 662689 632061 671790 616872 593401 614909 603122 630513 595219 599520
10388 599520 562312 539934 540587 509381 503529 571226 536534 495486 485953 466356 430784 431357 389669
10375 389669 466809 479438 463373 471528 436104 388299 430668 476181 425399 466835 446332 426859
10363 426859 412436 386510 420257 407958 311176 326928 355562 328774 394034 366128 378876
10352 378876 423135 404551 415111 398625 367768 354426 376509 386513 315419 312901 316306 345047
10340 345047 346561 369266 401320 409501 421819 431349 381316 378062 449807 431797 416908 383605
10328 383605 379290 379457 406519 403943 376636 303077 366646 363375 317522 265471 331630 327763 405362
10315 405362 459006 402208 370831 376108 333090 295927 342674 429487 399175 375852 370622 371966
10303 371966 365420 338522 388684 446523 395808 364129 353179 403415 379835 442908 458981 393249
10291 393249 402930 361617 419149 469387 437449 444999 549858 567411 538063 528458 597403 505600
10279 505600 493196 545254 542145 550225 594992 588384 559930 628895 675786 685372 653200 672257
10267 672257 759691 818747 838374 790380 841556 815716 895388 911352 872013 880641 899422 981795
10255 981795 1019537 1026331 1064941 1123152 1179423 1198422 1190386 1225194 1301654 1446971 1469301 1461645
10243 1461645 1465450 1533257 1604035 1681476 1725539 1816951 1850584 1858401 1947520 2059205 2128579
10232 2128579 2111240 2255058 2285686 2329029 2406163 2448458 2494265 2678323 2746540 2734415 2770201
10221 2770201 2812823 2880653 2996137 3032577 3097253 3137752 3207200 3264808 3235452 3376945 3396352
10210 3396352 3418148 3448034 3522579 3575116 3560593 3569065 3644811 3712083 3743495 3753492 3717330 3773921
10198 3773921 3802157 3789471 3842324 3899811 3913713 3986009 4041795 4044208 4039586 4092203 4122998 4164270
10186 4164270 4195435 4185635 4240322 4301766 4434204 4441100 4420739 4497845 4515943 4567880 4622554
10175 4622554 4665371 4691573 4720166 4737035 4743460 4704676 4676151 4744356 4781476 4789870 4805757 4882301
10163 4882301 4861340 4747723 4701034 4712198 4648190 4607511 4548194 4538725 4524069 4475777 4461677
10152 4461677 4386196 4306001 4310449 4224728 4145740 4176439 4088727 4010670 3951490 3904846 3883021
10141 3883021 3885922 3809793 3753949 3713406 3711733 3662831 3661327 3662656 3610481 3529182 3497125 3469640
10129 3469640 3465980 3537423 3440736 3464669 3382098 3369453 3302008 3217722 3182645 3168675 3161566 3153035
10117 3153035 3061604 2969196 2945168 2872801 2879219 2819061 2740972 2693310 2663033 2626856 2578581
10106 2578581 2480548 2473358 2398322 2349078 2279382 2144561 2105036 2067356 2026588 1977947 2009995
10095 2009995 1946837 1882930 1881163 1832165 1697959 1642601 1624667 1502460 1447546 1505649 1468999
10084 1468999 1364233 1383263 1413643 1367574 1335680 1235029 1248214 1225045 1178404 1125074 1074789
10073 1074789 1057926 1008015 970659 924709 930184 999651 952382 884879 973879 874766 802155
10062 802155 824320 814695 833230 813820 834724 772362 698166 709655 663392 696279 703178 675664
10050 675664 599206 604675 588109 549582 551085 590610 649012 614153 490595 472097 475995 476330
10038 476330 510520 528375 574426 442070 372457 456238 429413 450739 501910 482087 441944
10027 441944 448504 358841 380983 412465 385274 342010 328959 310213 299631 299787 276520 286713
10015 286713 279938 292092 284747 357407 429695 370255 304772 252654 268842 322752 325317 339841
10003 339841 299301 309050 278295 314738 341414 302889 197873 190787 178414 236163 272426 225215
9991 225215 207398 208150 221212 189175 219260 163603 194610 186487 177064 181751 193676 164330 128478
9978 128478 202803 206977 186242 224428 154673 114881 155086 149271 207804 204229 196524 191078 149782
9965 149782 169651 121354 127570 96361 123347 177282 155539 140812 178880 174240 139928 149921
9953 149921 151888 135853 210051 242405 149072 110497 137014 140905 127687 108010 109407 138742
9941 138742 124767 160848 172235 171173 152777 187328 185814 173511 154899 125344 75160 76473
9929 76473 108370 100391 130854 116315 125542 170765 137157 157529 165680 122423 49422 60791
9917 60791 143856 234551 202893 139219 47113 80688 116375 103983 30434 29016 45779 42020
9905 42020 27833 54139 66232 5974 106201 177045 116627 110100 -4193 16862 64226 65993
9893 65993 74646 31051 108827 65583 87154 89295 95256 156462 227842 166558 84781 107317
9881 107317 83451 57471 57702 76508 108388 140858 112189 54464 54474 64438 29428 71034 68491
9868 68491 94888 127294 48914 68320 109785 118491 73995 81190 68639 102070 89271 38145
9856 38145 25413 74996 188427 168895 177769 193022 112862 102239 86067 78696 43388 79612
9844 79612 127396 141330 101078 124824 92144 72012 84797 98166 150743 176155 148629 157833
9832 157833 118341 119195 97802 62857 83495 130809 124946 74012 129257 123658 111716 135782
9820 135782 148100 167498 121379 150639 221770 237681 236068 220157 172340 227691 228039 152906
9808 152906 160855 155805 160767 155317 214474 223214 263708 234981 209969 208218 300479 336678 327921
9795 327921 274255 260137 352554 332852 285926 293985 330920 346478 289566 330690 410945 360566
9783 360566 375322 325082 395583 480769 519982 475339 448987 428940 417223 454808 499766 537680
9771 537680 630441 635040 543280 563077 507395 600994 711949 736792 664577 690871 675597 692986
9759 692986 782068 800836 822809 851565 905423 939468 919120 922424 918248 981191 1000622 1060032
9747 1060032 1134864 1149140 1118699 1209582 1155284 1135085 1196036 1218064 1271707 1295651 1286556 1304857
9735 1304857 1378802 1415734 1416315 1482571 1481283 1386754 1405996 1424698 1432002 1571824 1586472 1457731
9723 1457731 1467787 1502968 1609618 1611929 1670579 1663420 1627742 1614602 1523068 1434911 1400289 1352122
9711 1352122 1344175 1412626 1420993 1332016 1256939 1190781 1120141 1139236 1096182 1082553 1060182 1053357
9699 1053357 990191 948736 1010058 919259 799329 865566 856197 842723 842118 744484 721773 747066
9687 747066 773246 715997 694431 591515 586188 613715 628893 540037 567892 551873 509021 547484
9675 547484 567620 531625 511175 452341 416996 408277 458867 379842 316193 299883 342589 386732
9663 386732 375944 329759 264634 259939 285131 323706 291747 224971 241607 304590 247211 268396
9651 268396 307405 299050 238797 240972 156626 152655 173276 255090 235997 218219 190512 225226
9639 225226 193802 176444 163612 146493 97663 167103 163256 127944 151700 135070 174673 152443
9627 152443 80521 30334 66875 52992 33095 -21397 10959 31669 28317 35464 133004 144877
9615 144877 168074 230580 140424 49157 59120 88113 91756 82378 48347 124343 131314 48358
9603 48358 72839 71638 46952 45457 47545 68936 81339 85819 87038 35904 53110 37363 73186
9590 73186 133331 53899 26160 38195 93234 75912 49541 69678 55644 90522 105775 72533
9578 72533 70878 59177 69591 135447 152984 129491 95772 113691 94358 63575 113516 93286
9566 93286 73451 70278 57063 90634 69071 22748 45041 77881 74871 72810 36549 14757
9554 14757 15994 84561 22775 61760 107678 128992 132748 107316 189851 188107 158212 142127
9542 142127 93991 67151 41029 78202 162053 158630 121062 142772 162186 129834 179563 223747
9530 223747 249124 253810 288531 290277 262797 237773 252767 236872 221538 206039 186049 192253
9518 192253 170352 161716 177615 143231 160702 206974 115531 118264 150510 151953 113898 49365
9506 49365 56424 21154 12081 88943 93104 42881 65616 27962 63037 62627 106868 163879 128419
9493 128419 95292 63129 61876 25858 -9805 13017 -5752 49978 -7543 -5519 42802 91985
9481 91985 19807 -41792 -83622 -94269 -69021 -53111 7188 8490 63729 14814 -73327 -62748
9469 -62748 -54314 -99141 -78177 -27328 -25392 -58716 -25986 -44559 53201 22709 -5356 -22915
9457 -22915 -44493 23312 69427 23136 -35040 -77869 -104217 -80485 6702 -8064 -38272 -51955
9445 -51955 -52572 -77611 -72613 -85729 -126672 -101033 -48307 -32189 -46168 -47715 -61268 -122776 -2855
9432 -2855 1945 -4394 -56359 -58980 9545 4578 26932 946 -51627 -114950 -93201 -122556 -116157
9419 -116157 -103465 -125263 -132800 -43386 -48333 -53567 -125306 -163340 -117564 -121763 -113449 -32812 -158986
9406 -158986 -138814 -97457 -106080 -112141 -96922 -117873 -105075 -120654 -134374 -87133 -121318 -113825
9394 -113825 -91693 -106776 -107806 -100601 -41061 -9341 -7778 -30787 -62712 -76823 -136836 -141591
9382 -141591 -109757 -65619 -54618 -51235 -27719 15197 -4890 -18104 -833 -20763 -68521 -70887
9370 -70887 -16361 22459 -17994 17329 31628 1736 21083 33365 35830 84248 23066 11780
9358 11780 53825 65137 -18731 -48290 12539 40075 41027 65196 -11965 -46417 -23210 94320
9346 94320 115712 62999 38540 22332 109392 80799 97356 109806 68083 110315 125219 94999
9334 94999 108121 45970 32966 27168 81255 141348 69668 38448 -2173 27179 86094 162469
9322 162469 109743 58920 119055 148125 196531 150505 138856 81792 89200 53472 100939 121554
9310 121554 95451 48420 91271 131300 94724 165894 104962 73557 78812 55871 57734 63648
9298 63648 109982 88989 33434 80005 105419 60387 30476 71744 43163 66907 49796 8399
9286 8399 -12122 15137 -2624 -39993 -47956 -62715 12561 80092 24308 -40241 2639 21251
9274 21251 3405 19407 54929 53851 -28488 -28257 89008 77644 12927 -23915 31767 67380
9262 67380 76441 113237 108830 38206 23911 40247 26223 113659 102997 59330 4821 -28580
9250 -28580 63264 -10094 -2873 16859 3791 -31143 14608 536 -16297 -52564 -28286 -13064
9238 -13064 24818 16985 -514 18505 -87068 -22177 16651 23486 12850 21979 61687 84333
9226 84333 82429 188774 188052 138406 112624 73733 73808 78834 74560 98271 109973 57379 37210
9213 37210 71971 88084 97601 29123 19821 102824 155977 104464 52760 121260 127099 114659
9201 114659 128320 88439 91509 100903 113054 195529 247860 233896 218464 180916 172480 173769
9189 173769 203724 196820 213939 261985 292335 249718 271296 261273 305740 303212 249731 373509
9177 373509 361585 369716 385967 411825 425406 424492 442356 430562 493491 597496 543854 533145
9165 533145 551025 614550 626544 584066 637675 666453 710205 783415 809583 888690 923641 933863
9153 933863 974775 1039292 1139301 1166142 1230386 1273690 1357054 1436805 1593715 1733985 1773299
9142 1773299 1923336 2136011 2357351 2598720 2770734 3045191 3364807 3677855 3967157 4287324
9132 4287324 4557033 4888498 5094752 5128183 5180622 5236574 5227751 5213341 5214485 5230877 5351277
9121 5351277 5419139 5458677 5513481 5553959 5645061 5794012 5943947 6146729 6371564 6557936
9111 6557936 6708113 6806210 6873923 6831272 6746230 6667554 6583525 6563954 6558627 6634335 6604779
9100 6604779 6567175 6616722 6661427 6745206 6875330 6943834 7138661 7318082 7465680 7625208
9090 7625208 7706294 7706574 7660264 7563923 7488052 7280022 7218606 7228338 7124768 7099362 7052441 7024285
9078 7024285 7011617 6989881 6973537 7047836 7094242 7134793 7211322 7308366 7315031 7245288 7127752
9067 7127752 6920826 6690910 6407965 6212222 5974653 5773888 5573372 5400620 5100087 4874281
9057 4874281 4629298 4339974 4083576 3817678 3631011 3408620 3288559 3142686 2914261 2827385
9047 2827385 2737518 2611948 2518649 2345096 2231258 2172632 2108421 2053358 1940257 1859964 1740122
9036 1740122 1732297 1686347 1580904 1493618 1427887 1388783 1315064 1297633 1257833 1219944 1170944
9025 1170944 1120651 1143161 1119416 1114391 1134728 1090872 1079672 1017528 976377 874311 874690 860757
9013 860757 827316 757501 738333 632502 684004 703837 637640 624895 706326 715689 673265 659228
9001 659228 636212 587615 563949 635441 668154 559037 554969 569205 543968 506683 490824 490157
8989 490157 488887 470343 501552 480639 451010 484044 486161 484097 491163 437690 401032 362272
8977 362272 389686 439437 380384 398444 445469 422100 400292 352433 323429 373522 415425 466342
8965 466342 386202 406686 365824 326893 357681 371081 356536 347638 424541 393774 364681 346297
8953 346297 364613 407140 363851 420120 359184 353466 369375 406444 345157 288087 298074 306075
8941 306075 313618 307136 267418 281201 309853 309774 312932 247024 180240 190145 211086 224870 164157
8928 164157 204459 274733 251435 279784 285407 301128 269214 239955 262949 327987 311200 303381
8916 303381 362801 346309 314509 268554 267502 261763 142568 174271 187331 168780 236187 251088
8904 251088 248187 186740 231938 240405 225650 213929 222826 308631 335832 306832 268655 233253
8892 233253 209232 204150 229352 207942 221932 244769 307191 290888 214785 200238 227816 269428
8880 269428 274014 216817 236364 303989 366154 311058 309804 252266 157311 316533 350914 366321
8868 366321 348134 300228 339468 372885 401284 366980 300103 275322 311929 374218 369255 388303
8856 388303 378770 441085 446264 471575 482707 451561 394873 425210 469834 509790 525545 526230
8844 526230 544192 525314 614641 594135 596112 587995 583355 553630 559493 550074 595990 665182 657309
8831 657309 675588 662960 683895 699056 761860 781628 834568 897052 854052 819632 923830
8820 923830 991774 1092574 1145933 1309447 1403067 1413933 1484888 1608659 1711188 1862196 2078947
8809 2078947 2274976 2415688 2599566 2843837 3110162 3408490 3767967 4184278 4526628 5033231
8799 5033231 5596077 5945099 6256952 6540745 6781162 6914977 7014626 7145706 7318155 7687471
8789 7687471 7936828 8215397 8405889 8444840 8454142 8370959 8132820 7767197 7437472 7163631
8779 7163631 6949940 6674157 6502777 6321053 6187443 5918596 5674516 5436038 5206608 5083718
8769 5083718 4937266 4873121 4752114 4762549 4749842 4722235 4758912 4842397 4993744 5203183 5389525
8758 5389525 5671486 5970135 6348424 6753784 7083837 7484677 7741541 7868569 7933640 7934949
8748 7934949 7982777 8089855 8324358 8544398 8737994 8911468 8998625 8920843 8812337 8597695
8738 8597695 8247262 7840287 7467382 7153760 6905694 6625646 6361546 6098561 5776043 5361189
8728 5361189 5049221 4763171 4481296 4186152 3995533 3795978 3578542 3323437 3197938 3042798
8718 3042798 2875028 2795853 2625873 2450071 2381716 2292313 2189457 2139836 2014903 1952526
8708 1952526 1871464 1863502 1811669 1748565 1698744 1685751 1644836 1599354 1503039 1407530 1393083 1398386
8696 1398386 1385015 1304040 1274108 1225834 1206153 1180033 1148004 1122206 1099112 1092444 1046702 1013846
8684 1013846 947068 971510 925330 950090 917724 867683 819813 783787 810713 894290 796691
8673 796691 745485 765690 776566 755012 686553 624482 715388 793431 735593 677091 749376 793458
8661 793458 715978 638433 652368 676557 649929 636067 669942 709730 659290 657343 687403 712143
8649 712143 638698 656940 676547 654141 718584 767132 825008 876953 784025 731547 729516 741031
8637 741031 776890 830562 819286 795826 823102 898838 888887 877833 893659 996600 1115982
8626 1115982 1115140 1164850 1219490 1263482 1312651 1375687 1397467 1509478 1606904 1771224 1918409
8615 1918409 2048334 2165178 2305697 2494410 2748734 2923295 3145126 3422436 3676776 3891225
8605 3891225 3974603 4060712 4118810 4205842 4243465 4335958 4371467 4541236 4686948 4837095 4874815
8594 4874815 4873924 4813493 4718167 4631896 4505095 4310355 4226493 4199802 4214026 4289001 4273380
8583 4273380 4008008 3828890 3911580 3914948 3911882 3946822 3979665 3978884 4131573 4298987 4518900
8572 4518900 4722637 5028485 5299609 5609096 5956846 6331191 6686380 6943848 7275683 7494912
8562 7494912 7616736 7715024 7820672 7859058 7945753 8078265 8257857 8347548 8356399 8335798 8269060
8551 8269060 8095112 7790651 7526109 7271402 7019194 6757710 6556257 6307196 6032707 5890306
8541 5890306 5683977 5472568 5237561 5088087 4914718 4660591 4496565 4420097 4377606 4295087
8531 4295087 4259394 4219800 4304333 4387393 4476754 4599920 4645575 4761513 4888853 4883801 4890407
8520 4890407 4861856 4847734 4830941 4807621 4840998 4869724 4911004 4862843 4820264 4732610 4606823
8509 4606823 4495372 4310848 4116370 3946425 3732529 3538133 3454994 3361639 3246955 3087873
8499 3087873 2878451 2725626 2621363 2492129 2392795 2258367 2120073 2019669 1963124 1901779
8489 1901779 1836773 1762865 1671543 1599787 1530580 1535904 1485879 1368601 1367161 1380564 1251636
8478 1251636 1158714 1158805 1177490 1130322 1070308 975713 911330 846783 800615 778392 824092 831222
8466 831222 753165 776610 735525 770546 735644 779908 716193 769543 743704 703231 776341 722281
8454 722281 726313 684146 653014 645066 663815 599510 590888 587842 557278 531402 488784 479934 534050
8441 534050 586855 525552 534717 545077 507619 426437 421375 515519 515480 392617 379530 397613
8429 397613 299164 316665 343383 336387 335142 358413 396776 402220 371307 350767 366455 278265
8417 278265 264213 272365 196814 190004 212717 264844 261899 238642 231987 265347 159560 131111
8405 131111 199868 233771 249436 250712 230985 209860 181212 224707 190616 64947 96254 174083
8393 174083 198041 181085 239315 218934 114938 90489 50565 90015 137701 199676 150785
8382 150785 172859 202642 173700 215035 180460 150001 134913 148080 170230 176855 207072 162956
8370 162956 163778 237216 179883 63070 37908 66968 108406 52242 -13187 29391 28991 89370
8358 89370 82637 58944 87932 69262 -664 8370 41463 -2145 25465 -54473 -7993 9919
8346 9919 34220 7110 -29799 23560 55873 29755 30510 39379 1654 -3635 21925 1701 -54360
8333 -54360 -29966 -28125 18878 14868 42386 -54843 -51420 24426 92152 87349 51799 49287 89991
8320 89991 5506 -8967 -9329 15961 -36318 -75779 -53527 -116705 -56196 -43829 31127 69486
8308 69486 -5637 47781 40544 -34618 -57925 -43338 -47038 -75338 -60055 16977 53778 -33527
8296 -33527 -74392 -90901 -97908 -80105 -71582 -109865 -39922 -29017 -19165 -6396 -82084 -102789
8284 -102789 -77174 -19508 -17677 -50789 -47747 -25706 19222 28396 1333 -46493 -113138 -89359
8272 -89359 -98226 -150085 -96627 -70976 -60534 -107269 -87555 -102992 -103294 -63358 -97947 -124295
8260 -124295 -126386 -85257 -89150 -45654 12713 54290 3593 -32637 -65728 -76794 -56282 -64300
8248 -64300 11869 25183 -1102 -16554 -41053 -75581 -55007 -37247 -112998 -174238 -126926 -130201
8236 -130201 -115041 -63397 31245 36167 -13918 -68653 -70349 -53643 -83670 -74956 -110763 -66692
8224 -66692 20933 53790 -9108 -56713 -130111 -53956 -15816 -25751 -50203 -59696 -86222 -50097
8212 -50097 -77851 -22138 -43233 -98007 -98652 -59246 -106512 -68822 -94019 -117218 -99672 39184
8200 39184 -83598 -97924 -73787 -65725 -152058 -165613 -236269 168917 1509073 839741 309035
8189 309035 282553 220427 216726 118946 73764 70960 79525 35182 27992 -13054 -49361 -96986
8177 -96986 -62208 -33972 566 -62537 -45241 4936 -41683 -140883 -130638 -76320 -89837 -32536
8165 -32536 -23819 -54857 -36159 42358 -5838 -60130 -11561 -50833 -63011 -20002 -32020 -9043
8153 -9043 -63052 -111305 -68636 -132859 -35640 26003 18951 -81829 -41818 -25966 -10546 -47759
8141 -47759 -59673 -85672 -79974 -52068 5129 31976 58737 63286 22714 -62298 -88743 -110761
8129 -110761 -69503 -47226 -94875 -73760 -117607 -108609 -48752 3055 -40119 -104570 -75464 4148
8117 4148 16736 14514 -14769 -33085 -40081 4813 -4610 4230 -12217 -32150 -38691 -33752 -67950
8104 -67950 -20332 24587 51604 62089 47711 -25732 -46333 -81495 -79483 -85403 -82744 -51793
8092 -51793 -62245 -20066 -19717 -56835 -103310 -23959 56490 11593 13994 38350 -5954 -86121
8080 -86121 -30250 -57093 -87148 2637 15849 -3243 -23157 -19104 -44543 59069 73353 52780
8068 52780 19446 -55543 -44027 -22893 -11311 -52798 -71800 -1117 -31422 -12803 48381 -35441
8056 -35441 -56254 -13301 -35924 -58284 -132161 -152511 -141603 -157187 -125244 -66810 -93115 -100639
8044 -100639 -123394 -110997 -87493 -104557 -72125 -24852 -40043 -75785 -60812 -32091 -29575 -35128
8032 -35128 -91553 -69699 -48431 -96450 -78831 -27368 -91940 -127342 -90127 -41545 -79420 -91498
8020 -91498 -82138 -36654 -82546 -121924 -90339 -74082 -81543 -104100 -60722 -4201 22915 -14737
8008 -14737 -98512 -138047 -130276 -76069 -58993 -126101 -81679 -118583 -76254 -50392 -105460 -97846
7996 -97846 -52425 -50308 -27446 -7039 1111 -11383 -108804 -107376 -60979 2418 -38822 -73666
7984 -73666 -73757 -121810 -95336 -42512 -45792 -112320 -70955 -95760 -40568 -9397 -41301 -45551 -82330
7971 -82330 -74290 -102119 -145861 -83323 -138486 -161412 -63269 -19318 -3807 -47160 -63442 -46242
7959 -46242 17315 15940 -82503 -76628 -139853 -56689 -8766 -53369 -38666 24159 33789 -25175
7947 -25175 -49598 -116186 -99902 -37483 -99676 -111445 -64374 -25803 -102052 -107358 -109728 -84933
7935 -84933 -66762 -65767 -39199 -81565 -74978 -26776 -50113 -90372 -120961 -50612 708 -70536
7923 -70536 -50988 -23841 -101934 -104777 -78301 -83431 -110204 -79637 -54124 -125486 -103168 -66817
7911 -66817 -42001 14183 3695 -54201 -24823 -12284 27660 19233 87862 -70815 -88113 -41176
7899 -41176 6702 -9753 4295 -60 -18615 7084 -43375 -37438 -70818 -27998 34877 77245
7887 77245 12619 -46944 -74566 -78609 -26282 -17551 58276 26556 -26001 6929 21965 -35004
7875 -35004 22552 46998 24168 -30834 -63920 -25284 21753 83242 48891 70858 56056 -33236
7863 -33236 -10351 38389 85407 82325 8477 -11942 -19852 -59067 -34164 38648 51085 -18511
7851 -18511 -15450 62321 -16767 -35272 -61344 17315 28395 -22970 17835 70138 32970 37618
7839 37618 -32988 -48484 37722 87431 89908 107239 113983 127265 135088 137199 94625 81178 15551
7826 15551 49387 67874 -18308 6322 32300 103933 76359 103372 153412 182926 144929 151547
7814 151547 104891 86524 78602 136419 104133 89120 142746 162029 145952 171973 194273 195916
7802 195916 276639 541661 194136 -86489 -18923 -7364 62844 53899 55940 54953 156880 88941
7790 88941 76726 126705 156601 135224 69470 104791 125163 86943 112219 157368 110632 87716
7778 87716 117303 110566 124933 114747 116996 126041 131427 86111 73793 35012 108477 88305 69234
7765 69234 88042 135259 114531 134039 113008 108480 149302 164634 87635 118197 92355 135354
7753 135354 165528 123828 128113 146226 152665 152946 137907 177405 181577 168916 178360 118604 179602
7740 179602 202606 170106 158679 172777 200696 264203 238753 242279 256947 319523 211487 212123
7728 212123 260893 214728 207961 243711 221849 260185 276746 201806 194133 279407 249936 253831
7716 253831 250409 212457 247309 283382 281189 310076 271303 259085 281958 328005 364313 294565
7704 294565 341573 307063 345708 327166 296280 338150 321382 289201 297739 362088 345348 389569
7692 389569 346722 319208 319892 367938 409611 426285 423797 447972 473197 412027 404288 407346 411342
7679 411342 410709 435940 498069 550628 493377 479398 502141 597175 505517 497438 525792 543470
7667 543470 541663 587242 593955 621241 626041 569366 570850 583808 676086 728493 714264 716312 756370
7654 756370 812384 773331 686389 792837 840855 815220 814393 869456 881302 1015354 1085794 1004345
7642 1004345 936445 967768 950129 946995 969105 1001086 1095314 1153827 1137302 1157844 1122083 1158284
7630 1158284 1210712 1239427 1266987 1318813 1401419 1438578 1469112 1422035 1402379 1448375 1500274
7619 1500274 1573470 1647464 1637647 1698799 1777108 1805844 1823576 1832875 1813604 1896638 1939708 1923691
7607 1923691 1947520 1965320 2033886 2073195 2121643 2202726 2288457 2315468 2367905 2445491 2508659
7596 2508659 2513788 2536718 2621506 2695062 2772294 2765168 2853876 2926305 2972736 3000180 3037231 3143030
7584 3143030 3247920 3322528 3310960 3301397 3410458 3548500 3534407 3596594 3615496 3654829 3733669
7573 3733669 3754000 3778706 3804593 3831900 3882330 3985661 3962030 4014106 3990646 4062903 4131478
7562 4131478 4155605 4249285 4173590 4215638 4255358 4256479 4295217 4251446 4258960 4308810 4318774 4365269
7550 4365269 4351189 4339883 4337987 4431843 4447693 4412231 4462057 4389353 4338492 4321573 4256179 4178986
7538 4178986 4074917 4032210 4033163 3978675 3882819 3899841 3828656 3684251 3684943 3584166 3542722 3503375
7526 3503375 3459441 3399640 3284424 3201172 3194360 3203863 3104446 2979095 2971737 2957331 2920665 2841665
7514 2841665 2793339 2786755 2696598 2652050 2636832 2534525 2504124 2465620 2452060 2414184 2337249
7503 2337249 2315771 2320974 2204497 2096455 2087545 2069976 2052057 2030165 1986095 1938037 1948934
7492 1948934 1929224 1837989 1771164 1760993 1649031 1752421 1736177 1674876 1665007 1613617 1593565
7481 1593565 1572648 1533844 1494185 1465847 1375560 1420282 1413777 1414323 1362957 1295520 1252289 1230740
7469 1230740 1272673 1278360 1272727 1267239 1245866 1114614 1040971 1073005 1136091 1141750 1119533 1040462
7457 1040462 984326 1038710 1007376 986755 964169 926882 955625 873075 863383 893244 837700 789939
7445 789939 750308 720199 666272 685355 713186 765002 770542 765127 761383 752973 767539 736811
7433 736811 644018 633347 723716 750270 645045 626963 680909 666883 629656 558745 569482
7422 569482 575424 624226 563157 594229 615109 629717 591447 574328 598563 498467 442063 503519
7410 503519 517881 497446 503739 454698 438015 448716 510861 543592 469627 377775 384275 427845
7398 427845 451688 389904 386886 392944 348843 348160 389680 408954 410611 352928 421190 384158 356988
7385 356988 375125 333681 315703 311565 349985 317622 293524 306824 366796 383589 410879 367019
7373 367019 401037 444924 440941 346519 302564 342825 285098 304645 277877 276443 284240 227067
7361 227067 212331 238244 202076 227673 207570 243321 328402 307200 315625 277442 250911 245121
7349 245121 226933 184206 213877 234048 241967 199931 184169 134172 75892 136136 216968 200918
7337 200918 147905 177043 213393 256258 175251 135400 120732 151500 174852 131707 189848 191745
7325 191745 184025 198132 207964 194683 146349 137796 185239 189562 208287 248801 181224 122323
7313 122323 157878 94683 68167 59970 67221 77032 68379 103694 96109 68889 86701 88344 104734
7300 104734 113889 93763 115448 139120 104605 188370 216112 177790 188717 173982 142298 110737
7288 110737 145199 152599 158998 84820 98965 96746 151812 178426 164384 174693 162090 140290
7276 140290 148720 163812 142303 161951 181998 44783 66660 83769 146362 92449 25284 96258
7264 96258 95754 60775 109577 133107 111439 125450 122223 72173 27423 95393 138518 59292
7252 59292 35074 137099 112591 91254 78344 31948 13432 -18582 13666 105299 116202 80270
7240 80270 47943 60792 34879 -4021 8092 -5189 6841 56496 28059 -15618 -58312 -8206
7228 -8206 -4678 -5374 -25764 -40296 6842 15405 3213 59390 31110 6052 45067 45585 79115
7215 79115 36419 60459 94805 10006 -2326 24233 83663 128563 80322 1060 22067 1427
7203 1427 -1307 -48795 -36018 -41137 -40102 10629 61359 70703 50387 35036 36743 38568 25970
7190 25970 77316 41098 10693 68409 73624 8250 -19422 -36297 28734 40611 -43165 -37218
7178 -37218 1125 7707 31790 -20048 -12643 8275 32096 -33060 -16233 11224 19300 31690
7166 31690 -59565 9746 27591 -18510 -18341 -26802 34400 50029 22217 -5994 -62293 -8824
7154 -8824 -12677 -36243 25503 -44127 -64987 -39153 -57638 -22092 -12363 12335 -25927 -59260
7142 -59260 -13392 11284 -29727 3655 51231 -9202 39585 26712 23753 108083 65618 37505
7130 37505 41452 86926 57219 54241 101423 55302 8773 16777 -24554 -44121 -21796 675
7118 675 -65 22654 23110 -23361 -46679 1333 -13664 17589 50571 20936 -42091 -98689 -44444
7105 -44444 -64523 -44595 -14973 19880 -6172 -18664 -61983 -113687 -110673 -59174 -83861 -100058
7093 -100058 -62224 -23074 -13642 -61474 -136880 -142894 -119046 -115370 -67740 -30032 -37775 -45487 -17644
7080 -17644 -13080 28126 -9335 -22617 -36487 -62843 -13990 -8084 -14366 -50670 -31393 -28214 -72391
7067 -72391 -98243 -87666 1362 38994 43678 32147 44898 61867 8239 62073 -42227 -114211
7055 -114211 -89525 -14898 -30439 -82871 -41240 41334 68746 24322 30653 7575 -18529 -44875
7043 -44875 -39217 -63765 -83985 -4905 13930 -47079 -73797 -55542 -35636 -10205 11620 19187
7031 19187 -38797 -30505 -53301 -70816 -33875 -13172 -32368 -58828 -65629 -55637 -35314 -4391
7019 -4391 6188 36409 58999 -28822 -13925 -11017 -20544 -13401 35398 -1127 30166 5423 -45124
7006 -45124 -3281 -3866 -79891 -4648 18872 -47930 -69566 -86891 -72932 -39992 -57846 -43647
6994 -43647 -7850 -29575 -29075 16957 -36590 -90860 -91520 -74784 -38796 -56625 -65928 1165 -28568
6981 -28568 -67972 12404 25880 -35192 -26020 -39576 -80374 -54948 -14511 -53793 -108664 -166404
6969 -166404 -72339 -86252 -106861 -117607 -96404 -37207 -55084 -58127 -67254 -10770 -55550 -78075
6957 -78075 -88396 -47625 -29206 -8038 -34208 -46733 -45117 -51421 -42533 2924 -61438 -41031
6945 -41031 -50009 -100266 -97283 -101935 -57171 -55871 -18245 55131 -17038 -43250 -53672 -54901 -55149
6932 -55149 -53435 1402 13498 -55341 -42661 -1951 -3858 4116 -70622 -59217 -21795 -5094
6920 -5094 -20285 -45048 -25672 -87460 -104425 -85927 -84590 -92602 -77518 -38343 -50921 -59519 -51197
6907 -51197 -8715 -43260 -89657 -99532 -69219 -68193 -1259 9595 17436 15246 -6575 -53810 -109299
6894 -109299 -82924 -50762 -43872 -49460 -42008 -40865 -90639 -172024 -81482 15591 -10407 17088
6882 17088 45796 39164 -26270 -42549 -5713 -54652 -60323 -22957 -74649 -122225 -97149 -74856
6870 -74856 -102384 -107508 -71895 -30438 -59683 -83001 -37589 -101026 -96551 -102780 -57885 -30587
6858 -30587 -21848 3512 1220 -3046 -73581 -44949 23292 27273 9933 24292 -7747 -73268 -733
6845 -733 -35549 -89004 -100678 -68788 -101812 -115879 -33952 -15064 -38116 -22263 -14362 -37261
6833 -37261 -71487 -63515 -32473 6978 -17195 -24463 60377 60538 4634 -22427 -5249 4915 -19882
6820 -19882 -106114 -77844 -72548 -92416 9900 70334 26062 14762 65998 22253 9928 62840
6808 62840 54321 50429 4906 18285 -37170 -56319 -22088 -7604 -25867 -45327 -27065 -21540
6796 -21540 -58195 -1988 24106 -53423 -55000 37470 41675 15118 36228 -44333 -47368 -6752
6784 -6752 -35746 -28986 -9265 -35488 -41882 24518 25615 35980 9911 -8131 -146076 -129382
6772 -129382 -5848 25232 24852 52306 103619 42951 24495 29859 29471 35706 6642 21600 73176
6759 73176 21300 31348 67935 94959 19345 -23690 -59359 -62231 31504 76475 19729 -16556
6747 -16556 -16649 -20516 21405 18825 15184 17077 -14368 -29930 -50530 7860 -51384 -60315 -3634
6734 -3634 -16938 12040 27785 39628 43337 11926 -67684 -96199 -72832 -114282 -124195 -98363
6722 -98363 -49992 -81345 -48612 -20139 -47928 -15348 3369 -43457 -42685 -17158 -10424 -41690
6710 -41690 -73768 -25252 29283 -3127 -69846 -41726 -32823 -58127 -130947 -81024 -50142 -9967
6698 -9967 126641 86814 5938 19104 -40859 -37693 -42945 -42680 -30644 -13985 -8234 -3750 27181
6685 27181 62180 -9200 -57854 4241 23972 37218 -1894 -32400 -42051 7150 38044 -34989
6673 -34989 -24464 -103415 -131192 -51897 59668 77016 51891 38509 -26275 -40840 -26206 3779
6661 3779 44523 25062 20457 -9559 -44838 -42 -17955 20966 58887 63360 -12645 4201
6649 4201 -8316 -37447 -54535 -47784 -27966 12682 471 58142 46020 -65518 -62114 -27087
6637 -27087 -32292 -42338 -37971 -48106 29797 57793 20348 -811 10170 -24967 -67801 -71104
6625 -71104 -9408 -24885 -7316 -41689 -22199 13366 16544 5119 -51895 -34394 -21116 -36298
6613 -36298 -37723 -50558 -38724 39765 62979 71363 26660 -34200 -12653 -33113 33474 43346
6601 43346 -27438 17536 27219 55866 36760 34490 -35564 9045 1666 11352 45439 18633 31614
6588 31614 -10716 -12798 13996 -12339 26009 3772 37099 28819 -1633 22651 -68506 -12594
6576 -12594 -17121 7131 7034 -50863 -32106 -87979 -127421 -80668 -23824 -38695 -2962 27922 -4356
6563 -4356 31125 102562 116553 85835 78350 67714 71149 119439 121884 51614 31430 44236 145049
6550 145049 102507 42896 54274 23856 25402 27674 -48686 -37120 49633 99654 72715 81480
6538 81480 34708 16569 9579 -10939 135986 124997 122945 58225 45863 27329 6684 31629
6526 31629 50116 72883 58303 78773 85506 123612 96126 112972 83536 30479 -1683 78347
6514 78347 87889 125374 110720 128138 148050 133539 94306 69509 146340 220669 168319 128434
6502 128434 127421 134096 166468 146245 172219 189404 160969 109844 170504 212402 192270 178185
6490 178185 203216 148504 147779 173002 207490 134278 73775 70635 86273 116229 128921 142278
6478 142278 158364 169477 174123 182468 123887 79673 92196 140757 161639 101850 133588 126495
6466 126495 208599 197400 137210 117107 162133 171677 126956 188770 215311 192114 151986 147632
6454 147632 178209 232694 234784 186974 183872 239790 245072 314094 216298 264450 289427 218406
6442 218406 229584 211975 199984 212392 199127 135112 158298 175374 126469 144356 192369 206320
6430 206320 231310 230316 185479 181797 150770 149750 197876 167294 219017 261201 214820 176120
6418 176120 207048 207107 205069 223015 228230 234355 246911 182221 160322 154195 168955 241115 195646
6405 195646 184810 178341 167109 324364 317824 263724 272827 274194 283159 303858 286082 327149
6393 327149 319560 226820 328981 342023 377345 369706 303234 258183 214091 272278 274647 273982
6381 273982 260642 240015 294882 308443 332524 372694 289618 260002 265341 257876 281660 267218
6369 267218 245701 212856 229597 275587 249256 201493 264593 357031 404897 334788 300205 308897
6357 308897 315165 332456 316813 338786 320699 265279 223381 220027 267350 292541 323857 337882
6345 337882 327882 338141 391145 308111 280141 330527 357707 355829 340209 391360 363425 390628
6333 390628 329870 343083 310678 342482 347531 313020 337004 364359 357259 337759 396571 312077
6321 312077 345705 354750 401054 340907 311958 379701 365432 318576 302056 340816 352775 375391
6309 375391 362139 385362 410386 400451 495135 391252 369853 463846 453975 393518 343983 369385
6297 369385 396504 423254 413253 412957 419866 447592 423880 449682 434948 416393 443693 431876
6285 431876 465242 477303 444542 431897 459163 519390 478273 398523 389693 499042 490083 524042
6273 524042 557942 525977 523663 506903 568864 566563 529034 493764 540187 536956 505175 501425
6261 501425 504335 531126 539333 481671 490826 588568 549163 459878 517720 536112 564356 604411
6249 604411 577588 541350 557069 578817 607696 625096 639785 686875 658886 602350 634692 708624
6237 708624 624463 668640 780737 761084 691605 729301 711376 695853 721573 851528 879180
6226 879180 812914 751359 743549 737708 759981 804346 818798 874941 856896 886661 907726 872217
6214 872217 876223 942502 972684 1029713 1016721 1033936 1051455 1043704 1065718 1109469 1157083 1154479
6202 1154479 1193940 1169926 1192458 1255648 1277605 1312415 1296876 1294737 1380847 1442104 1408301 1480210
6190 1480210 1599388 1591301 1636098 1666979 1696247 1818683 1879666 1922156 2037164 2090273 2161400
6179 2161400 2239800 2365989 2412540 2462461 2634808 2748773 2787583 2971671 3106382 3207200
6169 3207200 3345159 3469441 3559412 3689998 3895778 3999788 4166685 4314175 4429309 4455940
6159 4455940 4689440 4855455 4994314 5013295 5004443 5117440 5163735 5159837 5108740 5085805 4990710
6148 4990710 4951390 4891129 4814437 4652252 4498555 4497607 4474090 4406530 4326980 4225494 4156440
6137 4156440 4110663 4044030 4018043 3972168 3948547 3958905 3935714 3930538 4030849 4087541 4176723
6126 4176723 4151988 4227533 4415540 4456008 4541079 4702713 4779473 4875671 5080065 5302810 5485903
6115 5485903 5733871 5912638 6163858 6386811 6586693 6933042 7200780 7504039 7768878 7948215
6105 7948215 8196531 8454041 8723759 8974119 9110854 9244781 9325521 9464906 9634182 9773920
6095 9773920 9874888 9899411 9912681 9961225 9941894 10002769 9982213 9898720 9832653 9763288 9692783
6084 9692783 9625533 9616826 9572609 9483801 9339454 9319994 9329509 9196546 9109105 9139517 9138071 9146542
6072 9146542 9123543 9101072 9147668 9124630 9158801 9214236 9276847 9401405 9502244 9572806 9636779
6061 9636779 9678230 9745735 9836611 9940397 10016269 10090674 10140698 10152170 10186038 10205492 10276702
6050 10276702 10331087 10393753 10436100 10388735 10375576 10366000 10460436 10438750 10417866 10406345 10360090
6039 10360090 10438404 10412353 10418681 10511078 10603775 10562484 10582889 10694352 10743858 10801848 10824210
6028 10824210 10858012 10884289 10971791 11047199 11142868 11198862 11256315 11359705 11403690 11458518 11536542
6017 11536542 11629543 11728198 11805441 11832099 11836571 11884496 11973316 11967923 11948212 11930248 11878372 11843617
6005 11843617 11849525 11774891 11687774 11636630 11527103 11398021 11213291 11053831 10859106 10610493
5995 10610493 10415591 10183431 9887418 9646928 9379931 9160111 8921309 8747090 8560216
5986 8560216 8358373 8074242 7885459 7681129 7505336 7331206 7221957 7096045 6891439 6820914
5976 6820914 6738651 6636491 6516696 6400126 6342702 6331179 6216535 6137892 6083854 5960392
5966 5960392 5870862 5848300 5746994 5647865 5632427 5630312 5637454 5621906 5571526 5495543 5493797 5502286
5954 5502286 5561599 5663695 5714999 5761306 5742139 5767705 5683311 5687200 5706200 5686728 5577850
5943 5577850 5527850 5447570 5399466 5284698 5175511 5095800 4972033 4860143 4751235 4643572
5933 4643572 4533919 4476545 4367445 4220077 4167578 4120961 4020030 3881923 3854225 3809431
5923 3809431 3770400 3775815 3766697 3788766 3728489 3699893 3680266 3598588 3623021 3555263 3433868 3358978
5911 3358978 3354620 3286286 3258895 3291946 3249109 3163029 3097773 2968775 2936346 2904059 2841104
5900 2841104 2813580 2765780 2745669 2722133 2591763 2496636 2436209 2400725 2364294 2292021 2260202
5889 2260202 2223361 2182223 2088463 2066233 2044854 2077023 2056394 1962457 1898480 1949039 1885959
5878 1885959 1843666 1861103 1806740 1755332 1754784 1711146 1690614 1647983 1624333 1630035 1598053 1535898
5866 1535898 1589416 1568529 1561849 1537906 1523136 1541489 1586521 1519068 1497967 1541990 1533738 1470444
5854 1470444 1390729 1396719 1413301 1363144 1407997 1428466 1426341 1385607 1368336 1340547 1347296 1332296
5842 1332296 1342664 1334235 1379332 1358658 1303979 1345511 1383724 1384417 1332363 1318107 1382712 1384720
5830 1384720 1410915 1387071 1261063 1333190 1329331 1363913 1385566 1302485 1321207 1332751 1393209
5819 1393209 1463821 1385413 1369603 1352783 1314685 1294466 1301829 1238696 1293886 1308309 1213536 1178291
5807 1178291 1346720 1424384 1310445 1322578 1308837 1308935 1366392 1382257 1407507 1354749 1380347 1380105
5795 1380105 1375272 1416633 1483580 1472717 1400752 1392124 1371314 1299553 1334008 1445992 1385337 1393131
5783 1393131 1399685 1412323 1424052 1373121 1396298 1426609 1466807 1414291 1482547 1485211 1487200 1525828
5771 1525828 1509115 1534524 1556597 1524408 1534752 1581240 1544980 1486131 1541178 1648027 1639519
5760 1639519 1633622 1629480 1623489 1634139 1631567 1657895 1703497 1740424 1777756 1792757 1738740 1736484
5748 1736484 1755448 1821420 1841028 1844598 1848960 1934145 1998478 1945510 1982461 1966858 1992523 1992294
5736 1992294 1976310 1973437 2002678 2011525 2031715 2011291 2052432 2099406 2136057 2120262 2097164 2116253
5724 2116253 2162314 2189898 2144171 2243231 2228275 2251100 2323445 2285079 2280224 2306480 2326177 2304453
5712 2304453 2313814 2376418 2383849 2341653 2365572 2452261 2415031 2444933 2360441 2363154 2358288 2324119
5700 2324119 2358244 2381858 2331816 2303790 2406819 2488046 2473944 2426365 2426732 2464647 2528863 2635779
5688 2635779 2680662 2653614 2610140 2655521 2762939 2817282 2788393 2787424 2880448 2847637 2864689 2875611
5676 2875611 2904061 2877961 3010705 3063487 3072282 3051097 3093872 3162971 3205252 3217026 3214608 3273490
5664 3273490 3403276 3387578 3351803 3396593 3452826 3496945 3509635 3598580 3630236 3743655 3726051
5653 3726051 3696436 3688874 3732093 3822635 3903189 3905062 3851494 3893474 3887941 3965463 4042255 4061717
5641 4061717 4124544 4173298 4133932 4155898 4220030 4355038 4397594 4494145 4497517 4493393 4561407 4588106
5629 4588106 4670636 4772763 4832090 4921111 4969606 5006043 5038849 5084068 5173350 5225120 5292757
5618 5292757 5347290 5452807 5519610 5582762 5588953 5678343 5826963 5888129 5911280 6043306 6195056
5607 6195056 6265582 6249343 6347647 6442210 6527396 6655691 6787877 6922412 7052245 7106047 7236823
5596 7236823 7357868 7408911 7585211 7737338 7869948 7955728 8097029 8257302 8354284 8479913
5586 8479913 8662031 8863483 9002043 9193397 9372348 9508584 9629559 9828447 10078064 10235475
5576 10235475 10407893 10607318 10849861 11055131 11183919 11469063 11736219 11954510 12154965
5567 12154965 12356119 12614360 12997209 13319745 13544289 13802774 14177005 14528279 14811645
5558 14811645 15234994 15601487 15925896 16374658 16852803 17214439 17706769 18225722 18682097
5549 18682097 19171177 19731567 20351726 20928311 21569127 22234796 22872903 23559196 24288718
5540 24288718 25036773 25768131 26682974 27606076 28498780 29495834 30500715 31557348 32666364
5531 32666364 33802363 35091766 36423998 37759414 39194094 40757619 42386152 44124055
5523 44124055 45979854 47917268 50006435 52182581 54503731 56954564 59572433 62367256
5515 62367256 65308013 68459772 71863308 75455284 79313555 83479439 87989583 92745326
5507 92745326 97834115 103306920 109220262 115556264 122328884 129520473 137270103 145490737
5499 145490737 154184771 163371663 172972381 182938817 193158043 203708347 214354283 224970959
5491 224970959 235234570 245043616 254002883 261921777 268669450 273992491 277703420 279741603
5483 279741603 280369932 279533050 277364232 273998586 269674911 264448183 258390806 251618649
5475 251618649 244300214 236455081 228212872 219829370 211309652 202776862 194399510 186215074
5467 186215074 178268325 170558304 163217460 156164265 149423850 143044561 137005420 131207209
5459 131207209 125695370 120561759 115589443 110884662 106433060 102165575 98082953 94282826
5451 94282826 90594142 87129327 83854787 80744752 77709597 74785626 72140722 69586508
5443 69586508 67133221 64863020 62650250 60488388 58431507 56439799 54577499 52795255
5435 52795255 50993004 49404553 47897738 46362103 44905680 43394720 42099911 40842110
5427 40842110 39634670 38443077 37310556 36330382 35327172 34284036 33338495 32436900 31540634
5418 31540634 30695919 29886977 29148803 28402426 27722043 26983026 26275048 25607149 24968200
5409 24968200 24377947 23880616 23280743 22672899 22104596 21635032 21206543 20670660 20211418
5400 20211418 19784134 19336686 18885965 18447640 18095981 17716580 17414130 17071749 16692856
5391 16692856 16334123 15989739 15664939 15407905 15134434 14834362 14547880 14311341 14027415
5382 14027415 13825050 13571597 13374460 13157625 12891552 12666443 12453679 12314023 12048684
5373 12048684 11826279 11649234 11517639 11384292 11167260 10978899 10832180 10622971 10486989
5364 10486989 10279729 10084227 9899317 9765482 9684332 9520588 9435922 9361424 9112757 8961412
5354 8961412 8835085 8729738 8636608 8403443 8245137 8175492 8107878 7979408 7821597 7761426
5344 7761426 7590429 7475401 7413315 7352959 7260258 7199110 7047038 6954699 6844957 6738483
5334 6738483 6615571 6508177 6402625 6345122 6263091 6195049 6076677 5947290 5868213 5844499
5324 5844499 5849301 5706788 5667972 5579035 5506676 5412293 5396830 5332938 5254121 5159615 5047131
5313 5047131 4982949 4993076 4923108 4813076 4749932 4729537 4709860 4622337 4609180 4594529 4451865
5302 4451865 4397355 4385127 4336764 4324349 4297992 4227371 4210111 4133968 4086699 4131425 4099518
5291 4099518 4024194 3935962 3936813 3929869 3930099 3872370 3828626 3770091 3747123 3791364 3736843 3653733
5279 3653733 3574057 3582096 3625513 3571863 3555127 3609945 3576818 3487889 3397356 3422704 3422723 3394630
5267 3394630 3359447 3289602 3243012 3221883 3234074 3215493 3161001 3092998 3125148 3086039 3029957
5256 3029957 2975734 2971978 2927073 3021433 2988750 2954434 2930685 2874932 2844795 2790609 2748932 2711175
5244 2711175 2720557 2701438 2734573 2758587 2773490 2782445 2810293 2776831 2763219 2771632 2783622 2793102
5232 2793102 2802331 2800933 2830867 2843954 2740974 2756906 2833823 2819119 2835816 2889762 2881673 2873175
5220 2873175 2879136 2929769 2967208 3002180 3023035 2999797 3071642 3114736 3148201 3217715 3258413 3290457
5208 3290457 3374976 3315748 3382689 3457117 3571034 3611618 3730513 3745981 3791023 3908595 3969895
5197 3969895 3970124 3973671 4067574 4150181 4234276 4347865 4366387 4345603 4364650 4425979 4506094 4521942
5185 4521942 4591142 4592699 4608031 4641810 4630839 4679360 4659816 4680664 4781980 4782642 4783717 4734473
5173 4734473 4773664 4826178 4867749 4898416 4900379 4892130 4935636 5055440 5127480 5145815 5169497 5153553
5161 5153553 5264706 5388688 5393121 5441209 5579638 5755081 5750560 5801298 5843953 5861559 5958241
5150 5958241 6145227 6199589 6231604 6270273 6308789 6387764 6464432 6487315 6508884 6542129 6565635
5139 6565635 6678166 6673108 6598468 6640646 6705997 6699880 6710968 6718007 6779171 6717584 6645162 6593837
5127 6593837 6622057 6600801 6533724 6515430 6466693 6376975 6433602 6451370 6394700 6322858 6286621
5116 6286621 6207087 6216098 6187388 6190543 6138521 6150179 6131981 6119093 6102786 6140998 6105469 6063251
5104 6063251 6095645 6059548 5994998 5999070 5940158 5965740 5948125 5928856 5928127 5839893 5789582 5722320
5092 5722320 5723080 5510293 5444629 5430285 5413468 5345293 5191101 5144770 5098176 5038420 5025636
5081 5025636 4908846 4788419 4644706 4604168 4555024 4431741 4368265 4311945 4248979 4212956 4071402
5070 4071402 3989374 3927785 3919944 3819780 3771795 3670372 3585118 3496694 3469573 3404159 3407251
5059 3407251 3386204 3349732 3311747 3189407 3178881 3142575 3135731 3078826 3103026 3053115 3120074
5048 3120074 3130024 3048529 3072368 3044607 3106003 3195306 3232851 3280697 3279098 3270602 3343988 3367967
5036 3367967 3395237 3399128 3462863 3507129 3484329 3490519 3572100 3669488 3736984 3746078 3783196 3879946
5024 3879946 3900005 3994004 4034792 4157813 4203014 4207068 4228151 4257135 4279532 4337585 4291255
5013 4291255 4328487 4434625 4548566 4540729 4620109 4739518 4745749 4820378 4858259 4941784 5020040
5002 5020040 5036617 5074811 5116952 5094632 5161265 5257757 5372976 5396315 5465426 5579809 5683914
4991 5683914 5704723 5686049 5700635 5713046 5861313 5973174 6089590 6115545 6178833 6215756 6222971
4980 6222971 6299051 6309339 6303013 6356274 6440942 6449588 6507219 6541291 6597171 6556286 6567169 6601401
4968 6601401 6560087 6537860 6577873 6627094 6618781 6646453 6682897 6648856 6619225 6609992 6563145 6570674
4956 6570674 6617389 6684803 6649128 6692092 6837166 6815865 6785881 6766179 6869038 6951884 7032865
4945 7032865 7111136 7196140 7177107 7267348 7395736 7569880 7707591 7796902 7879447 7923620 7906530
4934 7906530 7824136 7749701 7727931 7699746 7684500 7664145 7667766 7683437 7607421 7572408 7506043 7420921
4922 7420921 7330532 7264179 7223503 7215021 7225251 7220680 7207865 7107045 7008468 7004478 6926812 6884328
4910 6884328 6765134 6651452 6631802 6592199 6506736 6462835 6357554 6304415 6271421 6248582 6268472
4899 6268472 6301396 6235268 6163749 6130123 6077275 6017862 5923479 5920654 5933442 5866461 5874588 5877246
4887 5877246 5901363 5858781 5830214 5926159 5903519 5893999 5951156 5921137 6002459 5973188 5943249 6038033
4875 6038033 6111160 6134363 6165024 6203378 6237763 6296339 6376136 6439898 6478232 6498305 6646724
4864 6646724 6748680 6797577 6914791 7004303 7014009 7061783 7183390 7282066 7371847 7559774 7629076
4853 7629076 7680995 7735139 7834344 7954410 8110337 8236085 8338931 8513344 8614709 8722932
4843 8722932 8807220 8969063 9033162 9107020 9130385 9218389 9206588 9245807 9320371 9424091 9434918
4832 9434918 9390108 9407946 9393339 9348124 9276739 9237632 9290364 9289237 9212143 9226047 9272283 9293646
4820 9293646 9235380 9216410 9216391 9259865 9307406 9289437 9339546 9355953 9404861 9496379 9491001 9501512
4808 9501512 9450285 9480447 9582077 9605059 9672907 9770697 9763343 9817815 9895782 10032971 10152073
4797 10152073 10214280 10355339 10450493 10532361 10524021 10565607 10592194 10597190 10576326 10568171 10518659 10554607
4785 10554607 10529906 10460622 10406143 10376927 10277224 10154929 10041267 9902936 9726288 9542972
4775 9542972 9404149 9305850 9208088 9079091 8969973 8874328 8822514 8671140 8528065 8465283
4765 8465283 8365991 8272084 8196466 8074610 7988715 7918724 7830657 7712743 7556439 7450918 7374847
4754 7374847 7250896 7186504 7124152 7104469 6990842 6910110 6781795 6695574 6631663 6517259 6436539
4743 6436539 6412765 6300630 6239902 6243740 6169404 6076588 6005306 6018146 6006230 6004496 5937673 5938677
4731 5938677 5970760 6031113 6060027 6106671 6113745 6183120 6263927 6268308 6247933 6319265 6441716 6519242
4719 6519242 6606738 6748025 6876191 6964509 7202833 7436239 7564596 7712655 7879126 8018903
4709 8018903 8261743 8500557 8625067 8845303 9053992 9265993 9523289 9739204 9971063 10188739
4699 10188739 10471545 10743369 11021080 11276075 11523328 11763654 11964108 12176637 12439963
4690 12439963 12672723 12952936 13183954 13407654 13676034 13895260 14123988 14475176 14741320
4681 14741320 15065694 15357088 15634019 15885671 16145924 16465266 16777737 17045813 17340595
4672 17340595 17662145 17921886 18163259 18360471 18538454 18681765 18821905 18903218 18975805 19005772
4662 19005772 18968977 18919505 18934933 18858594 18699492 18624518 18505560 18421551 18266251 18116669
4652 18116669 17880255 17716737 17579410 17418398 17247871 17112059 16985169 16847053 16790686 16657052
4642 16657052 16513478 16370272 16346316 16216829 16240903 16254269 16348372 16508779 16629193 16835856
4632 16835856 17125272 17471986 17904180 18390127 18759895 18635416 18262527 17698768 17127846
4623 17127846 16770853 16638644 16508394 16537866 16722553 16825493 16750999 16686676 16773030 16894132
4613 16894132 17177959 17573170 18096126 18634177 19227105 19838269 20435242 21113094 21891491
4604 21891491 22812998 23813530 24865274 25783345 26494336 27136305 27691306 28269065 28870937
4595 28870937 29566619 30261982 30972137 31472540 31499635 31186029 30786927 30410522 30098057 29894523
4585 29894523 29738792 29506885 28970927 28070283 27053056 25978580 24884623 23911504 23072719
4576 23072719 22348119 21580756 20603284 19408563 18281563 17248776 16262294 15387916 14579689
4567 14579689 13874858 13170208 12546334 11875619 11190453 10611952 10144414 9614420 9143672
4558 9143672 8781193 8393556 8016190 7684789 7349997 7100490 6883979 6559682 6315450 6112726
4548 6112726 5860736 5683125 5522249 5375013 5223923 5122000 4851196 4674550 4560353 4410236
4538 4410236 4313221 4144029 4066086 3993001 3874415 3817957 3706871 3651642 3580457 3395187 3294705
4527 3294705 3198876 3168058 3139402 3101352 3119921 3028943 2924154 2801137 2818577 2797551 2662465
4516 2662465 2612555 2505233 2530802 2493739 2437172 2378158 2444219 2403203 2349516 2302979 2270948
4505 2270948 2261465 2225335 2172989 2174058 2152306 2039706 2033349 2012767 1972873 2006015 1983431 2045884
4493 2045884 1989546 1954097 1931117 1901328 1849371 1819908 1805503 1767467 1740200 1747643 1710657 1637614
4481 1637614 1713657 1703295 1691819 1621787 1614341 1630691 1634513 1606281 1579456 1553444 1566363 1539224
4469 1539224 1561953 1506261 1494819 1426926 1379818 1371549 1394223 1425052 1387802 1434078 1423067 1383017
4457 1383017 1408081 1406165 1324728 1311351 1322764 1324868 1258248 1304914 1362852 1385169 1358095 1240365
4445 1240365 1216148 1240360 1187070 1165098 1158318 1159070 1148937 1141508 1091629 1100718 1116579 1148702
4433 1148702 1115203 1048874 1083963 1001782 1061218 1123960 1140418 1106701 1064765 1042356 1060159
4422 1060159 1100313 1091620 1087254 1069343 1038754 1003692 968020 979214 1046932 1047327 1047046 1030918 983382
4409 983382 991521 979942 966560 924688 906321 936435 948692 957923 1004851 1015258 1016723 1060604
4397 1060604 1025148 1043681 1017245 1030127 1062912 1056003 1031984 1043181 1027795 1034594 1056887 1029428
4385 1029428 1030667 1077638 1062168 1042750 1107288 1112398 1165408 1130610 1117148 1105935 1102963 1111190
4373 1111190 1158902 1165060 1197828 1174125 1219669 1214672 1121930 1062421 1109699 1202294 1203996 1259460
4361 1259460 1188768 1231381 1310164 1274182 1277842 1230572 1238188 1294829 1338441 1365474 1321707 1405296
4349 1405296 1454827 1421743 1414853 1421645 1496410 1558321 1541621 1537518 1570435 1617786 1705696 1736362
4337 1736362 1779301 1865885 1979868 2044795 2085243 2184354 2291290 2316584 2380857 2457485 2517121
4326 2517121 2593749 2713753 2759702 2850612 3055172 3192458 3319383 3467108 3661722 3764325
4316 3764325 3947287 4087498 4279817 4503201 4669857 4835346 5082837 5289198 5511160 5693772
4306 5693772 5949343 6255595 6482482 6613799 6818844 7119048 7436997 7721123 7960215 8242411
4296 8242411 8492909 8614932 8728121 9026964 9301246 9550027 9819611 9981557 10190865 10374296
4286 10374296 10503259 10667749 10788119 10920513 11092338 11147504 11183586 11219866 11229591 11223850 11134549
4275 11134549 11093849 11101641 11075625 10971326 10916455 10802455 10685199 10510757 10416718 10335136 10163325
4264 10163325 9989835 9846152 9712320 9531413 9319156 9100097 8948695 8780667 8574377
4255 8574377 8342423 8156593 7948037 7730645 7612307 7380317 7121123 6943950 6792067 6675948
4245 6675948 6565209 6326332 6187740 6087864 5928667 5749710 5588118 5462627 5366105 5266556
4235 5266556 5169060 5141009 4987271 4927960 4835527 4808101 4784844 4734416 4724819 4886986 4988731
4224 4988731 5060366 5180348 5325588 5474826 5680304 5928225 6231372 6625162 7088913 7495861
4214 7495861 8172306 8979107 9665416 10635293 11758237 12651768 12414965 11799068 10962607
4205 10962607 10031412 9472010 9222113 9001011 9029420 9121917 8885472 8203282 7495401 6903135
4195 6903135 6389064 6028473 5659631 5331493 5072328 4822882 4521255 4293526 4125835 3952921
4185 3952921 3841484 3724392 3597019 3419468 3306705 3278497 3267893 3093233 2973553 2932717
4175 2932717 2841069 2788265 2796699 2751793 2637689 2570833 2541215 2387002 2359952 2331964 2267950
4164 2267950 2309322 2204503 2196596 2174152 2180549 2139567 2184810 2177977 2074523 2063018 2042142 2014110
4152 2014110 2094611 2052894 2014122 1908033 1934572 1895457 1837408 1872011 1919800 1932231 1917106
4141 1917106 1947315 1897217 1910324 1928025 1856183 1871499 1837404 1889594 1813877 1795332 1781881
4130 1781881 1711613 1750548 1877617 1805017 1719492 1743292 1739261 1832893 1835413 1880167 1879528 1829280
4118 1829280 1764881 1814317 1816655 1769286 1783062 1811976 1880380 1809053 1811488 1907391 1947417 1884742
4106 1884742 1941542 2005179 2010999 1993060 2039663 2047729 2072477 2098787 2080430 2115624 2119727 2095198
4094 2095198 2130631 2212122 2260951 2277144 2275093 2313095 2364610 2426539 2507148 2600882 2592665 2642733
4082 2642733 2621624 2751984 2764972 2743296 2844020 2941252 2982356 3024119 3085044 3161883 3260528
4071 3260528 3362074 3447183 3542765 3690692 3891918 4108211 4298923 4463186 4645736 4851539
4061 4851539 5114653 5364823 5704326 6139268 6630125 7081440 7580807 8066627 8558688 8622871
4051 8622871 8555400 8422941 8259450 8164627 8175178 8287059 8443202 8603554 8622668 8568802
4041 8568802 8505573 8459126 8422094 8416500 8401197 8449343 8525232 8513657 8567818 8708376 8719588
4030 8719588 8824621 9035572 9042501 9148979 9297744 9436668 9597648 9748722 9930621 10050167
4020 10050167 10177377 10330414 10447743 10552677 10719552 10885532 11123990 11223785 11488455 11661058
4010 11661058 11887320 12093560 12310225 12497309 12673218 12934511 13112018 13252690 13483687
4001 13483687 13643667 13832566 13997345 14222643 14466830 14635526 14838742 15054765 15265761
3992 15265761 15487313 15685642 15884846 16100413 16373578 16603727 16924924 17162230 17356928
3983 17356928 17638291 17917017 18221478 18545536 18797644 19049083 19290023 19556382 19851831
3974 19851831 20120800 20370203 20610796 20823265 21012073 21221885 21463344 21660573 21770031
3965 21770031 21974109 22147700 22282816 22448152 22653297 22795000 22958079 23126804 23175368 23262849
3955 23262849 23398379 23465984 23595626 23710505 23768863 23798432 23840872 23929488 24013095 24086529 24206049
3944 24206049 24154955 24185772 24224277 24192605 24176792 24094306 24095634 24093513 23957239 23810472 23666899
3933 23666899 23517319 23303340 23127234 23009598 22869278 22628353 22444843 22286455 22097964
3924 22097964 21878076 21686891 21540863 21344301 21114198 20943308 20792106 20671381 20530942
3915 20530942 20425701 20398174 20342404 20264223 20309507 20302384 20238617 20243174 20296857 20339246 20426997
3904 20426997 20425669 20495620 20621771 20740761 20855828 20926150 21005413 21037571 21086176 21260841 21419467
3893 21419467 21458273 21594352 21696914 21775033 21803032 21868162 21912472 21937090 21973947 21992568 22038232
3882 22038232 22037197 22068155 22079405 22064250 22052263 21977556 21903148 21849823 21775749 21568937 21463264
3871 21463264 21430497 21419510 21256355 21061018 20873556 20704090 20519945 20284411 20097770 19844690
3861 19844690 19650885 19374395 19134675 18966892 18687180 18426551 18139107 17836823 17474214
3852 17474214 17166917 16841377 16471774 16195198 15801801 15407420 15029093 14644157 14224868
3843 14224868 13858241 13563821 13261131 12930800 12562836 12213183 11899361 11595358 11291047
3834 11291047 11055525 10816371 10588228 10366661 10218377 10018718 9853811 9723369 9672876 9538469
3824 9538469 9426774 9414751 9343563 9318872 9276176 9268014 9302623 9376978 9388374 9360401 9396640
3813 9396640 9428075 9374388 9328699 9475603 9506442 9512566 9483335 9471067 9391849 9336256 9343818 9344455
3801 9344455 9333585 9331254 9319688 9229546 9168462 9144047 9118025 9057816 9008337 8886891 8818870
3790 8818870 8826675 8822721 8746863 8670956 8656066 8669090 8593932 8564247 8634072 8712482 8691351 8771948
3778 8771948 8791656 8839959 8960529 8960735 9006307 9110803 9193386 9253995 9292838 9355526 9368714
3767 9368714 9402451 9378913 9445978 9436037 9334088 9337520 9305583 9277045 9308609 9297289 9240652 9196240
3755 9196240 9191527 9181787 9132555 9182016 9248251 9250163 9277945 9290689 9348176 9436863 9466478 9583012
3743 9583012 9641761 9735951 9860067 10004845 10206829 10400812 10546407 10757098 11051166 11251722
3733 11251722 11519061 11843460 12204830 12594184 12980622 13386493 13811634 14186851 14631824
3724 14631824 15089475 15570973 16030073 16458159 16953778 17495000 17984868 18540188 19024458
3715 19024458 19522470 19948229 20371667 20767138 21121348 21699693 22180032 22608050 23068898
3706 23068898 23589439 24127132 24681296 25152961 25736952 26305361 26733488 27252170 27828010
3697 27828010 28365339 28767701 29158188 29614108 29872519 30022776 30252500 30344007 30320389 30232432
3687 30232432 30019492 29846064 29503209 29148472 28750670 28258575 27785403 27305637 26762732
3678 26762732 26216000 25657965 25239218 24788524 24371878 23936032 23542949 23142672 22809454
3669 22809454 22510682 22137517 21839829 21616759 21348016 21134231 20959913 20700227 20476086
3660 20476086 20241635 20011431 19757486 19508957 19180824 18893866 18511940 18174272 17851129
3651 17851129 17543632 17219142 16937337 16664636 16311952 16029637 15735273 15435092 15146873
3642 15146873 14939310 14753950 14554999 14341765 14178770 14086907 13961408 13791704 13627499 13502387
3632 13502387 13339232 13230766 13105293 13049943 12905178 12835559 12718229 12613786 12562340 12463358
3622 12463358 12411596 12343739 12264541 12246639 12201423 12186178 12069465 11961780 11921650 11899506 11853995
3611 11853995 11742834 11632511 11462445 11392812 11299540 11201644 11026787 10833940 10658244 10426785
3601 10426785 10205852 10057660 9854001 9619956 9366987 9165416 8944100 8776851 8556582
3592 8556582 8347784 8180743 7959097 7795826 7624212 7459292 7353230 7210635 7081177 6997067
3582 6997067 6857146 6784210 6610079 6514444 6426634 6355189 6298261 6243830 6172626 6071216 6020401
3571 6020401 5944043 5936248 5945570 5928574 5862786 5837277 5816050 5829644 5858914 5936879 5921866 5850137
3559 5850137 5792745 5826112 5917123 5959009 5901600 5965878 5948643 5970325 6000822 5996418 6109502
3548 6109502 6141145 6211978 6285560 6368257 6437159 6519005 6585339 6670780 6760742 6821290 6927829
3537 6927829 7036281 7217408 7353733 7470586 7594039 7754354 7973617 8168075 8342176 8490148
3527 8490148 8689878 8986023 9304616 9529430 9794113 10091766 10400164 10767586 11084636 11430678
3517 11430678 11921552 12359334 12878727 13305506 13818929 14453306 15035402 15714220 16501991
3508 16501991 17290927 18110572 18974254 19889267 20861353 21835795 22882077 24059705 25348370
3499 25348370 26641002 27973286 29333557 30713621 32197544 33626463 35015244 36408243
3491 36408243 37745741 39082068 40299177 41462129 42517137 43550119 44475288 45335237
3483 45335237 46042475 46542845 46968216 47331372 47450909 47538062 47490063 47121804 46788806 46337090
3473 46337090 45694906 44949834 44181648 43200392 42262494 41206456 40101573 38920114 37678284
3464 37678284 36439548 35164056 33925269 32628916 31349140 30137490 28990413 27883803
3456 27883803 26783713 25656130 24631325 23604476 22618862 21730194 20887916 20118443 19366388
3447 19366388 18648186 17979726 17332089 16674696 16068577 15488515 15007680 14563413 14118889
3438 14118889 13712487 13314651 12898834 12563573 12240464 11883011 11552691 11253449 11046111
3429 11046111 10778916 10471094 10220048 9957685 9745538 9584530 9418910 9207859 8990507
3420 8990507 8833667 8722005 8615799 8432852 8396589 8276572 8206704 8102894 8033287 8055626
3410 8055626 7903301 7883971 7926273 7922580 7907584 7907012 7963693 7923030 7872499 7875454 7929211 7914942
3398 7914942 7962019 7973019 7939478 7913289 7895882 7855873 7808083 7786993 7677055 7575915 7502866
3387 7502866 7453432 7468331 7391586 7367229 7290971 7239905 7177878 7182033 7234171 7240121 7176213 7199358
3375 7199358 7250541 7265640 7332974 7459436 7461286 7530439 7719978 7790194 7999082 8107684 8185012
3364 8185012 8346547 8565360 8795364 9062967 9312285 9592646 9897477 10176506 10451144 10810454
3354 10810454 11163811 11597686 11982450 12427418 12929527 13423000 13837758 14222153 14655370
3345 14655370 15161675 15605803 16042576 16486347 16884917 17176047 17515207 17754810 18003164
3336 18003164 18195067 18312104 18493698 18621776 18685550 18779250 18857949 18930387 19013303 18981915
3326 18981915 18983336 19004923 19097794 19109920 19097561 19079148 19031316 18880176 18667783 18497172 18385561
3315 18385561 18167280 17935529 17737729 17428986 17086777 16737010 16318203 15910405 15584209
3306 15584209 15054984 14607025 14125636 13673067 13259541 12822676 12426021 11989446 11542602
3297 11542602 11108817 10744690 10438964 10123612 9754959 9369406 9054440 8725500 8490056
3288 8490056 8328318 8102092 8001178 7850803 7642287 7510396 7365132 7251614 7207445 7123814
3278 7123814 7171691 7196322 7236095 7263387 7305305 7474475 7534247 7433969 7280135 7227927 7122462
3267 7122462 7076222 7086805 6994230 7060700 7093222 7104845 7013256 6888912 6777312 6717816 6543218
3256 6543218 6522886 6493006 6414007 6338180 6309340 6312087 6249300 6180599 6196532 6201978 6272093 6300483
3244 6300483 6145201 5966732 5849871 5579140 5323161 5196149 5053221 4973679 4913116 4817516
3234 4817516 4705049 4595308 4393108 4224519 4103613 4061494 3997066 3819413 3730004 3678259
3224 3678259 3639930 3591029 3554059 3508916 3460895 3456861 3338674 3295544 3177653 3197197 3238223
3213 3238223 3230133 3166710 3159169 3179493 3183012 3185616 3169913 3167321 3158729 3152781 3169517 3149346 3105460
3200 3105460 3126990 3203465 3152051 3143272 3187066 3173384 3171839 3186266 3245519 3242469 3281852 3311075
3188 3311075 3284093 3280689 3320804 3336879 3356252 3417714 3467407 3489141 3504521 3472070 3509453 3588936
3176 3588936 3600484 3576797 3542859 3652469 3704165 3820083 3821960 3818242 3863912 4011661 3987993
3165 3987993 4035130 4137689 4150065 4207509 4244044 4306957 4393068 4502906 4556893 4642613 4729588
3154 4729588 4792952 4956350 5053301 5201765 5334586 5446813 5551560 5618191 5818955 5992242
3144 5992242 6197145 6337122 6525104 6700700 6833816 7055414 7288649 7480956 7745712 7924971
3134 7924971 8152078 8438619 8746413 9052494 9356692 9684160 10004120 10428877 10916721 11336054
3124 11336054 11844882 12359919 12830902 13375970 13974187 14607544 15337471 16160397 16900518
3115 16900518 17776462 18731633 19724720 20788211 21945731 23262332 24597846 26137587 27798839
3106 27798839 29629034 31540004 33717397 36049836 38472650 41163648 44145621 47293902
3098 47293902 50736049 54301444 58099901 62121782 66345252 70549141 74731462 78821452
3090 78821452 82655025 85966701 88624694 90487517 91569281 91805625 91300889 90410801 89258911
3081 89258911 87897665 86262159 84422413 82246219 79757825 76839203 73736069 70390066
3073 70390066 66972736 63611555 60370335 57337674 54452206 51592983 48973385 46480070
3065 46480070 44052697 41798688 39763137 37727061 35830606 34084794 32473061 30886988
3057 30886988 29394087 28109857 26778466 25577213 24398444 23271582 22228213 21311308
3049 21311308 20429340 19582108 18827002 18029529 17316565 16660109 16030873 15376460 14795337
3040 14795337 14294804 13779556 13336428 12856060 12391773 11991547 11516200 11083930 10692678
3031 10692678 10342599 9991038 9663637 9423887 9129711 8853000 8540423 8272851 8015990
3022 8015990 7799538 7537541 7258253 7064871 6868966 6695817 6493190 6351446 6187384 6045419
3012 6045419 5881178 5676252 5482402 5340964 5162181 5070649 4974125 4876380 4801958 4684339
3002 4684339 4543390 4449590 4366071 4241365 4160267 4050057 3968034 3899087 3827164 3775764 3703176
2991 3703176 3576698 3489248 3441993 3339640 3274820 3186485 3126957 3148255 3060422 2993857 2944077
2980 2944077 2864789 2815670 2789062 2775154 2659683 2606851 2562606 2593633 2565818 2487557 2468333
2969 2468333 2429102 2390288 2266655 2193112 2189081 2214063 2172143 2114120 2048385 2019051 2051787
2958 2051787 2011247 1936014 1948577 1901536 1872045 1803379 1798164 1794432 1724265 1635258 1595428 1561489
2946 1561489 1559010 1545180 1511745 1486954 1418903 1478774 1365645 1404468 1416967 1319587 1356401
2935 1356401 1290672 1203800 1163361 1241330 1289829 1264085 1190809 1119631 1150891 1125698 1043119
2924 1043119 967727 982019 972296 1006839 967472 956189 973920 908395 934596 921751 985438 943884
2912 943884 843066 792603 788385 785552 785320 750445 790340 749119 703727 726190 761309 799268
2900 799268 703825 655699 675353 642989 649631 654546 628949 629884 711783 721041 664419 638175 592917
2887 592917 643699 674508 646119 609664 572449 582715 541157 551385 532094 500808 491405 486845
2875 486845 545224 482426 433872 422440 487209 487699 455168 477116 478320 549627 540672 479015
2863 479015 429012 436060 420787 391954 375241 315552 330204 356279 368218 355834 402155 415531
2851 415531 364342 358940 369358 401937 388645 312354 291990 271929 223419 244053 326885 332547
2839 332547 292961 277105 231209 238798 288580 337315 323333 298410 344353 352274 300950 328316
2827 328316 332006 312201 330469 308304 345894 403681 391017 406813 376776 418698 430191 457608
2815 457608 556367 501469 447226 450730 513029 502714 514828 571668 585319 569922 524857 560030
2803 560030 563716 576479 629100 652549 635804 624850 664092 620298 522355 476125 535171 597552
2791 597552 544420 447694 511052 487476 453982 411318 406608 394781 362997 317091 350173 350557
2779 350557 386641 346679 308242 304972 272906 231938 248130 265276 274088 274579 229989 183000
2767 183000 143711 177304 171053 138037 183418 165508 180236 241115 247813 224369 254317 266153
2755 266153 192586 163899 118262 150967 115625 166134 180242 177882 123185 160331 140988 7417
2743 7417 29805 27802 73603 117549 117045 149119 106279 72667 89673 59952 17798 50799 30312
2730 30312 43777 1225 10837 87645 114221 86711 106634 63359 513 81550 88334 91297
2718 91297 53858 17945 97533 29039 -19056 9650 48663 -26951 5385 13100 54755 49489
2706 49489 -4688 28347 60122 67461 57983 12325 217 82666 106648 49882 22922 16090
2694 16090 67449 57569 48505 23400 -19784 -27982 -86031 -65805 -73247 -34106 -26446 -30440 -43630
2681 -43630 -90068 -98302 -32161 11992 -39232 -80806 -46297 -63881 21809 37038 4960 -6820
2669 -6820 -34685 -42844 5060 -16446 -34702 -40274 -23616 -20240 -11785 -15671 -13789 -23167 -22101 7627
2655 7627 -14605 -13369 -9637 -26949 -15391 7422 -21345 -10889 -36633 23593 19474 -62724 -64843
2642 -64843 6736 43117 -38255 -9688 -376 -25233 -43493 -29223 -37728 -31172 -33649 -65662 -70334
2629 -70334 35823 27009 -64496 -44955 -11492 -33308 -94090 -90119 -100423 -7311 13444 70083
2617 70083 60358 -11815 -24008 -77588 -58600 -65476 -37130 -35671 -58024 -73218 -53632 -99671
2605 -99671 -103919 -149735 -119743 -32604 -12689 10066 -3257 -40545 -40825 -5125 -38459 -69118
2593 -69118 -40836 6155 -27254 -87295 -116768 -104055 -60911 -36648 -34185 -79315 -12829 9188
2581 9188 -53243 -76120 -51879 28135 15439 20105 19769 -15644 -39417 26945 -38976 -97291 -49279
2568 -49279 -68858 -93043 -83262 -139 -14035 -69346 -71490 -31949 -60131 -45693 12265 -23178
2556 -23178 -27128 -63216 -85749 -43232 -7149 23292 -42485 -105836 -45840 -75132 -96213 -47649
2544 -47649 4194 -14682 -49219 -103399 -34186 -58962 -43546 -26473 -8076 8836 -17168 -36865
2532 -36865 -86324 -110045 -65353 -108401 -60386 -51829 -19749 32468 44498 13647 -89796 -998
2520 -998 -59098 -71474 -30135 29359 -23634 -79377 -139767 -165483 -99417 -58487 -102077 -46799
2508 -46799 -78572 -198792 -150888 -123207 -105640 -114704 -125393 -160747 -96094 -77649 -93535 -93023
2496 -93023 -7374 -25093 -49474 -31766 -45178 1223 -27322 -68470 -73559 -141340 -165793 -139382
2484 -139382 -115399 -100856 -111455 -69484 -48803 -114151 -73467 -89356 -110281 -101314 -124058 -132593
2472 -132593 -151133 -99297 -115413 -39976 -35788 -37174 -71497 -63988 -6994 -36623 -105463 -82853
2460 -82853 -77187 -26177 -56434 -70298 -43234 -5375 -57369 -94070 -82302 -56944 -46776 -13966
2448 -13966 -674 -14821 -21330 -48731 -62960 -71382 -59498 -41176 -68336 -33946 -2593 -62049
2436 -62049 -89711 -147113 -75428 -28376 382 49567 -501 -16079 -45497 -92981 -103904 -96099
2424 -96099 -41764 -57577 -59756 -19063 18755 -6015 3917 -37160 -42138 -45363 -70384 -89892 -104864
2411 -104864 -62746 -57104 -92819 12478 -5781 -8217 5726 -23553 -6641 -13640 35395 -53618
2399 -53618 -19718 -21758 -73689 -42860 11722 -8131 -10001 37538 -15053 -76286 -83655 -120789
2387 -120789 -46393 -13710 24174 -48028 -63182 -8279 4185 27898 -14852 -28810 -120514 -26763
2375 -26763 6360 37514 -13940 -43686 -42226 -72963 -53903 -23960 12737 24652 16693 28226
2363 28226 -41440 -46504 -33099 -15050 -8254 -1036 -51439 -18534 43134 68023 57681 1383
2351 1383 12812 28336 34559 12063 -29344 -10910 48541 100424 170026 96941 36074 43878
2339 43878 8836 49398 143402 117998 87349 118626 202908 208314 285062 242686 188078 209773
2327 209773 286324 300070 312671 349933 397442 448096 504318 613282 678193 742170 781750
2316 781750 908431 1088813 1187614 1315437 1377830 1262081 1247460 1202831 1075596 1012896 949813
2305 949813 939122 960186 956244 885496 770825 731774 685733 673654 610163 498376 378833
2294 378833 348925 318726 352746 383206 371996 372061 294030 246211 172432 187223 239622 241871
2282 241871 193650 115383 103454 36402 -29831 71331 101992 83836 97373 116512 155250
2271 155250 71583 42841 76702 42797 39506 84184 32843 29216 -9169 -35384 -12665 -11407
2259 -11407 -12250 12364 11406 -57885 -66816 25005 12659 -4931 67349 -45642 -56042 -47594 -69446
2246 -69446 -91026 -51963 -14213 -37966 18408 28137 -26751 -40944 -8329 -30045 -92812 -126097
2234 -126097 -56877 -8080 -38052 -48095 -37359 -60347 -51411 -33527 -67998 -6894 9132 13649
2222 13649 -27506 2692 20189 33638 -45985 -34834 -19418 -4712 25356 45547 14684 -43895
2210 -43895 -16826 -63100 -133422 -92465 -77027 -61005 -66421 -109116 -152636 -102418 -39547 -681
2198 -681 -20608 40163 40019 50 -4830 -97896 -69947 -61698 -81600 -104829 -45739 -26751 10451
2185 10451 20780 -29028 -40697 -37761 -29380 -70137 -89678 -62349 -90753 -55387 -34364 -5
2173 -5 -45898 9776 34295 13170 -102018 -72453 -51443 -108186 -132341 -32534 -105332 -181088
2161 -181088 -144349 -110815 -111321 -48254 -39654 -39935 -101107 -115554 -14155 -1154 -41249 -17448
2149 -17448 11727 17311 -31053 -43285 -27656 -50926 -58893 -68953 -23568 6122 -682 -44411
2137 -44411 7470 3369 -27707 -54971 3331 38813 25220 8331 66565 18821 -19511 25154
2125 25154 41104 -391 -56693 -82551 -96126 -117527 -45480 -46508 -42763 -18672 27113 -9910
2113 -9910 57347 56618 28303 -14413 -83743 -66335 -78997 -15310 25847 -25331 4814 15878
2101 15878 -31899 -99075 -84618 -11065 29974 -23009 -26268 -54463 -60893 -38772 -67530 -86243
2089 -86243 -108298 -114625 -105035 -18198 -33420 11084 -18317 24140 -5942 -36504 -27432 -39081
2077 -39081 -34515 -123237 -128259 -127643 -56426 -38191 -12252 26895 -17703 -7286 -54668 -133740 -130393
2064 -130393 -65064 -69961 -48312 -57475 -63400 -101030 -95414 -33283 -24837 -46573 -40977 -57183 -18472
2051 -18472 -1125 -31054 -2227 -7919 -12318 -16299 24447 -14410 -12265 -26475 -14142 -42859 -28240
2038 -28240 -65530 -83010 -46148 -71166 -73609 -120201 -80781 -131230 -197955 -110864 -78305 -48456
2026 -48456 -6854 -10844 -43558 -78654 -103976 -45805 -35884 -21757 27551 41584 25035 18846
2014 18846 43543 -12729 -26966 -86544 -94991 -138602 -70151 -31976 -54618 -86523 -45665 -26673
2002 -26673 -33081 29005 -21919 -62814 -104596 -106844 -24910 -44551 -38040 -8944 33169 24192 28250
1989 28250 -32074 -53591 -36634 -37345 506 -34124 -45070 -37146 -23987 -75059 -63507 -56955 -22233
1976 -22233 55666 51940 41480 70857 51216 93867 28373 19390 11748 23507 56085 14953
1964 14953 -44283 -43569 -79 -71603 -22083 -24145 -60694 -50884 -85931 -57347 13367 -28094 -35115
1951 -35115 -88290 -52063 -31146 5981 45481 -31810 -52693 -42340 6991 -88185 -62966 -42644
1939 -42644 11801 9219 -52356 -47951 -34345 6188 -28837 -78466 -142955 -154881 -127019 -142809
1927 -142809 -82775 -54192 -25930 -46279 -55097 -61590 -87656 -23199 11556 18108 -7915 -8992
1915 -8992 6168 -50111 -56564 -49786 -91448 -52108 5674 96518 42910 -104161 -24963 -34103
1903 -34103 -62397 14619 16858 -3994 -32287 -19087 7843 4101 -14778 12115 -6385 -6981 -10807
1890 -10807 -101505 -158206 -99310 -83206 -5599 -2074 -43303 -59360 -53077 -68614 -47477 -31516
1878 -31516 -58167 -1104 -37857 -8367 -8681 -4386 -10273 23316 -1601 -59012 -94842 -50179 2860
1865 2860 -19308 -72853 -125663 -63473 -85869 -111603 -70409 -38013 -38500 -22658 -24115 10793 11941
1852 11941 25268 14947 26008 -71848 -96724 -29371 -34886 -16815 48300 71631 49052 -35844
1840 -35844 -17879 -48427 -52913 20109 48981 31601 -36923 747 -29513 -31752 -53013 -45777
1828 -45777 -52796 -57681 -68035 -77515 -57083 -25333 11671 -570 9664 -41061 -77576 -67500
1816 -67500 -58726 -27897 31930 22623 -47769 -89082 -56759 -27091 -11624 24226 -14444 -51163
1804 -51163 -42927 -17978 -27983 -45046 -49124 -35520 -10237 17852 -72673 -43173 1098 -25033
1792 -25033 -55996 -32606 4398 -5971 -36408 -3879 -38592 -22545 -200 23755 25363 -31436
1780 -31436 -64977 -39748 1619 -8151 -37353 -72407 -72959 -79790 -1490 -19420 13087 -21154 -72694
1767 -72694 -39072 -5052 8953 -23639 59605 40347 -13974 -37745 -42317 -75674 -61520 -54515
1755 -54515 -33279 -37165 -51521 -29648 -45712 -12301 -35068 -37353 -30321 -16000 31594 -14224
1743 -14224 -58582 -5378 -1356 -22258 -8816 -2016 -82691 -94811 -102609 -48408 -81334 -52387
1731 -52387 -11923 15416 -26303 -42191 55267 185 -121190 -119081 -83049 -65959 -32069 -66286
1719 -66286 -49466 -134709 -142861 -54223 13292 18615 56684 82476 32491 -14542 -40001 -21566
1707 -21566 -6396 -8599 -23735 -46052 -30368 -37082 -20882 -24611 -61441 -49504 -46915 -23528 -39505
1694 -39505 -57942 -61036 -31941 -40394 -6122 29847 60221 49101 -38145 -3292 -49576 -65745
1682 -65745 8390 -20177 -66345 -41460 28179 24498 68796 102752 37908 -2054 4382 45950
1670 45950 39750 -29624 -58546 -21464 5090 -26253 -44196 -86047 -56400 -28625 3554 79547
1658 79547 56650 4059 19788 -41779 -21832 1325 -23632 6120 3217 -25346 -44586 -53675
1646 -53675 -26279 -23916 37362 -2348 -38686 -116906 -101701 -11404 -30711 -137910 -167468 -142487
1634 -142487 -64022 31428 -34648 -13055 2431 -5186 46044 10984 -14035 52296 19376 71327
1622 71327 52777 34520 62275 81207 57553 58958 16403 -3292 -4328 20799 -21968 -74172
1610 -74172 -14040 -33677 -52897 19596 30428 63777 44896 50012 14068 -34121 -47350 -9745
1598 -9745 -34686 -64564 -69976 -36378 -17863 13530 37641 16286 5753 8521 -39717 44565
1586 44565 -20246 -129812 -59244 -9800 60174 20910 -67389 -53112 -70798 -14429 -232 -72116
1574 -72116 -73158 -20036 24496 12853 19188 -62784 -98660 -114988 -65206 -76953 -79369 11967
1562 11967 45242 18343 32906 -6403 -17723 -2824 32929 6680 -12404 1990 21735 15137
1550 15137 -818 4745 -54697 -5672 49003 -51498 -39143 8708 24521 -5068 52560 54831
1538 54831 11875 -58895 -29398 50051 20514 43543 -14787 -29863 -12341 -3816 -351 -71969
1526 -71969 2034 -58249 -70240 -55093 -38835 -93266 -86352 3871 44634 -48374 -18506 -34236
1514 -34236 -45950 -32634 -56838 -96233 -120112 12830 -4158 29769 67621 45267 -24896 14003
1502 14003 56960 801 5505 61465 -73932 -54310 1693 36733 30905 -22743 -40065 -11252
1490 -11252 -25785 -15092 -10178 -63243 -78769 -51455 -39150 -98327 -95572 -62642 -58858 -48188
1478 -48188 -26589 28284 -293 30918 25561 79273 39245 6915 -16066 -4285 -18293 -48419
1466 -48419 -98788 -91534 -46820 -51478 19572 -31502 9351 28323 27491 -19351 5666 92951 41995
1453 41995 56428 75714 6406 -26680 -35950 -77889 -124617 -60710 -79244 -64361 20652 73843
1441 73843 75518 9262 37217 80343 2349 -15763 522 -28195 -37954 61750 93361 36449
1429 36449 -18503 -19296 -20798 5768 37256 -25474 38930 78262 33408 48600 35903 36498 19314
1416 19314 -7840 -14063 22886 17484 54769 12698 -47868 15333 81469 94569 54295 50201
1404 50201 -10038 -3315 121031 105392 21543 23184 -12075 361 31259 35104 21715 -23320
1392 -23320 -16393 6952 -33498 -44117 -11403 29613 14680 -75217 -77881 -65461 -53869 -3829
1380 -3829 -26231 -17427 -20333 -78691 -95644 -58860 -25444 -23504 -17387 28635 68472 18449 22388
1367 22388 45460 -5857 -32702 19987 41612 -895 -13701 23163 -12074 -56248 -8078 43423
1355 43423 68619 7993 -43180 52484 21171 -43515 -40749 -90037 -95747 -71806 -29210 -35275
1343 -35275 60594 75063 40969 57966 108729 70165 32527 38673 -7815 -61420 -51815 -63893
1331 -63893 -79241 -74349 -1493 10033 -21374 -30322 9941 31612 -27636 -20982 -34194 -91347
1319 -91347 -92608 -32610 -48739 -28735 -48171 51263 -48805 -85004 -49604 3223 70220 37608
1307 37608 29891 -44125 -7457 20189 285 -26030 19752 -25331 -14152 10829 10385 4398 -23656
1294 -23656 -42387 3143 69866 41276 1472 -45559 -74597 -61387 -54001 -20395 9380 -78118
1282 -78118 -42073 48910 79028 32739 -31881 -26425 -6886 11922 71909 33963 -13791 -50307
1270 -50307 -47886 2199 54634 13293 -87855 -18516 -57228 -57895 449 -10977 -65548 -14526
1258 -14526 47576 22234 -25711 -9102 11022 -51877 -80988 -24288 -11191 68262 128029 -10364
1246 -10364 -43280 -7662 98137 81746 46372 -35039 -33549 -11466 -28803 -53345 -40629 35170
1234 35170 28315 8603 43339 35024 -21781 -4399 53619 33212 57609 59087 -13030 -42177
1222 -42177 -38637 -101751 -51835 -22115 -50190 18541 42938 94368 88862 -5007 -36079 -14699
1210 -14699 -15880 49409 -22802 -30431 439 47445 75379 33887 15983 -42616 -13612 -35353
1198 -35353 -69838 24740 45886 -1883 -6657 48454 -5471 7908 73093 69287 47690 90252
1186 90252 44586 -31250 1777 43398 18077 17545 18597 33826 7571 4913 32937 35212 33371
1173 33371 -290 953 -43895 -61941 -28700 -43713 -32162 -7813 47731 43921 37817 992
1161 992 12240 32602 -310 7071 21055 -17266 -74796 14143 37739 1675 6190 7791 -92712
1148 -92712 -73102 -85087 -36637 -8373 2198 44068 58285 18659 -57103 -16039 37373 -25776
1136 -25776 -29512 -22960 19221 -27571 -35823 -21359 -33599 -23290 6483 70800 80809 52651
1124 52651 -7567 2152 -6771 -18486 -19193 29952 99476 76571 -32866 -76284 -38061 1752
1112 1752 -15654 -13382 -69024 -102071 -134379 -54167 -22556 -103719 -90823 -56517 -25906 -4458
1100 -4458 -24885 14034 63935 94291 114042 36597 67 20638 56960 -5745 -50698 -57374
1088 -57374 -4429 51418 41715 18119 33842 36861 -59797 -42223 -11125 52196 85633 44816
1076 44816 34872 -32664 15976 -13284 15178 22307 -34066 33435 106552 49457 29706 77447
1064 77447 -18754 -81491 -78148 -39659 -42990 -35539 -41596 -45961 -61847 -42884 -49924 9395 32565
1051 32565 43968 44726 195 -37839 -79131 -83955 -26544 32836 71620 56298 25725 -56231
1039 -56231 -23109 -29172 42096 50240 -15251 -2015 26074 66175 8697 9969 34058 -13274
1027 -13274 48774 42480 -4077 -33035 -42237 34761 10918 -4996 1461 30163 11865 29599
1015 29599 51874 56619 -14508 60295 15015 25158 19795 65520 58801 -16608 67181 67278 71938
1002 71938 37144 -535 25607 59731 74423 420 -60074 -46386 -43857 -34865 -63178 6474
990 6474 45360 28707 756 62032 35850 20332 4047 28763 40600 29291 54129 12921
978 12921 38002 32418 50485 16776 56281 11901 3636 -4476 -45622 25424 33770 14087 50831
965 50831 -24328 -43770 -29910 20643 20404 28376 36270 15525 17761 31341 48208 32501 2497
952 2497 52897 65810 29040 24653 28588 -14515 -18123 24231 -19372 23237 16929 37471 112275
939 112275 63275 57218 18176 7883 46338 20013 2456 -23274 4219 52879 -30264 -38417
927 -38417 18530 1853 -16858 665 37466 28405 60537 12343 65749 69472 71024 108144 79239
914 79239 60243 88078 92951 77793 53598 23782 91098 71629 72623 86472 52415 68437 5248
901 5248 -38561 -35386 -21352 8487 -39042 -21954 16612 7905 -38760 -17498 32260 26579 59263
888 59263 76196 87466 22529 76695 15971 -68428 -101175 -73707 -18692 23742 62493 52992
876 52992 52810 56002 21671 13210 -11261 48131 106269 121071 93427 54252 4201 47797 29099
863 29099 64128 35780 19126 46476 -20137 -4530 29459 50319 99655 49621 -18643 -5274
851 -5274 9548 58888 31081 18457 16484 -17982 31723 56268 -7563 25930 47969 14032
839 14032 -18144 -37886 53777 106349 66284 14073 12783 5553 -27961 -11146 -9585 -4294 -79733
826 -79733 -965 36159 17311 37660 12401 -21918 24378 59678 112338 16259 -71750 -50314
814 -50314 1679 47464 73120 32902 -11444 -23459 23302 29138 -10753 -71461 -68781 -38659
802 -38659 -62296 -3963 62690 82649 63376 16287 -1966 -31848 -2658 -54356 -81667 -23035
790 -23035 24224 -14608 114881 124849 42491 14514 15408 8756 33661 38172 -16865 29389 10628
777 10628 75269 87627 48396 23193 41287 56017 51598 67062 87412 14839 -18585 23616
765 23616 11106 9346 16581 -40556 -50709 -89460 -3931 53421 48173 56045 -22593 -25930 -70625
752 -70625 22989 82002 72114 68326 -5684 -12456 -34453 -18868 74547 20770 27036 32209 95829
739 95829 133358 104219 91467 58916 40440 52968 6584 -28759 -8784 -28532 -63940 -15900
727 -15900 -1437 -15237 -31 -4882 56524 32303 75711 -9758 -67182 -85833 -63277 -82274
715 -82274 -11736 -26553 30831 33548 37211 4945 -24006 18882 -12404 -26137 -25865 17836 -1602
702 -1602 -39398 -16712 34057 21275 5684 4751 -18417 33936 45550 108984 93952 71120 83523
689 83523 154239 130924 51004 114915 121734 103792 76842 8483 -35653 1507 18909 23750
677 23750 17779 -10437 68692 93029 46795 42755 45527 66896 52583 50584 -2911 -15835 36965
664 36965 102811 67681 -32350 -16861 39994 64842 16125 2087 58055 24269 8414 46348
652 46348 28415 52633 4353 30766 16724 42998 43602 -3399 56591 8160 20958 27069 74625
639 74625 19957 -3676 10484 36405 2013 64592 19034 12180 63887 19073 6931 36873
627 36873 7037 -21441 27054 -23843 -23300 14395 19329 9909 77493 124271 63908 106359 50243
614 50243 -34847 21388 122795 56170 5306 46533 62752 26731 3555 16076 70627 35971
602 35971 -6795 20144 30586 -44439 -56062 -48727 -4353 3960 -15554 5378 -41380 -33289 28835
589 28835 -1513 -5198 -43431 -72143 -54439 -18445 70196 41866 18273 67851 122093 79193
577 79193 60916 50930 -39741 -83213 -34110 -2593 36500 50072 46767 69126 49282 14977
565 14977 3106 7253 91009 67129 45245 72297 41386 -18870 -42887 -30325 17389 23767
553 23767 -25083 6176 46501 -31838 -131741 -79813 -9391 -32316 -14512 -13707 721 -12647
541 -12647 49257 41000 15830 -35302 -50766 -16691 45330 -17613 -7333 -21015 -18245 -16181 -29610
528 -29610 -18339 -23999 -49348 -5051 3975 40203 131570 62170 54487 16778 16912 23280 28689
515 28689 43232 80946 54247 -14055 19021 13223 -9758 88633 70908 25102 28144 5698
503 5698 -2044 7499 75829 66963 -11602 5702 35823 -32877 -49813 -22183 9060 12735 29309
490 29309 28696 30637 31031 72880 59474 17915 27094 -9132 18255 -28176 -43447 -2158 35886
477 35886 32579 32643 43151 54596 60416 -76 -29483 62701 153449 188781 132822 63667 92477
464 92477 100987 30834 24885 14262 24554 55258 33592 -32203 -19199 47901 57408 13197 16027
451 16027 85391 121414 34560 -4199 -23086 -18524 -28410 -13182 -27491 64206 65627 6812 -27196
438 -27196 1456 65989 53088 -1847 -38135 -4993 27445 17888 -3093 11554 13395 25333
426 25333 95419 69044 30224 30257 -26365 7075 15696 -8067 -28082 -8102 41520 75713 76032
413 76032 47711 23002 27102 59579 66737 18950 21949 -18944 -33510 -36431 -12207 -20999 -3203
400 -3203 56287 35185 12841 29891 57004 74416 33624 35517 30836 46074 49160 59815 60119
387 60119 17361 -9715 13896 35713 69405 55649 42913 52275 97914 138061 107834 103659
375 103659 45118 76530 151290 84022 16067 725 54626 85686 83875 76310 47827 20186
363 20186 27975 74814 104749 60029 40659 -8373 11983 47917 30162 19068 17029 120060
351 120060 143195 15568 40110 33095 29184 42569 4206 -9065 -18190 4820 2906 24623
339 24623 74702 128811 88633 32295 52228 17467 41078 82985 75913 69452 1721 -10517
327 -10517 -21831 -11833 -61989 6083 10338 -43430 -1803 8809 47809 79892 70778 -33966
315 -33966 -14041 -43519 -59469 -33609 18769 14498 13343 74400 70894 46736 -15684 -24000 45119
302 45119 46556 8373 52449 28840 36727 87969 84939 -14032 28435 15061 55523 60982 47085
289 47085 50220 38279 10867 128388 57877 30798 36469 6247 37407 -15859 21853 54613
277 54613 7392 37593 33094 66917 130911 97020 11591 35999 26877 32967 25272 80411 120867
264 120867 51518 97987 66740 5021 -28131 -21693 8281 -23051 -24717 40518 14926 62013
252 62013 50062 91689 89023 92184 37629 10340 25706 42522 9109 44588 64659 69847 38836
239 38836 22608 742 29793 87501 -49170 9047 55070 70875 69534 66684 79139 77203
227 77203 60551 77995 78944 28724 80162 1194 45021 92196 59436 67462 85829 41237 21513
214 21513 -32855 -28495 15160 6700 67988 70564 36441 52504 30513 71194 71044 45270 27082
201 27082 40813 56661 42885 37405 64895 164229 130916 9315 -42460 -23690 62479 108250
189 108250 63835 27145 27598 6767 71261 80882 49118 49078 55325 57146 40658 45988 41250 77411
175 77411 138331 128028 51216 66013 40757 -3793 -7921 29591 44217 -2665 -52894 16832
163 16832 62923 28788 37034 -29156 -55148 5310 80489 100312 52656 52001 53189 -8880 -7009
150 -7009 53454 79288 44543 5731 63927 52869 66327 64660 89313 71482 85703 58155
138 58155 -7718 -8370 31084 61075 38336 22575 10116 -20575 -24089 -13107 2411 25445 63271
125 63271 32281 48058 79452 103327 72941 -22157 3487 33539 87121 63689 30345 -4061
113 -4061 14455 6077 -20584 41678 22600 -7217 18763 79721 53988 7988 44937 32020
101 32020 76629 88743 91921 73614 43606 64511 67643 78013 65620 31039 -16272 -8246 72812
88 72812 71452 52866 45734 33487 45511 66123 56930 5286 43870 29024 2529 30085 78479
75 78479 63332 64770 41574 33291 10057 13239 55754 62844 86662 86681 92627 80490 77349 72346
61 72346 59683 63956 6092 -2226 23359 45911 40380 49311 38319 22625 63181 43848 55789
48 55789 46016 74944 78177 100078 35976 -13586 31674 49764 41635 -18777 -5972 31140 88695
35 88695 83652 72961 78253 79326 44828 8081 -25397 -33855 25783 60915 43183 33567 36991
22 36991 27927 19515 26383 65270 43298 52473 89304 85052 66208 71356 -5543 24954 25023 10676
8 10676 90983 68156 79110 58289 79329 56069 20194 -5641
0 -5641
$$ Imaginary data points
##PAGE= N=2
##DATA TABLE= (X++(I..I)), XYDATA
16383 -946697 -918526 -841778 -859872 -909666 -891515 -870656 -844093 -833202 -816136 -841283 -787347
16372 -787347 -735904 -736824 -720080 -712570 -713654 -709953 -684500 -650950 -649573 -640887 -631262 -617058 -582966
$$ [...]
##END NTUPLES=NMR SPECTRUM
##END=
