##TITLE=1H_DE-80H_X3
 200.13MHz, d2o
 8 sc
 
 19ns.26.2.2025
##JCAMPDX= 6.0         $$ Bruker NMR JCAMP-DX V2.0
##DATA TYPE= NMR SPECTRUM
##DATA CLASS= NTUPLES
##ORIGIN= UXNMR, Bruker Analytische Messtechnik GmbH
##OWNER= pz
$$ XWIN-NMR		Version 3.5
$$ Tue Jun 17 15:06:29 2025 Russian Standard Time (UT+4h)  Yarkov@DPX200
##.OBSERVE FREQUENCY= 200.1313
##.OBSERVE NUCLEUS= ^1H
##.ACQUISITION MODE= SIMULTANEOUS
##.ACQUISITION SCHEME= undefined
##.AVERAGES= 8
##.DIGITISER RES= 18
##SPECTROMETER/DATA SYSTEM= spect
##.PULSE SEQUENCE= zg30
##.SOLVENT NAME= DMSO
##.SHIFT REFERENCE= (INTERNAL, DMSO, 0, 15.5199)
##AUDIT TRAIL= $$ (NUMBER, WHEN, WHO, WHERE, WHAT)
$$ ##TITLE= Audit trail, XWIN-NMR		Version 3.5
$$ ##JCAMPDX= 5.01
$$ ##ORIGIN= Bruker BioSpin GmbH
$$ ##OWNER= Yarkov
$$ C:/Bruker/XWIN-NMR/data/yarkov2/nmr/H-C/1/pdata/1/auditp.txt
$$ ##AUDIT TRAIL=  $$ (NUMBER, WHEN, WHO, WHERE, WHAT)
(   1,<2025-06-17 15:05:17.57 +0400>,<Yarkov>,<DPX200>,
      <created by zg, POWCHK disabled, PULCHK disabled
       configuration hash MD5:
       00 E9 B6 7A A2 85 ED C7 34 08 36 98 17 FE 4E 26
       data hash MD5: 16K
       FE 09 29 2B CC 92 BA C4 CF 89 4C CC 00 57 40 43>)
(   2,<2025-06-17 15:05:38.06 +0400>,<Yarkov>,<DPX200>,
      <Start of raw data processing
       efp BC_mod = 2 LB = 0.25 FT_mod = 6 PKNL = 1 PHC0 = -1709.234 PHC1 = -1.633423 SI = 16K 
       data hash MD5: 16K
       C0 D6 FC 11 08 FC 36 68 FE 23 E0 A0 FF 83 A4 4B>)
$$ ##END=
$$ 
$$ hash MD5
$$ 1A 94 24 C1 C7 87 39 83 C6 55 96 AE F1 53 39 9C
##$RELAX= 
##$RELAX= 
##$RELAX= 
##$RELAX= 
##$RELAX= 
##$RELAX= 
$$ Bruker specific parameters
$$ --------------------------
##$DU= <C:/Bruker/XWIN-NMR>
##$EXPNO= 1
##$NAME= <H-C>
##$PROCNO= 1
##$TYPE= <nmr>
##$USER= <yarkov2>
##$AMP= (0..31)
100 100 100 100 100 100 100 100 100 100 100 100 100 100 100 100 100 100 
100 100 100 100 100 100 100 100 100 100 100 100 100 100 
##$AQSEQ= 0
##$AQ_mod= 1
##$AUNM= <au_zg>
##$AUTOPOS= <>
##$BF1= 200.13
##$BF2= 200.13
##$BF3= 200.13
##$BF4= 200.13
##$BF5= 200.13
##$BF6= 200.13
##$BF7= 200.13
##$BF8= 200.13
##$BYTORDA= 1
##$CFDGTYP= 0
##$CFRGTYP= 5
##$CHEMSTR= <none>
##$CNST= (0..31)
1 1 145 1 1 1 1 1 1 1 1 1 1 1 1 1 1 1 1 1 1 1 1 1 1 1 1 1 1 1 1 1 
##$CPDPRG= <>
##$CPDPRG1= <>
##$CPDPRG2= <>
##$CPDPRG3= <>
##$CPDPRG4= <mlev>
##$CPDPRG5= <mlev>
##$CPDPRG6= <mlev>
##$CPDPRG7= <mlev>
##$CPDPRG8= <mlev>
##$CPDPRGB= <>
##$CPDPRGT= <>
##$D= (0..31)
0 0.7 0 0 0 0 0 0 0 0 0 0.03 0 0 0 0 0 0 0 0 0 0 0 0 0 0 0 0 0 0 0 0 
##$DATE= 1750158317
##$DBL= (0..7)
120 120 120 120 120 120 120 120 
##$DBP= (0..7)
150 150 150 150 150 150 150 150 
##$DBP07= 0
##$DBPNAM0= <>
##$DBPNAM1= <>
##$DBPNAM2= <>
##$DBPNAM3= <>
##$DBPNAM4= <>
##$DBPNAM5= <>
##$DBPNAM6= <>
##$DBPNAM7= <>
##$DBPOAL= (0..7)
0.5 0.5 0.5 0.5 0.5 0.5 0.5 0.5 
##$DBPOFFS= (0..7)
0 0 0 0 0 0 0 0 
##$DE= 6
##$DECBNUC= <off>
##$DECIM= 32
##$DECNUC= <off>
##$DECSTAT= 4
##$DIGMOD= 1
##$DIGTYP= 9
##$DL= (0..7)
0 120 120 120 120 120 120 120 
##$DP= (0..7)
$$ [...]
##$SUBNAM2= <"">
##$SUBNAM3= <"">
##$SUBNAM4= <"">
##$SUBNAM5= <"">
##$SUBNAM6= <"">
##$SUBNAM7= <"">
##$SUBNAM8= <"">
##$SUBNAM9= <"">
##$SW= 18.0517328524113
##$SWIBOX= (0..15)
0 0 2 0 0 0 0 0 0 0 0 0 0 0 0 0 
##$SW_h= 3612.71676300578
##$TD= 16384
##$TD0= 1
##$TE= 0
##$TE2= 300
##$TE3= 300
##$TEG= 300
##$TL= (0..7)
0 120 120 120 120 120 120 120 
##$TP= (0..7)
150 150 150 150 150 150 150 150 
##$TP07= 0
##$TPNAME0= <>
##$TPNAME1= <>
##$TPNAME2= <>
##$TPNAME3= <>
##$TPNAME4= <>
##$TPNAME5= <>
##$TPNAME6= <>
##$TPNAME7= <>
##$TPOAL= (0..7)
0.5 0.5 0.5 0.5 0.5 0.5 0.5 0.5 
##$TPOFFS= (0..7)
0 0 0 0 0 0 0 0 
##$TUNHIN= 0
##$TUNHOUT= 0
##$TUNXOUT= 0
##$USERA1= <user>
##$USERA2= <user>
##$USERA3= <user>
##$USERA4= <user>
##$USERA5= <user>
##$V9= 5
##$VALIST= <valist>
##$VCLIST= <CCCCCCCCCCCCCCC>
##$VD= 0
##$VDLIST= <DDDDDDDDDDDDDDD>
##$VPLIST= <PPPPPPPPPPPPPPP>
##$VTLIST= <TTTTTTTTTTTTTTT>
##$WBST= 1024
##$WBSW= 4
##$XGAIN= (0..3)
0 0 0 0 
##$XL= 0
##$YL= 0
##$YMAX_a= 202035
##$YMIN_a= -170244
##$ZGOPTNS= <>
##$ZL1= 120
##$ZL2= 120
##$ZL3= 120
##$ZL4= 120
##$ABSF1= 0
##$ABSF2= 0
##$ABSG= 0
##$ABSL= 0
##$ALPHA= 0
##$AQORDER= 0
##$ASSFAC= 0
##$ASSFACI= 0
##$ASSFACX= 0
##$ASSWID= 0
##$AUNMP= <proc_1d>
##$AZFE= 0.1
##$AZFW= 0.1
##$BCFW= 0
##$BC_mod= 2
##$BYTORDP= 0
##$COROFFS= 0
##$CY= -3
##$DATMOD= 1
##$DC= 0
##$DFILT= <>
##$DTYPP= 0
##$F1P= 0
##$F2P= 0
##$FCOR= 1
##$FTSIZE= 16384
##$FT_mod= 6
##$GAMMA= 0
##$GB= 0
##$INTBC= 1
##$INTSCL= 3.241238e-09
##$ISEN= 128
##$LB= 0.25
##$LEV0= 0
##$LPBIN= 0
##$MAXI= 10000
##$MC2= 0
##$MEAN= 0
##$ME_mod= 0
##$MI= 1.114404
##$NCOEF= 0
##$NC_proc= -8
##$NLEV= 6
##$NOISF1= 3.799351
##$NOISF2= 2.8
##$NSP= 0
##$NTH_PI= 0
##$NZP= 0
##$OFFSET= 15.51992
##$PC= 1
##$PHC0= -1709.234
##$PHC1= -1.633423
##$PH_mod= 1
##$PKNL= yes
##$PPARMOD= 0
##$PSCAL= 0
##$PSIGN= 0
##$REVERSE= no
##$SF= 200.130000356881
##$SI= 16384
##$SIGF1= 3
##$SIGF2= 2
##$SINO= 0.751879
##$SIOLD= 32768
##$SREGLST= <19F.Aceton>
##$SSB= 0
##$STSI= 16384
##$STSR= 0
##$SW_p= 3612.71676300578
##$SYMM= 0
##$S_DEV= 0
##$TDeff= 16384
##$TDoff= 0
##$TI= <>
##$TILT= no
##$TM1= 0
##$TM2= 0
##$TOPLEV= 0
##$USERP1= <user>
##$USERP2= <user>
##$USERP3= <user>
##$USERP4= <user>
##$USERP5= <user>
##$WDW= 1
##$XDIM= 16384
##$YMAX_p= 476273829
##$YMIN_p= -1160924
$$ End of Bruker specific parameters
$$ ---------------------------------
##NTUPLES= NMR SPECTRUM
##VAR_NAME=  FREQUENCY,     SPECTRUM/REAL,   SPECTRUM/IMAG
##SYMBOL=    X,             R,               I
##VAR_TYPE=  INDEPENDENT,   DEPENDENT,       DEPENDENT
##VAR_FORM=  AFFN,          ASDF,            ASDF
##VAR_DIM=   16384,         16384,           16384
##UNITS=     HZ,            ARBITRARY UNITS, ARBITRARY UNITS
##FACTOR=    0.220516191357247, 1,           1
##FIRST=     3106.00166500837, 0,            0
##LAST=      -506.715097997411, 0,           0
##MIN=       -506.715097997411, -1160924,    0
##MAX=       3106.00166500837, 476273829,    0
$$ Real data points
##PAGE= N=1
##DATA TABLE= (X++(R..R)), XYDATA
$$ [...]
7937 7275366 7272793 7256226 7248563 7254961 7144898 7249307 7179501 7165249 7416362 7417774 7305687
7926 7305687 7245636 7157605 7262308 7290431 7239207 7239608 7228485 7229889 7137253 7172680 7310290 7385710
7914 7385710 7331058 7285328 7273838 7231677 7337873 7321979 7269222 7209113 7167791 7343628 7419874
7903 7419874 7394542 7362379 7225665 7339006 7247884 7312024 7260800 7196919 7285299 7155186 7186992
7892 7186992 7228217 7467621 7487762 7408961 7391167 7316725 7319145 7270688 7362087 7425911 7375001
7881 7375001 7276884 7300457 7375927 7371012 7385699 7422047 7381848 7369577 7372124 7395755 7295294 7335097
7869 7335097 7390691 7364657 7349366 7392436 7476709 7443325 7505866 7412034 7321497 7356219 7431392
7858 7431392 7404477 7336626 7405918 7484374 7452782 7469009 7293318 7499231 7502421 7378883 7341140
7847 7341140 7357222 7338486 7244294 7269282 7283086 7401339 7311182 7392998 7316565 7249137 7324478
7836 7324478 7416036 7442808 7447353 7354365 7319235 7410786 7452405 7415189 7345941 7431920 7406587 7417371
7824 7417371 7459978 7536151 7494652 7392423 7341404 7528317 7433952 7501359 7466145 7370244 7360322
7813 7360322 7443952 7352706 7296918 7290433 7371167 7281739 7310681 7352226 7418106 7486658 7451209 7365987
7801 7365987 7934265 8702079 7725365 7351195 7410872 7541496 7382012 7399064 7359710 7374572
7791 7374572 7401020 7324313 7445249 7495346 7582643 7570621 7644088 7717675 7569587 7580664 7457787
7780 7457787 7542222 7467450 7428732 7396810 7338219 7424657 7447102 7424565 7465672 7419117 7294879
7769 7294879 7330749 7401225 7551685 7509701 7493250 7459306 7403837 7355125 7390152 7323528 7500416
7758 7500416 7519600 7473541 7460626 7580127 7535647 7481472 7504954 7611642 7629578 7468403 7431972
7747 7431972 7495976 7562032 7514834 7445774 7538030 7505810 7514424 7481014 7585483 7544149 7474552
7736 7474552 7330263 7363926 7437081 7432968 7540914 7471598 7491980 7562408 7507783 7466454 7460138
7725 7460138 7434060 7398448 7464719 7503549 7450532 7504362 7469278 7513812 7542620 7608049 7633672
7714 7633672 7710363 7614143 7556104 7643083 7535949 7499276 7627804 7611718 7721251 7728398 7638780
7703 7638780 7626525 7627074 7524710 7418910 7496575 7529194 7559006 7603532 7553319 7613624 7620707 7477573
7691 7477573 7564708 7685747 7625787 7628916 7558723 7423846 7648953 7652134 7643984 7618046 7583676
7680 7583676 7598318 7674457 7685047 7559778 7531840 7489120 7626841 7622513 7647757 7598404 7676340
7669 7676340 7677099 7638954 7691294 7601397 7555440 7663374 7642014 7590429 7622535 7457070 7380767
7658 7380767 7399700 7507784 7564102 7528480 7688203 7803604 7770491 7728159 7726080 7645293 7558691
7647 7558691 7508875 7564057 7725851 7752913 7702328 7633550 7660421 7619286 7577882 7725872 7771269
7636 7771269 7791590 7714414 7755280 7782080 7750021 7855248 7827343 7730078 7621473 7520642 7481859
7625 7481859 7486459 7522485 7590458 7755204 7669791 7632337 7670062 7520429 7562607 7499384 7492725
7614 7492725 7492357 7546502 7640583 7562573 7594301 7606800 7633578 7560378 7503408 7587146 7588120 7649703
7602 7649703 7598400 7690043 7680248 7694928 7695294 7677944 7681733 7679485 7638627 7685435 7686144 7557295 7606203
7589 7606203 7565903 7664400 7715949 7657649 7514529 7624916 7723348 7804158 7794638 7721449 7730228
7578 7730228 7675909 7583122 7641624 7665916 7748441 7848608 7779406 7661155 7691056 7738535 7753056
7567 7753056 7766520 7688422 7854068 7946092 7853903 7730849 7825724 7793930 7743505 7880324 8041885
7556 8041885 8130413 8098261 8071896 8008109 7985859 8071608 8202155 8165308 8218113 8249883 8186184
7545 8186184 8169494 8277951 8239625 8039225 8092287 8156033 8190259 8131702 8029983 7766953 7811845
7534 7811845 7925818 7904909 7777779 7862878 7975295 7794413 7664970 7620506 7642504 7741674
7524 7741674 7795048 7801998 7849975 7819858 7820499 7798880 7716351 7786817 7612789 7721183 7694869 7675891
7512 7675891 7721425 7716491 7809299 7825280 7852888 7855197 7807323 7628070 7625318 7558540 7529763 7648435
7500 7648435 7649390 7615629 7639719 7576936 7639490 7589466 7555958 7685501 7642513 7612708 7661617 7561094
7488 7561094 7669791 7644285 7659317 7693785 7806115 7717111 7608179 7592551 7476330 7594563
7478 7594563 7698451 7748832 7559481 7511789 7551129 7629735 7564912 7568167 7810521 7781437 7790381
7467 7790381 7671280 7667983 7654315 7540337 7488493 7531899 7624379 7645588 7637969 7554370 7489446
7456 7489446 7557368 7493795 7537705 7568032 7624902 7725299 7709213 7515288 7568362 7813216 7712466
7445 7712466 7709652 7652559 7624937 7683242 7806357 7805942 7696308 7744710 7662038 7503419 7585855
7434 7585855 7737141 7786517 7765891 7724572 7729780 7703549 7638796 7605898 7548172 7547033 7589423 7600504
7422 7600504 7552484 7585225 7559076 7551743 7660359 7584018 7516467 7617669 7653717 7716643 7817905
7411 7817905 7771068 7868811 7793791 7699232 7621533 7540337 7627172 7571666 7722455 7774375 7874681
7400 7874681 7870753 7823215 7761410 7775612 7849631 7783806 7704185 7630553 7575784 7634540 7649612 7599248
7388 7599248 7485987 7388274 7576925 7585602 7669540 7785349 7904902 7822566 7772259 7742623 7632202
7377 7632202 7565449 7472031 7353068 7516047 7438422 7515163 7599569 7527149 7602315 7547887 7558076
7366 7558076 7551484 7500207 7674611 7746167 7610118 7467122 7456565 7601985 7546624 7702420 7770953
7355 7770953 7766191 7796467 7606313 7470503 7582358 7691030 7627377 7620981 7585488 7411813 7472826
7344 7472826 7556505 7596236 7671653 7512981 7415615 7453574 7519785 7659072 7555903 7462344 7407032
7333 7407032 7525828 7612246 7776478 7611388 7508777 7562297 7606532 7599421 7668041 7437927 7367465
7322 7367465 7507721 7460945 7330027 7392898 7457931 7529924 7660905 7584840 7617803 7557897 7606747
7311 7606747 7570601 7484160 7484773 7444617 7485270 7578959 7592660 7489292 7508645 7572057 7572793 7521212
7299 7521212 7513508 7633347 7577492 7590190 7622263 7618498 7520060 7547090 7480208 7469913 7422383 7461606
7287 7461606 7443184 7506519 7537916 7406613 7305342 7333095 7332165 7329272 7358535 7463198 7580056
7276 7580056 7437043 7395562 7300811 7322395 7390032 7385055 7290051 7428658 7467026 7361954 7470613
7265 7470613 7529705 7552528 7482080 7489424 7582181 7565790 7399451 7386610 7378673 7369341 7379094 7497176
7253 7497176 7629978 7572310 7374228 7408726 7437634 7356268 7424730 7548135 7409223 7371717 7346436
7242 7346436 7239774 7329324 7505664 7471213 7352688 7368603 7374996 7415186 7484278 7536575 7542595
7231 7542595 7474925 7482925 7462299 7485789 7439705 7405543 7333863 7221873 7347301 7341429 7505424
7220 7505424 7434879 7399041 7419020 7370318 7388441 7308260 7409685 7481422 7426222 7441397 7382573
7209 7382573 7316295 7211779 7132668 7232814 7318085 7367379 7416533 7410194 7338796 7323999 7367558
7198 7367558 7454346 7388949 7320026 7307810 7219555 7245969 7253700 7366381 7374776 7434767 7380015 7326858
7186 7326858 7346076 7309787 7317370 7409120 7369996 7263849 7188505 7258081 7305632 7364063 7413359
7175 7413359 7411181 7319610 7331964 7282610 7332672 7425052 7384783 7427292 7362354 7191741 7239378
7164 7239378 7349279 7480296 7483072 7425557 7306604 7100846 7295949 7346420 7395239 7362930 7371575
7153 7371575 7337451 7268215 7302020 7350589 7200805 7278091 7340231 7410625 7351786 7284958 7312432
7142 7312432 7200471 7192995 7295928 7323728 7333132 7285627 7245529 7310681 7355639 7204873 7295715
7131 7295715 7218767 7107182 7297305 7312472 7269291 7271097 7377879 7240440 7140814 7161191 7224809
7120 7224809 7391557 7378639 7261479 7385152 7228755 7176882 7278097 7173381 7291057 7221542
7110 7221542 7228925 7237304 7184759 7167173 6966674 7082960 7280493 7198212 7057760 7156965 7133544
7099 7133544 7174548 7218650 7091666 7150339 7116326 7094456 7168947 7262996 7318696 7243692 7200011
7088 7200011 7124699 7237822 7248555 7153262 7163609 7178805 7185633 7459583 7337869 7286842 7240726
7077 7240726 7103648 7161322 7118535 7145724 7238154 7375634 7205747 7150076 7153343 7188717 7209923
7066 7209923 7157123 7212960 7355444 7234570 7066749 7081868 7080058 7178718 7163903 7129565 7159761
7055 7159761 7090302 7178560 7093058 7021925 7018355 7025879 7209339 7251079 7314123 7293439 7209536 7122328
7043 7122328 7166424 7176772 7172739 7167363 7136106 7079421 7260023 7364232 7224610 7137211 7110896
7032 7110896 7153000 7021948 7087664 7066649 7057428 7021572 6903802 6909581 7024241 7079351 7049965
7021 7049965 6946890 6898902 6995694 7147937 7108857 7111784 7074462 7101719 7165774 7125517 7137946
7010 7137946 7145734 7089264 7021019 7065021 6995159 6969999 7013570 7024473 7079448 7050707 7117113 7083521
6998 7083521 6972396 6973929 7117381 7076596 7019104 6983476 6964582 7065934 7055089 7078953 7067052
6987 7067052 7092886 7027599 6968644 6890965 6982482 7020267 6996259 7004288 6986411 7013042 7000731 6963637
6975 6963637 6949219 6950217 6986254 6920634 7051885 7120290 7088093 7058019 6973938 6881422 6903688 6933437
6963 6933437 6816725 7036252 7058307 6884460 6961602 7093813 7014629 6879639 6912527 6972259
6953 6972259 6977567 6866109 6847023 6950459 7039023 6961916 6946391 6943777 6851478 6721128 6785800
6942 6785800 6749167 6801716 6927304 6905659 6800211 6909437 6934898 6925818 6877932 6916477 7021799
6931 7021799 7009129 6980792 6952787 6976233 6974088 6948698 6900232 6865678 6814880 6721912 6855825
6920 6855825 6873618 6759751 6722169 6798364 6906533 6803727 6935035 6750736 6928664 7008566
6910 7008566 6895257 6835480 6811402 6768033 6698879 6764137 6813378 6876986 6874307 6807385 6771161
6899 6771161 6669202 6774763 6764876 6830882 6740677 6800627 6830909 6763567 6756549 6869797 6809582
6888 6809582 6793104 6748694 6597029 6670715 6584177 6717579 6625030 6669124 6727967 6740062 6830065
6877 6830065 6907016 6854540 6718796 6672283 6791231 6797608 6709131 6707013 6687087 6708702 6677077
6866 6677077 6794956 6778104 6838458 6868228 6838977 6880701 6953136 6854775 6753970 6721718 6661435
6855 6661435 6651488 6664074 6694931 6775358 6822048 6719071 6807504 6816605 6705257 6619311 6692403
6844 6692403 6672508 6607153 6556113 6577180 6621967 6705628 6691854 6650977 6647998 6686110 6608155 6615718
6832 6615718 6608149 6576083 6596888 6596706 6572908 6691923 6758120 6638398 6581411 6522372 6549359 6582004
6820 6582004 6574361 6606008 6622736 6672228 6727692 6617568 6574163 6684727 6656026 6604372 6583466
6809 6583466 6597675 6553720 6443636 6645031 6711207 6699988 6620531 6362821 6411029 6497823 6473617
6798 6473617 6568858 6723041 6665763 6681051 6614710 6482499 6442307 6504420 6478357 6564133 6624948
6787 6624948 6706687 6550763 6469964 6492395 6476706 6478963 6535650 6472554 6451451 6504008 6606731
6776 6606731 6536062 6477027 6661191 6667941 6584578 6519960 6455564 6396413 6368613 6427765 6527520
6765 6527520 6432326 6406472 6380728 6495109 6424861 6511751 6485624 6469095 6483124 6537012 6412619
6754 6412619 6355990 6453144 6521321 6326549 6425388 6580799 6545945 6480082 6560456 6420256 6358447
6743 6358447 6503707 6416860 6520820 6585364 6527550 6426915 6381460 6263719 6388090 6346280
6733 6346280 6437953 6369010 6312504 6333892 6367677 6467319 6419509 6472343 6483063 6442538 6353959
6722 6353959 6476245 6287884 6299695 6362445 6279490 6181066 6196405 6406484 6269966 6355939 6401799
6711 6401799 6424031 6318406 6229295 6351123 6263424 6244683 6270954 6347740 6395312 6487425 6462714
6700 6462714 6327129 6331655 6275164 6184154 6302683 6318124 6354805 6289035 6286298 6269162 6175055
6689 6175055 6190796 6068316 6009444 6186926 6163814 6105781 6075167 6145181 6204940 6164751 6107589
6678 6107589 5978289 6095287 6260806 6258462 6236674 6269242 6306295 6175876 6225348 6253155 6216262
6667 6216262 6213202 6128871 6187202 6150839 6159619 6067346 6079773 5976352 6104642 6223190 6127782
6656 6127782 6161088 6116698 6103026 6171274 6270004 6271452 6255286 6287882 6239341 6350076 6269782
6645 6269782 6187124 6236761 6133887 6000448 6003378 5958795 6016306 6024570 6096678 6202211 6226993
6634 6226993 6182950 6141424 6008814 5986173 5997346 6010445 6068255 6089155 6038303 5973047 6087136
6623 6087136 6105377 6157428 6101774 6051401 6100898 6072449 6044700 6169653 6169585 6157384 6048816 5995745
6611 5995745 6074249 6215405 6039700 6024219 6070601 5971729 5985729 5978394 5953753 5940659 6076390
6600 6076390 6190891 6326899 6164647 6195936 6166463 6090062 6142258 6071567 6078972 6055921 6060056
6589 6060056 5989910 6000871 6033941 6002156 5981496 6028624 6041308 5962687 5952905 6018175 6111904 6062413
6577 6062413 5991744 6067545 6026542 5854080 5979297 6013807 5831095 5793390 5863402 5890950 5961443
6566 5961443 6023906 6012520 5926141 5805846 5710686 5683580 5661880 5751264 5658287 5669245 5729404
6555 5729404 5712836 5752462 5803987 5784634 5773729 5791737 5831873 5853188 5878850 5857779 5823405
6544 5823405 5736083 5662464 5734221 5841391 5817366 5843075 5743216 5633941 5654561 5668289 5749033
6533 5749033 5777983 5728458 5772065 5745639 5558879 5739287 5683085 5649792 5606922 5572350 5702764
6522 5702764 5718939 5839310 5878924 5739195 5733036 5638232 5704583 5723533 5855418 5881255 5748300
6511 5748300 5636947 5766591 5789578 5751186 5753589 5765742 5817457 5787056 5654810 5750909 5685986
6500 5685986 5732746 5753265 5585683 5633593 5721075 5597168 5595058 5554430 5560289 5681030 5671010
6489 5671010 5690482 5583012 5620417 5676989 5758361 5811966 5762378 5695870 5599497 5610023 5580203
6478 5580203 5529600 5637071 5718543 5687695 5597437 5531386 5504802 5485372 5559465 5447067 5446922
6467 5446922 5477870 5521519 5595397 5652049 5688917 5667797 5706868 5684996 5544911 5411472 5556032
6456 5556032 5555531 5578776 5408135 5416320 5523631 5499613 5443294 5473831 5402828 5365048 5246205
6445 5246205 5265635 5368988 5385910 5469153 5508690 5448900 5450366 5316976 5310694 5482654 5525283
6434 5525283 5511910 5319833 5225745 5450116 5372533 5487913 5485756 5502507 5543327 5608191 5599732
6423 5599732 5407919 5535383 5490605 5383223 5342751 5374435 5542319 5568875 5485392 5504609 5648043
6412 5648043 5544399 5389168 5443141 5417930 5337629 5271262 5181295 5295195 5476500 5553527 5621855
6401 5621855 5468129 5405559 5422783 5309896 5325747 5318912 5276692 5386890 5413102 5398058 5468418
6390 5468418 5407401 5256891 5428839 5489793 5410153 5331443 5401753 5326279 5235459 5332037 5252336
6379 5252336 5185433 5345236 5279554 5197480 5192916 5279151 5402479 5265616 5162924 5274483 5268523
6368 5268523 5275158 5265550 5263162 5177120 5189283 5194725 5377691 5412353 5308603 5330717 5240589 5330859
6356 5330859 5306169 5169868 4974583 5204018 5280046 5332851 5354537 5228929 5175396 5265982 5272182
6345 5272182 5257133 5178523 5056514 5075256 5087991 5219140 5151038 5172581 5170317 5026424 4923824
6334 4923824 4895389 5119785 5092794 5043872 5176515 5251451 5268599 5222210 5203120 5191889 5254779
6323 5254779 5324303 5294294 5209606 5133533 5130263 5173786 5120023 5158778 5141540 5111604 5075285 5095028
6311 5095028 5112970 5156957 5080872 5097378 4949957 4911902 4852326 4979804 5074151 5057346 5121572
6300 5121572 5046733 4997145 4995007 5092719 5070330 5091948 5091944 5348283 5326114 5116386 5021070 5081928
6288 5081928 5123017 5058717 4992613 4917660 4958285 5069543 5106767 5044353 5027348 5084601 5017944
6277 5017944 4879914 4938315 5057201 5169332 5104865 5033740 5024966 4930919 4927623 4916367 4893050
6266 4893050 5125903 5175262 5129552 5066047 4942480 5002179 5021449 5098488 4994564 4896948 4863267
6255 4863267 4957679 5038709 4923478 5036152 4961121 4946299 4966234 4924692 5052545 5084730 5006355
6244 5006355 5069563 5053202 4907983 4885237 4847217 4758729 4790392 4884434 4950778 4926036 4828016
6233 4828016 4941134 4973954 4964421 4887919 4883472 4838346 4883306 4886472 4860805 5005242 5078338 5198953
6221 5198953 5280905 5063572 4986953 4914254 5036694 4945514 4834927 4875190 4919025 4999617 4984812
6210 4984812 4959312 4868971 4924248 4961621 4959166 4909630 5053361 5051807 5156504 5213676 5152570
6199 5152570 5035191 5052455 5119849 5160475 5019960 5059794 5053200 4942425 5066527 5085571 5106677
6188 5106677 5054755 5038569 5168655 5109242 5100089 5184691 5077499 5067284 5089367 5111119 5101157
6177 5101157 5102275 5143457 5103095 5058973 5049986 5144664 5318307 5412267 5293689 5091487 5082233
6166 5082233 5217007 5273686 5196869 5181950 5094473 5088262 5204481 5216074 5044716 5092346 5165983
6155 5165983 5109628 5115902 5058406 5109694 5294137 5409802 5412309 5337635 5322142 5313548 5318614 5323134
6143 5323134 5219536 5110130 5049027 5128735 5252900 5209980 5221526 5346071 5397991 5166667
6133 5166667 5108719 5149177 5237918 5302568 5252941 5251406 5118014 5074314 5120820 5150946 5121314
6122 5121314 5112540 5027859 5083464 5110137 5077316 5141368 5121466 5069757 5101965 5081773 5023038 5003874
6110 5003874 4971889 5096997 5191655 5212728 5186118 5140558 5067106 4980298 5104733 5064050 5087385
6099 5087385 5187358 5127161 5129777 5182843 5132864 5068157 5114197 5088635 5154683 5178520 5152823 5051851
6087 5051851 5006075 5003076 5104120 5073522 5014018 5016342 4963970 5044380 5032034 5135003 5139191 5044651
6075 5044651 5022866 4946864 4868800 4836100 4767743 4809786 4897624 4929321 5025127 5009373 4863931
6064 4863931 4873571 4896803 4709154 4725511 4784583 4854966 4784382 4713380 4605048 4597961 4739997
6053 4739997 4865469 4963679 4872509 4791110 4749935 4846281 4733598 4671422 4566313 4552528 4611080
6042 4611080 4630073 4542301 4600386 4650533 4629977 4642840 4595782 4621709 4566880 4643593 4637886 4524975
6030 4524975 4595300 4717015 4794404 4668724 4565710 4512442 4595839 4651242 4615725 4645366 4634979
6019 4634979 4585165 4640211 4731325 4711264 4715474 4770796 4690613 4698066 4707615 4753503 4726441 4723038
6007 4723038 4636201 4595684 4793718 4863866 4898207 4905724 4870960 4795502 4823011 4805412 4782838
5996 4782838 4826312 4937756 4938655 4924769 4926803 4740171 4774544 4875591 4871816 4831830 4869826 4904609
5984 4904609 4890824 5009437 4897555 4899344 4974559 5065664 5108630 5190822 5128805 4965008 4998846
5973 4998846 5121330 5246619 5279082 5133736 5097990 5241091 5303759 5259778 5173037 5348273
5963 5348273 5445111 5374748 5363744 5382806 5360940 5449900 5493421 5475556 5374456 5342604 5475866
5952 5475866 5476539 5633873 5545097 5541281 5705095 5768955 5694027 5629187 5512306 5591746 5590078 5500572
5940 5500572 5527914 5582173 5554462 5559293 5643552 5584337 5583219 5540677 5564318 5613866 5646810 5552426
5928 5552426 5435652 5459827 5521576 5525439 5453255 5409975 5443591 5390024 5436123 5376050 5278202
5917 5278202 5425888 5557291 5469777 5478658 5503417 5432913 5367080 5275765 5368033 5369606 5537399
5906 5537399 5486789 5333043 5341199 5463204 5401045 5378226 5343142 5222147 5259915 5220508 5346623
5895 5346623 5450928 5349010 5239271 5309368 5422488 5269676 5111117 5119290 5099779 5065983
5885 5065983 5143177 5159449 5186164 5108471 5089368 5132062 4990410 4892668 4927603 4971802 4914874
5874 4914874 5076080 5031853 4969887 4882694 4881661 4893045 4809930 4781398 4794926 4644744 4712871
5863 4712871 4802905 4930370 4807452 4755350 4739501 4686926 4684402 4607966 4646103 4622802 4593289
5852 4593289 4666797 4726959 4574084 4604690 4567149 4542695 4497940 4577560 4489911 4442786 4448498
5841 4448498 4433792 4465068 4326916 4244164 4238105 4382746 4376079 4341624 4340320 4338375 4233548 4205507
5829 4205507 4184736 4073614 4128791 4114287 3966118 4045256 4051688 4097083 4062142 3971220 4156976
5818 4156976 4019370 3906604 3991363 4097522 4107223 3928412 3843487 3829292 3805042 3833411 3880356
5807 3880356 4014264 4036129 3979699 4069449 3958645 3813767 3729089 3863090 3967847 3867375
5797 3867375 3729371 3748192 3769133 3806543 3828488 3834495 3676531 3640170 3824187 3854860 3864580
5786 3864580 3931946 3911644 3879630 3946572 3890036 3869274 3939591 3896011 3921066 3941389 3911785
5775 3911785 3906124 3799335 3798268 3909208 3993479 3820747 3763727 3788830 3909007 3898434 3919623
5764 3919623 3934186 3870773 3795237 3833455 3810184 3868600 3875911 3890707 3909070 3901910 3863787 3881491
5752 3881491 3976110 3983084 4067520 4035990 4014555 4019056 3984520 4013020 4014312 4059063 3975819 3873004
5740 3873004 3889839 3808808 3834859 3908097 3911408 3899396 3857371 3785113 3835143 3851031 3755955 3782020
5728 3782020 3791397 3938205 3958401 3900272 3907822 3970698 3908702 3860311 3921032 3813381 3870736
5717 3870736 3908588 3872761 3810775 3828548 3851316 3738517 3710230 3857527 3900596 3914539 3811350
5706 3811350 3753353 3768489 3888071 3825563 3783094 3865030 3825971 3848808 3692972 3684414 3746141
5695 3746141 3862768 3758113 3761809 3696486 3574469 3713153 3843200 3795926 3739579 3783676 3628950
5684 3628950 3604828 3669499 3625157 3633568 3530515 3568106 3740884 3692172 3666356 3734356 3679028
5673 3679028 3512809 3579577 3512424 3539295 3571360 3514385 3559469 3668987 3634137 3570557 3527471
5662 3527471 3509337 3548475 3615013 3557401 3603706 3611755 3713504 3732107 3753511 3879558 3754602
5651 3754602 3612438 3661542 3563546 3536513 3502193 3536357 3659621 3665724 3569205 3490585 3503182
5640 3503182 3517836 3477342 3408458 3463588 3573684 3600501 3487154 3534279 3497590 3624391 3503948
5629 3503948 3519460 3536801 3554076 3611298 3572481 3611481 3649741 3547844 3598740 3621346 3655780
5618 3655780 3576113 3379684 3402199 3407290 3377645 3334233 3497580 3665284 3680070 3513937 3457358
5607 3457358 3442288 3487442 3660082 3790272 3636519 3476591 3506507 3418359 3346367 3511940
5597 3511940 3579313 3567756 3553101 3659278 3688648 3667917 3646629 3623662 3495871 3465159 3499642
5586 3499642 3546123 3655204 3606003 3595960 3558334 3618082 3600472 3548594 3502147 3594090 3735892
5575 3735892 3729508 3677689 3669923 3638985 3692436 3674687 3638088 3730754 3626403 3493319 3681117
5564 3681117 3626712 3600301 3628140 3520414 3392745 3610321 3764738 3644268 3735562 3590375
5554 3590375 3636991 3701168 3677090 3622291 3568502 3635858 3581270 3635615 3549172 3554331 3741132
5543 3741132 3756837 3798392 3838724 3695747 3652625 3680284 3649197 3565617 3619163 3874332 3846269
5532 3846269 3664443 3615270 3571284 3441022 3598279 3645947 3554217 3487097 3550953 3632817 3670667
5521 3670667 3514839 3423877 3469584 3473861 3476757 3561196 3659431 3529510 3343520 3266946 3324449
5510 3324449 3339903 3417332 3504908 3461590 3452178 3378653 3367638 3451724 3373388 3452898 3405709 3247734
5498 3247734 3280940 3264752 3383590 3404545 3371333 3228685 3286799 3472430 3402955 3270976 3070153
5487 3070153 3009355 3069826 3146520 3126743 3243786 3220486 3103534 2901386 3031865 3219013
5477 3219013 3224129 3015065 2927837 2954222 2903591 3051835 3047327 2927579 2920979 3063540 3089371
5466 3089371 3087449 2891901 2874825 2985602 2846809 2875136 3014848 3077295 3125251 3134652 3102304
5455 3102304 3039446 2847590 2790426 2966016 3106888 3211654 2962906 2804221 2903426 2862564
5445 2862564 2949450 2985866 2972697 3073753 3146970 3117847 3085605 3018201 2964046 2921044 2955182
5434 2955182 3029339 2979925 3089001 3089287 3063403 2946616 3049019 3104478 2969223 3067891 3116728
5423 3116728 3034367 3003078 3112652 3130659 3082941 3005408 3114125 3071223 2963790 3051586 3087790
5412 3087790 3131108 3148080 3173872 3337977 3311264 3168166 3197777 3200549 3198392 3263275 3184682
5401 3184682 3202825 3238787 3227505 3126629 3192121 3285803 3288410 3402888 3386834 3321781 3411256
5390 3411256 3294548 3333571 3340914 3270667 3365911 3312659 3326625 3219897 3152272 3200396 3314862
5379 3314862 3359633 3422551 3259590 3293789 3288154 3140541 3252249 3388498 3321879 3354423 3471299
5368 3471299 3352071 3401432 3529731 3672607 3495243 3332598 3303518 3242330 3353119 3408908
5358 3408908 3430279 3378159 3285233 3268190 3336445 3427227 3393229 3350303 3256469 3124643 3123987 3285662
5346 3285662 3199408 3181093 3283219 3175664 3159450 3198031 3156905 3106906 3153035 3117013 3151929
5335 3151929 3102671 2937315 2956968 3046842 2995121 3030273 3122035 3032390 3049249 3008416 3115699
5324 3115699 3051477 2986858 3105285 3029786 3003860 2977277 2960383 3017514 3167185 3011605 2908012
5313 2908012 2918726 2883667 2829580 2925424 2813096 2747627 2839089 2919617 2920661 2886227 2817998
5302 2817998 2859563 2841052 2883488 2832303 2880005 2909491 2875107 2965412 2792651 2677541 2632445
5291 2632445 2590618 2647836 2784528 2782039 2831465 2867697 2794133 2810397 2701030 2678899 2695879
5280 2695879 2594077 2751187 2823665 2650007 2595381 2695384 2731499 2766705 2664040 2780192
5270 2780192 2756457 2653155 2613052 2595726 2544454 2604247 2592112 2661509 2688097 2629031 2698956
5259 2698956 2556197 2491231 2488318 2464772 2655566 2695929 2574355 2661437 2702737 2702726 2652550 2494295
5247 2494295 2477608 2481666 2491836 2435186 2465988 2559853 2658778 2737581 2683712 2489320 2393741
5236 2393741 2394716 2485336 2556403 2546779 2616172 2663139 2660589 2622298 2630760 2736625 2708514 2549346
5224 2549346 2553515 2552273 2530743 2564117 2497809 2507287 2635920 2640703 2705970 2643282 2669935 2566613
5212 2566613 2443370 2505918 2561147 2534381 2544810 2553990 2623499 2618854 2629482 2636717 2491584 2445776
5200 2445776 2591704 2620690 2591321 2621640 2624688 2653569 2717035 2775324 2659909 2617244 2536863
5189 2536863 2563353 2519158 2669632 2685467 2519556 2470355 2484382 2562999 2589421 2639649 2730283
5178 2730283 2906091 2820970 2785621 2838682 2730343 2722053 2658070 2815125 2774467 2673850 2656584
5167 2656584 2543798 2525449 2609564 2685415 2557027 2677756 2682671 2649265 2558852 2505929 2580753
5156 2580753 2646286 2629942 2695848 2647057 2580254 2566224 2606996 2608338 2593781 2677849 2663368 2653056
5144 2653056 2711928 2714172 2631036 2624854 2546170 2688452 2589119 2605352 2650621 2733526 2740783 2735018
5132 2735018 2833750 2792075 2639642 2619938 2659785 2636436 2675705 2644174 2526213 2527060 2757228
5121 2757228 2761293 2698187 2751350 2758748 2672515 2647701 2754668 2708809 2620319 2631345 2663381 2735245
5109 2735245 2760199 2826198 2687100 2705566 2764672 2744678 2770396 2732623 2717573 2711511 2659574
5098 2659574 2752785 2700384 2739031 2795456 2756607 2756260 2786621 2847659 2786810 2736320 2897785 2749568
5086 2749568 2612159 2687307 2693140 2679167 2665792 2753287 2686851 2737914 2924073 2912611 2903858
5075 2903858 3034400 2960746 2852061 2876231 2891550 2868628 2916452 2931011 2932301 2888150 2861728
5064 2861728 3031855 3107217 3093530 2949336 2919172 2886387 2825494 2885542 2869264 2818658 3029886
5053 3029886 3022233 3063609 2990906 2928358 2851666 2943006 2978428 2976565 3072419 2961316 3139714
5042 3139714 3111379 3143856 3133675 3065902 3073694 3204643 3235321 3182366 3270815 3265710 3157049
5031 3157049 3176590 3260084 3313199 3397394 3389077 3345796 3314336 3426529 3544194 3551271 3611886
5020 3611886 3627112 3532904 3359671 3482707 3508084 3475561 3541135 3608555 3626737 3653344 3741714
5009 3741714 3764085 3850527 3936643 3888936 3882712 3702831 3841528 4035790 4053783 3975218 3979520
4998 3979520 4015372 4027032 4207047 4233993 4082332 4025814 4017961 4085890 4151938 4171783 4244567
4987 4244567 4359478 4306645 4260865 4327941 4359737 4342489 4369056 4386461 4362909 4212685 4192030
4976 4192030 4128757 4199442 4502710 4419496 4368749 4355922 4341654 4334280 4393939 4473747 4542404
4965 4542404 4590309 4630488 4642233 4581817 4641479 4741167 4749692 4796509 4848096 4869449 4962008 4765442
4953 4765442 4778950 4948852 4923696 5072867 5105982 5225507 5338096 5332711 5333121 5379433 5533356
4942 5533356 5579003 5612226 5623522 5660359 5896178 5973005 5927643 5988409 5974263 6157868 6073267
4931 6073267 6030978 5955883 5990951 6125995 6042878 5781567 5663304 5800589 5762062 5595991
4921 5595991 5531475 5552930 5463254 5412300 5292065 5334338 5236181 5228623 5209146 5166298 5155148
4910 5155148 5060163 4914485 4852826 4956194 4914670 4999973 5000196 4883342 4891502 4725531 4804571
4899 4804571 4648896 4531671 4585872 4634940 4660028 4533688 4548718 4651178 4613874 4688334 4773526
4888 4773526 4901784 4901697 4819022 4748845 4676789 4653035 4708591 4711536 4860058 4728895 4629412 4621064
4876 4621064 4766297 4740371 4852594 4864593 4826548 4750351 4700217 4782463 4792097 4766719 4720216
4865 4720216 4880611 5153021 5280051 5193133 5112318 5195021 5257891 5123011 5283458 5382751
4855 5382751 5291014 5269682 5291909 5415078 5507385 5385994 5322512 5278796 5275274 5401935 5493249
4844 5493249 5520268 5511946 5458519 5658987 5552315 5556608 5600140 5651028 5680262 5641544 5590472
4833 5590472 5695612 5720869 5573404 5651475 5676252 5698489 5681933 5719128 5730409 5725605 5899643
4822 5899643 5792189 5823339 5766957 5873754 5904544 5675012 5729984 5846172 5779728 5851804 5847776
4811 5847776 5854179 5909931 5943861 5913680 5946884 5971188 6094312 6048426 6086210 6113482 6044695
4800 6044695 6161235 5999264 6011346 6030159 6031099 6082731 6136878 6208420 6194945 6171267 6166711 6256953
4788 6256953 6301363 6408155 6301449 6330599 6316978 6392263 6404986 6499918 6543638 6555623 6523536
4777 6523536 6402876 6391269 6299095 6087811 6186223 6103071 5883774 6001598 5857382 5863893 5857197
4766 5857197 5786873 5645947 5730339 5738556 5661519 5577762 5522580 5521241 5526630 5467769 5342363 5355781
4754 5355781 5395761 5465535 5532172 5370830 5411925 5340176 5407873 5374672 5317449 5331838 5346127
4743 5346127 5266201 5210190 5154833 5125471 5191958 5068654 5086398 5106512 5073484 5178606 5240338
4732 5240338 5176635 5140692 5110140 5076134 5087884 5143031 5172017 5054404 5124345 5161059 5166469
4721 5166469 5253620 5121984 5248695 5313806 5324709 5340470 5366952 5455611 5343405 5312576 5339349
4710 5339349 5367418 5518059 5566173 5539711 5508300 5678599 5656069 5635111 5759297 5799159 5920090
4699 5920090 5874104 5919367 5907924 6072767 6273122 6387964 6406063 6372360 6381588 6422707 6537468
4688 6537468 6624178 6650594 6734740 6712755 6891973 6961580 6981921 7183169 7216269 7135595 7202391
4677 7202391 7280389 7424030 7448450 7468754 7653011 7798148 7902123 7884236 8007714 8202462
4667 8202462 8391237 8543384 8495121 8635850 8878452 9103906 9190579 9245098 9439126 9558493
4657 9558493 9613530 9730543 10002695 10189214 10529698 10545831 10795860 11064147 11220602 11429725
4647 11429725 11529718 11884336 12078861 12350848 12693119 12949537 13304786 13556503 14019413 14455946
4637 14455946 14823596 15323121 15869189 16473795 16903034 17319055 17829894 18451584 19057386
4628 19057386 19660652 20192003 20689978 21334520 21905358 22397497 22680157 22955786 23362579
4619 23362579 23741471 23837464 23980252 24353816 24616982 25086283 25651666 26181546 26861875 27581613
4609 27581613 28255588 28991312 29769267 30644759 31518108 32530386 33490557 34413016 35272008
4600 35272008 36296925 37262510 38144754 38929261 39695575 40393466 41038286 41658739 41929887
4591 41929887 42280620 42340535 42360419 42275252 42095929 41932307 41720740 41157852 40335383 39586002
4581 39586002 38857269 37937786 36992934 36027339 34949155 33794448 32581560 31474003 30320671
4572 30320671 28999122 27935825 26877348 25866630 24855920 23722491 22630946 21595748
4564 21595748 20660528 19744346 18904879 18202234 17255520 16608350 16038248 15392192 14914687
4555 14914687 14336216 13865103 13461562 13097788 12715662 12266814 12046204 11689199 11333948
4546 11333948 11025395 10762001 10483761 10167214 10034982 9919023 9675587 9335945 9251990 9074216
4536 9074216 8886958 8738812 8587432 8464720 8300990 8256858 8177553 8087061 7963688 7830946
4526 7830946 7612939 7599659 7439223 7299580 7303774 7185862 7069151 7109562 7153517 7017113
4516 7017113 6935106 6812643 6596274 6551104 6596571 6486921 6317123 6284853 6357938 6259542 6199800
4505 6199800 6159199 6190844 6098402 5922501 5847506 5914127 5963469 6012017 5927139 5878856 5881206
4494 5881206 5883552 5810531 5851877 5710363 5733321 5643537 5559852 5371687 5450347 5627873 5637691
4483 5637691 5553174 5530277 5478589 5489103 5466744 5413284 5407377 5371993 5294220 5286117 5416459 5427216
4471 5427216 5386296 5415582 5288752 5223128 5204192 5320143 5243693 5247491 5290309 5208845 5372954
4460 5372954 5325903 5220204 5328843 5293876 5135978 5047331 5047981 5177402 5152365 5169169 5116341
4449 5116341 5222176 5280923 5270996 5110945 5151518 5146039 5030961 5089321 5098322 5062057 4999178
4438 4999178 4924478 5048738 5039055 5120464 5209244 5135056 5109686 5011286 5076189 5075476 5116257 5059821
4426 5059821 5056351 5078019 4937207 5115334 5233009 5199367 5120505 5191306 5260097 5236063 5383696
4415 5383696 5422864 5099292 5097811 5129030 5218800 5235240 5312912 5261359 5293154 5341718 5440206
4404 5440206 5319632 5263425 5337195 5311277 5311573 5412494 5536107 5516632 5441084 5470840 5628777
4393 5628777 5556159 5511556 5599510 5775638 5789210 5803861 5844175 5917847 5790800 5787473 5917741
4382 5917741 5906918 5875254 6080158 6127456 5961721 6117000 6128002 6129575 6054998 5965333 6289054
4371 6289054 6374200 6468214 6508235 6448263 6420307 6451142 6518757 6635346 6599204 6602669 6660285
4360 6660285 6675763 6732931 6801993 6915562 6990235 7047823 7177616 7258229 7460555 7548069 7565141
4349 7565141 7565973 7611883 7721102 7729254 7764001 7804142 8002746 8079928 8297194 8350731 8440074
4338 8440074 8457895 8422198 8605166 8818778 8822425 8977571 9028980 8973338 9053589 9254295 9421281
4327 9421281 9506250 9639947 9802553 9933098 10085530 10296221 10454507 10637188 10816906 10847857
4317 10847857 11039068 11334256 11534883 11658937 11740142 12048750 12239541 12360996 12579179 12760669
4307 12760669 13076171 13448183 13612902 13935479 14119999 14463043 14755864 15057567 15535828
4298 15535828 15805290 16112451 16566321 17110642 17498314 17903061 18420808 18969364 19511315
4289 19511315 20000206 20685174 21294541 21973045 22581092 23337207 24158831 24786519 25420491
4280 25420491 26251875 27058200 28022436 28857611 29700436 30605675 31698677 32808488 33728466
4271 33728466 34807794 35893950 37039819 38113103 39175743 40391944 41587979 42734902
4263 42734902 43880153 45088473 46329144 47454311 48418038 49568101 50682400 51621093
4255 51621093 52858090 53860004 54843212 55726343 56455993 57253358 57951704 58554041 59175353
4246 59175353 59755156 60213074 60748267 61056891 61222450 61455404 61500271 61433086 61386239 61063448
4236 61063448 60791681 60420971 59976144 59588079 59097106 58534115 57886030 57196614 56445572
4227 56445572 55745730 54879394 54086638 53318544 52386279 51485498 50631087 49536222 48609088
4218 48609088 47810437 47151212 46312798 45551852 44811999 44126556 43424776 42807349 42232153
4209 42232153 41715492 41259009 40741161 40430303 40084953 39774656 39515900 39242221 38981300
4200 38981300 38643182 38268072 37946887 37406972 36722817 36002799 35087697 33810703 32415049
4191 32415049 31105309 29873985 28654171 27549811 26447080 25208033 24146752 23124440
4183 23124440 22339351 21476324 20692419 20041669 19398240 18774840 18206044 17587501 17107418
4174 17107418 16588492 16235388 15913239 15464628 15218654 14805005 14557172 14300735 14050098
4165 14050098 13683201 13370154 13166577 12950497 12679510 12587784 12419763 12177540 11934292 11589628
4155 11589628 11432672 11252330 11169863 11012055 10841193 10783411 10650531 10494667 10392446 10283178
4145 10283178 10406890 10351807 10145797 10177348 10139950 10003082 9796263 9694843 9498850 9593111
4135 9593111 9586244 9487877 9366840 9282759 9162934 9141531 9103516 9189539 9207712 8997019 8828391
4124 8828391 8927402 8908246 8841046 8746015 8702464 8806232 8788518 8735709 8653203 8669397 8517705
4113 8517705 8521258 8479345 8480010 8455234 8526868 8454989 8349451 8459532 8431392 8494966 8471309 8471570
4101 8471570 8506573 8466115 8550830 8521045 8488212 8431729 8353929 8286294 8207395 8266693 8263502 8369390
4089 8369390 8351796 8224249 8206854 8255425 8350505 8250885 8181881 8231930 8199401 8071785 8095732
4078 8095732 8285882 8265558 8101958 8113495 8207402 8205475 8102264 7965196 7991983 8111692 8254605
4067 8254605 8218108 8149978 8204158 8110156 8167816 8075440 7973372 8132100 8051306 8137312 8354032
4056 8354032 8384005 8377324 8285833 8313447 8277095 8373299 8466387 8422878 8364987 8425383 8597895
4045 8597895 8633400 8574624 8714582 8726863 8672989 8716027 8789122 8838482 8839972 8934100 9037145
4034 9037145 9082998 9069644 8943328 8990640 9152193 9251441 9305203 9391182 9496053 9600407 9766346
4023 9766346 9709306 9713188 9720514 9790361 9833957 9882505 9995431 10060152 10149881 10177715 10256104 10336778
4011 10336778 10421652 10413511 10517730 10594731 10707215 10858337 10940077 11021209 11142987 11149793 11322554
4000 11322554 11526873 11703940 11954526 12036152 12065616 12294712 12478739 12572665 12760967 12918235
3990 12918235 13020317 13240614 13430745 13556633 13861037 14127960 14317596 14404981 14583452 14804399
3980 14804399 15060177 15255977 15256687 15236400 15466126 15608937 15695355 15726098 15752094 15796413 15706249
3969 15706249 15718209 15689134 15658678 15763846 15824200 15807972 15689657 15641739 15665023 15827596 15848201
3958 15848201 15848686 15804591 15891013 15848571 15966755 15995158 15839814 15822396 15956314 16141934 16085340
3947 16085340 16108238 16268553 16232381 16302956 16414002 16490088 16464045 16535214 16611717 16762721 16857774
3936 16857774 16997812 17229358 17278756 17277444 17326940 17416472 17567426 17666340 17755575 17994194 17962701
3925 17962701 17917130 17992302 18242934 18323516 18596273 18814090 18896984 18776333 18890116 18970128
3915 18970128 19036232 19015054 19228931 19590318 19665275 19756177 19792240 19998163 20290203 20437644
3905 20437644 20466246 20584132 20816095 20859740 21068792 21266515 21480797 21754064 21873422 22173992
3895 22173992 22318782 22447905 22691547 22867568 23157139 23428677 23627273 23998897 24237052
3886 24237052 24501713 24989530 25243331 25469171 25805404 26090773 26454947 26811549 27211508
3877 27211508 27483227 27920754 28313195 28762439 29294964 29719172 30159674 30617959 31096074
3868 31096074 31648971 32309437 32963042 33575079 34193835 34836412 35574929 36381420 36883378
3859 36883378 37624636 38472577 39409878 40408653 41312701 42131421 43182744 44488672 45540135
3850 45540135 46821212 48222871 49672607 51020688 52527453 54096633 55772070 57449792
3842 57449792 59395151 61444684 63414855 65600351 67933153 70420784 72850710 75504503
3834 75504503 78379249 81313547 84250959 87250931 90240533 93536401 96820582 100125208
3826 100125208 103370425 106653307 109875504 113136653 116358975 119324732 122124487 124675342
3818 124675342 126848648 128630670 130537559 132014181 132939592 133778612 134291827 134520344 134490608
3809 134490608 134197967 133523395 132672644 131634933 130271835 128722445 126784792 124585532
3801 124585532 122358619 119739210 117007654 114261283 111282818 108213234 105132554 102086154
3793 102086154 98920667 95686579 92831958 89943631 87076372 84363486 81702051 79342701
3785 79342701 76778056 74368212 72274566 70357381 68384814 66521495 64895937 63253490
3777 63253490 61632424 60090602 58787355 57395117 56095342 55039984 53988259 52915124
3769 52915124 51867751 50946524 50058079 49331204 48645787 47908969 47179303 46493789 45898706
3760 45898706 45476822 45048894 44524032 44040060 43522981 43095574 42824484 42455941 42216062
3751 42216062 41812284 41659901 41486031 41192181 41031907 40849325 40727536 40646203 40702396 40728144
3741 40728144 40586883 40570277 40463602 40458935 40636983 40525411 40544177 40662214 40664965 40869921
3731 40869921 41058661 41270589 41583472 41783091 41943050 42341618 42663850 42906571 43380532
3722 43380532 43790059 44271721 44689345 45159137 45712088 46326190 47055814 47545516 48184738
3713 48184738 48959186 49788146 50603786 51358986 52202364 52921825 53870239 54878840 55912882
3704 55912882 56887209 57962138 59035374 60016472 60958674 61977687 63022511 64162643 64968913
3695 64968913 65882654 66857078 67573408 68368612 69151666 69968869 70551029 71126053 71873234
3686 71873234 72537522 73188431 73868309 74549332 75237746 76162989 77114761 78144680 79304011
3677 79304011 80439430 81714335 83117504 84870803 86590400 88379924 90300497 92355786
3669 92355786 94568527 97004898 99445724 102190383 105177435 108240287 111404493 114870303
3661 114870303 118581654 122613950 126703763 130969166 135497026 140180732 144979949 150162789
3653 150162789 155421540 160730062 166166656 171541060 177050024 182565828 187929835 193454970
3645 193454970 198693131 203450815 208157583 212446857 216258429 219908060 223042189 225447047
3637 225447047 227676071 229417486 230513616 231104850 231333063 231171579 230581613 229362693 227905977
3628 227905977 226021533 223807013 221166113 217991450 214440834 210669221 206525714 202008970
3620 202008970 197438756 192620006 187653037 182633440 177408390 172230839 167085700 161897389
3612 161897389 156864873 152126416 147309590 142636068 138212941 133931891 129802606 126036719
3604 126036719 122340235 118793182 115318778 112214562 109267205 106434954 103849854 101249597
3596 101249597 98783991 96677483 94816541 92898171 91058738 89513649 87953295 86564460
3588 86564460 85356041 84196458 83132718 82072402 81028097 80170094 79420201 78638848 78097603
3579 78097603 77617303 77096227 76747937 76172532 75660758 75042475 74489486 73791389 73107128
3570 73107128 72621559 72006249 71363297 70631185 69768626 68998415 68272247 67366118 66605002
3561 66605002 65880091 65104044 64370590 63664300 62834573 62474883 61931105 61471263 61091824
3552 61091824 60709994 60147544 59887313 59615139 59376508 59093670 59064014 58813821 58645552 58784697
3542 58784697 58806539 58990713 59119703 59213401 59510509 59740577 59974016 60254561 60542580 60904727
3532 60904727 61209019 61564538 62049782 62614424 63091995 63491508 64141927 64804809 65471143
3523 65471143 66227991 66954597 67762597 68748509 69568896 70352967 71364559 72445994 73455661
3514 73455661 74612284 75946062 77184968 78571458 80041282 81573309 83137310 84928631
3506 84928631 86768107 88731356 90752307 93003371 95377525 97835464 100362507 103120046
3498 103120046 106095410 109225704 112503012 116042040 119757688 123588190 127623831 132101381
3490 132101381 136768257 141708529 146698960 151912998 157627518 163512586 169523751 175648667
3482 175648667 182170630 188802811 195403176 202243985 209047232 215788725 222565132 229082494
3474 229082494 235308489 241164831 246772584 251925138 256512504 260396620 263600489 266393556
3466 266393556 268430554 269592949 270326876 270414809 269807636 268576575 266813646 264478473 261579348
3457 261579348 257881748 253686679 249267808 244107938 238446253 232454001 226049421 219399077
3449 219399077 212594994 205697927 198690100 191770758 184895759 178047748 171454723 165035236
3441 165035236 158947265 153099489 147301460 141946109 136718107 131761621 127218298 122904671
3433 122904671 118735893 114658422 110868940 107308943 103951857 100789071 97837771 94915524
3425 94915524 92214832 89701181 87313195 85128819 82944133 80821731 78944760 77167889
3417 77167889 75472484 73796798 72286077 70929880 69555855 68118260 66909765 65937443
3409 65937443 64958304 63902259 63053167 62165225 61432352 60706770 60034449 59450232 59030339
3400 59030339 58482422 57933084 57540339 57237839 56886883 56676253 56542922 56380547 56272889
3391 56272889 56111003 56053758 55895145 55870011 56076544 56120327 56108781 56127321 56196290 56301440
3381 56301440 56356575 56357633 56524376 56591789 56498691 56168714 56109954 56149637 55989702 55825176 55718737
3370 55718737 55796689 55586841 55336684 55288900 55205028 55142006 55206363 55207633 55344677 55700479 55916935
3359 55916935 56072712 56446175 56800563 57216948 57694072 58320527 59063294 59628911 60345437
3350 60345437 61266782 62300909 63178477 64097757 65089936 66366996 67742568 69096103 70629615
3341 70629615 71930716 73464774 75193580 76945723 78797250 80769668 82620145 84536785
3333 84536785 86643861 88753520 90934205 93229804 95341731 97537652 99429512 101402184
3325 101402184 103378950 105234171 106670814 108070798 109397231 110711912 111639493 112233073
3317 112233073 112662634 113148651 113432824 113491176 113468528 113427616 113197157 112906663 112646488 112419408
3307 112419408 112093850 111829237 111740443 111305675 110879246 110364759 109905212 109226379 108403918
3298 108403918 107495588 106259014 104875870 103175202 101359211 99545632 97428170 95140802
3290 95140802 92897602 90407128 87968547 85515168 82995611 80510504 78055433 75887176
3282 75887176 73503187 71235036 69204694 67085490 65300709 63366524 61590782 60016644
3274 60016644 58554013 57330794 55995257 54752148 53707429 52718214 51560197 50781922
3266 50781922 50023901 49355881 48752655 48181501 47599584 47099333 46803792 46450184 46024045
3257 46024045 45804417 45613896 45474439 45265370 45133275 44860402 44710238 44444035 44238564
3248 44238564 44163490 43852485 43631767 43527783 43540064 43369055 43123934 42751571 42485389 42359464
3238 42359464 42097902 41717046 41311373 41006488 40554541 40131994 39550045 39045076 38642669
3229 38642669 38304062 37827611 37375158 36789175 36332038 35787035 35331405 34808714 34183105
3220 34183105 33747313 33369261 32790926 32351915 32044479 31726076 31524867 31225964 30923308
3211 30923308 30701518 30631674 30409762 30237887 30098359 29990895 29912186 29765938 29723155 29582998
3201 29582998 29664782 29707291 29523498 29497192 29450572 29429222 29381934 29583113 29757908 29970362
3191 29970362 29998242 30071800 30167419 30116462 30251170 30539307 30654752 30789132 30936459 30966389
3181 30966389 31091547 31300196 31480372 31772539 31990126 32119668 32353383 32526766 32722541
3172 32722541 33038810 33242042 33505461 33775467 34008685 34292216 34579811 34895289 35217256
3163 35217256 35514587 35879797 36304627 36650508 37265509 37691654 38006614 38385937 38831541
3154 38831541 39376488 39847647 40393881 40846642 41495210 42115904 42748714 43216238 43706794
3145 43706794 44393432 45239959 45838075 46458401 47262310 48063393 48792036 49574520 50338294
3136 50338294 51158858 52056461 52778197 53561076 54441586 55447368 56430794 57479201 58534549
3127 58534549 59604105 60812532 61877359 63157846 64520389 65930262 67369783 68910881
3119 68910881 70382243 71841792 73573075 75441668 77287165 79025370 80952799 83048428
3111 83048428 85204265 87458649 89739143 92149182 94805107 97553110 100523175 103543862
3103 103543862 106677035 110028540 113675186 117469372 121503380 125660118 130304694 135215291
3095 135215291 140127963 145476725 151336003 157420435 163832324 170627037 177922882 185625145
3087 185625145 193653630 202318090 211521371 221326773 231797630 242831848 254656987 267014231
3079 267014231 279878008 293355696 307346122 321814352 336726066 351746752 367000997
3072 367000997 382314843 397343385 412010383 425910853 438891508 450499281 460341340
3065 460341340 468315122 473623981 476273829 475611225 471603655 464482452 454413432 441817295
3057 441817295 427068404 411040153 394239231 377122638 359902704 343029307 326284886
3050 326284886 310169292 294768450 280049438 266103623 252880650 240311130 228508419
3043 228508419 217533282 207094604 197243713 188148935 179727497 171765781 164496955 157624080
3035 157624080 151096170 144965770 139166671 133681952 128413511 123621028 119015503 114710017
3027 114710017 110452453 106447542 102543124 98793264 95472534 92126559 88884735 85909428
3019 85909428 83030401 80390431 77865707 75513873 73111869 70859345 68793954 66754567
3011 66754567 64899424 63069422 61336653 59853313 58334370 56807525 55416306 54096866
3003 54096866 52786728 51310742 50089669 48903553 47619558 46598824 45534409 44541643
2995 44541643 43430315 42404261 41451018 40470748 39725276 38851523 38098498 37374841 36635699
2986 36635699 35752165 35005589 34375023 33727136 33054137 32387962 31831086 31332022 30765019
2977 30765019 30228600 29642647 29084553 28608159 28138564 27643433 27124463 26721015 26490303
2968 26490303 26061870 25597520 25243786 24915743 24522733 24277661 23949206 23556783 23133470
2959 23133470 22686406 22249214 22008255 21611213 21221344 20922475 20504555 20208225 20021626
2950 20021626 19755142 19345295 18965666 18671945 18577479 18264431 17959003 17671094 17455213 17160209
2940 17160209 16934513 16790632 16411442 16150131 15959303 15763451 15677385 15354110 15187991 14986190
2930 14986190 14744445 14513613 14384577 14230718 13935488 13796178 13501623 13465797 13307384 13097467
2920 13097467 12868023 12681782 12662601 12612355 12614945 12447226 12146762 11893592 11668050 11502716
2910 11502716 11398624 11281605 11096619 11020090 11027322 10918367 10841162 10727834 10511052 10302644
2900 10302644 10235570 10004227 9973042 9979310 9890545 9550088 9490738 9487684 9394122 9348066 9143452
2889 9143452 9096693 8996296 8823023 8810034 8826716 8795387 8635628 8437510 8352972 8195065
2879 8195065 8074085 8025153 7920859 7915397 7754751 7603999 7486764 7465353 7483946 7304123
2869 7304123 7229036 7104709 6991567 6934205 6896127 6842185 6701867 6522940 6416163 6451819
2859 6451819 6314445 6196431 6215204 6267117 6316325 6172893 6113815 5960136 6048172 5986682 5886918
2848 5886918 5766084 5568372 5642088 5718192 5633177 5608371 5580979 5537928 5433606 5433307 5368732
2837 5368732 5394756 5479850 5400588 5303319 5151951 5182208 5263775 5382897 5346158 5084027 5001919
2826 5001919 4969565 4867591 4824746 4825932 4829827 5003587 4907531 4754089 4657495 4745939 4806189
2815 4806189 4810664 4783569 4748063 4947230 4922062 4731111 4720271 4795938 4694540 4848361 4873835
2804 4873835 4947725 4905426 4903783 4975778 4842262 4896417 4997764 4988503 4968712 4953535 5088757
2793 5088757 5026951 5159269 5172541 5160735 5237034 5294533 5255208 5496409 5457053 5453486 5614686
2782 5614686 5681488 5598274 5342242 5415520 5447827 5334286 5223713 5094702 5168297 5021683
2772 5021683 4848649 4833405 4614306 4560997 4521615 4507167 4228529 4176903 4084970 4000768 3900994
2761 3900994 3895755 3811813 3654885 3664109 3711954 3616888 3545268 3401562 3324141 3288522 3056392
2750 3056392 3108352 3079618 3044368 3081959 3137338 3022960 3000487 2898371 2755981 2635290 2695519
2739 2695519 2886131 2648672 2673864 2724522 2698093 2555708 2556869 2591235 2544563 2565056 2462435
2728 2462435 2479760 2472533 2372128 2453033 2422049 2443870 2430611 2406961 2361907 2201688 2148715
2717 2148715 2223165 2073137 2169060 2311485 2161084 2162650 2264149 2191937 2119694 2097257 2045467
2706 2045467 1945911 2003694 1897981 1951125 1910591 1710690 1590506 1747188 1934629 1842854
2696 1842854 1916327 1929823 1937217 1828252 1816460 1757189 1715319 1827361 1774178 1702392 1836168
2685 1836168 1812473 1767114 1678706 1608592 1593224 1681607 1709732 1621409 1674571 1674903 1495600 1427456
2673 1427456 1576223 1590869 1596097 1646294 1501489 1442112 1467972 1486846 1522983 1433156 1356659
2662 1356659 1353628 1371932 1425080 1398410 1432894 1269546 1257009 1375046 1394626 1187639 1287156
2651 1287156 1251562 1241167 1387678 1270978 1111068 1065875 1162502 1049190 1134459 1308365
2641 1308365 1327435 1380176 1208264 1037251 1029140 1054380 1100426 1052107 1076736 1150514 1108188
2630 1108188 1005288 1047819 1023915 899049 912748 1058586 981593 936578 900502 866623 944122
2619 944122 876863 926961 870539 850305 763746 817170 903059 954169 980424 905032 853240 970259
2607 970259 973485 858647 727336 736412 772503 807916 883690 881912 972072 944594 810972 757795
2595 757795 823841 892309 929337 787676 726560 774948 743149 795538 766406 697725 861123
2584 861123 920509 889238 882482 824884 835604 803505 740022 805719 685798 634339 643405 842521
2572 842521 741734 740088 706608 740378 687663 629711 767146 803543 733709 643255 630378
2561 630378 599042 653235 631927 723733 732916 638102 612392 634391 624280 593738 482197 501645
2549 501645 584709 694798 625637 571858 435343 291743 372817 564974 570125 479514 565721
2538 565721 693549 710665 770161 727291 555403 597356 644764 558834 425482 511558 466021
2527 466021 528943 398821 271593 337056 412497 441933 485741 543195 411959 376611 548118
2516 548118 628140 577124 708612 672601 585296 481702 420884 282524 190998 442454 340879
2505 340879 384099 489441 492606 429460 448274 302225 294231 423990 546541 470580 387769
2494 387769 461912 389623 407197 362676 308227 314785 386842 374450 365070 310376 386538 517727
2482 517727 451662 302280 189177 278493 330357 232256 365404 439488 454300 363293 329170
2471 329170 299213 252230 249205 268899 209949 208333 116513 123590 148787 174327 263215 349455
2459 349455 413123 322315 250959 256398 208010 197141 141835 144910 180656 304251 314747 191104
2447 191104 173038 225520 231276 163276 127356 187600 280333 64148 20591 245051 253985 213853
2435 213853 241833 190601 298404 223782 242562 211453 225789 246720 210415 193988 167939
2424 167939 172420 56663 53159 8602 69719 133294 303783 241197 239515 271061 311870 257259
2412 257259 196126 197512 326969 182828 211375 123434 154837 110585 31249 56275 -84338
2401 -84338 36529 61802 129687 59895 43681 52604 126043 168223 153042 69242 175117 123592
2389 123592 110935 248309 95300 164623 238504 150278 170886 156273 266052 244622 218734
2378 218734 140609 223954 133686 143475 248859 342611 148721 113099 118699 84558 179820 148636
2366 148636 135637 165980 83728 54451 78982 106197 180114 371853 331649 71343 -21949
2355 -21949 30067 211732 286593 299978 225489 170428 229709 182868 233400 306841 151266
2344 151266 184410 281807 259577 219657 290343 261302 245040 177872 391776 337566 242282
2333 242282 376823 494177 342510 277128 307468 245365 270090 283932 326554 437265 477296
2322 477296 520698 521587 531841 662935 670742 701212 677282 777216 831458 898242 955653 1040234
2310 1040234 1108550 1161659 1291649 1339417 1399324 1487642 1657398 1646796 1596817 1689158 1761338
2299 1761338 1770578 1848374 2019533 1964957 1846510 1818867 1720592 1583365 1473033 1287238 1269721
2288 1269721 1202921 980056 873606 853253 837760 768498 702584 629841 673686 691956 550819
2277 550819 552225 489881 444566 444161 345800 305097 322873 528433 317021 228101 281341 275588
2265 275588 349808 190895 217610 281029 204461 154313 72607 7433 56953 46162 105939
2254 105939 35061 -2745 76044 106562 -122776 -58569 -124695 -124972 -94347 -18198 -10453 -67159
2242 -67159 23159 103553 94256 25338 -157941 -191115 -56234 -188579 -240803 -247295 -35559
2231 -35559 7534 -68475 -96410 25570 2545 -30513 19244 -144566 -122440 -35716 -70868
2220 -70868 -129709 -244033 -50518 -213 -169838 -119866 -42713 -84081 -86508 -140363 -121968
2209 -121968 -162010 -105133 -183321 -200016 -127188 -135400 -186105 -151921 -121494 -92142 -102325 -153347
2197 -153347 -213639 -193637 -208090 -209787 -210957 -212931 -218126 -204047 -245972 -113755 -100997 -119435
2185 -119435 -108633 -55264 -87967 -157523 -338349 -349731 -179464 -90847 -148649 -315427 -257505
2174 -257505 -247190 -229164 -187945 -185897 -414087 -301814 -143598 -89289 -288855 -319410 -281325
2163 -281325 -424013 -471685 -344627 -345878 -282301 -186558 -210377 -296926 -310093 -384472 -356798
2152 -356798 -258283 -229725 -263435 -293332 -307354 -329981 -189128 -162906 -159239 -125849 -299614
2141 -299614 -359519 -252969 -155712 -235077 -211803 -144525 -301381 -186271 -243102 -304421 -294966
2130 -294966 -349029 -352438 -402778 -348782 -253297 -90181 -275188 -310124 -303959 -318601 -396651 -429336
2118 -429336 -468329 -448158 -336313 -224501 -273939 -304101 -318410 -280942 -212489 -271730 -251665
2107 -251665 -209743 -224515 -191157 -130552 -204894 -216502 -263137 -306517 -339733 -262470 -179443 -129008
2095 -129008 -167684 -207750 -323546 -216650 -111858 -340808 -229095 -277939 -355080 -314894 -140010
2084 -140010 -110277 -268058 -371262 -301383 -128822 -201189 -260256 -253964 -202475 -267187 -409939
2073 -409939 -358211 -393020 -533648 -384121 -372559 -350932 -415829 -437295 -266570 -236424 -312735
2062 -312735 -302862 -432350 -281484 -230554 -206830 -368602 -317496 -288312 -242482 -350282 -326608
2051 -326608 -149573 -205359 -336844 -261024 -79858 -115204 -191897 -175928 -268222 -370964 -309745
2040 -309745 -263895 -305874 -459342 -471664 -437549 -486568 -413000 -440804 -357824 -287656 -309462
2029 -309462 -274694 -295534 -318762 -309973 -223755 -344950 -412149 -499306 -375582 -364128 -322252
2018 -322252 -331113 -289656 -341080 -541718 -347343 -380120 -351452 -219352 -252562 -275385 -425961
2007 -425961 -425405 -389546 -275574 -226899 -325441 -463452 -276894 -323808 -365957 -318524 -474970
1996 -474970 -414397 -383787 -338676 -390718 -407833 -383467 -284022 -60516 -44276 -124433 -398095
1985 -398095 -403602 -359339 -364339 -452198 -398852 -361194 -355746 -202533 -218460 -236496 -407138 -462201
1973 -462201 -414941 -442630 -294542 -205491 -201928 -340540 -455982 -432048 -407388 -370102 -414680
1962 -414680 -406101 -495995 -403002 -264703 -228145 -337497 -378249 -355178 -481308 -426164 -276308
1951 -276308 -304416 -441249 -329438 -372082 -352431 -356002 -289362 -378300 -387938 -461235 -420991 -349021
1939 -349021 -335464 -361669 -359832 -344176 -399914 -494369 -515871 -390349 -284044 -286844 -320736 -324858
1927 -324858 -401103 -360575 -444879 -314733 -440433 -313552 -282706 -315533 -215395 -323509 -372710
1916 -372710 -343324 -401729 -432093 -492427 -413794 -234479 -337831 -418520 -441118 -475816 -520026
1905 -520026 -344171 -299436 -276347 -193574 -244917 -268951 -365263 -476869 -546610 -394421 -538427
1894 -538427 -416105 -385975 -342954 -361326 -426861 -492072 -505499 -560777 -456084 -410563 -417003
1883 -417003 -231356 -269410 -454070 -472080 -421197 -405820 -279597 -341973 -432296 -458771 -402916
1872 -402916 -325249 -401384 -431697 -360535 -366448 -343823 -369850 -385821 -366303 -339932 -390758 -354918
1860 -354918 -405880 -454254 -455857 -480054 -480314 -370237 -333308 -416270 -451284 -408556 -330487 -324961
1848 -324961 -355561 -476355 -558167 -456748 -464078 -528794 -530047 -543802 -473366 -411877 -397484 -511945
1836 -511945 -550950 -492762 -510731 -519392 -508204 -398645 -381714 -475345 -517973 -451371 -473453 -475993
1824 -475993 -535673 -444159 -586250 -615829 -424867 -537814 -532273 -530701 -450762 -354344 -498792
1813 -498792 -443328 -474702 -435610 -485206 -548607 -492792 -485814 -469958 -516831 -556470 -562796 -534963
1801 -534963 -529299 -456010 -415010 -373155 -333177 -385155 -396234 -257763 -241609 -249788 -238069 -301454
1789 -301454 -516805 -486192 -502694 -467080 -432867 -520920 -396181 -448350 -390878 -410203 -411159 -335899
1777 -335899 -260614 -306194 -401967 -408701 -490890 -536525 -534938 -447576 -425915 -511780 -451887 -445361
1765 -445361 -532294 -598386 -684247 -708949 -539077 -404679 -458610 -412163 -404613 -430649 -571472
1754 -571472 -557872 -430329 -432759 -517888 -518686 -423590 -450880 -424750 -535166 -597892 -615512 -563833
1742 -563833 -575559 -519903 -584084 -621868 -499333 -433199 -460574 -510581 -481650 -485757 -555880 -483333
1730 -483333 -501977 -523177 -449125 -485364 -409344 -447134 -460723 -483550 -526875 -524529 -529309 -572183
1718 -572183 -558444 -429387 -516849 -719487 -581665 -439542 -501554 -614977 -487828 -494929 -439048
1707 -439048 -544859 -532859 -549548 -558966 -635708 -620559 -495873 -400736 -457596 -508212 -392239
1696 -392239 -394566 -401550 -523170 -659151 -693121 -596455 -485903 -482697 -503292 -521395 -625930
1685 -625930 -556427 -542733 -576472 -637036 -512901 -529582 -601048 -579121 -435912 -385380 -540332
1674 -540332 -492211 -457787 -481382 -436094 -371886 -519679 -543792 -477149 -381288 -363155 -497110
1663 -497110 -427108 -344848 -371386 -376064 -418098 -449629 -523224 -602233 -506861 -434335 -392747 -430576
1651 -430576 -517848 -413831 -507880 -540938 -391960 -418965 -404289 -351014 -366529 -491102 -494139
1640 -494139 -517040 -626684 -644771 -619272 -604428 -589773 -693396 -791005 -628004 -677744 -529160
1629 -529160 -450979 -434651 -408573 -453083 -493972 -502950 -501952 -560355 -574265 -581372 -520227 -506881
1617 -506881 -449925 -516595 -505411 -596422 -631889 -611044 -536050 -599777 -709172 -640287 -550850
1606 -550850 -554470 -597543 -531157 -518335 -585716 -633713 -695274 -573415 -425472 -505355 -511599 -499998
1594 -499998 -633610 -645976 -550965 -377061 -423525 -477965 -478820 -451526 -504153 -543431 -558205 -527792
1582 -527792 -552513 -579681 -687339 -702237 -649315 -563789 -514695 -388588 -318985 -402281 -501299
1571 -501299 -571440 -600219 -619074 -534980 -439532 -447808 -517517 -581021 -548516 -459393 -432542 -571918
1559 -571918 -564103 -409866 -420369 -392807 -442976 -444042 -421066 -553447 -493890 -371153 -371942 -509135
1547 -509135 -557917 -581177 -633037 -475327 -574892 -521655 -523363 -527334 -593677 -625450 -617634 -587703
1535 -587703 -584566 -557644 -466546 -441540 -473768 -540591 -578772 -599001 -603614 -517922 -479923 -543043
1523 -543043 -690202 -691838 -551034 -568471 -524959 -525146 -504498 -371609 -432401 -483885 -488640 -440625
1511 -440625 -493901 -465324 -626316 -674819 -700802 -619093 -600170 -570538 -454397 -518746 -576001
1500 -576001 -616893 -660550 -589319 -552971 -527864 -619338 -631328 -625755 -708068 -700717 -624743 -546550
1488 -546550 -515330 -567908 -516873 -638823 -713144 -631603 -364561 -344534 -411790 -409549 -606823
1477 -606823 -544378 -611053 -440889 -510240 -484779 -548282 -540150 -637947 -604701 -558311 -609556 -610221
1465 -610221 -521734 -399542 -491021 -534980 -548647 -618790 -611715 -645752 -535061 -519654 -439079
1454 -439079 -395156 -500663 -546998 -490323 -527970 -574456 -509983 -393858 -419173 -538216 -494501
1443 -494501 -460896 -504507 -459927 -414408 -485396 -490624 -537238 -663522 -720734 -697134 -592377
1432 -592377 -502304 -490580 -468578 -553309 -616588 -619893 -553300 -597860 -579208 -531916 -460836 -463011
1420 -463011 -680775 -627943 -615218 -718618 -600768 -614549 -639018 -665945 -619659 -616077 -560142
1409 -560142 -549609 -519430 -539503 -456282 -478259 -465871 -477004 -561129 -598692 -474113 -492004
1398 -492004 -599414 -531420 -443387 -467194 -621470 -641492 -649778 -569443 -494741 -528409 -559072
1387 -559072 -618586 -625990 -549180 -599810 -493437 -397721 -421360 -533973 -634802 -718749 -726559
1376 -726559 -632139 -600288 -590204 -616311 -723025 -619549 -546199 -566816 -593914 -550115 -554808
1365 -554808 -446465 -489006 -439884 -495822 -376839 -338980 -392340 -364496 -442844 -475204 -596999
1354 -596999 -682996 -597786 -513586 -529161 -563423 -575397 -639599 -712325 -535602 -521647 -464064
1343 -464064 -448153 -496521 -529659 -574329 -602417 -654597 -737770 -520166 -452193 -510454 -670288
1332 -670288 -572885 -597144 -634549 -457035 -426409 -536680 -641686 -607098 -450975 -407859 -521580
1321 -521580 -460335 -505629 -545843 -632121 -621542 -362450 -360986 -679300 -657265 -687991 -703165
1310 -703165 -644498 -627118 -699657 -707444 -637768 -614339 -548515 -593338 -532180 -635879 -716358 -577102
1298 -577102 -450998 -537934 -591418 -617546 -624331 -601460 -493735 -572356 -540975 -547365 -627994 -601417
1286 -601417 -526100 -501052 -378524 -427784 -653097 -613046 -511194 -507256 -603623 -657302 -662393
1275 -662393 -592052 -628271 -735656 -675145 -614215 -548057 -429543 -494938 -561766 -682251 -746687
1264 -746687 -625032 -536220 -468732 -444409 -493009 -344118 -465694 -581670 -664223 -612609 -496913
1253 -496913 -511253 -662977 -623303 -630758 -620635 -574076 -611904 -725994 -711376 -671003 -661766 -645308
1241 -645308 -653332 -659384 -704421 -597737 -641742 -639134 -665182 -641572 -646260 -689750 -695494 -706644
1229 -706644 -553413 -573517 -733238 -640912 -666953 -724043 -637695 -629311 -612407 -576103 -524828
1218 -524828 -500198 -568409 -569556 -503016 -576118 -668729 -641439 -563575 -499694 -412783 -486580 -498002
1206 -498002 -461847 -484929 -464328 -491063 -572268 -671703 -607729 -622364 -567448 -545199 -571308 -643174
1194 -643174 -597815 -715919 -759407 -740211 -624093 -578387 -465166 -401051 -339575 -421176 -450532
1183 -450532 -375456 -339572 -402982 -448974 -482814 -557203 -607821 -626804 -528358 -569377 -539664 -543799
1171 -543799 -552126 -670958 -598480 -482217 -519926 -571996 -631558 -690864 -598578 -655062 -623412
1160 -623412 -644577 -650268 -632637 -714035 -666847 -539160 -624159 -424953 -498612 -530462 -517304
1149 -517304 -528904 -495823 -560505 -654361 -594882 -578035 -637436 -655092 -630715 -470405 -534546
1138 -534546 -582121 -561555 -501903 -383656 -350132 -428393 -435229 -508906 -481396 -528113 -597185 -575888
1126 -575888 -569281 -504587 -527076 -668237 -789480 -819721 -795388 -772300 -685460 -845318 -856892
1115 -856892 -846525 -718008 -701236 -819466 -800036 -759110 -693235 -578869 -546185 -594258 -593174
1104 -593174 -581014 -663951 -737790 -671090 -524247 -481581 -559330 -636290 -893046 -782417 -651557
1093 -651557 -745164 -653801 -625049 -562419 -551922 -573042 -621545 -521542 -514813 -527421 -472119 -446571
1081 -446571 -586675 -664168 -538861 -544947 -427768 -494594 -609542 -667139 -631425 -537283 -582367
1070 -582367 -602365 -634269 -524049 -497797 -456702 -420879 -454850 -556164 -775241 -650662 -680237
1059 -680237 -645587 -614566 -657255 -609894 -502743 -610062 -696931 -585185 -566245 -518567 -473007
1048 -473007 -532664 -478835 -506879 -493008 -531119 -566077 -611226 -706289 -604371 -580635 -640758
1037 -640758 -667783 -612745 -593226 -561643 -506917 -493470 -673065 -615273 -498540 -495036 -554322
1026 -554322 -664303 -635765 -591181 -533109 -525725 -642929 -718483 -668562 -664799 -717333 -735392 -635737
1014 -635737 -679003 -532482 -614190 -677501 -546882 -533984 -531065 -675810 -777445 -798014 -689318
1003 -689318 -690083 -520007 -485976 -379459 -471861 -587190 -608010 -468723 -584715 -570434 -583655
992 -583655 -641805 -567192 -567378 -463692 -440623 -486221 -568350 -625824 -679842 -671101 -578042 -594080
980 -594080 -627490 -597044 -619723 -585176 -524983 -445752 -475072 -457993 -651285 -641922 -646131 -729410
968 -729410 -595913 -465651 -460028 -511925 -496325 -547473 -648221 -592696 -558598 -572494 -648692
957 -648692 -744278 -777847 -738405 -618841 -657768 -635994 -658346 -671304 -621080 -557536 -545316 -596928
945 -596928 -626070 -696881 -572377 -551030 -565923 -549727 -548282 -635413 -608460 -693429 -710009 -548609
933 -548609 -499750 -578768 -644784 -570722 -597134 -619132 -558154 -655315 -723515 -682383 -551847 -642969
921 -642969 -548658 -500852 -576272 -583275 -660455 -634494 -606064 -717272 -682064 -684280 -642981 -701407
909 -701407 -747638 -723952 -631801 -582053 -624886 -685178 -714085 -699954 -722175 -624803 -610106 -477049
897 -477049 -582594 -579444 -649934 -557874 -490329 -479287 -591264 -644367 -537870 -575572 -546808
886 -546808 -654546 -620260 -460523 -585269 -558929 -606595 -722820 -659363 -571440 -568450 -484457
875 -484457 -497544 -657276 -648738 -680628 -682512 -726358 -619077 -651832 -676253 -534814 -588704 -721270
863 -721270 -746678 -617286 -609665 -614039 -650836 -691318 -708430 -745165 -685681 -580973 -566577 -536874
851 -536874 -657160 -667101 -672087 -661986 -571743 -688642 -545387 -551262 -618140 -658127 -661671 -615735
839 -615735 -599355 -605864 -569085 -600941 -601088 -551240 -618466 -585953 -519647 -595811 -599467 -603536 -670689
826 -670689 -695850 -749852 -606199 -617592 -530633 -515402 -610705 -597379 -642776 -728532 -688372 -702123
814 -702123 -689171 -635741 -565598 -504770 -383140 -526552 -620931 -653342 -626793 -779751 -806744
803 -806744 -677721 -588016 -661649 -741385 -662843 -632436 -592140 -508741 -579704 -691615 -579367
792 -579367 -612753 -595489 -528195 -513890 -590240 -708096 -790693 -780170 -734884 -705309 -791961 -731913
780 -731913 -687695 -736206 -751411 -683689 -705964 -603189 -550114 -634807 -571711 -596286 -737195
769 -737195 -643548 -619016 -679384 -539665 -389443 -526567 -660665 -628702 -531638 -439328 -457491
758 -457491 -573020 -556654 -611060 -670109 -751915 -767493 -704861 -653430 -677042 -649206 -527336
747 -527336 -591056 -597379 -416295 -618999 -536500 -633072 -755706 -647815 -702430 -726231 -605375
736 -605375 -564129 -634105 -661443 -534944 -489098 -554202 -541250 -585732 -685175 -696129 -661626 -729540
724 -729540 -667804 -656308 -661714 -664204 -655478 -627144 -646579 -550675 -537875 -524341 -532093 -488037 -427160
711 -427160 -515213 -586701 -628994 -693042 -741355 -853512 -805609 -656536 -719497 -594147 -592347
700 -592347 -599496 -671907 -623069 -673794 -716785 -726072 -528641 -563734 -642401 -537968 -632380 -611103
688 -611103 -558370 -602311 -582503 -591791 -570910 -498247 -487354 -474216 -494353 -609631 -672644 -634944
676 -634944 -560293 -595174 -555100 -500132 -461168 -621317 -680157 -801147 -860230 -879919 -880703 -801572
664 -801572 -723827 -648100 -543514 -546325 -585692 -536751 -588268 -613206 -694968 -718229 -744635 -779915
652 -779915 -733986 -568329 -413027 -460894 -559573 -629411 -656611 -724443 -828010 -776253 -703601
641 -703601 -603142 -511214 -528441 -618203 -482478 -497805 -555532 -607362 -634470 -689714 -780799
630 -780799 -758903 -816826 -738716 -655851 -657559 -678325 -678282 -545999 -561000 -574839 -525002 -533051 -581509
617 -581509 -528950 -621456 -582126 -558518 -615151 -589986 -629666 -617719 -645000 -619652 -596980 -628266
605 -628266 -712618 -604831 -549395 -636026 -769217 -825702 -716894 -638970 -646828 -617361 -695452
594 -695452 -844902 -677339 -547229 -599464 -657639 -698367 -618001 -591986 -724435 -691540 -620085
583 -620085 -583276 -515653 -410492 -593621 -720511 -749288 -701378 -713963 -684580 -638118 -678070
572 -678070 -739032 -730959 -617153 -565999 -569711 -650818 -644394 -669507 -766214 -722265 -680359 -760199
560 -760199 -757846 -697426 -683235 -568367 -565217 -591673 -594254 -710641 -716173 -698946 -591054 -553327
548 -553327 -645279 -671534 -588460 -536322 -623842 -592191 -524357 -703584 -667812 -651080 -587216 -519278
536 -519278 -544287 -657543 -711373 -555358 -469509 -558462 -640380 -806121 -823045 -753757 -872270
525 -872270 -770994 -614363 -670999 -595611 -672635 -778691 -702635 -746341 -610583 -637048 -702015
514 -702015 -599492 -680594 -548794 -529445 -711081 -650049 -599643 -732784 -599828 -675890 -741741
503 -741741 -557764 -568251 -736942 -735084 -579085 -551398 -627733 -648427 -580714 -536914 -496297
492 -496297 -550722 -548480 -643319 -636286 -691168 -621069 -636442 -737173 -745934 -707256 -644036 -592712
480 -592712 -589128 -641546 -765473 -764480 -670038 -551390 -541200 -726159 -792697 -728544 -708737 -719371
468 -719371 -701714 -592563 -669711 -563781 -554065 -543179 -707382 -856442 -738577 -597862 -656878
457 -656878 -667906 -593030 -548282 -522708 -685959 -633052 -648427 -435825 -521010 -598770 -455933
446 -455933 -440301 -553915 -672003 -675664 -641105 -722390 -641872 -573222 -611049 -499460 -491542 -471448
434 -471448 -559082 -652802 -617060 -653026 -678559 -664884 -656191 -590141 -656337 -582935 -705143 -725263
422 -725263 -595417 -649074 -681517 -816418 -663332 -577242 -635893 -679123 -681251 -707282 -676358
411 -676358 -646560 -757464 -765711 -603115 -515014 -467970 -553396 -532632 -533344 -587546 -657337 -618245
399 -618245 -645226 -633507 -704366 -620092 -594856 -623470 -705697 -675467 -798473 -831895 -794618 -732397
387 -732397 -743378 -710128 -700021 -787025 -724280 -661891 -655642 -642981 -644403 -631653 -521923 -479666
375 -479666 -489898 -532337 -403168 -581416 -578883 -549270 -660090 -596552 -610612 -718291 -642435
364 -642435 -627035 -575991 -617497 -620490 -658050 -611273 -689311 -738628 -751572 -682330 -669324 -718206
352 -718206 -728592 -654181 -689601 -755089 -716122 -735774 -704020 -562527 -675856 -728247 -751878
341 -751878 -688164 -609801 -548757 -536291 -677334 -610372 -528032 -478897 -615986 -618876 -464636
330 -464636 -549966 -571244 -715008 -634715 -851845 -863481 -686081 -815342 -811434 -657073 -649212
319 -649212 -700341 -711677 -652871 -623360 -718358 -603301 -569955 -548404 -506097 -503177 -592813 -690971
307 -690971 -738373 -693531 -786547 -684444 -699179 -686298 -711079 -750141 -778518 -754305 -756682 -741806
295 -741806 -676725 -505330 -595192 -736354 -745876 -690768 -625566 -667163 -733999 -761484 -882337
284 -882337 -804605 -649947 -644121 -629965 -625768 -498134 -609576 -710972 -739663 -671599 -737169
273 -737169 -748953 -572843 -598447 -585675 -644543 -734565 -653493 -600057 -595015 -566387 -610604 -691229
261 -691229 -807124 -747976 -567387 -659077 -662449 -681096 -647226 -635287 -718570 -699420 -634979 -639461
249 -639461 -704005 -715459 -656661 -637330 -635377 -655494 -687225 -634307 -490800 -582608 -605733 -617450
237 -617450 -654287 -537153 -611872 -667205 -874230 -857703 -806186 -765692 -633044 -616014 -598495
226 -598495 -619017 -587039 -550088 -567690 -567069 -599591 -613544 -540872 -535627 -612024 -623309 -648400
214 -648400 -724759 -748510 -611928 -627225 -698703 -656772 -677899 -736350 -709300 -643343 -776854
203 -776854 -706013 -666583 -648536 -551994 -566429 -546604 -607692 -672440 -750387 -731504 -642182 -680998
191 -680998 -732131 -626690 -649605 -771214 -741676 -633188 -678679 -780214 -779155 -742403 -699282
180 -699282 -647454 -736027 -780646 -584221 -630243 -768047 -712312 -687871 -708111 -747714 -720530
169 -720530 -723537 -572429 -521728 -607451 -586431 -591093 -684040 -722103 -748006 -669846 -589881 -606707
157 -606707 -561312 -624035 -677718 -713655 -689880 -671478 -616681 -669738 -830540 -873020 -759191
146 -759191 -768279 -769570 -616580 -638532 -618175 -590619 -714601 -709506 -745370 -795252 -803422 -774629
134 -774629 -741421 -747719 -768498 -723975 -709270 -688067 -632134 -606672 -620887 -691049 -634384 -602189
122 -602189 -649646 -627905 -605155 -672620 -766376 -782271 -724022 -742545 -720027 -666134 -773263 -674626
110 -674626 -556413 -701889 -696229 -651080 -640059 -631809 -736100 -690607 -671609 -628820 -573339 -634306
98 -634306 -671337 -715888 -721274 -746298 -750565 -695095 -644119 -773092 -723544 -593646 -644993 -668221
86 -668221 -698063 -609898 -614385 -657770 -702731 -710655 -751900 -738772 -704619 -701268 -726480 -757167 -774410
73 -774410 -769144 -782035 -888610 -838909 -759028 -826984 -846392 -763107 -667562 -726151 -797777 -787323
61 -787323 -825960 -863416 -788658 -778575 -784912 -723050 -684468 -702445 -808825 -768606 -836040 -860074
49 -860074 -734643 -773783 -723244 -699023 -765169 -654575 -659648 -729026 -768330 -780944 -732458 -778219
37 -778219 -733663 -787886 -785502 -786505 -711046 -761767 -795461 -826289 -827649 -815100 -799690 -733411 -737803
24 -737803 -727189 -730339 -754404 -800507 -766315 -706419 -754282 -780498 -675126 -765785 -887891 -838065
12 -838065 -852985 -842377 -777054 -709885 -685771 -745813 -738783 -812440 -846439 -916844 -865993 -883218
0 -883218
$$ Imaginary data points
##PAGE= N=2
##DATA TABLE= (X++(I..I)), XYDATA
16383 -3650915 -3622812 -3547268 -3504102 -3456291 -3486930 -3405609 -3350406 -3346767 -3284657 -3254559 -3129052
16372 -3129052 -3061443 -3040800 -2971933 -2870627 -2750295 -2792728 -2772461 -2692060 -2727578 -2725412 -2653325
16361 -2653325 -2597227 -2463761 -2509267 -2369479 -2300389 -2252507 -2245598 -2194242 -2195604 -2174461 -2225174
16350 -2225174 -2097167 -1955603 -1847569 -1860936 -1895547 -1854487 -1742530 -1763426 -1645178 -1547274
16340 -1547274 -1434986 -1478643 -1567324 -1481270 -1282648 -1208735 -1261545 -1204104 -1269310 -1196900 -1080644
16329 -1080644 -1034640 -1007434 -885530 -798393 -737445 -716731 -701346 -809378 -794722 -754981 -732376
16318 -732376 -640745 -616246 -530722 -514957 -500820 -439775 -369064 -293266 -304531 -260754 -118755
16307 -118755 -61802 -20333 20282 -31053 -8179 24090 144921 170702 120474 184530 179850
16296 179850 256544 304672 356383 336422 395572 445239 460612 508610 584874 613174 683132
16285 683132 859009 803161 743188 821007 886605 884280 887230 996313 1004415 1000398 1033837 1090141
16273 1090141 1098740 1082626 1210969 1291208 1382915 1315439 1359701 1324366 1410215 1513466 1517489
16262 1517489 1629002 1556739 1601195 1600938 1566119 1638838 1677627 1727773 1777991 1814134 1890626
16251 1890626 1971956 1858964 1976314 2014833 1912086 1900468 1945246 2083004 2116575 2098978
16241 2098978 2141923 2176612 2315734 2264302 2131419 2191168 2080419 2127135 2216998 2293947 2329057
16230 2329057 2371332 2448384 2546785 2442369 2416962 2442810 2436880 2490949 2506129 2600244 2551942
16219 2551942 2624459 2650429 2683482 2604956 2618724 2571015 2705192 2731450 2799439 2678520 2622853
16208 2622853 2708817 2793380 2822666 2817121 2907107 2736561 2728589 2902089 2944074 3048061 2874165
16197 2874165 3055391 3164238 3121967 3044017 3011923 3021871 2994494 3042831 3091590 3074369 3026109
16186 3026109 3175182 3163611 3249730 3248940 3219618 3238654 3351880 3197600 3275212 3368752 3360123
16175 3360123 3375507 3330412 3364111 3353772 3355826 3410162 3464054 3447185 3376223 3346670 3404321
16164 3404321 3573213 3594990 3594456 3414873 3420579 3485377 3554867 3536414 3517851 3528739 3583118
16153 3583118 3702299 3687140 3628707 3692975 3684259 3706532 3746719 3635667 3666534 3722857 3648631
16142 3648631 3625403 3643933 3755453 3757356 3818202 3827818 3775018 3740379 3900119 3862909 3870754
16131 3870754 3864357 3827097 3841642 3822200 3747491 3710188 3785818 3894224 3964166 3840834 3757176
16120 3757176 3810307 3723083 3723883 3812024 3977694 3936555 3888617 4009496 3985657 3958240 3913958
16109 3913958 4068974 4077827 3922283 3780568 3823853 3867737 3804035 3783548 3769112 3778867 3808795
16098 3808795 3837560 3907392 3899495 4034456 3966597 4035912 3961947 3948313 3849272 3974071 3919152
16087 3919152 3918387 3895568 3998689 3978156 3912969 3894324 3875104 3893754 3828537 3849883 3776981
16076 3776981 3668643 3708507 3828187 3879150 3888639 3942606 3952146 3858881 3857589 3934183 4087695
16065 4087695 4060229 3976974 3913551 3873295 3839750 3938977 3922784 3963083 3937366 4008633 3916503
16054 3916503 3990122 4075416 4119586 4064501 4015208 3981212 3976710 4023425 4016727 3985717 4071638 4088647
16042 4088647 4012850 4050397 4034813 4167552 4219851 4053491 3940727 4152543 4247353 3973223
16032 3973223 3903234 3987037 4094712 4162677 3937802 3850910 3870587 3930747 3997375 3909439 3967595
16021 3967595 4142116 4155226 4074750 4098270 3989248 3960887 3994173 3946722 4041652 4071251 4128087
16010 4128087 4304029 4212474 4088385 4094133 4147092 4158529 4171934 4101863 4054728 4140211 4213092
15999 4213092 4252188 4244933 4085399 4028263 4058094 4060077 4088874 4036608 4100683 3971948 3885872
15988 3885872 3948925 3995803 4028870 4120234 4109394 4040403 4067223 4034567 4054519 4106711 4065833
15977 4065833 4144719 4206444 4231162 4234544 4190128 4196346 4025635 4061164 4138088 4039011 3990578
15966 3990578 3921438 3998869 4034075 4035648 4080505 4186578 4096473 4077218 4019906 4055627 4150274
15955 4150274 4187772 4126632 4095117 4114429 4044423 3863366 3916168 3988910 4064316 4066450 4018996
15944 4018996 4110602 4274697 4214886 4091021 4230010 4216120 4198054 4108379 4107125 4112729 4027670
15933 4027670 4147767 4222970 4200286 4088925 4117465 4104126 4102932 4118139 4022267 4071945 4116477
15922 4116477 4137115 4198517 4204208 4160668 4177638 4144379 4128716 4169582 4178644 4140915 4056153 4065238
15910 4065238 4154537 4030750 4157907 4073911 4152913 4051698 4076798 4149604 4051952 4160627
15900 4160627 4120115 3945288 4011549 3942137 3932302 4070815 4086238 4145834 4182342 4100770 4135812
15889 4135812 4274274 4123678 4171417 4195936 4177124 4223264 4216994 4289227 4224377 4160245 4140665
15878 4140665 4096274 4026632 4118106 4156237 4155460 4221542 4204034 4195691 4175975 4221262 4263081 4095207
15866 4095207 4189293 4223321 4178200 4145544 4044854 4074293 4176341 4112224 3937981 3993131 4044056
15855 4044056 4257008 4355835 4252400 4173208 4123565 4138818 4145478 4172491 4125719 4095027 4109308
15844 4109308 4104421 4166701 4001106 4117859 4214584 4161164 4047461 4006676 3961466 4029246 4018885
15833 4018885 3978787 4084524 4167973 4210537 4144016 4096457 4124856 4172616 4194514 4158785 4198996
15822 4198996 4152342 4321834 4354607 4288699 4237022 4101466 4107714 4128838 4209503 4184633 4077733
15811 4077733 4054165 4100401 4056592 4154828 4153744 4058110 4067382 4081936 4000150 4005405 4071950 4175330
15799 4175330 4203789 4083300 4186617 4262813 4137339 4028772 4136510 4192914 4051421 4143365
15789 4143365 4175094 4013275 4040903 4147478 4175437 4154552 4152487 4080084 4004672 4279610 4174584
15778 4174584 4058923 4123989 4036464 3981154 4152787 4195805 4196230 4262431 4172358 4089380 4103508
15767 4103508 4026497 4019455 4118644 4258918 4313855 4301282 4206235 4091299 4071019 4112481 4117033
15756 4117033 4198390 4126977 4094828 4189424 4199721 4253133 4331605 4260616 4148365 4106236 4281552
15745 4281552 4357430 4279076 4235555 4148643 4210645 4079025 4078651 4174260 4272441 4238938 4209971
15734 4209971 4191480 4230135 4179621 4085932 4277924 4335747 4163458 4196415 4057129 3971848 4090148
15723 4090148 4177001 4125198 4111508 4076734 4242738 4169357 4247295 4144891 4161350 4189078 4225180
15712 4225180 4339011 4272738 4238147 4226486 4147056 4272140 4282810 4348322 4300892 4119604 4100495
15701 4100495 4106093 4071823 4113003 4184404 4087992 4140747 4228990 4297367 4231289 4204427 4081703
15690 4081703 4124741 4129162 4205008 4167803 4187040 4115521 4138824 4249991 4230347 4139354 4108629
15679 4108629 4192043 4276979 4144744 4125718 4215166 4250245 4251009 4235523 4190814 4210431 4172616
15668 4172616 4277067 4340632 4209077 4252077 4217584 4060075 4130684 4208234 4186613 4028130
15658 4028130 4110425 4112202 4161950 4309046 4308113 4295692 4288271 4225478 4277370 4364977 4255269 4295559
15646 4295559 4319231 4253131 4224156 4245433 4377434 4331638 4241756 4224362 4165790 4130937 4240285
15635 4240285 4226473 4077965 4140569 4073429 4082065 4213790 4116966 4176166 4167567 4127122 4190449
15624 4190449 4079956 3991249 4088731 4160048 4172580 4166188 4163061 4176122 4145572 4177958 4217122
15613 4217122 4164639 4105195 4111945 4095224 4128436 4185068 4238810 4248201 4336303 4403405 4259905
15602 4259905 4301811 4497363 4392602 4251713 4194139 4227319 4209441 4038673 4044296 4148024
15592 4148024 4146226 4259719 4324343 4288390 4186982 4171618 4226181 4268150 4290131 4337439 4178981
15581 4178981 4142447 4200083 4234217 4185778 4192460 4241044 4195836 4384023 4441826 4257047 4184949
15570 4184949 4167364 4218277 4381848 4396651 4258601 4170070 4233216 4405910 4324982 4198046
15560 4198046 4308925 4301499 4225938 4228920 4100349 4056218 4316719 4382193 4326106 4241402 4287442
15549 4287442 4273427 4263633 4295081 4246171 4269867 4215742 4289125 4351919 4325201 4329605 4378178 4352106
15537 4352106 4219519 4189803 4260247 4247142 4337992 4429222 4324579 4257205 4280009 4282031 4301814
15526 4301814 4213789 4272230 4272337 4217670 4152366 4209316 4168188 4190198 4249494 4167343 4189710 4235453
15514 4235453 4247734 4286830 4303067 4329753 4266423 4197446 4353281 4339961 4234915 4264965 4246287
15503 4246287 4199416 4347099 4293602 4390326 4291938 4294703 4397229 4186424 4197912 4223488 4274621
15492 4274621 4470303 4619065 4428114 4330743 4400238 4424931 4301421 4244796 4365335 4289613
15482 4289613 4247906 4388512 4350443 4262300 4295310 4366440 4218499 4204623 4245895 4300356 4266870
15471 4266870 4309270 4391255 4295285 4196270 4159551 4142946 4203096 4273662 4263399 4407309 4393934
15460 4393934 4361874 4221664 4219633 4413248 4444004 4262372 4222522 4208941 4396473 4415486 4326866
15449 4326866 4328696 4347783 4327381 4195719 4181256 4386143 4352322 4284382 4397755 4323111 4222652
15438 4222652 4280748 4385685 4327669 4224675 4222440 4169221 4175780 4176658 4187381 4272453 4399968
15427 4399968 4397242 4394148 4209623 4157143 4301453 4280335 4299890 4467819 4521847 4512893 4314822
15416 4314822 4369467 4325295 4345111 4428233 4339036 4326791 4285537 4332657 4251913 4338185 4432924
15405 4432924 4439594 4336227 4385438 4382081 4380674 4442839 4486738 4534489 4567270 4522615 4491645 4427026
15393 4427026 4404278 4374439 4351307 4459801 4336997 4259040 4403203 4419206 4391059 4285609
15383 4285609 4408327 4535901 4483784 4480258 4366728 4312183 4392600 4415270 4302637 4237751 4202980
15372 4202980 4249671 4401337 4326317 4273871 4331401 4304629 4287049 4257722 4307801 4306077 4269251
15361 4269251 4186433 4114934 4178925 4159341 4304388 4415751 4323291 4375858 4382073 4306268 4293169
15350 4293169 4369154 4399634 4316060 4280922 4245217 4332241 4279271 4324070 4338406 4235183 4255569
15339 4255569 4316632 4330646 4343388 4319720 4318852 4338550 4365006 4475993 4470743 4440610 4333417
15328 4333417 4345824 4439424 4348408 4248590 4302902 4382701 4344500 4368759 4421139 4463581 4332845
15317 4332845 4387583 4310364 4423991 4547167 4402408 4359480 4455654 4398626 4464451 4415535 4402628
15306 4402628 4459705 4341825 4332012 4377712 4391323 4305503 4376963 4455431 4525337 4444664 4467258
15295 4467258 4527379 4310129 4321085 4318254 4288081 4429425 4447760 4343368 4174803 4271111 4298881
15284 4298881 4234473 4170997 4234115 4346663 4369410 4414536 4466146 4393163 4455078 4312901 4301739
15273 4301739 4400220 4474087 4473400 4373368 4392569 4390707 4388459 4242013 4319539 4356201 4355126 4506325
15261 4506325 4425019 4366786 4255312 4272681 4403346 4429931 4296776 4324802 4425815 4379882
15251 4379882 4421105 4423318 4413785 4344341 4414185 4427173 4335400 4390954 4286180 4437030 4517651
15240 4517651 4459707 4380170 4360121 4376957 4375701 4436443 4425102 4472047 4517489 4487723 4434317
15229 4434317 4478049 4418791 4428537 4450276 4548604 4535683 4318649 4429076 4415226 4531583 4559894
15218 4559894 4278248 4181610 4255306 4259970 4342472 4466202 4382902 4349864 4348257 4460168 4301373
15207 4301373 4300747 4483616 4425994 4410000 4453483 4405858 4343351 4388735 4297581 4397316 4428944
15196 4428944 4405675 4475027 4538178 4503357 4458921 4515021 4486325 4618007 4629224 4519547 4520875
15185 4520875 4386463 4411217 4368014 4286740 4474115 4532082 4423175 4395051 4460915 4563951
15175 4563951 4708142 4543483 4522063 4471421 4534068 4631845 4500764 4338805 4415346 4368217
15165 4368217 4396111 4535110 4510077 4554709 4540550 4481296 4453151 4431366 4343489 4277400 4465282
15154 4465282 4429693 4377946 4248218 4376503 4592148 4578033 4538133 4463050 4416829 4442752 4551064
15143 4551064 4517207 4410992 4426697 4625276 4532343 4400956 4407807 4385283 4408442 4379647 4490833
15132 4490833 4561625 4418522 4551028 4513480 4508073 4444359 4410310 4389734 4415646 4440728 4470972
15121 4470972 4452871 4483757 4350018 4228414 4305196 4260867 4265911 4357907 4432366 4373679 4397699
15110 4397699 4421536 4465730 4464833 4360751 4411799 4426940 4476870 4398216 4355373 4454225 4598847
15099 4598847 4667581 4532675 4513035 4535007 4480902 4615741 4729769 4668221 4543499 4430625
15089 4430625 4569380 4499712 4497545 4448362 4327133 4402720 4490462 4458674 4579238 4545051 4478690
15078 4478690 4484466 4523336 4628156 4558680 4583810 4410206 4401544 4450192 4509284 4544857 4557391
15067 4557391 4453727 4499874 4529194 4629920 4538720 4459737 4575609 4477955 4535053 4428667
15057 4428667 4446308 4442649 4472911 4515973 4340613 4363719 4580537 4595476 4636368 4624012 4579853
15046 4579853 4428046 4646661 4631148 4581971 4575776 4467439 4530819 4582751 4533417 4464822 4481329
15035 4481329 4420511 4392763 4459018 4578071 4743944 4607651 4623169 4693547 4655193 4618299 4623709
15024 4623709 4573973 4472307 4486878 4400469 4456213 4574289 4551426 4472478 4472820 4539089 4581120
15013 4581120 4709522 4596229 4480423 4416265 4421858 4513216 4481499 4660306 4526964 4489555
15003 4489555 4510860 4437025 4449079 4428340 4341000 4431252 4415965 4463925 4504684 4373209 4455080
14992 4455080 4514730 4474599 4527125 4467033 4513311 4419522 4519376 4550591 4636275 4588533 4671040
14981 4671040 4707461 4504847 4568418 4503149 4352631 4460111 4586451 4530506 4514336 4577725
14971 4577725 4611060 4662604 4597141 4570997 4608529 4595495 4523222 4530093 4587514 4505045 4525770
14960 4525770 4470483 4576187 4586961 4527816 4520829 4581694 4432970 4465451 4550181 4613258 4599741
14949 4599741 4681774 4757443 4677060 4659986 4699146 4636635 4529774 4550003 4459186 4385752 4427050
14938 4427050 4570996 4532516 4564966 4488805 4453868 4652992 4701613 4661098 4517719 4552772 4604381
14927 4604381 4462346 4565972 4706972 4626754 4647733 4693924 4609938 4585067 4514405 4508361 4589071
14916 4589071 4693575 4689281 4692972 4669374 4584695 4602096 4664163 4606062 4539549 4461857 4523767
14905 4523767 4590910 4496097 4557877 4685778 4577854 4506513 4603044 4615941 4557199 4445967 4460349
14894 4460349 4481516 4534821 4501626 4575210 4536827 4530966 4481856 4584137 4664131 4605565 4634587
14883 4634587 4700079 4603216 4519000 4638437 4545733 4445918 4353667 4457832 4610894 4638583 4584372
14872 4584372 4572984 4650400 4482700 4369434 4581864 4693179 4667658 4684925 4602564 4610287 4570204
14861 4570204 4642059 4506621 4456153 4591378 4655020 4713694 4761608 4677699 4625080 4522058 4454402
14850 4454402 4518220 4604749 4649739 4594986 4675619 4654107 4682774 4656353 4595627 4538567 4554091
14839 4554091 4648181 4620423 4589435 4568081 4475997 4678717 4663942 4674915 4690238 4690328 4650854 4694684
14827 4694684 4592140 4477032 4506768 4581605 4475239 4525574 4527854 4558610 4540963 4521685 4558062
14816 4558062 4525384 4534954 4686788 4765028 4670260 4705444 4611386 4582248 4584010 4623223 4627427 4662746
14804 4662746 4556010 4629088 4657030 4643205 4663768 4611253 4505455 4649585 4716653 4718513 4709641
14793 4709641 4607011 4612820 4630828 4584831 4622821 4604203 4676323 4707284 4645234 4634336 4779879
14782 4779879 4704685 4668741 4614122 4512483 4450636 4414301 4529058 4626826 4639849 4586509 4538211
14771 4538211 4562547 4562790 4577214 4538609 4534827 4596437 4503843 4595525 4731899 4697502 4724010 4581716
14759 4581716 4568912 4642795 4709527 4737392 4588064 4560718 4578106 4625761 4516730 4525149 4622784
14748 4622784 4729653 4789192 4778719 4630673 4715516 4679746 4713576 4700214 4731818 4738600 4614642
14737 4614642 4756562 4676037 4756301 4624165 4591303 4768453 4604909 4571279 4537151 4679680
14727 4679680 4638808 4535891 4533735 4520279 4567894 4721647 4688093 4646449 4647145 4659845 4679811
14716 4679811 4567784 4566151 4580998 4643564 4691035 4602472 4677724 4790870 4724631 4741164 4635199
14705 4635199 4621745 4578382 4608504 4524171 4388430 4516779 4582085 4618715 4625744 4578596 4400517
14694 4400517 4466352 4514890 4639565 4748763 4893289 4887295 4817684 4798634 4674619 4545294
14684 4545294 4595177 4617111 4546757 4651629 4652124 4562124 4510487 4613213 4665819 4812445 4829141
14673 4829141 4656687 4562159 4600275 4608627 4585440 4519923 4570422 4629192 4677442 4798528 4787721
14662 4787721 4682724 4613158 4570203 4657995 4665019 4700753 4736118 4700794 4858498 4703643 4684666
14651 4684666 4756154 4674268 4562326 4596848 4740822 4759333 4720681 4704971 4755440 4686365 4414868
14640 4414868 4487401 4622679 4606628 4794516 4829816 4586322 4599890 4700896 4740483 4694304
14630 4694304 4648861 4644981 4561168 4569886 4597723 4578371 4545037 4667332 4735936 4715604 4756739
14619 4756739 4767594 4794640 4827746 4690088 4626726 4641386 4828723 4677967 4658699 4793983
14609 4793983 4822411 4776848 4818467 4700924 4679852 4596338 4637675 4785451 4701365 4530079 4659138
14598 4659138 4738020 4757682 4729936 4636564 4545006 4621504 4557642 4560905 4648620 4631409 4689745
14587 4689745 4779880 4857256 4881060 4794694 4665791 4667227 4735500 4711537 4657164 4640469 4667718
14576 4667718 4610090 4604742 4633004 4588830 4721889 4690320 4813346 4746619 4691499 4625123 4639864
14565 4639864 4677712 4756067 4820740 4812093 4659901 4633041 4670612 4597656 4608594 4740665 4690955
14554 4690955 4674797 4721159 4803926 4907343 4810619 4773418 4771747 4740741 4705407 4775168 4706161
14543 4706161 4654729 4777022 4801548 4819202 4813406 4789261 4787925 4797299 4746671 4765200 4775555 4833947
14531 4833947 4875811 4995517 4874391 4958363 4972644 4858448 4687389 4806251 4931078 4835168
14521 4835168 4913153 4920693 4790753 4721912 4648372 4721005 4674976 4529577 4607189 4676521 4718239
14510 4718239 4742552 4704940 4826337 4786942 4743206 4745688 4711883 4740370 4624489 4568791 4658760
14499 4658760 4605902 4697681 4771539 4851998 4808170 4571252 4614564 4604982 4792497 4692977 4617210
14488 4617210 4780171 4807330 4754812 4699774 4652081 4710040 4760021 4738376 4719687 4723041 4686760
14477 4686760 4868713 4778512 4877598 4850907 4762297 4809366 4955847 4832296 4735001 4767862 4676632
14466 4676632 4719728 4798107 4684996 4636117 4739844 4848826 4880610 4783677 4772361 4784351 4670159
14455 4670159 4692340 4709763 4831778 4918359 4773577 4731830 4783682 4685833 4712510 4714132 4845016
14444 4845016 4973684 4808616 4814325 4876311 4998859 4906576 4751693 4781131 4732083 4705082 4779841
14433 4779841 4785597 4904241 4886999 4903142 4762910 4789042 4836399 4900330 4907557 4967876 5020208
14422 5020208 4936502 4853939 4836128 4833371 4879642 4925128 4831030 4672390 4638175 4797456 4793292
14411 4793292 4799541 4898208 5001692 4912308 4857795 4887141 4781941 4636479 4617089 4777311 4779216
14400 4779216 5031118 5003232 4947277 5006612 4833197 4783164 4794447 4873229 4960862 4964640 4879621
14389 4879621 4945415 4884901 4896953 4867350 4915847 4938755 5052062 5095079 4791735 4787760 4873532
14378 4873532 4856028 4843726 4783928 4786274 4835818 4916738 4878696 4846668 4870092 4919021 4926593 4865909
14366 4865909 4738419 4794036 4865988 5001452 5068073 4926356 4852097 4780638 4882551 4887322 4825742
14355 4825742 4700725 4841014 4949939 4956915 4823112 4897528 4922871 4953791 5055659 5061955 4985104
14344 4985104 4942251 4899968 4756249 4860995 4919216 4934553 4893109 4840074 4783202 4928149 4965081
14333 4965081 4819142 4959351 5035630 4919675 4877894 4783542 4797711 4775280 4810388 4760658 4748896
14322 4748896 4819716 4843645 4869071 4978197 4922250 4895682 4897805 4884398 4914577 4895331 4781337
14311 4781337 4766635 4759655 4864169 4922708 4930861 4948739 4995613 4990573 4816581 4743222 4785356
14300 4785356 4849143 4849756 4898574 4868643 4936668 4983632 5200739 5159749 5019573 4954706 4945302
$$ [...]
##END NTUPLES=NMR SPECTRUM
##END=
