##TITLE=1H_DE-80H_X3
 200.13MHz, d2o
 8 sc
 
 19ns.26.2.2025
##JCAMPDX= 6.0         $$ Bruker NMR JCAMP-DX V2.0
##DATA TYPE= NMR SPECTRUM
##DATA CLASS= NTUPLES
##ORIGIN= UXNMR, Bruker Analytische Messtechnik GmbH
##OWNER= pz
$$ XWIN-NMR		Version 3.5
$$ Wed Jun 11 10:59:25 2025 Russian Standard Time (UT+4h)  Yarkov@DPX200
##.OBSERVE FREQUENCY= 200.1313
##.OBSERVE NUCLEUS= ^1H
##.ACQUISITION MODE= SIMULTANEOUS
##.ACQUISITION SCHEME= undefined
##.AVERAGES= 8
##.DIGITISER RES= 18
##SPECTROMETER/DATA SYSTEM= spect
##.PULSE SEQUENCE= zg30
##.SOLVENT NAME= CDCl3
##.SHIFT REFERENCE= (INTERNAL, CDCl3, 0, 15.4174)
##AUDIT TRAIL= $$ (NUMBER, WHEN, WHO, WHERE, WHAT)
$$ ##TITLE= Audit trail, XWIN-NMR		Version 3.5
$$ ##JCAMPDX= 5.01
$$ ##ORIGIN= Bruker BioSpin GmbH
$$ ##OWNER= Yarkov
$$ C:/Bruker/XWIN-NMR/data/yarkov2/nmr/H-C/1/pdata/1/auditp.txt
$$ ##AUDIT TRAIL=  $$ (NUMBER, WHEN, WHO, WHERE, WHAT)
(   1,<2025-06-11 10:58:34.09 +0400>,<Yarkov>,<DPX200>,
      <created by zg, POWCHK disabled, PULCHK disabled
       configuration hash MD5:
       00 E9 B6 7A A2 85 ED C7 34 08 36 98 17 FE 4E 26
       data hash MD5: 16K
       E1 91 22 A0 4A 36 BB 85 19 6B 70 FB 6E 26 A8 68>)
(   2,<2025-06-11 10:58:44.21 +0400>,<Yarkov>,<DPX200>,
      <Start of raw data processing
       efp BC_mod = 2 LB = 0.25 FT_mod = 6 PKNL = 1 PHC0 = -1710.501 PHC1 = 9.76656 SI = 16K 
       data hash MD5: 16K
       0B 82 A2 B4 16 8A DD BA 29 3A 0E 42 33 DF 6A 39>)
(   3,<2025-06-11 10:58:49.46 +0400>,<Yarkov>,<DPX200>,
      <abs ABSG = 5 
       data hash MD5: 16K
       CB CC 3C 09 EB 0A 97 4A D4 AB DD C3 6E 21 31 6B>)
$$ ##END=
$$ 
$$ hash MD5
$$ B9 A2 99 EF FA 7F 62 3E 69 6F F8 45 94 13 13 5E
##$RELAX= 
##$RELAX= 
##$RELAX= 
##$RELAX= 
##$RELAX= 
##$RELAX= 
$$ Bruker specific parameters
$$ --------------------------
##$DU= <C:/Bruker/XWIN-NMR>
##$EXPNO= 1
##$NAME= <H-C>
##$PROCNO= 1
##$TYPE= <nmr>
##$USER= <yarkov2>
##$AMP= (0..31)
100 100 100 100 100 100 100 100 100 100 100 100 100 100 100 100 100 100 
100 100 100 100 100 100 100 100 100 100 100 100 100 100 
##$AQSEQ= 0
##$AQ_mod= 1
##$AUNM= <au_zg>
##$AUTOPOS= <>
##$BF1= 200.13
##$BF2= 200.13
##$BF3= 200.13
##$BF4= 200.13
##$BF5= 200.13
##$BF6= 200.13
##$BF7= 200.13
##$BF8= 200.13
##$BYTORDA= 1
##$CFDGTYP= 0
##$CFRGTYP= 5
##$CHEMSTR= <none>
##$CNST= (0..31)
1 1 145 1 1 1 1 1 1 1 1 1 1 1 1 1 1 1 1 1 1 1 1 1 1 1 1 1 1 1 1 1 
##$CPDPRG= <>
##$CPDPRG1= <>
##$CPDPRG2= <>
##$CPDPRG3= <>
##$CPDPRG4= <mlev>
##$CPDPRG5= <mlev>
##$CPDPRG6= <mlev>
##$CPDPRG7= <mlev>
##$CPDPRG8= <mlev>
##$CPDPRGB= <>
##$CPDPRGT= <>
##$D= (0..31)
0 0.7 0 0 0 0 0 0 0 0 0 0.03 0 0 0 0 0 0 0 0 0 0 0 0 0 0 0 0 0 0 0 0 
##$DATE= 1749625113
##$DBL= (0..7)
120 120 120 120 120 120 120 120 
##$DBP= (0..7)
150 150 150 150 150 150 150 150 
##$DBP07= 0
##$DBPNAM0= <>
##$DBPNAM1= <>
##$DBPNAM2= <>
##$DBPNAM3= <>
##$DBPNAM4= <>
##$DBPNAM5= <>
##$DBPNAM6= <>
##$DBPNAM7= <>
##$DBPOAL= (0..7)
0.5 0.5 0.5 0.5 0.5 0.5 0.5 0.5 
##$DBPOFFS= (0..7)
0 0 0 0 0 0 0 0 
##$DE= 6
$$ [...]
##$SUBNAM3= <"">
##$SUBNAM4= <"">
##$SUBNAM5= <"">
##$SUBNAM6= <"">
##$SUBNAM7= <"">
##$SUBNAM8= <"">
##$SUBNAM9= <"">
##$SW= 18.0517328524113
##$SWIBOX= (0..15)
0 0 2 0 0 0 0 0 0 0 0 0 0 0 0 0 
##$SW_h= 3612.71676300578
##$TD= 16384
##$TD0= 1
##$TE= 0
##$TE2= 300
##$TE3= 300
##$TEG= 300
##$TL= (0..7)
0 120 120 120 120 120 120 120 
##$TP= (0..7)
150 150 150 150 150 150 150 150 
##$TP07= 0
##$TPNAME0= <>
##$TPNAME1= <>
##$TPNAME2= <>
##$TPNAME3= <>
##$TPNAME4= <>
##$TPNAME5= <>
##$TPNAME6= <>
##$TPNAME7= <>
##$TPOAL= (0..7)
0.5 0.5 0.5 0.5 0.5 0.5 0.5 0.5 
##$TPOFFS= (0..7)
0 0 0 0 0 0 0 0 
##$TUNHIN= 0
##$TUNHOUT= 0
##$TUNXOUT= 0
##$USERA1= <user>
##$USERA2= <user>
##$USERA3= <user>
##$USERA4= <user>
##$USERA5= <user>
##$V9= 5
##$VALIST= <valist>
##$VCLIST= <CCCCCCCCCCCCCCC>
##$VD= 0
##$VDLIST= <DDDDDDDDDDDDDDD>
##$VPLIST= <PPPPPPPPPPPPPPP>
##$VTLIST= <TTTTTTTTTTTTTTT>
##$WBST= 1024
##$WBSW= 4
##$XGAIN= (0..3)
0 0 0 0 
##$XL= 0
##$YL= 0
##$YMAX_a= 524851
##$YMIN_a= -442811
##$ZGOPTNS= <>
##$ZL1= 120
##$ZL2= 120
##$ZL3= 120
##$ZL4= 120
##$ABSF1= 15.5078
##$ABSF2= -2.544049
##$ABSG= 5
##$ABSL= 3
##$ALPHA= 0
##$AQORDER= 0
##$ASSFAC= 0
##$ASSFACI= 0
##$ASSFACX= 0
##$ASSWID= 0
##$AUNMP= <proc_1d>
##$AZFE= 0.1
##$AZFW= 0.1
##$BCFW= 0
##$BC_mod= 2
##$BYTORDP= 0
##$COROFFS= 0
##$CY= -3
##$DATMOD= 1
##$DC= 0
##$DFILT= <>
##$DTYPP= 0
##$F1P= 0
##$F2P= 0
##$FCOR= 1
##$FTSIZE= 16384
##$FT_mod= 6
##$GAMMA= 0
##$GB= 0
##$INTBC= 1
##$INTSCL= 3.241238e-09
##$ISEN= 128
##$LB= 0.25
##$LEV0= 0
##$LPBIN= 0
##$MAXI= 10000
##$MC2= 0
##$MEAN= 0
##$ME_mod= 0
##$MI= 1.114404
##$NCOEF= 0
##$NC_proc= -6
##$NLEV= 6
##$NOISF1= 3.799351
##$NOISF2= 2.8
##$NSP= 0
##$NTH_PI= 0
##$NZP= 0
##$OFFSET= 15.41745
##$PC= 1
##$PHC0= -1710.501
##$PHC1= 9.76656
##$PH_mod= 1
##$PKNL= yes
##$PPARMOD= 0
##$PSCAL= 0
##$PSIGN= 0
##$REVERSE= no
##$SF= 200.130020863878
##$SI= 16384
##$SIGF1= 3
##$SIGF2= 2
##$SINO= 0.751879
##$SIOLD= 32768
##$SREGLST= <19F.Aceton>
##$SSB= 0
##$STSI= 16384
##$STSR= 0
##$SW_p= 3612.71676300578
##$SYMM= 0
##$S_DEV= 0
##$TDeff= 16384
##$TDoff= 0
##$TI= <>
##$TILT= no
##$TM1= 0
##$TM2= 0
##$TOPLEV= 0
##$USERP1= <user>
##$USERP2= <user>
##$USERP3= <user>
##$USERP4= <user>
##$USERP5= <user>
##$WDW= 1
##$XDIM= 16384
##$YMAX_p= 360838573
##$YMIN_p= -311430
$$ End of Bruker specific parameters
$$ ---------------------------------
##NTUPLES= NMR SPECTRUM
##VAR_NAME=  FREQUENCY,     SPECTRUM/REAL,   SPECTRUM/IMAG
##SYMBOL=    X,             R,               I
##VAR_TYPE=  INDEPENDENT,   DEPENDENT,       DEPENDENT
##VAR_FORM=  AFFN,          ASDF,            ASDF
##VAR_DIM=   16384,         16384,           16384
##UNITS=     HZ,            ARBITRARY UNITS, ARBITRARY UNITS
##FACTOR=    0.220516191357247, 1,           1
##FIRST=     3085.49458039582, 0,            0
##LAST=      -527.222182609958, 0,           0
##MIN=       -527.222182609958, -311430,     0
##MAX=       3085.49458039582, 360838573,    0
$$ Real data points
##PAGE= N=1
##DATA TABLE= (X++(R..R)), XYDATA
$$ [...]
$$ plain form
12317 36611 34671 64528 102921 40833 43542 102507 58158 -25122 12955 54619 -43902 -103213
12305 -103213 -58047 -460 41665 -1536 43086 47826 66385 138589 66889 64281 57590 26512
12293 26512 -28553 -9639 51551 52533 -15474 -43054 16330 2786 40184 6565 24533 53691
12281 53691 -40149 -42361 -64802 -78255 -41858 3180 -18905 47893 60872 56911 19673 29598
12269 29598 111779 68886 -13255 -1049 32919 42962 22567 30712 111489 99878 80977 39932
12257 39932 32982 30801 29226 575 -300 72933 16089 22490 61982 57829 13161 22629 63550
12244 63550 70547 92053 42885 24493 -58517 -47794 1874 -67458 -12808 11170 -16183 2207
12232 2207 31852 -6418 -7275 17400 35068 -2905 52469 52731 21733 22065 101384 85146 50210
$$ packed form
12317C6611j940K9857L8393o2088K709N8965m4349q3280L8077M1664r8521n9311
12305a03213M5166N7587M2125m3201M4622M740J8559P2204p1700k608o691l1078
12293B6512n5065J8914O1190R82o8007k7580N9384j3544L7398l3619J7968K9158
12281E3691r3840k212k2441j3453L6397M5038k2085O6798J2979l961l7238R925
12269B9598Q2181m2893q2141J2206L3968J0043k0395Q145Q0777j1611j8901m1045
12257C9932o950k181j575k8651q75P3233n6844O401L9492m153m4668R468M0921
12244F3550O997K1506m9168j8392q3010J0723M9668o9332N4650K3978k7353J8390
12232B207K9645l8270q57K4675J7668l7973N5374K62l0998L32P9319j6238l4936
$$ plain form
12219 50210 80625 32526 52632 75916 15147 -113787 -29298 22246 76219 48206 50881 24007
12207 24007 -20056 58978 48356 -27134 -54308 -25108 2375 59404 73 15667 15238 7381
12195 7381 30037 31813 -652 65351 45705 48333 36120 -11010 39792 103755 90363 64400
12183 64400 42967 25660 38618 5187 24283 68308 56678 42577 55058 51574 18528 -46514
12171 -46514 -95826 -47912 -634 30997 38949 -14663 -14043 -21798 11720 -9677 40831 2949
12159 2949 -7140 16058 -16381 -10432 16578 10553 -11410 -1561 -33213 -17025 -34764 9559
12147 9559 38498 87038 127486 65945 81132 68189 46780 39379 13547 14135 99242 75121
12135 75121 124100 132334 92239 75203 -4212 -31611 30766 54251 37978 12068 10366 41738
$$ packed form
12219E0210L0415m8099K0106K3284o0769j28934Q4489N1544N3973k8013K675k6874
12207B4007m4063P9034j0622p5490k7174K9200K7483N7029n9331J5594m29p857
12195G381K2656J776l2465O6003j9646K628j2213m7130N0802O3963j3392k5963
12183F4400k1433j7307J2958l3431J9096M4025j1630j4101J2481l484l3046o5042
12171d6514m9312M7914M7278L1631P952n3612O20p755L3518k1397N0508l7882
12159B949j0089K3198l2439N949K7010o025k1963R849l1652J6188j7739M4323
12147I559K8939M8540M0448o1541J5187j2943k1409p401k5832N88Q5107k4121
12135G5121M8979Q234m0095j7036p9415k7399O2377K3485j6273k5910j702L1372
$$ plain form
12123 41738 72621 29573 23753 21938 -26205 52231 77850 100094 73576 11673 92462 121412
12111 121412 47676 10236 29375 67644 30998 23468 -9415 -29642 -45219 -76658 -41663 -59881
12099 -59881 34113 94724 77459 58666 -4197 5284 26640 42699 69686 66384 55186 23304
12087 23304 -29474 -43765 -5297 48158 13852 9767 -13422 -38866 21871 -16355 -84115 -62907
12075 -62907 -13149 -36781 19524 22211 -5311 8849 16720 54232 73851 67639 93583 59033
12063 59033 -13316 1428 6251 54721 109303 83737 70857 60967 5961 76292 97379 79247
12051 79247 8254 -29812 -36164 -15871 25481 67413 -2625 2659 101653 53520 33622 -21315
12039 -21315 4616 77634 34076 -6638 18933 80498 61288 44235 55077 29000 25865 22227
$$ packed form
12123D1738L0883m3048n820j815m8143P8436K5619K2244k6518o1903Q0789K8950
12111A21412p3736l7440J9139L8269l6646p530l2883k0227j5577l1439L4995j8218
12099e9881R3994O0611j7265j8793o2863R481K1356J6059K6987l302j1198l1882
12087B3304n2778j4291L8468N3455l4306m085k3189k5444O0737l8226o7760K1208
12075f2907M9758k3632N6305K687k7522J4160P871L7512J9619o212K5944l4550
12063E9033p2349J4744M823M8470N4582k5566j2880r890n5006P0331K1087j8132
12051G9247p0993l8066o352K0293M1352M1932p0038N284R8994m8133j9898n4937
12039b1315K5931P3018m3558m0714K5571O1565j9210j7053J0842k6077l135l638
$$ plain form
12027 22227 83784 65439 -12063 19069 25523 50643 1431 -29125 -10724 50831 34174 -39427
12015 -39427 -81946 -8151 48450 45810 25409 -12640 -7383 54704 97480 88865 104891 134965
12003 134965 147575 93786 21173 4974 33436 107346 87772 12531 17055 -20661 1761 997
11991 997 -25880 -21590 680 19550 28441 83 14672 1126 19416 34109 59227 96000
11979 96000 119555 82887 25908 2160 -15375 40009 75243 -2119 18910 57926 115187 127486
11967 127486 22226 -24955 -4946 38967 31115 -529 -18975 -13023 -10238 31400 20446 -6282
11955 -6282 14806 29971 58371 10456 -66286 -26636 -10004 60854 549 54372 46056 48018
11943 48018 27228 3057 -17187 -11772 24641 58461 102790 69384 48817 -11482 22887 -39531
$$ packed form
12027B2227O1557j8345p7502L1132O454K5120m9212l0556J8401O1555j6657p3601
12015c9427m2519P3795N6601k640k0401l8049N257O2087M2776q615J6026L0074
12003A34965J2610n3789p2613j6199K8462P3910j9574p5241M524l7716K2422p64
11991I97k6877M290K2270J8870Q891k8358J4589j3546J8290J4693K5118L6773
11979I6000K3555l6668n6979k3748j7535N5384L5234p7362K1029L9016N7261J2299
11967A27486j05260m7181K0009M3913p852l1644j8446N952K785M1638j0954k6728
11955f282K1088J5165K8400m7915p6742L9650J6632P0858o0305N3823q316J962
11943D8018k0790k4171k0244N415L6413L3820M4329l3406k0567o0299L4369o2418
$$ plain form
11931 -39531 18447 18078 66555 41553 40879 57966 61709 41645 27394 79195 78798 76580 66462
11918 66462 45892 63089 94317 86206 85311 70556 34447 100 35879 34746 10669 62640
11906 62640 44134 78202 62653 22520 38330 74211 38539 28283 -3579 20645 16996 25922
11894 25922 98513 51559 25722 45385 44808 68803 60706 40033 23402 17842 -34791 8225
11882 8225 111750 105660 75847 46530 71681 95606 60517 -12541 -29086 31925 9522 25989
11870 25989 45543 66727 79753 30049 -4187 -60057 -24230 -65958 5729 41983 59735 55058
11858 55058 91605 32239 21422 35407 21355 80204 94343 91710 78695 -16045 7929 -31171
11846 -31171 -48295 34145 7639 -14071 4539 32674 61086 16174 -10826 4131 19978 38020
$$ packed form
11931c9531N7978l69M8477k5002o74J7087L743k0064j4251N1801l97k218j0118
11918F6462k0570J7197L1228q111q95j4755l6109l4347L5779j133k4077N1971
11906F2640j8506L4068j5549m0133J5810L5881l5672j0256l1862K4224l649Q926
11894B5922P2591m6954k5837J9663n77K3995q097k0673j6631n560n2633M3016
11882H225J03525o090k9813k9317K5151K3925l5089p3058j6545O1011k2403J6467
11870B5989J9554K1184J3026m9704l4236n5870L5827m1728P1687L6254J7752m677
11858E5058L6547n9366j0817J3985j4052N8849J4139k633j3015r4740K3974l9100
11846c1171j7124Q2440k6506k1710J8610K8135K8412m4912k7000J4957J5847J8042
$$ plain form
11834 38020 78307 81628 137144 129698 67466 55602 59325 42331 29610 36266 27099 5553 -18824
11821 -18824 15154 62979 29574 63503 147400 134816 36019 14621 1437 -110 5842 26104
11809 26104 25506 37548 33547 12050 121498 73314 -48801 14182 34386 43702 76713 59014
11797 59014 63763 42526 73172 62423 -5589 -34448 1621 17072 43208 57633 39132 58780
11785 58780 120927 26323 13825 25487 14987 -68204 -19153 15008 -26069 48038 32143 -998
11773 -998 9618 17124 19037 60016 5028 39223 41845 22074 18003 -9836 49724 23185 29561
11760 29561 4688 45018 29046 19835 -5110 25215 23827 30800 21029 37488 6286 29389
11748 29389 -21508 -9559 68303 91357 24997 -22059 57874 53655 24609 23188 46744 -12228
$$ packed form
11834C8020M0287L321N5516p446o2232j1864L723j6994j2721O656r167k1546k4377
11821a8824L3978M7825l3405L3929Q3897j2584r8797k1398j3184j547N952K0262
11809B6104n98J2042m001k1497J09448m8184j22115O2983K0204R316L3011j7699
11797E9014M749k1237L0646j0749o8012k8859L6069J5451K6136J4425j8501J9648
11785E8780O2147r4604j2498J1662j0500q3191M9051L4161m1077P4107j5895l3141
11773i98J0616P506J913M0979n4988L4195K622j9771m071k7839N9560k6539O376
11760B9561k4873M0330j5972r211k4945L0325j388O973r771J6459l1202K3103
11748B9389n0897J1949P7862K3054o6360m7056P9933m219k9046j421K3556n8972
$$ plain form
11736 -12228 -2361 34191 8064 31338 86864 59313 17082 10687 24529 21060 27043 13050
11724 13050 81127 56860 33363 50297 71320 71764 48056 20141 22285 7043 1785 -65591
11712 -65591 -127001 -26445 18496 84753 82262 54356 7210 -21713 -12856 62249 33908 -14949
11700 -14949 -8497 37533 42061 16020 -767 -12793 -87203 -64114 -82731 -83405 1846 -53054
11688 -53054 1994 -1665 -15638 9280 21464 -26980 53293 56844 64140 1536 8783 35446
11676 35446 10796 -7232 -34534 3052 68577 50622 4815 -9840 36811 83140 90735 56320
11664 56320 101337 92763 66208 40579 29936 -8373 -18570 4597 36366 21381 63750 41442
11652 41442 -13526 10593 5218 48662 67608 39801 -37328 -5446 13071 -2996 -36169 -68456
$$ packed form
11736a2228R867L6552k6127K3274N5526k7551m2231o395J3842l469N983j3993
11724A3050O8077k4267k3497J6934K1023M44k3708k7915K144j5242n258o7376
11712f5591o1410J00556M4941O6257k491k7906m7146k8923Q857P5105k8341m8857
11700a4949O452M6030M528k6041j6787j2026p4410K3089j8617o74Q5251n4900
11688e3054N5048l659j3973K4918J2184m8444Q0273L551P296o2604P247K6663
11676C5446k4650j8028k7302L7586O5525j7955m5807j4655M6651M6329P595l4415
11664E6320M5017q574k6555k5629j0643l8309j0197K3167L1769j4985M2369k2308
11652D1442n4968K4119n375M3444J8946k7807p7129L1882J8517j6067l3173l2287
$$ plain form
11640 -68456 -68464 -61270 -12301 -26307 28081 27437 -2171 -14525 22388 45192 31455 34761 -24071
11627 -24071 40509 53292 36720 24390 -18202 22051 -8793 -57085 -46876 19073 70994 36022
11615 36022 40279 49345 36010 68648 120419 67965 -52695 -28284 60380 31409 27493 2898
11603 2898 46173 26959 -17493 8954 64509 92475 59052 73288 4512 -18286 46507 59275
11591 59275 38182 16406 34539 77694 69329 58975 52136 32381 52209 28210 27679 -14977
11579 -14977 103099 121914 98090 85084 74059 26955 -6355 31334 -11858 -79857 -76228 -71260
11567 -71260 52649 78506 32868 73147 43835 -1843 20798 -6397 -15224 -12526 45171 7456
11555 7456 19523 8452 -27369 10336 10896 22386 39956 -16315 9464 -25123 27639 86202
$$ packed form
11640f8456qP194M8969j4006N4388o44k9608j2354L6913K2804j3737L306n8832
11627b4071O4580J2783j6572j2330m2592M0253l0844m8292J0209O5949N1921l4972
11615C6022M257R066j3335L2638N1771n2454j20660K4411Q8664k8971l916k4595
11603B898M3275j9214m4452K6447N5555K7966l3423J4236o8776k2798O4793J2768
11591E9275k1093k1776J8133M3155q365j0354o839j9755J9828k3999n31m2656
11579a4977J18076J8815k3824j3006j1025m7104l3310L7689m3192o7999L629M968
11567g1260J23909K5857m5638M0279k9312m5678K2641k7195q827K698N7697l7715
11555G456J2067j1071l5821L7705N60J1490J7570n6271K5779l4587N2762N8563
$$ plain form
11543 86202 16011 45881 20463 -44490 -14415 21622 -71067 -15629 -19344 -12046 -65294 -6601
11531 -6601 -22690 -79826 19221 49555 -22445 -61860 -57965 -17350 -8494 83429 59581 57103
11519 57103 126108 73754 32431 25661 57335 73118 54468 42315 25827 12104 23986 33188
11507 33188 23690 -7047 19208 1889 9470 27214 36754 5219 295 -24860 7192 15403 -24083
11494 -24083 -40940 -47890 20092 78701 65487 40432 68345 12721 376 6362 12073 -13335
11482 -13335 -26571 17754 73140 -625 -23490 86092 97252 24229 4875 13225 -15409 -64251
11470 -64251 -38220 30714 39029 79030 99162 79862 80277 62154 53892 -10406 -44258 -7774
11458 -7774 -18003 -35895 -39954 -77608 -20758 -29353 998 -32601 6889 18186 40929 33235
$$ packed form
11543H6202p0191K9870k5418o4953L0075L6037r2689N5438l715P298n3248N8693
11531f601j6089n7136R9047L0334p2000l9415L895M0615Q856R1923k3848k478
11519E7103O9005n2354m1323o770L1674J5783j8650j2153j6488j3723J1882R202
11507C3188r498l0737K6255j7319P581J7744R540l1535m924k5155L2052Q211l9486
11494b4083j6857o950O7982N8609j3214k5055K7913n5624j2345N986N711k5408
11482a3335j3236M4325N5386p3765k2865J09582J1160p3023j9354Q350k8634m8842
11470f4251K6031O8934Q315M0001K0132j9300M15j8123q262o4298l3852L6484
11458g774j0229j7892m059l7654N6850q595L0351l3599L9490J1297K2743p694
$$ plain form
11446 33235 29650 54300 60120 -36764 -23894 11412 50161 56393 16451 -29316 10060 89473
11434 89473 92850 30155 13233 -46552 -62401 10081 -15129 -2730 1253 36486 -36765 -49467
11422 -49467 6846 32321 -31767 9586 -41371 16285 29836 -11415 -47788 -38819 -94151 -76054
11410 -76054 -35921 60466 46268 40005 -20708 -72046 -39942 -35749 -15306 -25380 -36559 -90026
11398 -90026 -21355 -9290 16548 16191 -80736 -38776 -33183 -58432 -29178 -57139 -13450 5026
11386 5026 -9320 23627 8400 -14769 31540 23744 26256 26609 -37285 24652 41366 652 -35430
11373 -35430 30341 74040 107355 94685 18182 3002 12236 -10143 7091 55478 21778 -34311
11361 -34311 -47596 -4508 -39804 13091 41559 45692 42840 34821 73912 9279 -7464 24336
$$ packed form
11446C3235l585K4650N820r6884J2870L5306L8749O232l9942m5767L9376P9413
11434H9473L377o2695j6922n9785j5849P2482k5210J2399L983L5233p3251j2702
11422d9467N6313K5475o4088M1353n0957N7656J3551m1251l6373Q969n5332J8097
11410g6054M0133R6387j4198o263o0713n1338L2104M193K0443j0074j1179n3467
11398i0026O8671J2065K5838l57r6927M1960N593k5249K9254k7961M3689J8476
11386E026j4346L2947j5227k3169M6309p796K512L53o3894O1937J6714m0714l6082
11373c5430O5771M3699L3315j2670p6503j5180R234k2379J7234M8387l3700n6089
11361c4311j3285M3088l5296N2895K8468M133k852q019L9091o4633j6743L1800
$$ plain form
11349 24336 -7417 -1330 -16249 -15851 -3715 -46587 -70022 12356 -35920 -45119 -15707 -15240 13158
11336 13158 13357 56883 40872 3845 -70864 -51829 -36120 -30413 -31330 51485 -2008 -36653 1049
11323 1049 -28471 -18650 -28276 10221 71042 -11318 -27234 -50016 19768 22838 24111 84773 43907
11310 43907 39460 -54518 -73126 -55007 -61904 -24260 63680 84303 24351 -8814 14677 13060
11298 13060 75288 162930 105697 35509 45456 64282 35506 21539 38337 72562 77861 -19149
11286 -19149 38486 -41705 -32362 31961 24167 -18894 -13799 -28172 8151 10811 -18373 18844
11274 18844 18787 2141 17062 36355 15544 -3727 30347 28167 41725 57360 48537 18976 93082
11261 93082 76659 14443 -23633 -50796 60350 34053 31282 -3015 -32240 -60922 -15927 -38395
$$ packed form
11349B4336l1753O087j4919L98J2136m2872k3435Q2378m8276r199K9412M67K8398
11336A3158J99M3526j6011l7027p4709J9035J5709N707r17Q2815n3493l4645L7702
11323A049k9520R821r626L8497O0821q2360j5916k2782O9784L070J273O0662m0866
11310D3907m447r3978j8608J8119o897L7644Q7940K0623n9952l3165K3491j617
11298A3060O2228Q7642n7233p0188R947J8826k8776j3967J6798L4225N299r7010
11286a9149N7635q0191R343O4323p794m3061N095j4373L6323K660k9184L7217
11274A8844n7j6646J4921J9293k0811j9271L4074k180J3558J5635q823k9561P4106
11261I3082j6423o2216l8076k7163J11146k6297k771l4297k9225k8682M4995k2468
$$ plain form
11249 -38395 -61952 55503 -26822 -48936 -34946 -7314 8470 -14681 -52200 13459 40775
11238 40775 85047 94380 -8400 -20820 9141 -5424 28474 -1697 37147 85178 86733 67136
11226 67136 -27861 -53974 -1332 17052 28540 89132 51539 36524 116151 97464 65952 36889
11214 36889 32457 74703 60476 148271 147497 75942 106303 123112 27585 18259 7909 82022
11202 82022 68003 71786 106203 115254 129835 104270 35953 15514 21853 52936 81492 56907
11190 56907 43039 83534 21243 -3007 14474 19706 38340 66713 26419 -29189 -44725 -9700
11178 -9700 19029 74804 59145 46631 31522 65450 57943 54737 59737 51363 7752 -7099 -22389
11165 -22389 -65453 17467 -16090 -4835 7491 21612 90181 73580 78621 84741 60859 72060
$$ packed form
11249c8395k3557J17455q2325k2114J3990K7632J5784k3151l7519O5659K7316
11238D0775M4272R333j02780j2420K9961j4565L3898l0171L8844M8031J555j9597
11226F7136r4997k6113N2642J8384J1488O0592l7593j5015P9627j8687l1512k9063
11214C6889m432M2246j4227Q7795p74p1555L0361J6809r5527r326j0350P4113
11202H2022j4019L783L4417R051J4581k5565o8317k0439O339L1083K8556k4585
11190E6907j3868M0495o2291k4250J7481N232J8634K8373m0294n5608j5536L5025
11178i700K8729N5775j5659j2514j5109L3928p507l206N000q374m3611j4851j5290
11165b2389m3064Q2920l3557J1255J2326J4121O8569j6601N041O120k3882J1201
$$ plain form
11153 72060 91017 66473 26950 8150 33734 -24059 3601 62171 34385 35901 -6816 51134
11141 51134 96858 -36890 -66509 -40472 15472 -62347 -87812 -15234 51076 48146 1085 80853
11129 80853 38836 20622 -10262 -18377 -18056 21008 -29415 3738 11230 -4618 -3036 -344 -68980
11116 -68980 -36712 16964 -5273 35387 -8454 -5266 -147 24580 15217 -18412 18687 70189
11104 70189 49621 -3341 -4405 10145 -4311 -17733 34667 41276 12326 -6850 -5049 28413
11092 28413 86724 47976 51841 29410 31484 58076 -8696 31587 32459 41136 83785 11754 -5176
11079 -5176 -49785 -55958 -6020 -32103 -3419 42328 50102 9729 -66557 -22621 -23755 -1617
11067 -1617 -1067 -15115 -23271 -37190 -20503 7534 -9686 -6389 -37896 28966 18383 -11628 7244
$$ packed form
11153G2060J8957k4544l9523j8800K5584n7793K7660N8570k7786J516m2717N7950
11141E1134M5724j33748k9619K6037N5944p7819k5465P2578O6310k930m7061P9768
11129H0853m2017j8214l0884q115L21L9064n0423L3153P492j5848J582K692o8636
11116f8980L2268N3676k2237M0660m3841L188N119K4727r363l3629L7099N1502
11104G0189k0568n2962j064J4550j4456j3422N2400O609k8950j9176J801L3462
11092B8413N8311l8748L865k2431K074K6592o6772M0283Q72Q677M2649p2031j6930
11079e176m4609o173M9938k6083K8684M5747P774m0373p6286M3936j134K2138
11067a617N50j4048q156j3919J6687K8037j7220L297l1507O6862j0583l0011J8872
$$ plain form
11054 7244 36340 85298 61349 36733 22833 -6875 -16215 -4679 -55561 -6076 50153 16203
11042 16203 -20694 -32275 6578 -7421 -47689 -14666 6526 5786 53393 16166 -91317 -64819
11030 -64819 -4051 -7367 -1451 60112 13627 83605 132170 97052 94852 83242 56040 62490
11018 62490 93529 49295 46790 76224 71422 14149 -51464 9678 15120 1933 -34055 -28507
11006 -28507 -23197 20428 1395 44183 40640 48887 -13446 13449 99823 41297 -11917 -75070
10994 -75070 -25218 -1243 -25710 -15284 65490 59532 16066 -3438 -57509 -45598 -32639 -11581
10982 -11581 -7313 39488 68167 3247 -26969 -21136 9762 26157 40798 15511 17942 -52673
10970 -52673 -54935 20776 -31239 -49738 -54793 -57861 1730 8232 -57335 -73867 -21026 -20773 -90175
$$ packed form
11054G244K9096M8958k3949k4616j3900k9708r340J1536n0882M9485N6229l3950
11042A6203l6897j1581L8853j3999m0268L3023K1192p40M7607l7227j07483K6498
11030f4819O0768l316N916O1563m6485O9978M8565l5118k200j1610k7202O450
11018F2490L1039m4234k505K9434m802n7273o5613O1142N442j3187l5988N548
11006b8507N310M3625j9033M2788l543Q247o2333K6895Q6374n8526n3214o3153
10994g5070M9852K3975k4467J0426Q0774n958m3466j9504n4071J1911J2959K1058
10982a1581M268M6801K8679o4920l0216N833L0898J6395J4641k5287K431p0615
10970e2673k262P5711n2015j8499n055l068N9591O502o5567j6532N2841K53o9402
$$ plain form
10957 -90175 -116231 -51579 -73720 -64607 -91911 -63162 -2050 -64480 -76597 -58768 21798 26286
10945 26286 -27103 -6787 6590 -14127 5235 -25118 4980 -24972 -1072 12007 54475 92683
10933 92683 60105 -11682 -77940 -60338 -1932 55664 44677 9517 1309 31846 20804 -11989
10921 -11989 -18278 69443 34152 -63305 -36428 10974 8770 -30985 -79233 -115984 -124470 -51473
10909 -51473 -24892 24592 24176 3542 -3093 50534 23338 9125 58525 81183 9859 32934
10897 32934 16061 -44473 -24646 -27238 10678 57812 19936 -33840 -28162 -1369 37593 -11175
10885 -11175 -4296 -27729 -72304 -46845 31937 5762 -28255 -20518 -28940 -66927 -34267 18264
10873 18264 2135 -1285 15401 -4126 -57812 -16939 -10133 25220 30930 39881 24717 29242 16470
$$ packed form
10957i0175k6056O4652k2141R113k7304K8749O1112o2430j2117J7829Q0566M488
10945B6286n3389K0316J3377k0717J9362l0353L0098k9952K3900J3079M2468L8208
10933I2683l2578p1787o6258J7602N8406N7596j0987l5160q208L0537j1042l2793
10921a1989o289Q7721l5291r7457K6877M7402k204l9755m8248l6751q486P2997
10909e1473K6581M9484m16k0634o635N3627k7196j4213M9400K2658p1324K3075
10897C2934j6873o0534J9827k592L7916M7134l7876n3776N678K6793L8962m8768
10885a1175O879k3433m4575K5459P8782k6175l4017P737q422l7987L2660N2531
10873A8264j6129l420J6686j9527n3686M0873O806L5353N710Q951j5164M525j2772
$$ plain form
10860 16470 -9736 -24773 -86591 -113851 -55435 -14130 -72232 -88537 -76436 1943 29567 -12301
10848 -12301 -54739 -25886 -6621 -52779 2094 51080 57092 48685 57204 1598 -48638 3873
10836 3873 -56166 -97076 -82156 -87137 -32584 -2280 -363 -17215 842 -4773 13616 20484 22079
10823 22079 4451 4223 13574 -29162 -47162 -3585 -18862 -36170 -57843 -80370 -91993 -115643
10811 -115643 -41455 -56531 -38181 -21829 -6876 -68050 -47438 -44373 -10794 30916 16652 -10356
10799 -10356 -58794 -55041 -75794 -31720 -83872 -8483 15747 8954 -62005 -66882 28751 -11226
10787 -11226 -49152 -107044 -43124 -10352 -45616 -36985 55400 56964 -7948 75258 73245 4975
10775 4975 -8667 22238 22180 3075 2934 -105925 -65305 -34305 -61132 -100707 -95875 -108568 -56254
$$ packed form
10860A6470k6206j5037o1818k7260N8416M1305n8102j6305J2101P8379K7624m1868
10848a2301m2438K8853J9265m6158N4873M8986O012q407Q519n5606n0236N2511
10836C873o0039m0910J4920m981N4553L0304J917j6852J8057n615J8389O868J595
10823B2079j7628k28R351m2736j8000M3577j5277j7308k1673k2527j1623k3650
10811a15643P4188j5076J8350J6352J4953o1174K0612L065L3579M1710j4264k7008
10799a0356m8438L753k0753M4074n2152P5389K4230o793p0959m877R5633l9977
10787a1226l7926n7892O3920L2772l5264Q631R2385J564o4912Q3206k013o8270
10775D975j3642L0905n8j9105j41j08859M0620L1000k6827l9575M832j2693N2314
$$ plain form
10762 -56254 -55809 -23635 55903 72266 25740 7233 -11533 -3148 -4709 33480 17718 -34191
10750 -34191 15254 -878 -12832 -43119 -39610 -47494 25839 8707 -2166 -25084 -51681 9129
10738 9129 58280 31864 -79171 -62558 -77130 -83383 -31718 -18545 6339 -9667 -41184 30672
10726 30672 19333 -38974 7612 59192 37859 59449 4033 -38498 -7207 -52085 -32837 -39661
10714 -39661 -18838 -10493 -80055 -68193 -27647 -33935 -59186 -118222 -90842 -18508 41483 -426
10702 -426 -11112 -46499 -17981 -76686 -11218 91965 69839 9701 -8515 -58718 6993 -29829
10690 -29829 -45817 32200 -38523 -134608 -133477 -46379 -49000 -118238 -102845 -8627 -45565 -53501
10678 -53501 -30451 10719 84425 71213 85431 49168 21298 56027 -10364 -26429 -44484 -64039
$$ packed form
10762e6254M45L2174P9538J6363m6526j8507j8766Q385j561L8189j5762n1909
10750c4191M9445j6132j1954l0287L509p884P3333j7132j0873k2918k6597O0810
10738I129M9151k6416j11035J6613j4572o253N1665J3173K4884j6006l1517P1856
10726C0672j1339n8307M6586N1580k1333K1590n5416m2531L1291m4878J9248o824
10714c9661K0823Q345o9562J1862M0546o288k5251n9036K7380P2334N9991m1909
10702d26j0686l5387K8518n8705O5468J03183k2126o0138j8216n0203O5711l6822
10690b9829j5988P8017p0723r6085J131Q7098k621o9238J5393R4218l6938p936
10678e3501K3050M1170P3706j3212J4218l6263k7870L4729o6391j6065j8055j9555
$$ plain form
10666 -64039 -49402 -58859 -71288 -53949 -49283 27606 5084 -62843 -85622 -71127 -124586 -102857
10654 -102857 -170911 -173082 -71640 -49247 -18028 -54152 -25877 -34531 -97020 -80001 -59958 -47406
10642 -47406 -75619 -75562 5591 14705 -17737 -5593 -47331 -58854 -35724 -37168 -26304 -33419 -18916
10629 -18916 -27067 -71580 2672 9703 -29015 -94518 -85017 -46283 42090 41694 -9706 -14567 15830
10616 15830 -22419 -32052 16686 -6118 -65426 -28195 -8044 -54438 -67777 -87911 -19971 -50642
10604 -50642 -63643 -41542 -62807 -77551 -61735 -43244 1478 -25928 -26922 -12409 5567 32590
10592 32590 18410 -7978 30859 63790 -16658 -13734 15945 -8194 -53089 -92734 -76115 -101712
10580 -101712 -72646 -136345 -152895 -129975 -153192 -129990 -77932 -116153 -97084 -96797 -61460 -101927
$$ packed form
10666f4039J4637r457j2429J7339M666P6889k2522o7927k2779J4495n3459K1729
10654a02857o8054k171J01442K2393L1219l6124K8275q654o2489J7019K0043J2552
10642d7406k8213N7Q1153R114l2442J2144m1738j1523K3130j444J0864p115J4503
10629a8916q151m4513P4252P031l8718o5503R501L8734Q8373l96n1400m861L0397
10616A5830l8249r633M8738k2804n9308L7231K0151m6394j3339k0134O7940l0671
10604e0642j3001K2101k1265j4744J5816J8491M4722k7406r94J4513J7976K7023
10592C2590j4180k6388L8837L2931q0448K924K9679k4139m4895l9645J6619k5597
10580a01712K9066o3699j6550K2920k3217K3202N2058l8221J9069K87L5337m0467
$$ plain form
10568 -101927 -80143 -28049 -21283 -70796 -37842 -60989 -41560 -16227 -78048 -99507 -93496 -39058
10556 -39058 13455 14233 -147438 -106328 -81716 -57728 6481 -27950 -41284 -74389 -37537 -254
10544 -254 4431 -94438 -86335 -116732 -122252 -108434 -92681 -79985 -88971 -87839 -81384 -77980 -117290
10531 -117290 -61647 -115246 -69850 -24976 -30242 -133348 -77631 -62896 -24134 -28008 -106238 -80992
10519 -80992 -62480 -40358 -18551 -149975 -87734 -463 -12712 20937 -74563 -69933 -73463 -32654
10507 -32654 70022 14742 24737 -50887 -25481 -11467 -28141 -11197 -21016 -49386 -47473 -42731
10495 -42731 -33929 -26103 30056 14491 -60006 -66050 -45634 -57476 -33754 11189 -28414 -40672
10483 -40672 -56230 4032 -4010 -21108 -42361 -44845 -51663 -74586 -92897 -53805 -93815 -181331
$$ packed form
10568a01927K1784N2094O766m9513L2954k3147J9429K5333o1821k1459O011N4438
10556c9058N2513P78j61671M1110K4612K3988O4209l4431j3334l3105L6852L7283
10544b54M685r8869Q103l0397n520J3818J5753J2696q986J132O455L404l9310
10531a17290N5643n3599M5396M4874n266j03106N5717J4735L8762l874p8230K5246
10519h0992J8512K2122K1807j31424O2241Q7271j2249L3649r5500M630l530M0809
10507c2654J02676n5280R995p5624K5406J4014j6674J6944r819k8370J913M742
10495d2731Q802P826N6159j5565p4497o044K0416j1842K3722M4943l9603j2258
10483d0672j5558O0262q042j7098k1253k484o818k2923j8311L9092m0010q7516
$$ plain form
10471 -181331 -195987 -129704 -45095 -3150 -4593 -30597 -45429 -93388 -12456 -23224 -40091 16468
10459 16468 -9254 -70257 -65207 -35275 -92071 -48345 -39359 -82559 -32022 -68449 -50400 -17501
10447 -17501 -59545 -21207 2015 -50799 -54842 -74028 -78676 -38334 -125118 -76101 -16874 -36400
10435 -36400 -112974 -54208 -19223 -33529 -123841 -72604 -40435 -27975 -6302 -82637 -86819 -9653
10423 -9653 -36930 -84298 -129071 -79417 -20580 -24704 -52420 -128176 -133253 -94100 -93217 -70691 20667
10410 20667 -19713 -74610 -63050 -24525 -41550 -84884 -129889 -45987 -31660 -66386 -35272 -45020
10398 -45020 -91804 -45830 -89860 -143786 -72140 -34696 -91616 -113628 -55422 -39301 -94647 -87859
10386 -87859 -124885 -142193 -110366 -55334 -57424 33983 6035 -96800 -66378 -65798 -54907 -56417
$$ packed form
10471a81331j4656O6283Q4609M1945j443k6004j4832m7959Q0932j0768j6867N6559
10459A6468k5722o1003N050K9932n6796M3726Q986m3200N0537l6427J8049L2899
10447a7501m2044L8338K3222n2814m043j9186m648M0342q6784M9017N9227j9526
10435c6400p6574N8766L4985j4306r0312N1237L2169J2460K1673p6335m182P7166
10423i653k7277m7368m4773M9654N8837m124k7716p5756n077L9153Q83K2526R1358
10410B0667m0380n4897J1560L8525j7025m3334m5005Q3902J4327l4726L1114r748
10398d5020m6784M5974m4030n3926P1646L7444n6920k2012N8206J6121n5346O788
10386h7859l7026j7308L1827N5032k090R1407k7948j02835L0422N80J0891j510
$$ plain form
10374 -56417 -85191 -42433 -13852 -17365 43712 1124 30281 20119 -26077 -77175 -88724 -109271
10362 -109271 -97543 -107233 -126934 -55887 20359 -42356 -52930 -74627 -41610 -21320 -52625 -77508
10350 -77508 -7466 40680 24859 18419 -28530 -72325 -73131 -54467 -76491 -89959 -37414 6905
10338 6905 -44153 -58905 -49432 -25138 -67193 -154473 -117007 -131452 -172513 -124037 -158905 -118886
10326 -118886 -87249 -114945 -140728 -105571 -159336 -163629 -112956 -118908 -85173 -97019 -145570 -182901
10314 -182901 -242468 -145116 -129023 -100379 -82589 -67884 -58715 -48058 -102249 -125163 -68933 -96461
10302 -96461 -88486 -113679 -104468 -48891 -50604 -53162 -113568 -120504 -96035 -87194 -29194 -24426 -111284
10289 -111284 -161852 -154787 -152475 -60164 -111239 -98131 -21832 -22914 -81545 -144916 -93321 -62946
$$ packed form
10374e6417k8774M2758K8581l513O1077m2588K9157j0162m6196n1098j1549k0547
10362a09271J1728r690j9701P1047P6246o2715j0574k1697L3017K0290l1305k4883
10350g7508P0042M8146j5821o440m6949m3795q06J8664k2024j3468N2545M4319
10338F905n1058j4752R473K4294m2055q7280L7466j4445m1061M8476l4868M0019
10326a18886L1637k7696k5783L5157n3765m293N0673n952L3735j1846m8551l7331
10314a82901n9567R7352J6093K8644J7790J4705R169J0657n4191k2914N6230k7528
10302i6461P975k5193R211N5577j713k558o0406o936K4469Q841N8000M768q6858
10289a11284n0568P065K312R2311n1075J3108P6299j082n8631o3371N1595L0375
$$ plain form
10277 -62946 -94345 -137567 -97090 -77663 -107172 -51932 -52373 -34704 3276 -26825 -42503 -33098
10265 -33098 -57069 -40930 -100636 -148458 -55448 -59643 -103523 -156702 -129894 -105918 -110815 -89145
10253 -89145 -99695 -80574 -108741 -121014 -142407 -152339 -105408 -70308 -60812 -61933 -25703 -16908
10241 -16908 -42951 -77990 -41387 -76229 -103518 -100822 -35285 -48980 -105807 -100580 -187073 -231867
10229 -231867 -193577 -169980 -106968 -57900 -64807 -38324 11968 -62812 -100725 -139163 -123165 -126207
10217 -126207 -163179 -135762 -158295 -120443 -168170 -120451 -76705 15850 -11555 -23613 -54463
10206 -54463 -110408 -80123 -6004 35223 -54157 -93295 -135990 -118552 -160127 -214932 -173042 -188787
10194 -188787 -133271 -110744 -151677 -184044 -153302 -74211 -76965 -90983 -115082 -76962 -75685 -100844
$$ packed form
10277f2946l1399m3222M0477J9427k9509N5240m41J7669L7980l0101j5678R405
10265c3098k3971J6139n9706m7822R3010m195m3880n3179K6808K3976m897K1670
10253h9145j0550J9121k8167j2273k1393r932M6931L5100R496j121L6230Q795
10241a6908k6043l5039L6603l4842k7289K696O5537j3695n6827N227q6493m4794
10229b31867L8290K3597O3012M9068o907K6483N0292p4780l7913l8438J5998l042
10217a26207l6972K7417k2533L7852m7727M7719M3746R2555k7405j2058l0850
10206e4463n5945L0285P4119M1227q9380l9138m2695J7438m1575n4805M1890j5745
10194a88787N5516K2527m0933l2367L0742P9091k754j4018k4099L8120J277k5159
$$ plain form
10182 -100844 -5437 -17844 -60275 -147321 -113619 -71695 -108145 -104021 -76218 -65287 -22298 -44252
10170 -44252 -129510 -130361 -125697 -143342 -122138 -145705 -73741 -106605 -153684 -83472 -141401 -152976
10158 -152976 -150088 -154143 -129102 -117703 -128982 -152970 -85941 -48536 -125493 -119217 -111635 -146032
10146 -146032 -97616 -42145 -75926 -128283 -83278 -81971 -44584 -10079 -2606 -10863 -67230 -71368
10134 -71368 -13010 -10025 -101120 -51172 -81399 -120286 -122337 -126735 -96979 -67113 -78657 -74738
10122 -74738 -117742 -83446 -110017 -76092 -134185 -113953 -66882 -70284 -102911 -100198 -129489 -130915
10110 -130915 -172946 -190921 -135878 -162433 -118958 -158218 -160848 -196189 -121504 -105109 -121714 -91430
10098 -91430 -57129 -89364 -134186 -122601 -43431 4183 -76327 -126193 -146687 -136747 -76331 -130577
$$ packed form
10182a00844R5407j2407m2431q7046L3702M1924l6450M124K7803J0931M2989k1954
10170d4252q5258q51M664j7645K1204k3567P1964l2864m7079P0212n7929j1575
10158a52976K888m055K5041J1399j1279k3988O7029L7405p6957O276P582l4397
10146a46032M8416N5471l3781n2357M5005J307L7387L4505P473q257n6367m138
10134g1368N8358K985r1095M9948l0227l8887k051m398K9756K9866j1544L919
10122g4738m3004L4296k6571L3925n8093K0232M7071l402l2627K713k9291j426
10110a30915m2031j7975N5043k6555M3475l9260k630l5341P4685J6395j6605L0284
10098i1430L4301l2235m4822J1585P9170M7614q0510m9866k0494R940O0416n4246
$$ plain form
10086 -130577 -234263 -182343 -158335 -86520 -34127 -48490 -69243 -75115 -88096 -149107 -172619
10075 -172619 -106483 -87757 -55759 -84683 -164289 -146616 -97374 -84393 -135782 -158836 -100620
10064 -100620 -68992 -84702 -38841 -103667 -61060 -16068 -52445 -52755 -77796 -28935 -39797 -118750
10052 -118750 -143874 -133496 -101689 -67344 -100152 -93350 -97643 -159394 -164959 -29041 -93231 -141164
10040 -141164 -82499 -47135 -20449 -106334 -133521 -137118 -139444 -142142 -153974 -164500 -102127 -125775
10028 -125775 -142870 -112721 -146645 -150025 -136069 -91205 -96966 -55007 -97214 -111928 -110657 -136104
10016 -136104 -113501 -128664 -115570 -184801 -145370 -145401 -64133 -69945 -81725 -39619 -71211 -115517
10004 -115517 -119416 -124153 -127824 -170527 -207139 -158250 -99637 -111195 -60943 -69719 -67696 -74308 -91214
$$ packed form
10086a30577j03686N1920K4008P1815N2393j4363k0753n872j2981o1011k3512
10075a72619O6136J8726L1998k8924p9606J7673M9242J2981n1389k3054N8216
10064a00620L1628j5710M5861o4826M2607M4992l6377l10k5041M8861j0862p8953
10052a18750k5124J0378L1807L4345l2808O802m293o1751n565J35918o4190m7933
10040a41164N8665L5364K6686q5885k7187l597k326k698j1832j0526O2373k3648
10028a25775j7095L0149l3924l380J3956M4864n761M1959m2207j4714J271k5447
10016a36104K2603j5163J3094o9231L9431l1Q1268n812j1780M2106l1592m4306
10004a15517l899m737l671m2703l6612M8889N8613j1558N0252q776K023o612j6906
$$ plain form
9991 -91214 -127536 -142763 -81888 -101318 -111754 -87090 -134746 -98688 -24314 -6584 -8305 -17641
9979 -17641 -91265 -102899 -76250 -131534 -131821 -134733 -111255 -97652 -104008 -95871 -99340 -98055 -78411
9966 -78411 -91550 -55668 -93693 -70161 -95559 -108978 -98359 -85825 -142880 -180621 -64182 -97008
9954 -97008 -78743 -65085 -157353 -164429 -137455 -85002 -63399 -109162 -139953 -180513 -203603 -106314
9942 -106314 -113995 -170846 -236657 -150494 -90286 -62475 -63984 -77984 -85043 -126229 -103286 -131600
9930 -131600 -135406 -93878 -100486 -56073 -32004 -71902 -157269 -142178 -74737 -74635 -52799 -102438
9918 -102438 -123204 -71619 -39181 -133918 -180683 -162984 -138712 -124830 -154624 -129259 -129325 -149511
9906 -149511 -74549 -106729 -100763 -72733 -97765 -135687 -95011 -44509 -64691 -69233 -83400 -104824
$$ packed form
9991i1214l6322j5227O0875j9430j0436K4664m7656L6058P4374J7730j721r336
9979a7641p3624j1634K6649n5284k87k912K3478J3603o356Q137l469J285J9644
9966g8411j3139L5882l8025K3532k5398j3419J0619J2534n7055l7741J16439l2826
9954i7008J8265J3658r2268p076K6974N2453K1603m5763l0791m0560k3090R7289
9942a06314p681n6851o5811Q6163O0208K7811j509j4000p059m1186K2943k8314
9930a31600l806M1528o608M4413K4069l9898q5367J5091O7441J02K1836m9639
9918a02438k0766N1585L2438r4737m6765J7699K4272J3882k9794K5365o6k0186
9906a49511P4962l2180N966K8030k5032l7922M0676N0502k0182m542j4167k1424
$$ plain form
9894 -104824 -171941 -206934 -177794 -143605 -157768 -177388 -196449 -199997 -191150 -123992 -107349 -131115
9882 -131115 -172140 -134331 -71183 -122921 -83823 -72353 -98532 -71861 -129721 -127211 -103829 -123431
9870 -123431 -68726 -51055 -84702 -120021 -175808 -138331 -146742 -167896 -126414 -129709 -126216 -109358
9858 -109358 -77661 -87512 -101315 -151915 -156786 -82122 -17651 32996 -43933 -100312 -39407 -72309
9846 -72309 -141227 -193795 -133563 -111788 -117308 -113882 -77469 -74486 -67141 -190449 -135169 -51943
9834 -51943 -92779 -90227 -118113 -58709 -48263 -41635 -56677 -85880 -139445 -97090 -55353 -102328
9822 -102328 -147870 -94759 -40688 -89459 -73946 -99208 -99966 -67173 -184512 -205712 -185725 -191376
9810 -191376 -206393 -157579 -143986 -126965 -93179 -59686 -141495 -103429 -133839 -126688 -68258 -57647
$$ packed form
9894a04824o7117l4993K9140L4189j4163j9620j9061l548Q847O7158J6643k3766
9882a31115m1025L7809O3148n1738L9098J1470k6179K6671n7860K510K3382j9602
9870a23431N4705J7671l3647l5319n5787L7477q411k1154M1482l295L493J6858
9858a09358L1697r851j3803n0600m871P4664O4471N0647p6929n6379O0905l2902
9846g2309o8918n2568O0232K1775n520L426L6413K983P345j23308N5280Q3226
9834e1943m0836K552k7886N9404J0446O628j5042k9203n3565M2355M1737m6975
9822a02328m5542N3111N4071m8771J5513k5262p58L2793j17339k1200J9987n651
9810a91376j5017M8814J3593J7021L3786L3493q1809L8066l0410P151N8430J0611
$$ plain form
9798 -57647 -125687 -150082 -151988 -175790 -69023 -51943 -61430 -150494 -145165 -87384 -80502 -121949
9786 -121949 -77718 -74974 -138119 -183342 -140005 -79599 -99751 -133478 -116368 -97530 -90866 -70817
9774 -70817 -41083 -45641 -111797 -85709 -97556 -160533 -163318 -117569 -110865 -98612 -128380 -138905
9762 -138905 -110848 -131691 -72738 -31153 -71553 -86082 -94142 -55746 -39952 -71608 -115005 -129791
9750 -129791 -78151 -127602 -165739 -150648 -140564 -165808 -138494 -114673 -46347 -3143 343 14535
9738 14535 -18276 -109143 -96102 -37267 -90678 -160538 -142429 -109623 -41326 -12082 -35784 -41217
9726 -41217 -98976 -81367 -78267 -81901 -94003 -62476 6540 -24978 -30516 3562 9264 -58027 -57751
9713 -57751 -76595 -25627 -30780 -49626 -86758 -152864 -115245 24165 38299 2461 -17618 -76636
$$ packed form
9798e7647o8040k4395j906k3802J06767J7080r487q9064N329N7781O882m1447
9786a21949M4231K744o3145m5223M3337O0406k0152l3727J7110J8838O664K0049
9774g0817K9734m558o6156K6088j1847o2977k785M5749O704J2253k9768j0525
9762a38905K8057k0843N8953M1585m0400j4529q060L8396J5794l1656m3397j4786
9750a29791N1640m9451l8137J5091J0084k5244K7314K3821O8326M3204L486J4192
9738A4535l2811r0867J3041N8835n3411o9860J8109L2806O8297K9244k3702n433
9726d1217n7759J7609L100l634j2102L1527O9016l1518n538L4078N702o7291K76
9713e7751j8844N0968n153j8846l7132o6106L7619J39410J4134l5838k0079n9018
$$ plain form
9701 -76636 -85368 -68395 3755 12650 -8600 20315 37096 38156 -36033 -74191 -84964 -56388
9689 -56388 -53166 -11306 50286 385 -56644 -63005 -27114 -24162 -51846 -30577 -9110 3223
9677 3223 18927 -18424 -78781 -70396 -7004 -41269 -1150 33220 94542 68705 19199 21705
9665 21705 -47929 -28609 -3953 -33935 21242 51724 98926 81857 20263 -1452 34929 -3852
9653 -3852 50233 140264 156853 89035 153708 134351 194324 153090 127293 107636 45549 61356
9641 61356 71954 56666 6255 -12066 -2769 -16507 80660 51573 39708 26902 22432 3967
9629 3967 -27559 35845 57531 54000 27010 69654 81355 101906 123507 167552 98789 117342
9617 117342 180264 188165 146195 182506 195451 140475 133134 226354 198245 213409 288864 232708
$$ packed form
9701g6636q732J6973P2150Q895k1250K8915J6781J060p4189l8158j0773K8576
9689e6388L222M1860O1592m9901n7029o361L5891K952k7684K1269K1467J2333
9677C223J5704l7351o0357Q385O3392l4265M0119L4370O1322k5837m9506K506
9665B1705o9634J9320K4656k9982N5177L0482M7202j7069o1594k1715L6381l8781
9653c852N4085R0031J6589o7818O4673j9357N9973m1234k5797j9657o2087J5807
9641F1356J0598j5288n0411j8321R297j3738R7167k9087j1865j2806m470j8465
9629C967l1526O3404K1686l531k6990M2644J1701K0551K1601M4045o8763J8553
9617A17342O2922P901m1970L6311J2945n4976p341R3220k8109J5164P5455n6156
$$ plain form
9605 232708 144035 80867 56673 95229 25466 45097 28993 -15918 29756 67186 11235 -99589
9593 -99589 -145532 -47719 -13318 30920 34033 9976 23976 64522 48160 -13054 -3820 -10657
9581 -10657 -58883 -94983 -55470 -27986 -33801 -21176 -55393 -66904 5961 15749 17709 17202 26315
9568 26315 114536 66300 43473 15493 -1571 2037 -60860 -77194 -72594 -21032 -37990 -33762
9556 -33762 -68536 -107690 -97667 -23650 29324 31260 -27313 -106968 -39009 7858 16751 28374
9544 28374 32342 22209 -70382 -74222 -7683 46915 2857 4520 35223 8722 2196 -11099 15190
9531 15190 -56307 -19848 14646 53923 118910 98259 78034 44592 53091 73821 -38335 -15664
9519 -15664 51097 53921 -9419 -27857 25466 -18372 -25729 -7262 33663 47929 74208 63296
$$ packed form
9605B32708q8673o3168k4194L8556o9763J9631j6104m4911M5674L7430n5951j10824
9593i9589m5943R7813L4401M4238L113k4057J4000M0546j6362o1214R234o837
9581a0657m8226l6100L9513K7484n815J2625l4217j1511P2865R788J960n07R113
9568B6315Q8221m8236k2827k7980j7064L608o2897j6334M600N1562j6958M228
9556c3762l4774l9154J0023P4017N2974J936n8573p9655O7959M6867Q893J1623
9544B8374L968j0133r2591l840O6539N4598m4058J663L0703k6501o526j3295K6289
9531A5190p1497L6459L4494L9277O4987k0651k0225l3442Q499K0730j12156K2671
9519a5664O6761K824o3340j8438N3323m3838p357J8467M0925J4266K6279j0912
$$ plain form
9507 63296 52452 119659 164300 160095 168762 179416 141278 118659 114263 118098 158746 119487 93540
9494 93540 88391 124612 162735 155748 118969 170565 117278 48927 84501 114797 172304 205806
9482 205806 162930 148926 126638 141460 86297 70212 172813 162861 154776 177102 132547 120248
9470 120248 164715 176297 190685 247902 233186 276050 291728 376829 364201 309059 292839 287132
9458 287132 328176 351529 407663 447231 428092 413805 462440 548077 583150 449360 452342 536316
9446 536316 534749 596040 635600 660781 734723 745866 786511 860693 834733 825401 851389 896574
9434 896574 939565 1005348 1080139 1136211 1120503 1159917 1271268 1302285 1317940 1357990 1471127
9423 1471127 1505623 1578006 1613054 1659969 1769581 1871376 1935920 1965784 1999642 2087208 2211971
$$ packed form
9507F3296j0844O7207M4641m205Q667J0654l8138k2619m396L835M0648l9259k5947
9494I3540n149L6221L8123o987l6779N1596n3287o8351L5574L0296N7507L3502
9482B05806m2876j4004k2288J4822n5163j6085J02601r952q085K2326m4555j2299
9470A20248M4467J1582J4388N7217j4716M2864J5678Q5101j2628n5142j6220n707
9458B87132M1044K3353N6134L9568j9139j4287M8635Q5637L5073j33790K982Q3974
9446E36316j567O1291L9560K5181P3942J1143M0645P4182k5960r332K5988M5185
9434H96574M2991O5783P4791N6072j5708L9414J11351L1017J5655M0050J13137
9423A471127L4496P2383L5048M6915J09612J01795O4544K9864L3858Q7566J24763
$$ plain form
9412 2211971 2299808 2447606 2544981 2613508 2764037 2798969 2898052 3074505 3207061 3364849
9402 3364849 3592295 3840497 4149770 4410421 4673848 4786269 4730452 4550444 4261845 4081560
9392 4081560 3880356 3759779 3710286 3605735 3551041 3451710 3388293 3300894 3237163 3104362 2983673
9381 2983673 2965650 2923732 2786013 2657183 2658510 2565053 2434259 2372922 2320951 2285863 2177222
9370 2177222 2074892 2105589 2037649 1990100 1894873 1838005 1716804 1639707 1624559 1550775 1515160
9359 1515160 1518839 1486727 1383375 1365458 1389138 1327191 1270574 1258237 1172135 1175754 1184763 1127897
9347 1127897 1097114 1099003 1078650 1044921 1060615 1106321 1029998 999265 929278 955935 956716 910248
9335 910248 846319 901696 931063 885380 987957 974084 913946 918997 918057 860449 806712 822799
$$ packed form
9412B211971Q7837J47798R7375O8527J50529L4932R9083J76453J32556J57788
9402C364849K27446K48202L09273K60651K63427J12421n5817j80008k88599j80285
9392D081560k01204j20577m9493j04551n4694r9331o3417q7399o3731j32801j20689
9381B983673j8023m1918j37719j28830J327r3457j30794o1337n1971l5088j08641
9370B177222j02330L0697o7940m7549r5227n6868j21201p7097j5148p3784l5615
9359A515160L679l2112j03352j7917K3680o1947n6617j2337q6102L619R009n6866
9347A127897l0783J889k0353l3729J5694M5706p6323l0733o9987K6657P81m6468
9335I10248o3929N5377K9367m5683J02577j3873o0138N051r40n7608n3737J6087
$$ plain form
9323 822799 849076 826892 854316 847995 883768 825637 790717 735995 733167 769284 819281 806338
9311 806338 749501 750603 730930 772277 828216 803577 804711 793791 799387 771107 763534 756082 737189
9298 737189 711996 693926 766463 749778 770479 717921 676329 691511 736675 750468 712406 698410
9286 698410 622291 689104 675629 642224 700429 678807 679445 628118 568740 602983 613924 572052
9274 572052 663740 694540 703212 778547 824691 767763 785386 832632 803776 869229 844102 788172
9262 788172 775962 736718 735245 723999 566577 564266 656817 681771 594816 626145 689727 700235
9250 700235 706252 741917 751073 754334 695124 655895 663272 600317 550154 584815 624241 612741
9238 612741 647087 606304 617070 632332 573474 511563 648176 708723 743515 776266 744174
$$ packed form
9323H22799K6277k2184K7424o321L5773n8131l4920n4722k828L6117M9997j2943
9311H06338n6837J102j9673M1347N5939k4639J134j0920N596k8280p573p452j8893
9298G37189k5193j8070P2537j6685K0701n2558m1592J5182M5164J3793l8062j3996
9286F98410p6119O6813j3475l3405N8205k1622O38n1327n9378L4243J0941m1872
9274E72052R1688L0800Q672P5335M6144n6928J7623M7246k8856O5453k5127n5930
9262G88172j2210l9244j473j1246j57422k311R2551K4954q6955L1329O3582J0508
9250G00235O017L5665R156L261n9210l9229P377o2955n0163L4661L9426j1500
9238F12741L4346m0783J0766J5262n8858o1911J36613O0547L4792L2751l2092
$$ plain form
9227 744174 776293 814471 836442 799822 806333 754849 697164 790867 804780 773225 749304 697716
9215 697716 755960 764127 766465 774028 796069 778702 854124 929287 903906 832136 888260 947644
9203 947644 848570 843188 891972 961863 1005832 984996 975775 955519 868835 861248 922040 945809
9191 945809 890942 977330 998270 984882 970005 986218 985682 934943 930332 965630 913686 887072
9179 887072 846349 896885 900102 946837 930789 969633 978649 1004114 1020847 922018 907179 915907
9167 915907 929384 922855 912475 868435 934090 968362 1148769 1199507 1211474 1201676 1266656 1337479
9155 1337479 1399987 1433356 1388146 1412746 1434938 1496746 1479160 1467837 1496712 1498663 1500658 1481388
9143 1481388 1465135 1496522 1530222 1557165 1521816 1497538 1469349 1465164 1449594 1462850 1496691 1477038
$$ packed form
9227G44174L2119L8178K1971l6620O511n1484n7685R3703J3913l1555k3921n1588
9215F97716N8244Q167K338P563K2041j7367P5422P5163k5381p1770N6124N9384
9203I47644r9074n382M8784O9891M3969k0836r221k0256q6684p587O0792K3769
9191I45809n4867Q6388K0940j3388j4877J6213n36n0739m611L5298n1944k6614
9179H87072m0723N0536L217M6735j6048L8844R016K5465J6733r8829j4839Q728
9167I15907J3477o529j0380m4040O5655L4272J80407N0738J1967r798O4980P0823
9155A337479O2508L3369m5210K4600K2192O1808j7586j1323K8875J951J995j9270
9143A481388j6253L1387L3700K6943l5349k4278k8189m185j5570J3256L3841j9653
$$ plain form
9131 1477038 1472131 1459753 1489779 1603904 1685350 1676133 1697618 1651046 1649904 1642915 1701721 1763850
9119 1763850 1846207 1916565 1919760 2013148 2113871 2191260 2217953 2346224 2396827 2397898 2450846
9108 2450846 2468498 2570218 2525422 2549882 2632613 2720572 2898230 3085868 3216749 3389242
9098 3389242 3617674 3920978 4197987 4432695 4595238 4607075 4626386 4478357 4441837 4324796
9088 4324796 4271620 4351373 4379960 4538615 4717185 4814938 4821902 4762122 4630562 4456859 4216512
9077 4216512 3967641 3812795 3743019 3625708 3517194 3452654 3410521 3435655 3430982 3422493 3482660
9066 3482660 3566418 3595018 3668217 3815868 3878172 3868924 4025593 4149433 4190226 4302637 4403497
9055 4403497 4573198 4822811 5068020 5347519 5600750 5792250 5919791 5919224 5746746 5524386
$$ packed form
9131A477038m907j2378L0026J14125Q1446r217K1485m6572j142o989N8806O2129
9119A763850Q2357P0358L195R3388J00723P7389K6693J28271N0603J071N2948
9108B450846J7652J01720m4796K4460Q2731Q7959J77658J87638J30881J72493
9098C389242K28432L03304K77009K34708J62543J1837J9311j48029l6520j17041
9088D324796n3176P9753K8587J58655J78570R7753O964n9780j31560j73703k40347
9077D216512k48871j54846o9776j17311j08514o4540m2133K5134m673q489O0167
9066C482660Q3758K8600P3199J47651O2304r248J56669J23840M0793J12411J00860
9055D403497J69701K49613K45209K79499K53231J91500J27541n67j72478k22360
$$ plain form
9045 5524386 5432476 5389893 5459782 5571693 5696118 5871071 5994342 5978934 5826697 5668071
9035 5668071 5441612 5252521 5100013 4910921 4729880 4616776 4575018 4542733 4454194 4373725
9025 4373725 4498939 4533640 4549286 4627823 4701085 4679054 4722574 4763444 4781662 4752047 4713909
9014 4713909 4697578 4741091 4768496 4729783 4780143 4820472 4795338 4802901 4895464 5003178 5053881
9003 5053881 5161793 5263993 5464701 5569847 5689186 5795080 5987600 6195105 6302170 6455567
8993 6455567 6647084 6883737 7139780 7351822 7457299 7640316 7896075 8154543 8421936 8675807
8983 8675807 8937949 9275700 9696394 10139223 10457813 10860056 11306795 11815765 12406078 13103659
8973 13103659 13767630 14306113 14907893 15516799 16204646 16956950 17763754 18614525 19586010
$$ packed form
9045E524386r1910m2583O9889J11911J24425J74953J23271j5408j52237j58626
9035E668071k26459j89091j52508j89092j81041j13104m1758l2285q8539q0469
9025D373725J25214L4701J5646P8537P3262k2031M3520M0870J8218k9615l8138
9014D713909j6331M3513K7405l8713N0360M0329k5134P563R2563J07714N0703
9003E053881J07912J02200K00708J05146J19339J05894J92520K07505J07065J53397
8993F455567J91517K36653K56043K12042J05477J83017K55759K58468K67393K53871
8983H675807K62142L37751M20694M42829L18590M02243M46739N08970N90313O97581
8973A3103659O63971N38483O01780O08906O87847P52304Q06804Q50771R71485
$$ plain form
8964 19586010 20699914 21759046 23041140 24505128 25916227 27179600 28609517 30183875
8956 30183875 31965487 34034921 36372552 38964771 41516894 44142432 46270121 47521562
8948 47521562 49030946 50584746 52795468 55522324 59057879 62839780 66907006 71034600
8940 71034600 75533568 80291406 85561465 91390328 98373063 105151987 112608567 121291373
8932 121291373 131327528 143895648 160863396 183995381 216428950 253689529 295424814
8925 295424814 338092667 360838573 356639331 318893659 267018780 224265901 190432059
8918 190432059 165403665 146670097 130708999 117311678 106807567 98601404 92669370
8911 92669370 88801968 86491635 85220261 84292819 83158457 81138377 78025332 74149818
$$ packed form
8964A9586010J113904J059132J282094J463988J411099J263373J429917J574358
8956C0183875J781612K069434K337631K592219K552123K625538K127689J251441
8948D7521562J509384J553800K210722K726856L535555L781901M067226M127594
8940G1034600M498968M757838N270059N828863O982735O778924P456580Q682806
8932A21291373J0036155J2568120J6967748K3131985L2433569L7260579M1735285
8925B95424814M2667853K2745906m199242l7745672n1874879m2752879l3833842
8918A90432059k5028394j8733568j5961098j3397321j0504111q206163n932034
8911I2669370l867402k310333j271374r27442j134362k020080l113045l875514
$$ plain form
8903 74149818 69922021 66135053 62891626 60193522 57983641 56108331 54557994 53441135
8895 53441135 53016049 53093351 53772087 55192598 57071767 59468089 61894110 63731027 64346928
8886 64346928 63392593 61077169 57915786 54565596 51585906 49290710 47567462 46433737
8878 46433737 45797208 45532679 45746421 46348682 47493246 49325582 51894934 55106718 59023769
8869 59023769 63225472 66991628 69645066 70318591 68845375 65817053 61914400 58171459
8861 58171459 55131433 52758839 51121681 50165941 49749090 49879145 50616206 51997594 54244917
8852 54244917 57278286 60929424 65221441 69480288 72999416 74940869 74890977 73111012
8844 73111012 70268014 67277497 65014618 63927124 64072393 65343326 67561662 70510031
$$ packed form
8903G4149818m227797l786968l243427k698104k209881j875310j550337j116859
8895E3441135m25086P7302O78736J420511J879169K396322K426021J836917O15901
8886F4346928r54335k315424l161383l350190k979690k295196j723248j133725
8878D6433737o36529k64529K13742O02261J144564J832336K569352L211784L917051
8869E9023769M201703L766156K653438O73525j473216l028322l902653l742941
8861E8171459l040026k372594j637158r55740m16851J30055P37061J381388K247323
8852E4244917L033369L651138M292017M258847L519128J941453m9892j779965
8844G3111012k842998k990517k262879j087494J45269J270933K218336K948369
$$ plain form
8836 70510031 73528313 75962961 77034031 76505401 74708459 72216324 69933361 68604472
8828 68604472 68494712 69599510 71668622 74025275 75983069 76576364 75295469 72433253
8820 72433253 68428535 63868416 59474799 55492137 52207275 49409489 47023747 45098781
8812 45098781 43626506 42537287 41708629 41166492 40937747 40835362 41078002 41475656 42022430
8803 42022430 42730805 43613935 44736213 46076311 47591575 49385182 51592847 54358545
8795 54358545 57681261 61502624 65519166 68997571 71181868 71660867 70559998 68450155
8787 68450155 66109174 64561574 64134580 64987907 66799741 69108316 71273071 72413168
8779 72413168 71657909 68798570 64358630 59051405 53783271 49110966 45182630 41970202
$$ packed form
8836G0510031L018282K434648J071070n28630j796942k492135k282963j328889
8828F8604472j09760J104798K069112K356653J957794N93295j280895k862216
8820G2433253m004718m560119m393617l982662l284862k797786k385742j924966
8812D5098781j472275j089219q28658n42137k28745j02385K42640L97654N46774
8803D2022430P08375Q83130J122278J340098J515264J793607K207665K765698
8795E4358545L322716L821363M016542L478405K184297M78999j100869k109843
8787F8450155k340981j547600m26994Q53327J811834K308575K164755J140097
8779G2413168p55259k859339m439940n307225n268134m672305l928336l212428
$$ plain form
8771 41970202 39359192 37081101 35161486 33422080 31969328 30774517 29797150 29039997
8763 29039997 28565831 28265704 28205811 28211185 28173638 28046591 27713822 27220163 26664373 26124676
8753 26124676 25770165 25283945 24550538 23695641 22820332 21977557 21320744 20725683 20208269
8744 20208269 19799206 19505426 19295375 19186297 19125399 19214535 19358907 19638353 20005186 20394884
8734 20394884 20735907 21036635 21054791 20915232 20549263 20072522 19568916 19151660 18829530 18562349
8724 18562349 18380733 18400893 18553319 18666605 18985667 19440976 19993174 20565904 21207269 21961608
8714 21961608 22531121 22902510 23061948 22785290 22337536 21757158 21130397 20467058 19941083
8705 19941083 19395181 18968107 18645976 18367191 18233251 18225693 18338674 18742582 19241688 19779362
$$ packed form
8771D1970202k611010k278091j919615j739406j452752j194811r77367p57153
8763B9039997m74166l00127n9893N374l7547j27047l32769m93659n55790n39697
8753B6124676l54511m86220p33407q54897q75309q42775o56813n95061n17414
8744B0208269m09063k93780k10051j09078o0898Q9136J44372K79446L66833L89698
8734B0394884L41023L00728J8156j39559l65969m76741n03606m17256l22130k67181
8724A8562349j81616K0160J52426J13286L19062M55309N52198N72730O41365P54339
8714B1961608N69513L71389J59438k76658m47754n80378o26761o63339n25975
8705A9941083n45902m27074l22131k78785j33940p558J12981M03908M99106N37674
$$ plain form
8695 19779362 20399673 20845466 21050306 20983609 20526420 19938138 19247124 18609783 18115406 17731194
8685 17731194 17484431 17275283 17226369 17238522 17196056 17289756 17406514 17586966 17815969 17948387
8675 17948387 18050166 17997814 17921433 17818007 17838556 17896778 17999816 18202398 18497003 18811018
8665 18811018 19226556 19607349 19812983 19952708 20026049 20199217 20471712 20876865 21398419 21974461
8655 21974461 22655804 23593156 24859486 26424835 28386125 30806476 33362360 36023090
8647 36023090 38277766 39417783 39320619 38192520 36750155 35612260 34965336 35014132 35673041
8638 35673041 36807566 38137770 39435489 40080787 39669864 38243330 36218116 34048699
8630 34048699 32207749 30825904 29819428 29048473 28607870 28419993 28357794 28451129 28647632
$$ packed form
8695A9779362O20311M45793K04840o6697m57189n88282o91014o37341m94377l84212
8685A7731194k46763k09148m8914J2153m2466R3700J16758J80452K29003J32418
8675A7948387J01779n2352p6381j03426K0549N8222J03038K02582K94605L14015
8665A8811018M15538L80793K05634J39725P3341J73168K72495M05153N21554N76042
8655B1974461O81343R37352J266330J565349J961290K420351K555884K660730
8647C6023090K254676J140017r7164j128099j442365j137895o46924M8796O58909
8638C5673041J134525J330204J297719O45298m10923j426534k025214k169417
8630C4048699j840950j381845j006476p70955m40603j87877o2199R3335J96503
$$ plain form
8621 28647632 29035589 29489156 30116187 30904858 31897645 33188712 34758174 36715759 38925793
8612 38925793 41514127 44436554 47547852 51123004 54868838 58533947 61535233 63386644
8604 63386644 63699252 62632343 60626108 58384682 56496612 55395408 55127784 55651643 56657623
8595 56657623 57526374 57782334 56990926 54917269 51590261 47638095 43566018 40026667 37137611
8586 37137611 34899792 33235226 31930702 30940651 30137736 29552740 29109981 28719080 28456105
8577 28456105 28402353 28530352 28928782 29596387 30499040 31461321 32609094 33863214 35098498
8568 35098498 36380537 37728148 39183629 40494462 41342702 41429293 40712131 39564473 38487298
8559 38487298 37678494 37306474 37137243 37279430 37558540 37744455 37619519 36764795 35126694
$$ packed form
8621B8647632L87957M53567O27031P88671R92787J291067J569462J957585K210034
8612C8925793K588334K922427L111298L575152L745834L665109L001286J851411
8604F3386644L12608j066909k006235k241426j888070j101204k67624N23859J005980
8595E6657623Q68751K55960p91408k073657l327008l952166m072077l539351k889056
8586C7137611k237819j664566j304524r90051q02915n84996m42759l90901k62975
8577B8456105n3752J27999L98430O67605R02653R62281J147773J254120J235284
8568C5098498J282039J347611J455481J310833Q48240Q6591p17162j147658j077175
8559C8487298q08804l72020j69231J42187K79110J85915j24936q54724j638101
$$ plain form
8550 35126694 32807220 30259176 27774577 25602292 23890989 22602340 21491660 20652598
8542 20652598 19956900 19310177 18797419 18309286 17770966 17422777 17035978 16657024 16416894
8533 16416894 16364601 16395233 16441546 16499285 16506296 16275034 15797583 15261094 14591905 14075342
8523 14075342 13699218 13380243 13097969 12943992 12805786 12705516 12534638 12190350 11805590
8514 11805590 11459521 11248156 10936469 10678999 10376459 10006512 9654885 9311110 9026677
8505 9026677 8808598 8647748 8537210 8467061 8389738 8337251 8240802 8148286 8008478 7790179
8495 7790179 7518365 7355344 7218722 7140711 7103440 7023877 7024674 6991156 6942010 6993879 7016234
8484 7016234 7032481 6988795 6977039 7001553 7055841 7128295 7319688 7464320 7563203 7581614 7433578
$$ packed form
8550C5126694k319474k548044k484599k172285j711303j288649j110680q39062
8542B0652598o95698o46723n12758m88133n38320l48189l86799l78954k40130
8533A6416894n2293L0632M6313N7739P011k31262m77451n36489o69189n16563
8523A4075342l76124l18975k82274j53977j38206j00270j70878l44288l84760
8514A1805590l46069k11365l11687k57470l02540l69947l51627l43775k84433
8505I026677k18079j60850j10538p0149p7323n2487r6449r2516j39808k18299
8495G790179k71814j63021j36622p8011l7271p9563P97l3518m9146N1869K2355
8484G016234J6247m3686j1756K4514N4288P2454J91393J44632R8883J8411j48036
$$ plain form
8473 7433578 7206037 6878351 6565464 6356602 6202045 6091954 5921401 5722291 5526717 5382662
8463 5382662 5322352 5217670 5142449 5025947 5011079 5003940 4961419 5031243 5025501 4959802 5057774
8452 5057774 5091634 5080106 5152464 5356169 5673846 5847975 5887662 5785541 5537844 5147625
8442 5147625 4859866 4634559 4463693 4280192 4157308 3957350 3876082 3804914 3716556 3605411
8432 3605411 3578523 3541586 3454390 3521736 3653359 3648330 3567588 3458439 3382052 3396370 3311254
8421 3311254 3280107 3194216 3163551 3097333 3097924 3052990 3017993 3008140 2959286 2923921 2917881 2825563
8409 2825563 2809280 2762116 2717593 2746222 2704092 2659978 2659810 2605923 2602600 2554780 2553604 2551490
8397 2551490 2460879 2452993 2467443 2459219 2523636 2497038 2403568 2363739 2390154 2356176 2293874 2283350
$$ packed form
8473G433578k27541l27686l12887k08862j54557j10091j70553j99110j95574j44055
8463E382662o0310j04682p5221j16502j4868p139m2521O9824n742o5699R7972
8452E057774L3860j1528P2358K03705L17677J74129L9687j02121k47697l90219
8442E147625k87759k25307j70866j83501j22884j99958q1268p1168q8358j11145
8432C605411k6888l6937q7196O7346J31623n029q0742j09149p6387J4318q5116
8421C311254l1147q5891l0665o6218N91m4934l4997r853m8854l5365o040r2318
8409B825563j6283m7164m4523K8629m2130m4114j68n3887l323m7820j176k114
8397B551490r0611p886J4450q224O4417k6598r3470l9829K6415l3978o2302j0524
$$ plain form
8385 2283350 2327692 2360420 2326655 2325028 2278848 2254093 2297238 2274407 2291959 2292298 2260157 2257459
8373 2257459 2289799 2302330 2295520 2247584 2253421 2306403 2347357 2326568 2290036 2303740 2339639 2267366
8361 2267366 2234795 2219031 2177092 2162050 2158956 2191227 2232266 2246335 2210055 2218641 2192194 2242299
8349 2242299 2266473 2240166 2184309 2244557 2252445 2264489 2258236 2237242 2211027 2264933 2277135 2298320
8337 2298320 2254847 2223074 2336441 2348657 2333109 2327934 2404663 2437203 2399067 2438533 2476838
8326 2476838 2445240 2453790 2458245 2424128 2459206 2531312 2536879 2567348 2601891 2626401 2666534 2749221
8314 2749221 2790917 2790838 2820447 2802650 2820376 2835476 2911603 3018339 3081539 3110228 3155021 3163499
8302 3163499 3160138 3125655 3128236 3134801 3204597 3221362 3277469 3293718 3320406 3305395 3321648 3363957
$$ packed form
8385B283350M4342L2728l3765j627m6180k4755M3145k2831J7552L39l2141k698
8373B257459L2340J2531o810m7936N837N2982M0954k0789l6532J3704L5899p2273
8361B267366l2571j5764m1939j5042l094L2271M1039J4069l6280Q586k6447N0105
8349B242299K4174k6307n5857O0248P888J2044o253k0994k6215N3906J2202K1185
8337B298320m3473l1773J13367J2216j5548n175P6729L2540l8136L9466L8305
8326B476838l1598Q550M455l4117L5078P2106N567L0469L4543K4510M0133Q2687
8314B749221M1696p9K9609j7797J7726J5100P6127J06736O3200K8689M4793Q478
8302C163499l361l4483K581O565O9796J6765N6107J6249K6688j5011J6253M2309
$$ plain form
8290 3363957 3315869 3382637 3316599 3343619 3355705 3293112 3320394 3307846 3276528 3293042 3362326
8279 3362326 3359576 3344971 3274796 3259745 3188558 3142114 3158264 3134885 3143813 3083480 3124164 3122260
8267 3122260 3183750 3309485 3362863 3494167 3596613 3674714 3721637 3742707 3679656 3638128 3715837
8256 3715837 3755572 3770555 3822991 3895646 3910906 3833148 3761528 3773211 3664289 3544403 3491790
8245 3491790 3429189 3361483 3327723 3339342 3369305 3315747 3281339 3161212 3079162 2970051 2904418
8234 2904418 2818393 2805189 2791004 2734204 2692937 2727314 2732782 2779289 2805342 2759325 2817012 2919983
8222 2919983 2959896 2968108 3037737 3024759 2983248 2980271 2999817 3016594 3069706 3128287 3243069 3293528
8210 3293528 3325296 3329252 3299841 3204179 3144364 3096979 3114210 3092726 3161818 3179579 3232066 3256021
$$ packed form
8290C363957m8088O6768o6038K7020J2086o2593K7282j2548l1318J6514O9284
8279C362326k750j4605p0175j5051p1187m6444J6150k3379Q928o0333M0684j904
8267C122260O1490J25735N3378J31304J02446P8101M6923K1070o3051m1528P7709
8256C715837L9735J4983N2436P2655J5260p7758p1620J1683j08922j19886n2613
8245C491790o2601o7706l3760J1619K9963n3558l4408j20127q2050j09111o5633
8234B904418q6025j3204j4185n6800m1267L4377N468M6507K6053m6017N7687J02971
8222B919983L9913Q212O9629j2978m1511k977J9546J6777N3112N8581J14782N0459
8210C293528L1768L956k9411r5662n9815m7385J7231k1484O9092J7761N2487K3955
$$ plain form
8198 3256021 3198628 3145451 3220440 3043777 2882858 2661914 2527954 2886414 2880907 2911467 2980099
8187 2980099 3059248 3152141 3262961 3440504 3530962 3534593 3549145 3475977 3451514 3443796 3441857 3409037
8175 3409037 3407084 3343996 3265302 3197645 3036958 2919997 2881350 2975183 2973119 3013178 3083764
8164 3083764 3226022 3328114 3406738 3364583 3266963 3308820 3222872 3184130 3147583 3042338 2950408
8153 2950408 2936541 2841364 2729968 2602465 2449916 2383040 2363906 2245499 2183473 2246949 2200335
8142 2200335 2281662 2274307 2229098 2225482 2202076 2174575 2087814 2059066 1994809 1974610 1903478 1905132
8130 1905132 1867145 1811865 1794527 1739582 1707805 1723949 1713179 1734672 1680164 1717314 1729994
8119 1729994 1753955 1687757 1600351 1621381 1542937 1528156 1477143 1432555 1426176 1457373 1367990 1296876
$$ packed form
8198C256021n7393n3177P4989j76663j60919k20944j33960L58460n507L0560O8632
8187B980099P9149R2893J10820J77543R0458L631J4552p3168k4463p718j939l2820
8175C409037j953o3088p8694o7657j60687j16961l8647R3833k064M0059P0586
8164C083764J42258J02092P8624m2155r7620M1857q5948l8742l6547j05245r1930
8153B950408j3867r5177j11396j27503j52549o6876j9134j18407o2026O3476m6614
8142B200335Q1327p355m5209l616k3406k7501q6761k8748o4257k0199p1132J654
8130A905132l7987n5280j7338n4945l1777J6144j0770K1493n4508L7150J2680
8119A729994K3961o6198q7406K1030p8444j4781n1013m4588o379L1197q9383p1114
$$ plain form
8107 1296876 1259274 1213528 1213243 1156652 1120618 1163151 1086530 993474 1002276 1062571 1030385 996409
8095 996409 925659 976418 949314 935004 905325 941627 864658 822401 887435 863812 806659 808345
8083 808345 807055 818818 864114 827451 814292 727743 795726 750563 679343 732684 751437 755200
8071 755200 713395 803840 779591 798469 813474 742934 756696 727907 754711 770818 745934 697588
8059 697588 650973 656418 643604 669593 629542 633770 637722 632625 698271 690881 595125 509088 516333
8046 516333 607769 646612 597457 589458 550384 585167 550573 514754 546488 525836 533150 505777
8034 505777 497982 614553 606404 521470 529756 530477 466641 529553 521602 436480 465267 488088 552972
8021 552972 575703 555771 581810 548952 471600 524303 602523 586250 567618 531946 571814 524714
$$ packed form
8107A296876l7602m5746k85n6591l6034M2533p6621r3056Q802O0295l2186l3976
8095I96409p0750N0759k7104j4310k9679L6302p6969m2257O5034k3623n7153J686
8083H08345j290J1763M5296l6663j3159q6549O7983m5163p1220N3341J8753L763
8071G55200m1805R0445k4249J8878J5005p0540J3762k8789K6804J6107k4884m8346
8059F97588m6615N445j2814K5989m0051M228L952n097O5646p390r5756q6037P245
8046E16333R1436L8843m9155p999l9074L4783l4594l5819L1734k0652P314k7373
8034E05777p795J16571q149q4934Q286P21o3836O2912p951q5122K8787K2821O4884
8021E52972K2731j9932K6039l2858p7352N2703P8220j6273j8632l5672L9868m7100
$$ plain form
8009 524714 574768 599064 616121 634186 621439 594604 588042 606480 565223 602628 601579 499021
7997 499021 502241 486984 436361 450032 467203 512920 516674 487541 534584 525121 546994 562769
7985 562769 510671 522102 450368 511121 552964 497477 509147 507258 465467 422709 488141 544298
7973 544298 503819 507678 454689 463281 488772 469614 488720 511277 531023 512421 451630 470872
7961 470872 488405 499785 542919 542968 558717 512428 490884 519853 528052 514022 574583 552773
7949 552773 543172 553514 561726 555727 595687 599398 602311 657901 598910 615380 561012 609602 609838
7936 609838 663760 640975 672359 747757 740134 707623 728232 794176 735625 756302 765386 708784
7924 708784 717346 824206 761720 746617 771676 822485 758043 787105 836356 811681 767742 781752
$$ packed form
8009E24714N0054K4296J7057J8065j2747k6835o562J8438m1257L7405j049j02558
7997D99021L220j5257n0623J3671J7171M5717L754k9133M7043r463K1873J5775
7985E62769n2098J1431p1734O0753M1843n5487J1670j889m1791m2758O5432N6157
7973E44298m0479L859n2989Q592K5491j9158J9106K2557J9746j8602o0791J9242
7961D70872J7533J1380M3134M9J5749m6289k1544K8969Q199j4030O0561k1810
7949E52773r601J0342Q212n999L9960L711K913N5590n8991J6470n4368M8590K36
7936F09838N3922k2785L1384P5398p623l2511K0609O5944n8551K0677R084n6602
7924G08784Q562J06860o2486j5103K5059N0809o4442K9062M9251k4675m3939J4010
$$ plain form
7912 781752 794477 835246 881288 869108 879965 959628 864534 812576 838288 840589 806699 733091
7900 733091 814065 875486 822113 810422 830751 840914 868885 813818 797320 846801 850137 864064
7888 864064 999513 1026443 1029501 1023420 1072164 976360 938445 978903 1058456 1046486 1043321 1068076
7876 1068076 1116354 1106343 1085951 1087925 1083268 1044312 1123343 1131720 1065341 1089396 1088371 1073585
7864 1073585 1079616 1114633 1134155 1152745 1141329 1136302 1133039 1114193 1130099 1084151 1104099 1145458
7852 1145458 1164460 1125298 1037162 996327 1028516 1107765 1076043 1026498 992007 966046 979205
7841 979205 1031558 1076887 1068170 1078527 1093566 1154466 1158003 1090256 1188558 1102197 1194917 1300301
7829 1300301 1305500 1291790 1245615 1258405 1287718 1322344 1298233 1325393 1421157 1472324 1461216 1492012
$$ packed form
7912G81752J2725M0769M6042j2180J0857P9663r5094n1958K5712K301l3890p3608
7900G33091Q0974O1421n3373j1691K0329J0163K7971n5067j6498M9481L336J3927
7888H64064J35449K6930L058o081M8744r5804l7915M0458P9553j1970l165K4755
7876A068076M8278j0011k0392J974m657l8956P9031Q377o6379K4055j025j4786
7864A073585O031L5017J9522J8590j1416n027l263j8846J5906m5948J9948M1359
7852A145458J9002l9162q8136m0835L2189P9249l1722m9545l4491k5961J3159
7841I79205N2353M5329q717J0357J5039O0900L537o7747R8302q6361R2720J05384
7829A300301N199j3710m6175J2790K9313L4626k4111K7160R5764N1167j1108L0796
$$ plain form
7817 1492012 1517714 1577955 1490774 1519477 1542474 1544382 1648218 1656782 1722964 2063311 1988690
7806 1988690 1846249 1920411 1977654 2064856 2095913 2185478 2244121 2417921 2592332 2757825 2956412
7795 2956412 3265787 3538793 3775810 3960093 4039177 4009873 3956751 3956184 3995979 4056409 4192776
7784 4192776 4162544 3988674 3699033 3355385 3011338 2801648 2573551 2376328 2212828 2071456
7774 2071456 1960684 1900403 1761561 1792483 1738266 1606127 1571458 1472138 1374467 1401206 1340278
7763 1340278 1275502 1281045 1282878 1263493 1289914 1279233 1204963 1202172 1140304 1156083 1132592 1112346
7751 1112346 1125825 1186867 1193028 1280073 1276745 1254827 1231245 1241525 1315375 1354742 1384955 1406916
7739 1406916 1390802 1419427 1464642 1472627 1467174 1462353 1481993 1508278 1551444 1586428 1631723 1761548
$$ packed form
7817A492012K5702O0241q7181K8703K2997J908J03836Q564O6182L40347p4621
7806A988690j42441P4162N7243Q7202L1057Q9565N8643J73800J74411J65493J98587
7795B956412L09375K73006K37017J84283P9084k9304n3122n67L9795O0430J36367
7784D192776l0232j73870k89641l43648l44047k09690k28097j97223j63500j41372
7774B071456j10772o0281j38842L0922n4217j32139l4669r9320r7671K6739o0928
7763A340278o4776N543J833j9385K6421j0681p4270k791o1868J5779k3491k0246
7751A112346J3479O1042O161Q7045l328k1918k3582J0280P3850L9367L0213K1961
7739A406916j6114K8625M5215P985n453m821J9640K6285M3166L4984M5295J29825
$$ plain form
7727 1761548 1804758 1872664 1924809 1889983 1902915 1934323 2087763 2270800 2365248 2540284 2655439
7716 2655439 2759822 2994725 3237502 3456095 3622592 3648108 3607840 3540848 3463889 3467944 3542681
7705 3542681 3602675 3591315 3486522 3250185 3028661 2761163 2572432 2419657 2230754 2027074
7695 2027074 1948341 1880872 1779319 1720302 1658534 1607008 1527039 1503266 1507104 1411022 1437373
7684 1437373 1447343 1403050 1430796 1408245 1377646 1382605 1413852 1431630 1476244 1419739 1401689 1389286
7672 1389286 1445595 1431894 1444284 1425332 1436959 1440470 1427842 1499588 1536032 1514459 1550563 1546603
7660 1546603 1537389 1610078 1643034 1645170 1729847 1731441 1723952 1713521 1652017 1678930 1720949 1645663
7648 1645663 1624510 1673607 1721165 1704068 1675926 1701451 1688736 1751382 1732016 1739376 1744092 1708048
$$ packed form
7727A761548M3210O7906N2145l4826J2932L1408J53440J83037R4448J75036J15155
7716B655439J04383K34903K42777K18593J66497K5516m0268o6992p6959M055P4737
7705C542681N9994j1360j04793k36337k21524k67498j88731j52775j88903k03680
7695B027074p8733o7469j01553n9017o1768n1526p9969k3773L838r6082K6351
7684A437373R970m4293K7746k2551l0599M959L1247J7778M4614n6505j8050j2403
7672A389286N6309j3701J2390j8952J1627L511j2628P1746L6444k1573L6104l960
7660A546603r214P2689L2956K136Q4677J594p489j0431o1504K6913M2019p5286
7648A645663k1153M9097M7558j7097k8142K5525j2715O2646j9366P360M716l6044
$$ plain form
7636 1708048 1731343 1801662 1852165 1910011 1997714 2018123 1989067 1995478 2033132 2065077 2099766 2160356
7624 2160356 2118909 2076507 2087378 2127892 2067736 2036595 2081797 1939973 1883953 1878658 1766841
7613 1766841 1741895 1725427 1728487 1756988 1622027 1614784 1620742 1623006 1590678 1484593 1544843 1512800
7601 1512800 1499570 1525963 1491063 1526558 1556087 1489665 1459339 1500669 1505764 1488796 1461833 1436869
7589 1436869 1475767 1484465 1435870 1377717 1460780 1486305 1485204 1435888 1449328 1406889 1400247 1395744
7577 1395744 1410057 1326943 1307580 1367694 1270239 1194591 1144871 1154568 1105046 1057686 1017194 952094
7565 952094 921871 988926 934026 891338 913180 922834 929179 1016985 1045692 937601 976609 1018769
7553 1018769 1115798 1160025 1165432 1174149 1153439 1196452 1225179 1224826 1191433 1210336 1209364 1293500 1302524
$$ packed form
7636A708048K3295P0319N0503N7846Q7703K0409k9056O411L7654L1945L4689O0590
7624B160356m1447m2402J0871M0514o0156l1141M5202j41824n6020n295j11817
7613A766841k4946j6468L060K8501j34961p243N958K264l2328j06085O0250l2043
7601A512800j3230K6393l4900L5495K9529o6422l0326M1330N095j6968k6963k4964
7589A436869L8898Q698m8595n8153Q3063K5525j101m9316J3440m2439o642m503
7577A395744J4313q3114j9363O0114r7455p5648m9720R697m9522m7360m0492o5100
7565I52094l0223O7055n4900m2688K1842R654O345Q7806K8707j08091L9008M2160
7553A018769R7029M4227N407Q717k0710M3013K8727l53l3393J8903r72Q4136R024
$$ plain form
7540 1302524 1183145 1176027 1184855 1190854 1220736 1133610 1161033 1260570 1248509 1283717 1324134 1381593
7528 1381593 1466264 1564530 1644103 1675882 1797758 1950908 2081402 2219578 2377728 2680006
7518 2680006 3041692 3321094 3541504 3612254 3567984 3462830 3395567 3304371 3374871 3441753 3416659
7507 3416659 3398262 3248435 2957235 2623271 2354855 2102342 1897053 1794840 1722684 1587274
7497 1587274 1456183 1362727 1368664 1308866 1185411 1190393 1254878 1276091 1323568 1340769 1397768
7486 1397768 1381109 1334516 1337511 1360937 1386994 1445805 1478523 1474355 1520305 1632939 1753539
7475 1753539 1807110 1826270 1910902 1960372 2018181 2213566 2315067 2505269 2783391 3019787
7465 3019787 3244048 3473568 3682143 3749463 3730520 3650413 3581709 3567960 3660061 3686139 3586501
$$ packed form
7540A302524j19379p118Q828N999K9882q7126K7423R9537j2061L5208M0417N7459
7528A381593Q4671R8266P9573L1779J21876J53150J30494J38176J58150L02278
7518B680006L61686K79402K20410P0750m4270j05154o7263r1196P0500O6882k5094
7507C416659j8397j49827k91200l33964k68416k52513k05289j02213p2156j35410
7497A587274j31091r3456N937n9798j23455M982O4485K1213M7477J7201N6999
7486A397768j6659m6593K995K3426K6057N8811L2718m168M5950J12634J20600
7475A753539N3571J9160Q4632M9470N7809J95385J01501J90202K78122K36396
7465C019787K24261K29520K08575O7320j8943q0107o8704j3749R2101K6078r9638
$$ plain form
7454 3586501 3497661 3377943 3107252 2866127 2534137 2301222 2151271 2010958 1849909 1639566
7444 1639566 1515528 1399345 1344901 1309483 1268825 1151854 1105277 1093361 1060333 1009206 1025547
7433 1025547 981898 1028405 997632 909886 837616 850256 823872 874210 929858 942695 899938
7422 899938 850877 872994 895057 958166 913718 892412 916317 994881 1017173 978230 967251 984974
7410 984974 948493 920146 890147 928198 1010938 997999 888630 845257 833204 731559 709381
7399 709381 759270 768098 750009 700866 714771 793684 764855 715453 584604 540290 512423 528628
7387 528628 534963 522146 417685 420438 410560 425235 351841 287839 305500 348688 325150 309821
7375 309821 313759 308858 254106 232234 327393 278476 274293 280065 255080 214267 284689 298081
$$ packed form
7454C586501q8840j19718k70691k41125l31990k32915j49951j40313j61049k10343
7444A639566j24038j16183n4444l5418m0658j16971m6577j1916l3028n1127J6341
7433A025547m3649M6507l0773q7746p2270J2640k6384N0338N5648J2837m2757
7422H99938m9061K2117K2063O3109m4448k1306K3905P8564K2292l8943j0979J7723
7410I84974l6481k8347k9999L8051Q2740j2939j09369m3373j2053j01645k2178
7399G09381M9889Q828j8089m9143J3905P8913k8829m9402j30849m4314k7867J6205
7387E28628O335j2817j04461K753r878J4675p3394o4002J7661M3188k3538j5329
7375C09821L938m901n4752k1872R5159m8917m183N772k4985m0813P0422J3392
$$ plain form
7363 298081 257369 198763 221985 233309 233693 214111 276588 251054 233223 261852 289488 272214
7351 272214 278661 248536 216599 237140 298379 336018 314476 292066 292756 311518 282928 318175
7339 318175 348577 224541 216660 198084 212434 149971 133466 166633 204537 227363 218206 212910
7327 212910 175799 180900 231533 100893 19827 79755 117964 143240 125637 142920 120346 112013
7315 112013 115643 106274 79374 79319 95138 100482 93173 85491 138882 83554 112538 66519 72458
7302 72458 104844 72961 68199 20505 66341 60797 60606 63534 78378 81849 100757 181425 239501
7289 239501 228021 279829 294766 274185 235854 187095 131367 102593 188481 165452 153504 181653
7277 181653 180356 151083 67343 48221 31762 39637 85802 49705 89644 109107 17569 -4975
$$ packed form
7363B98081m0712n8606K3222J1324L84j9582O2477k5534j7831K8629K7636j7274
7351B72214O447l0125l1937K0541O1239L7639k1542k2410O90J8762k8590L5247
7339C18175L0402j24036p881j8576J4350o2463j6505L3167L7904K2826r157n296
7327B12910l7111N101N0633j30640q1066N9928L8209K5276j7603J7283k2574q333
7315A12013L630r369k6900n5J5819N344p309p682N3391n5328K8984m6019N939
7302G2458L2386l1883m762m7694M5836n544j91K928J4844L471J8908Q0668N8076
7289B39501j1480N1808J4937k0581l8331m8759n5728k8774Q5888k3029j1948K8149
7277A81653j297k9273q3740j9122j6459P875M6165l6097L9939J9463r1538k2544
$$ plain form
7265 -4975 -17403 86316 102431 96728 84705 47893 19654 7762 -18119 30162 93991 124514
7253 124514 98916 107252 133799 156962 99925 18320 -68850 -6141 3001 -25202 -17784 38419
7241 38419 27261 52028 68879 41429 31754 -26249 528 -51331 -65983 -28878 9924 7976
7229 7976 -11067 104396 56935 16371 13327 -40143 -39401 -58814 -78507 12587 -44709 -33321
7217 -33321 -19644 -7356 11961 -1874 -1822 -38250 -93797 -54890 -26708 -59741 -42041 -11585
7205 -11585 -23709 -37053 -9719 -43245 -26920 -1616 -18476 -49195 -19502 7046 11989 -3987
7193 -3987 -34267 -109109 -95629 -86518 6471 39251 53593 -52589 -19564 -15826 -25179 8057
7181 8057 19927 18467 -16528 -2052 29507 78854 53493 -22107 21970 178383 160352 127437
$$ packed form
7265d975j2428J03719J6115n703j2023l6812k8239j1892k5881M8281O3829L0523
7253A24514k5598Q336K6547K3163n7037q1605q7170O2709R142k8203P418N6203
7241C8419j1158K4767J6851k7450r675n8003K6777n1859j4652L7105L8802j948
7229G976j9043J15463m7461m0564l044n3470P42j9413j9693R1094n7296J1388
7217c3321J3677J2288J9317j3835N2l6428n5547L8907K8182l3033J7700L0456
7205a1585j2124j3344K7334l3526J6325K5304j6860l0719K9693K6548M943j5976
7193c987l0280p4842J3480R111R2989L2780J4342j06182L3025L738r353L3236
7181H057J1870j460l4995J4476L1559M9347k5361p5600M4077J56413j8031l2915
$$ plain form
7169 127437 172400 175168 162003 39483 58795 143486 165403 163560 210051 166303 184180 195689
7157 195689 161337 174655 194003 210569 253167 268647 250918 252246 320978 340537 426004 473302
7145 473302 591504 752509 891912 1099660 1198410 1175647 1009010 834580 728073 549870
7135 549870 440269 309839 286280 306195 151764 165245 145387 110385 141404 145417 106250
7124 106250 84689 68430 9680 -37714 60341 105991 64824 -10566 -9248 -32359 -65485 -21935
7112 -21935 -2472 -43503 34458 -15598 -81300 -71612 -94529 -98914 -45028 -63903 -45158 -56158
7100 -56158 -45964 38 -28556 12080 -81064 -105185 -130025 -38654 -144738 -168260 -109286 -133159
7088 -133159 -82274 -40799 -2221 7217 47330 -34092 -85661 -111350 -92112 -128678 -67245 -22210
$$ packed form
7169A27437M4963K768j3165j22520J9312Q4691K1917j843M6491m3748J7877J1509
7157A95689l4352J3318J9348J6566M2598J5480j7729J328O8732J9559Q5467M7298
7145D73302J18202J61005J39403K07748R8750k2763j66637j74430j06507j78203
7135E49870j09601j30430k3559J9915j54431J3481j9858l5002L1019M013l9167
7124A06250k1561j6259n8750m7394R8055M5650m1167p5390J318k3111l3126M3550
7112b1935J9463m1031P7961n0056o5702R688k2917m385N3886j8875J8745j1000
7100e6158J0194M6002k8594M0636r3144k4121k4840R1371j06084k3522N8974k3873
7088a33159N0885M1475L8578R438M0113q1422n1569k5689J9238l6566O1433M5035
$$ plain form
7076 -22210 -47648 -41629 -84505 -81322 -82659 -94140 -145335 -154569 -102984 -101148 -45023 -108219 -135509
7063 -135509 -94233 -14137 -17736 -142020 -149158 -72245 -119216 -118913 -117672 -109937 -145381 -142654 -137250
7050 -137250 -130633 -156745 -111726 -98708 -46533 -50298 -76038 -75686 -91143 -71951 -52833 1340
7038 1340 -48591 -115677 -94742 -85733 -74671 -30070 -78579 -56252 -58129 -57275 -3308 -15250 -22712
7025 -22712 76763 65881 92313 50034 106781 42397 66862 118108 124871 211987 287846 329838
7013 329838 324678 298773 282064 271496 173144 141435 153920 207558 137154 128057 119571 115536
7001 115536 114453 133269 90824 104973 124396 73408 90348 20051 44302 12274 35389 -12938
6989 -12938 12144 88209 89012 131483 121164 41212 73094 52599 34839 -740 -46035 7958
$$ packed form
7076b2210k5438O019m2876L183j337j1481n1195r234N1585J836N6125o3196k7290
7063a35509M1276Q0096l599j24284p138P6913m6971L03J241P735l5444K727N404
7050a37250O617k6112M5019J3018N2175l765k5740L52j5457J9192J9118N4173
7038A340m9931o7086K0935R009J1062M4601m8509K2327j877Q54N3967j1942p462
7025b2712R9475j0882K6432m2279N6747o4384K4465N1246O763Q7116P5859M1992
7013C29838n160k5905j6709j0568r8352l1709J2485N3638p0404r097q486m035
7001A15536j083J8816m2445J4149J9423n0988J6940p0297K4251l2028K3115m8327
6989a2938K5082P6065Q03M2471j0319p9952L1882k0495j7760l5579m5295N3993
$$ plain form
6977 7958 38631 38584 -50688 -100584 -58147 -45079 -43403 -7382 -38077 -74871 -35265 26302 -34907
6964 -34907 -62821 -48517 -60593 -62388 10666 -28504 -83786 -12055 -21443 29648 17497 17963 -3190
6951 -3190 -32208 -26351 -54175 -69515 -12129 -7084 20181 43439 -32726 -6196 53791 49962 42010
6938 42010 54845 137819 133070 137622 188345 200538 237678 246106 260429 246909 209128 138960
6926 138960 105969 135657 215721 178310 250827 362829 386324 359151 312095 263999 251720
6915 251720 203681 182344 153960 121837 160585 215378 195199 210128 206906 197337 121040 131553
6903 131553 158941 112139 52494 108843 185042 202887 142988 120575 114548 50222 2677 29231
6891 29231 11814 -66749 -78801 -48841 -1755 22672 753 38045 -30248 -78834 -80778 -139657
$$ packed form
6977G958L0673m7q9272m9896M2437J3068J676L6021l0695l6794L9606O1567o1209
6964c4907k7914J4304j2076j795P3054l9170n5282P1731r388N1091j2151M66k1153
6951c190k9018N857k7824j5340N7386N045K7265K3258p6165K6530N9987l829p952
6938D2010J2835Q2974m749M552N0723J2193L7140Q428J4323j3520l7781p0168
6926A38960l2991K9688Q0064l7411P2517J12002K3495k7173m7056m8096j2279
6915B51720m8039k1337k8384l2123L8748N4793k0179J4929l222r569p6297J0513
6903A31553K7388m6802n9645N6349P6199J7845n9899k2413o027o4326m7545K6554
6891B9231j7417p8563j2052K9960M7086K4427k1919L7292o8293m8586j944n8879
$$ plain form
6879 -139657 -93493 -101631 -91277 -86975 -91700 -76903 -142377 -257962 -156172 -111184 -70104 -132434
6867 -132434 -166617 -188342 -182045 -171033 -121134 -141462 -177762 -194533 -201701 -218678 -149754 -129226
6855 -129226 -133737 -176273 -192577 -191898 -311430 -265638 -204742 -115043 -91727 -194314 -183741 -142744
6843 -142744 -120232 -135635 -117297 -57517 -102206 -126490 -154654 -151633 -158487 -118584 -85415 -103809
6831 -103809 -100833 -155503 -189863 -146101 -199603 -152176 -110729 -106949 -122057 -164427 -167693 -92266
6819 -92266 -69247 -28164 -41073 -108068 -125722 -147558 -113982 -181345 -145888 -104888 -60699 -88534
6807 -88534 -118716 -126658 -114209 -138954 -156132 -119168 -80039 -106329 -73949 -71689 -80644 -75605 -105105
6794 -105105 -98418 -128426 -138330 -127563 -91622 -79474 -62678 -99929 -87441 -110695 -63922 -94293
$$ packed form
6879a39657M6164q138J0354M302m725J4797o5474j15585J01790M4988M1080o2330
6867a32434l4183k1725O297J1012M9899k0328l6300j6771p168j6977O8924K0528
6855a29226m511m2536j6304O79j19532M5792O0896Q9699K3316j02587J0573M0997
6843a42744K2512j5403J8338N9780m4689k4284k8164L021o854L9903L3169j8394
6831a03809K976n4670l4360M3762n3502M7427M1447L780j5108m2370l266P5427
6819i2266K3019M1083j2909o6995j7654k1836L3576o7363L5457M1000M4189k7835
6807h8534l0182p942J2449k4745j7178L6964L9129k6290L2380K260q955N039k9500
6794a05105O687l0008r904J0767L5941J2148J6796l7251J2488k3254M6773l0371
$$ plain form
6782 -94293 -33977 -40307 -99830 -184675 -97201 -56584 -69276 -99733 -170046 -131922 -126154 -59527
6770 -59527 -76947 -113814 -97986 -114179 -167122 -133938 -151618 -82454 -67457 -41256 -9827 -70396
6758 -70396 -65724 -100883 -146826 -134818 -167773 -178927 -143526 -160439 -151647 -80243 -57706 -147811
6746 -147811 -97901 -35201 -64992 -78520 -119866 -105526 -76964 -59327 -93851 -146143 -44778
6735 -44778 2778 -108498 -140771 -136454 -83759 -85176 -111477 -129456 -59887 -30847 -8070 -54675
6723 -54675 -47667 29483 58760 -54250 -80355 -16442 -18949 -23055 -68060 -50688 -65349 -75639
6711 -75639 -108557 -75677 -5467 -20649 -92657 -120320 -115254 -44205 -26615 -56519 -21681 -45047
6699 -45047 -22382 -14435 -36783 -39715 -79837 -67534 -101456 -79123 -41823 -38853 -12836 5099
$$ packed form
6782i4293O0316o330n9523q4845Q7474M0617j2692l0457p0313L8124N768O6627
6770e9527j7420l6867J5828j6193n2943L3184j7680O9164J4997K6201L1429o0569
6758g0396M672l5159m5943J2008l2955j1154L5401j6913Q792P1404K2537r0105
6746a47811M9910O2700k9791j3528m1346J4340K8562J7637l4524n2292J01365
6735d4778M7556j11276l2273M317N2695j417k6301j7979O9569K9040K2777m6605
6723e4675P008P7150K9277j13010k6105O3913k507m106m5005J7372j4661j0290
6711g5639l2918L2880P0210j5182p2008k7663N066P1049J7590k9904L4838k3366
6699d5047K2665P947k2348k932m0122J2303l3922K2333L7300K970K6017J7935
$$ plain form
6687 5099 37307 -36598 -15339 40054 44098 31184 -26067 1849 68193 78034 19449 35745
6675 35745 50549 86194 70507 84874 72890 118185 110709 153988 159009 101881 181085 159642
6663 159642 137067 107244 104697 164501 209695 223063 211675 201239 167233 87063 93556 203406
6651 203406 242406 245071 294453 339670 337239 288173 292373 410907 443520 529792 499147 548274
6639 548274 526717 574309 570303 588384 638222 639143 709131 703301 766771 797412 828194 833078 920025
6626 920025 908044 929979 1014917 1054103 1066894 1093311 1106366 1130708 1171251 1173199 1145484 1194173
6614 1194173 1198858 1178327 1150321 1150017 1155867 1140006 1118081 1148717 1047070 1010965 933428 978709
6602 978709 993121 1039982 974601 961410 973356 911761 875680 868045 904532 888403 825730 722718
$$ packed form
6687E099L2208p3905K1259N5393M044j2914n7251K7916O6344R841n8585J6296
6675C5745J4804L5645j5687J4367j1984M5295p476M3279N021n7128P9204k1443
6663A59642k2575k9823k547N9804M5194J3368j1388j0436l4006q0170O493J09850
6651B03406L9000K665M9382M5217k431m9066M200J18534L2613Q6272l0645M9127
6639E48274k1557M7592m006J8081M9838R21O9988n830O3470L0641L0782M884Q6947
6626I20025j1981K1935Q4938L9186J2791K6417J3055K4342M0543J948k7715M8689
6614A194173M685k0531k8006l04N850j5861k1925L0636j01647l6105p7537M5281
6602I78709J4412M6861o5381j3191J1946o1595l6081p635L6487j6129o2673j03012
$$ plain form
6590 722718 658876 642696 565974 514753 555895 594965 545365 500615 530845 495435 531271 468134
6578 468134 476309 461934 386416 335640 306369 259359 258409 274769 324487 265097 184936 260528
6566 260528 335690 352352 308539 308697 354600 314144 315505 314940 293452 226347 195544 179661 214678
6553 214678 253755 223964 210775 199032 160635 178829 199303 245911 271949 259794 216161 206875
6541 206875 212749 239629 315919 311419 350586 382133 369989 338332 331404 312840 326407 306376
6529 306376 303155 285097 348394 365079 336876 308842 272346 278040 265335 273945 303312 289944
6517 289944 201760 193245 180331 205145 206773 205288 200165 117040 104073 138178 178882 221598
6505 221598 247014 207568 158839 151250 207184 220890 245762 329501 325577 302154 220151 266209
$$ packed form
6590G22718o3842j6180p6722n1221M1142L9070m9600m4750L0230l5410L5836o3137
6578D68134Q175j4375p5518n0776k9271m7010r50J6360M9718n9390q0161P5592
6566B60528P5162J6662m3813J58M5903m0456J361n65k1488o7105l0803j5883L5017
6553B14678L9077k9791j3189j1743l8397J8194K0474M6608K6038j2155m3633r286
6541B06875N874K6880P6290m500L9167L1547j2144l1657o928j8564J3567k0031
6529C06376l221j8058O3297J6685k8203k8034l6496N694j2705Q610K9367j3368
6517B89944q8184q515j2914K4814J628j485n123q3125j2967L4105M0704M2716
6505B21598K5416l9446m8729p589N5934J3706K4872Q3739l924k3423q2003M6058
$$ plain form
6493 266209 305499 320785 285467 283433 338884 375707 377024 397062 370784 442564 449924 455063
6481 455063 493359 471208 455212 576445 575918 607110 655051 667156 772839 768777 770972 813216
6469 813216 900890 979203 995649 1107604 1197742 1319387 1465010 1645557 1780730 1920750
6459 1920750 2011380 2047693 2125926 2040877 2014415 1942926 1953907 1957981 1977873 1996618 1964984 2067513
6447 2067513 2238044 2274051 2294328 2237544 2076068 1973138 1893795 1760853 1635579 1523411
6437 1523411 1444065 1374274 1278921 1254344 1260199 1185561 1166794 1101452 1093069 995687 1014689 991004
6425 991004 1009985 1028156 1000261 1017538 1101537 1059018 1054159 1072380 1086729 1054152 1086945 1179498
6413 1179498 1132124 1063076 1060615 1081639 1130899 1214971 1272008 1288103 1329819 1390994 1475379 1607993
$$ packed form
6493B66209L9290J5286l5318k034N5451L6823J317K0038k6278P1780P360N139
6481D55063L8296k2151j5996J21233n27L1192M7941J2105J05683m062K195M2244
6469H13216Q7674P8313J6446J11955R0138J21645J45623J80547J35173J40020
6459A920750R0630L6313P8233q5049k6462p1489J0981M074J9892J8745l1634J02529
6447B067513J70531L6007K0277n6784j61476j02930p9343j32942j25274j12168
6437A523411p9346o9791r5353k4577N855p4638j8767o5342q383r7382J9002k3685
6425I91004J8981J8171k7895J7277Q3999m2519m859J8221J4349l2577L2793R2553
6413A179498m7374o9048k461K1024M9260Q4072N7037J6095M1716O1175Q4385J32614
$$ plain form
6401 1607993 1610102 1730375 1872683 1899986 2028296 2137327 2205651 2352375 2540410 2785544
6391 2785544 3010382 3219997 3418479 3608615 3836325 4035059 4125562 4135434 4082054 3973520
6381 3973520 3900583 3955424 3928665 3970009 4104015 4237869 4307646 4412165 4488511 4482159 4422369
6370 4422369 4240626 4016954 3852610 3706465 3528426 3346741 3195186 3069067 3078116 2987240
6360 2987240 2918047 2919643 2891130 2842288 2840386 2890713 2891169 2843258 2813369 2816139 2794436 2797816 2783955
6347 2783955 2837518 2876775 2787836 2810718 2871337 2940393 2929990 2899343 3001116 3107037 3226799
6336 3226799 3410083 3558887 3677564 3821956 4081420 4284518 4452954 4681818 4898534 5109804
6326 5109804 5351988 5590257 5852892 6077453 6359926 6645081 7001043 7375907 7827313 8324645
$$ packed form
6401A607993K109J20273J42308K7303J28310J09031O8324J46724J88035K45134
6391B785544K24838K09615J98482J90136K27710J98734R0503R872n3380j08534
6381C973520p2937N4841k6759M1344J34006J33854O9777J04519P6346o352n9790
6370D422369j81743k23672j64344j46145j78039j81685j51555j26119R049r0876
6360B987240o9193J596k8513m8842j902N0327M56m7911k9889K770k1703L380j3861
6347B783955N3563L9257q8939K2882O0619O9056j0403l0647J01773J05921J19762
6336C226799J83284J48804J18677J44392K59464K03098J68436K28864K16716K11270
6326E109804K42184K38269K62635K24561K82473K85155L55962L74864M51406M97332
$$ plain form
6316 8324645 8823448 9447551 10142277 10831614 11558879 12343984 13199516 14156632 15143417 16348149
6306 16348149 17880384 19889215 22241514 24935590 27703254 30106885 31804052 32519856
6298 32519856 31969937 30460876 28642936 27022281 25810542 25171320 25138215 25556170 26538007
6289 26538007 27968017 29601873 31201790 32191650 31982206 30541691 28076808 25217232
6281 25217232 22437029 20009026 18058902 16396224 15069998 13906388 12907854 12052767
6273 12052767 11368255 10770741 10357025 10076211 9869368 9718305 9683713 9718216 9728901 9792195
6263 9792195 9872384 9946142 10038063 10251722 10537661 10836898 11171699 11553704 11934868 12351114
6253 12351114 12707029 13083371 13533377 14051592 14705677 15439179 16240786 17121254 18028130
$$ packed form
6316H324645M98803O24103O94726O89337P27265P85105Q55532R57116R86785J204732
6306A6348149J532235K008831K352299K694076K767664K403631J697167P15804
6298C2519856n49919j509061j817940j620655j211739o39222l3105M17955R81837
6289B6538007J430010J633856J599917R89860k09444j440515k464883k859576
6281B5217232k780203k428003j950124j662678j326226j163610r98534q55087
6273A2052767o84512n97514m13716k80814k06843j51063l4592L4503J0685O3294
6263I792195Q0189P3758R1921K13659K85939K99237L34801L82005L81164M16246
6253A2351114L55915L76342M50006N18215O54085P33502Q01607Q80468R06876
$$ plain form
6244 18028130 19063680 20236154 21462451 22689625 23978533 25368002 26992268 28809693
6236 28809693 30980836 33597830 36753105 40674378 45245833 50187394 54911435 58553291
6228 58553291 60357337 60015399 57780530 54670850 51495588 48967289 47391082 46672369
6220 46672369 46942715 48208500 50306810 53028867 55690989 57567174 57788372 55976761
6212 55976761 52233156 47328336 42258037 37505030 33533793 30233332 27439346 24985594
6204 24985594 22810905 20917414 19360540 17991741 16793548 15790510 14919073 14192389
6196 14192389 13643158 13123069 12699082 12355741 12110281 11907648 11654276 11536076 11372444
6187 11372444 11166910 11061473 11031642 11045182 10990497 10877179 10700213 10447952 10191992 9856867
$$ packed form
6244A8028130J035550J172474J226297J227174J288908J389469J624266J817425
6236B8809693K171143K616994L155275L921273M571455M941561M724041L641856
6228E8553291J804046l41938k234869l109680l175262k528299j576207p18713
6220D6672369K70346J265785K098310K722057K662122J876185K21198j811611
6212E5976761l743605m904820n070299m753007l971237l300461k793986k453752
6204B4985594k174689j893491j556874j368799j198193j003038q71437p26684
6196A4192389n49231n20089m23987l43341k45460k02633k53372j18200j63632
6187A1372444k05534j05437k9831J3540n4685j13318j76966k52261k55960l35125
$$ plain form
6177 9856867 9575618 9306338 9046353 8739052 8422632 8199365 8062529 7880085 7709175 7561874
6167 7561874 7466758 7368327 7379559 7434775 7458970 7557797 7626675 7570921 7577266 7506964 7409053 7286982
6155 7286982 7099105 6822725 6504337 6319080 6093130 5857012 5672382 5533699 5378351 5200606
6145 5200606 5011157 4932777 4843130 4767721 4702085 4591330 4492867 4476624 4439853 4392657 4316350
6134 4316350 4329796 4307271 4309124 4373070 4299793 4322025 4298872 4355357 4420324 4476736 4559002 4571880
6122 4571880 4647905 4780435 4853072 4878142 4952289 5085476 5264193 5482418 5605593 5764670
6112 5764670 5975205 6142378 6263506 6337321 6478720 6574482 6594467 6560193 6593420 6624720 6676452
6101 6676452 6714193 6891391 7121708 7418201 7607177 7889409 8182982 8434952 8781035 9235183
$$ packed form
6177I856867k81249k69280k59985l07301l16420k23267j36836j82444j70910j47301
6167G561874r5116r8431J1232N5216K4195R8827O8878n5754O345p0302r7911j22071
6155G286982j87877k76380l18388j85257k25950k36118j84630j38683j55348j77745
6145E200606j89449p8380q9647p5409o5636j10755r8463j6243l6771m7196p6307
6134D316350J3446k2525J853O3946p3277K2232k3153N6485O4967N6412Q2266J2878
6122D571880P6025J32530P2637K5070P4147J33187J78717K18225J23175J59077
6112E764670K10535J67173J21128P3815J41399R5762J9985l4274L3227L1300N1732
6101F676452L7741J77198K30317K96493J88976K82232K93573K51970L46083M54148
$$ plain form
6091 9235183 9643553 10060622 10599411 11064787 11558261 12081094 12491421 12861206 13228927 13495356
6081 13495356 13860551 14333909 14837814 15501694 16203324 17022681 17973129 18984039 20073273
6072 20073273 21378602 22724500 24109635 25672075 27331735 29196437 31300662 33732467
6064 33732467 36747884 40377944 44514351 48829298 52610820 55079241 55492941 53658753
6056 53658753 50179962 46147679 42411495 39364957 36940599 35181602 33963430 33162366
6048 33162366 32670706 32519516 32660073 33244228 34326357 35964971 38165147 41150834 44838356
6039 44838356 49033163 52947229 55738415 56612169 54942607 51163265 46161001 41278747
6031 41278747 36899305 33270487 30336182 27891193 25763200 23938364 22516219 21303055
$$ packed form
6091I235183M08370M17069N38789M65376M93474N22833M10327L69785L67721K66429
6081A3495356L65195M73358N03905O63880P01630Q19357R50448J010910J089234
6072B0073273J305329J345898J385135J562440J659660J864702K104225K431805
6064C3732467L015417L630060M136407M314947L781522K468421M13700j834188
6056E3658753l478791m032283l736184l046538k424358j758997j218172q01064
6048C3162366m91660j51190J40557N84155J082129J638614K200176K985687L687522
6039D4838356M194807L914066K791186Q73754j669562l779342n002264m882254
6031D1278747m379442l628818k934305k444989k127993j824836j422145j213164
$$ plain form
6023 21303055 20337673 19527240 18968286 18565633 18280705 18260458 18194562 18107591 18205951 18405038
6013 18405038 18580421 18786046 19116466 19486086 20050694 20718455 21539301 22456287 23541226
6004 23541226 24618005 25568895 26368031 27002940 27453403 27684920 27810305 27980067 28321003
5995 28321003 28925346 29799966 31087704 32819275 34916390 37319670 39601988 41327652
5987 41327652 41990708 41400005 39681214 37530695 35571053 33934678 32751173 31987033 31544503
5978 31544503 31426441 31594242 32034334 32877557 33975092 35374978 37089182 39167834 41599173
5969 41599173 44163525 46740276 49043224 50513898 50564256 49053669 46020556 42217348
5961 42217348 38298551 34775192 31816740 29272139 27207920 25454670 24031685 22837916
$$ packed form
6023B1303055r65382q10433n58954m02653k84928k0247o5896q6971R8360J99087
6013A8405038J75383K05625L30420L69620N64608O67761Q20846R16986J084939
6004B3541226J076779R50890P99136O34909M50463K31517J25385J69762L40936
5995B8321003O04343Q74620J287738J731571K097115K403280K282318J725664
5987D1327652O63056n90703j718791k150519j959642j636375j183505p64140m42530
5978C1544503j18062J67801M40092Q43223J097535J399886J714204K078652K431339
5969D1599173K564352K576751K302948J470674N0358j510587l033113l803208
5961D2217348l918797l523359k958452k544601k064219j753250j422985j193769
$$ plain form
5953 22837916 21850133 21090482 20469054 19999778 19746472 19607466 19453989 19257276 18899544
5944 18899544 18507758 18048764 17367006 16605490 15786775 15036618 14369303 13761371 13239801
5935 13239801 12720559 12294997 11935439 11598974 11270904 11072315 10899360 10652746 10435819
5926 10435819 10258782 10138970 10017748 9859276 9660303 9492864 9314830 9108147 9011303 8814618
5916 8814618 8636845 8540958 8505122 8332993 8204576 8116668 8016317 7972144 8032301 8059881 8085821
5905 8085821 8202271 8426352 8594564 8665201 8634188 8572209 8464736 8268679 8098834 7909040
5895 7909040 7735407 7454532 7267207 7114951 7062855 6950762 6823213 6728787 6657692 6534399
5885 6534399 6472437 6465422 6391944 6332637 6218599 6107011 6104929 6061426 5925167 5777815 5586766
$$ packed form
5953B2837916r87783p59651o21428m69276k53306j39006j53477j96713l57732
5944A8899544l91786m58994o81758p61516q18715p50157o67315o07932n21570
5935A3239801n19242m25562l59558l36465l28070j98589j72955k46614k16927
5926A0435819j77037j19812j21222j58472j98973j67439j78034k06683r6844j96685
5916H814618j77773r5887l5836j72129j28417q7908j00351m4173O0157K7580K5940
5905H085821J16450K24081J68212P0637l1013o1979j07473j96057j69845j89794
5895G909040j73633k80875j87325j52256n2096j12093j27549r4426p1095j23293
5885F534399o1962p015p3478n9307j14038j11588k082m3503j36259j47352j91049
$$ plain form
5874 5586766 5437403 5333825 5154508 4994913 4863059 4793866 4736877 4692055 4601732 4492986
5864 4492986 4414920 4339229 4281383 4197544 4126522 4036687 4029612 4018191 4003914 3936029 3888541 3767885
5852 3767885 3735445 3736732 3660236 3580576 3551687 3496702 3441816 3413813 3496810 3454670 3476737 3544475
5840 3544475 3526182 3570825 3564981 3624433 3631838 3604877 3569193 3591853 3664581 3791636 3844469 3865133
$$ packed form
5874E586766j49363j03578j79317j59595j31854o9193n6989m4822r0323j08746
5864D492986p8066p5691n7846q3839p1022q9835p075j1421j4277o7885m7488j20656
5852C767885l2440J287p6496p9660k8889n4985n4886k8003Q2997m2140K2067O7738
5840C544475j8293M4643n844N9452P405k6961l5684K2660P2728J27055N2833K0664
$$ [...]
##END NTUPLES=NMR SPECTRUM
##END=
