##TITLE=1H_DE-80H_X3
 200.13MHz, d2o
 8 sc
 
 19ns.26.2.2025
##JCAMPDX= 6.0         $$ Bruker NMR JCAMP-DX V2.0
##DATA TYPE= NMR SPECTRUM
##DATA CLASS= NTUPLES
##ORIGIN= UXNMR, Bruker Analytische Messtechnik GmbH
##OWNER= pz
$$ XWIN-NMR		Version 3.5
$$ Thu Jun  5 11:38:51 2025 Russian Standard Time (UT+4h)  Yarkov@DPX200
##.OBSERVE FREQUENCY= 200.1313
##.OBSERVE NUCLEUS= ^1H
##.ACQUISITION MODE= SIMULTANEOUS
##.ACQUISITION SCHEME= undefined
##.AVERAGES= 8
##.DIGITISER RES= 18
##SPECTROMETER/DATA SYSTEM= spect
##.PULSE SEQUENCE= zg30
##.SOLVENT NAME= CDCl3
##.SHIFT REFERENCE= (INTERNAL, CDCl3, 0, 15.4703)
##AUDIT TRAIL= $$ (NUMBER, WHEN, WHO, WHERE, WHAT)
$$ ##TITLE= Audit trail, XWIN-NMR		Version 3.5
$$ ##JCAMPDX= 5.01
$$ ##ORIGIN= Bruker BioSpin GmbH
$$ ##OWNER= Yarkov
$$ C:/Bruker/XWIN-NMR/data/yarkov2/nmr/H-C/1/pdata/1/auditp.txt
$$ ##AUDIT TRAIL=  $$ (NUMBER, WHEN, WHO, WHERE, WHAT)
(   1,<2025-06-05 11:38:01.79 +0400>,<Yarkov>,<DPX200>,
      <created by zg, POWCHK disabled, PULCHK disabled
       configuration hash MD5:
       00 E9 B6 7A A2 85 ED C7 34 08 36 98 17 FE 4E 26
       data hash MD5: 16K
       EE 0B 88 09 6E 27 17 34 BF 0C 23 9E CE D4 C6 BF>)
(   2,<2025-06-05 11:38:08.92 +0400>,<Yarkov>,<DPX200>,
      <Start of raw data processing
       efp BC_mod = 2 LB = 0.25 FT_mod = 6 PKNL = 1 PHC0 = -1710.501 PHC1 = 9.76656 SI = 16K 
       data hash MD5: 16K
       D5 9C 2E F5 AD 8E 2F 14 75 E0 63 BF 01 9E BB 74>)
(   3,<2025-06-05 11:38:19.00 +0400>,<Yarkov>,<DPX200>,
      <abs ABSG = 5 
       data hash MD5: 16K
       A1 80 58 15 99 C6 E6 91 C9 B0 7C D9 66 BA 7E ED>)
$$ ##END=
$$ 
$$ hash MD5
$$ 6B 25 8F 52 E2 58 74 BA E4 D2 CE 81 C2 87 B5 A4
##$RELAX= 
##$RELAX= 
##$RELAX= 
##$RELAX= 
##$RELAX= 
##$RELAX= 
$$ Bruker specific parameters
$$ --------------------------
##$DU= <C:/Bruker/XWIN-NMR>
##$EXPNO= 1
##$NAME= <H-C>
##$PROCNO= 1
##$TYPE= <nmr>
##$USER= <yarkov2>
##$AMP= (0..31)
100 100 100 100 100 100 100 100 100 100 100 100 100 100 100 100 100 100 
100 100 100 100 100 100 100 100 100 100 100 100 100 100 
##$AQSEQ= 0
##$AQ_mod= 1
##$AUNM= <au_zg>
##$AUTOPOS= <>
##$BF1= 200.13
##$BF2= 200.13
##$BF3= 200.13
##$BF4= 200.13
##$BF5= 200.13
##$BF6= 200.13
##$BF7= 200.13
##$BF8= 200.13
##$BYTORDA= 1
##$CFDGTYP= 0
##$CFRGTYP= 5
##$CHEMSTR= <none>
##$CNST= (0..31)
1 1 145 1 1 1 1 1 1 1 1 1 1 1 1 1 1 1 1 1 1 1 1 1 1 1 1 1 1 1 1 1 
##$CPDPRG= <>
##$CPDPRG1= <>
##$CPDPRG2= <>
##$CPDPRG3= <>
##$CPDPRG4= <mlev>
##$CPDPRG5= <mlev>
##$CPDPRG6= <mlev>
##$CPDPRG7= <mlev>
##$CPDPRG8= <mlev>
##$CPDPRGB= <>
##$CPDPRGT= <>
##$D= (0..31)
0 0.7 0 0 0 0 0 0 0 0 0 0.03 0 0 0 0 0 0 0 0 0 0 0 0 0 0 0 0 0 0 0 0 
##$DATE= 1749109081
##$DBL= (0..7)
120 120 120 120 120 120 120 120 
##$DBP= (0..7)
150 150 150 150 150 150 150 150 
##$DBP07= 0
##$DBPNAM0= <>
##$DBPNAM1= <>
##$DBPNAM2= <>
##$DBPNAM3= <>
##$DBPNAM4= <>
##$DBPNAM5= <>
##$DBPNAM6= <>
##$DBPNAM7= <>
##$DBPOAL= (0..7)
0.5 0.5 0.5 0.5 0.5 0.5 0.5 0.5 
##$DBPOFFS= (0..7)
0 0 0 0 0 0 0 0 
##$DE= 6
$$ [...]
##$SUBNAM3= <"">
##$SUBNAM4= <"">
##$SUBNAM5= <"">
##$SUBNAM6= <"">
##$SUBNAM7= <"">
##$SUBNAM8= <"">
##$SUBNAM9= <"">
##$SW= 18.0517328524113
##$SWIBOX= (0..15)
0 0 2 0 0 0 0 0 0 0 0 0 0 0 0 0 
##$SW_h= 3612.71676300578
##$TD= 16384
##$TD0= 1
##$TE= 0
##$TE2= 300
##$TE3= 300
##$TEG= 300
##$TL= (0..7)
0 120 120 120 120 120 120 120 
##$TP= (0..7)
150 150 150 150 150 150 150 150 
##$TP07= 0
##$TPNAME0= <>
##$TPNAME1= <>
##$TPNAME2= <>
##$TPNAME3= <>
##$TPNAME4= <>
##$TPNAME5= <>
##$TPNAME6= <>
##$TPNAME7= <>
##$TPOAL= (0..7)
0.5 0.5 0.5 0.5 0.5 0.5 0.5 0.5 
##$TPOFFS= (0..7)
0 0 0 0 0 0 0 0 
##$TUNHIN= 0
##$TUNHOUT= 0
##$TUNXOUT= 0
##$USERA1= <user>
##$USERA2= <user>
##$USERA3= <user>
##$USERA4= <user>
##$USERA5= <user>
##$V9= 5
##$VALIST= <valist>
##$VCLIST= <CCCCCCCCCCCCCCC>
##$VD= 0
##$VDLIST= <DDDDDDDDDDDDDDD>
##$VPLIST= <PPPPPPPPPPPPPPP>
##$VTLIST= <TTTTTTTTTTTTTTT>
##$WBST= 1024
##$WBSW= 4
##$XGAIN= (0..3)
0 0 0 0 
##$XL= 0
##$YL= 0
##$YMAX_a= 177460
##$YMIN_a= -145926
##$ZGOPTNS= <>
##$ZL1= 120
##$ZL2= 120
##$ZL3= 120
##$ZL4= 120
##$ABSF1= 15.51221
##$ABSF2= -2.539639
##$ABSG= 5
##$ABSL= 3
##$ALPHA= 0
##$AQORDER= 0
##$ASSFAC= 0
##$ASSFACI= 0
##$ASSFACX= 0
##$ASSWID= 0
##$AUNMP= <proc_1d>
##$AZFE= 0.1
##$AZFW= 0.1
##$BCFW= 0
##$BC_mod= 2
##$BYTORDP= 0
##$COROFFS= 0
##$CY= -3
##$DATMOD= 1
##$DC= 0
##$DFILT= <>
##$DTYPP= 0
##$F1P= 0
##$F2P= 0
##$FCOR= 1
##$FTSIZE= 16384
##$FT_mod= 6
##$GAMMA= 0
##$GB= 0
##$INTBC= 1
##$INTSCL= 3.241238e-09
##$ISEN= 128
##$LB= 0.25
##$LEV0= 0
##$LPBIN= 0
##$MAXI= 10000
##$MC2= 0
##$MEAN= 0
##$ME_mod= 0
##$MI= 1.114404
##$NCOEF= 0
##$NC_proc= -6
##$NLEV= 6
##$NOISF1= 3.799351
##$NOISF2= 2.8
##$NSP= 0
##$NTH_PI= 0
##$NZP= 0
##$OFFSET= 15.47034
##$PC= 1
##$PHC0= -1710.501
##$PHC1= 9.76656
##$PH_mod= 1
##$PKNL= yes
##$PPARMOD= 0
##$PSCAL= 0
##$PSIGN= 0
##$REVERSE= no
##$SF= 200.130010280371
##$SI= 16384
##$SIGF1= 3
##$SIGF2= 2
##$SINO= 0.751879
##$SIOLD= 32768
##$SREGLST= <19F.Aceton>
##$SSB= 0
##$STSI= 16384
##$STSR= 0
##$SW_p= 3612.71676300578
##$SYMM= 0
##$S_DEV= 0
##$TDeff= 16384
##$TDoff= 0
##$TI= <>
##$TILT= no
##$TM1= 0
##$TM2= 0
##$TOPLEV= 0
##$USERP1= <user>
##$USERP2= <user>
##$USERP3= <user>
##$USERP4= <user>
##$USERP5= <user>
##$WDW= 1
##$XDIM= 16384
##$YMAX_p= 403883654
##$YMIN_p= -188119
$$ End of Bruker specific parameters
$$ ---------------------------------
##NTUPLES= NMR SPECTRUM
##VAR_NAME=  FREQUENCY,     SPECTRUM/REAL,   SPECTRUM/IMAG
##SYMBOL=    X,             R,               I
##VAR_TYPE=  INDEPENDENT,   DEPENDENT,       DEPENDENT
##VAR_FORM=  AFFN,          ASDF,            ASDF
##VAR_DIM=   16384,         16384,           16384
##UNITS=     HZ,            ARBITRARY UNITS, ARBITRARY UNITS
##FACTOR=    0.220516191357247, 1,           1
##FIRST=     3096.07925822868, 0,            0
##LAST=      -516.637504777097, 0,           0
##MIN=       -516.637504777097, -188119,     0
##MAX=       3096.07925822868, 403883654,    0
$$ Real data points
##PAGE= N=1
##DATA TABLE= (X++(R..R)), XYDATA
$$ [...]
8143B544995m5260J31K9949n7622R792k4857j16896p4413k9916K3080o1997l3642
$$ 2544995 2499735 2499866 2529815 2472193 2481985 2457128 2340232 2265819 2235903 2258983 2196986 2163344
8131B163344k5088K3425N3087L6783J5665r4151K3886Q4948o412L0160N1220k530
$$ 2163344 2138256 2161681 2214768 2251551 2267216 2173065 2196951 2281899 2275487 2305647 2356867 2354337
8119B354337R834R2521O8163L1613J9050L049n0102o0211O335j4588m30r293K2188
$$ 2354337 2364171 2456692 2524855 2556468 2575518 2578567 2528465 2468254 2474589 2460001 2459571 2450278 2472466
8106B472466j3293m9797n5628q117L8514l5500K163j01370o9470N2814L3432L0599
$$ 2472466 2459173 2409376 2353748 2345631 2384145 2348645 2350808 2249438 2179968 2232782 2266214 2296813
8094B296813o950o1517j10827k8694n55Q6050l4743j27928p3660j361K5787r3066
$$ 2296813 2289863 2228346 2117519 2088825 2088270 2174320 2139577 2011649 1937989 1936628 1962415 1869349
8082A869349j3437j9802p425O771j07386r1857n0021o1867o5439Q6919p1704o5504
$$ 1869349 1855912 1836110 1828685 1835456 1728070 1636213 1586192 1524325 1458886 1545805 1474101 1408597
8070A408597j5194p1455j0225j0296r4728m0318n0477m6958j5216o2722r32K7125
$$ 1408597 1393403 1321948 1311723 1301427 1206699 1166381 1115904 1068946 1053730 991008 990076 1017201
8058A017201J356K2872l3932k5259K1195n677K1423r6711K3893m1322r1201k3458
$$ 1017201 1018557 1041429 1007497 982238 1003433 997756 1019179 922468 946361 905039 813838 790380
8046G90380J15197p6432k7984O0070n3252o3037k6340N9026j333j8925K0359l6241
$$ 790380 905577 829145 801161 861231 807979 744942 718602 777628 776295 757370 777729 741488
8034G41488l7506L0578j8714m5212M086M8064L9026j6739q7471l4236O1422o7592
$$ 741488 703982 734560 715846 670634 674720 722784 761810 745071 657600 623364 684786 617194
8022F17194K2252M3433R963k5142k3407M0934k5566K4539p6950k6113J854N7007
$$ 617194 639446 682879 692842 667700 644293 685227 659661 684200 607250 581137 582991 639998
8010F39998P1560m8450n4959n625L1143l8770N0724M363k4386P4771l2680P639
$$ 639998 711558 663108 608149 602524 633667 594897 645621 649984 625598 700369 667689 675328
7998F75328k8019n3670N1360O1437k5951j1499M2906L2425p6925j180k8343l5087
$$ 675328 647309 593639 644999 706436 680485 668986 711892 744317 667392 666212 637869 602782
7986F02782Q4175K6279L3226p476p673K4373J4047l9053J3959l5568m6051L6583
$$ 602782 686957 713236 746462 738986 731313 755686 769733 730680 744639 709071 663020 699603
7974F99603N4736j7351j7025Q8194o989k4608M5822k8125n4338j7441J8905K7902
$$ 699603 754339 736988 719963 808157 801168 776560 822382 794257 739919 722478 741383 769285
7962G69285j34492r026r841J207M2087L3920J9417N1435L085j16459q4402l3380
$$ 769285 634793 625767 615926 617133 659220 693140 712557 763992 767077 650618 566216 532836
7950E32836M9322K5050k2543j435l068m0957k8782P9000M0536m9301l0479k7579
$$ 532836 582158 607208 584665 583230 580162 539205 510423 589423 629959 580658 550179 522600
7938E22600m2453K2686L6755l785j1794O4420m3888l18K3893O371k0892M4115
$$ 522600 480147 502833 539588 535803 524009 588429 544541 544223 568116 574487 553595 597710
7926E97710l6561j01214o090M8275N3970l57l3411n6621L8303K680K6726n8850
$$ 597710 561149 459935 453845 502120 556090 555733 522322 465701 504004 506684 533410 474560
7914D74560n2132o076K9675r933Q62K1966l257r985P284p3260J0220M3115p4759
$$ 474560 422428 416352 446027 436094 436956 458922 455665 445680 452964 379704 389924 433039 358280
7901C58280j4201N9617K6131J6027N688O608o4558j3240L8415N527r7471M678
$$ 358280 344079 403696 429827 445854 451542 458150 393592 380352 418767 424294 326823 331501
7889C31501K7599M358k5435J0897J1227k9148k5784j6994L9395n8006L2952M9600
$$ 331501 359100 363458 338023 348920 360147 330999 305215 288221 327616 269610 302562 352162
7877C52162j1394L4361J1916o961Q697j3802k423J4808l1116n1564l132o988J923
$$ 352162 340768 375129 387045 380084 388781 374979 372556 387364 356248 304684 301552 294564 296487
7864B96487R5171M7769P3648q3978q9647j3075l4949J732J8359M9151m1622L8379
$$ 296487 391658 439427 513075 429097 339450 326375 291426 293158 311517 360668 319046 357425
7852C57425J7982K7089L7007n1495l5803j7977k7328m110J6612N4717J9529K5434
$$ 357425 375407 402496 439503 388008 352205 334228 306900 302790 319402 374119 393648 419082
7840D19082k3734m77J8244p2437R508K4452K7822J9779M403m1950j9847J4143
$$ 419082 395348 394871 413115 340678 350186 374638 402460 422239 426642 384692 364845 378988
7828C78988k736J2697J0391p3930M0995J9259k9735J8606L9124n3977k9600N6885
$$ 378988 376252 388949 399340 325410 366405 385664 355929 374535 413659 359682 330082 386967
7816C86967m3886J3962J5138J7240M8060L1559l9854j5080M8574j5131p6661O2292
$$ 386967 343081 357043 372181 389421 437481 469040 429186 414106 462680 447549 370888 433180
7804D33180K1193Q790k75894J25183J66935o1812j9115K5415M2242k2186J3575
$$ 433180 454373 463163 187269 312452 479387 417575 398460 423875 466117 443931 457506
7793D57506j4271J1275L1147M1907o1485L3151K7645J7108j105J1452k0616m4176
$$ 457506 443235 454510 485657 527564 466079 499230 526875 543983 542878 554330 533714 489538
7781D89538m4891M6475l502l5833o870k6145j4499L6564O8232j89k5554q563k2719
$$ 489538 444647 491122 487620 451787 444917 418772 404273 440837 509069 508880 483326 474763 452044
7768D52044l4025O8387k2014l2647j8044j2580O6720n692j3737k421n5624N7265
$$ 452044 418019 486406 464392 431745 413701 401121 467841 462149 448412 445991 390367 447632
7756D47632M1424m3019M1751k3991o7197m7623k2960Q3846O7822j6477k534J298
$$ 447632 489056 446037 487788 463797 396600 348977 326017 409863 477685 461208 458674 459972
7744D59972K5782L4345k70p9461N009Q6694J1802q4679m3372L5437J4578m0789
$$ 459972 485754 520099 519829 440368 445377 532071 543873 459194 415822 451259 465837 425048
7732D25048p3359J7845M6019k244J1694N9139l6740P925m2577k5351J1889n3983
$$ 425048 351689 369534 415553 413309 425003 484142 447402 455327 412750 387399 399288 345305
7720C45305J21022K6523o6900k4211j8515J083j5627N4235L2626p1953Q4610k0874
$$ 345305 466327 492850 425950 401739 383224 384307 368680 422915 455541 383588 468198 447324
7708D47324l6644R226m2941J4200J9697l50p7980j754j5643O5767K6063j11315
$$ 447324 410680 419906 376965 391165 410862 410512 332532 330778 315135 380902 406965 295650
7696B95650L3467P2212o3039l1966O5612L8631j07620m4072q866j3666k048O622
$$ 295650 329117 401329 338290 306324 371936 410567 302947 258875 250009 236343 234295 240917
7684B40917L6667L2487L2246j9805L2238k6403K8443q122n5385j6478L0529m4042
$$ 240917 277584 310071 342317 322512 354750 328347 356790 348668 293283 276805 307334 263292
7672B63292m1680o873N5777r672o9726j5348K3644O9325k1192n2944O7125j4060
$$ 263292 221612 214739 270516 260844 191118 175770 199414 268739 247547 194603 261728 247668
7660B47668n084L0848J7386M3220l3830L577l1767l6031L8762n4058l4748J5476
$$ 247668 242584 273432 290818 334038 300208 303785 272018 235987 274749 220691 185943 201419
7648B01419M5095M9966o0042K1238j1072q4305L212L2224J8548L7827K7234p0295
$$ 201419 246514 296480 236438 257676 246604 162299 165511 197735 216283 254110 281344 211049
7636B11049K9222K3432k1037K9447o1908j9873l2219n6740M5872J6982m772j5120
$$ 211049 240271 263703 242666 272113 210205 190332 158113 101373 147245 164227 159455 144335
7624A44335J8415J5441K7208L5563k5278k621l0242L1445K3307J9112n380j5784
$$ 144335 162750 178191 205399 240962 215684 213063 182821 214266 237573 256685 251305 235521
7612B35521p6340n1984L8479J8961R185j6252O5138P886m1463n3761o7464R747
$$ 235521 159181 107197 145676 164637 173822 157570 222708 230594 189131 135370 67906 77653
7600G7653J6603Q6428o081j1374J3243K1313O603m0923k1904L5397K067k3433
$$ 77653 94256 180684 174603 163229 176472 197785 204388 163465 141561 176958 179025 155592
7588A55592L3556j6806j5165K4307n9639Q034m3057N6966J6722m0495P7203Q385
$$ 155592 189148 172342 157177 181484 121845 129879 86822 143788 160510 120015 197218 205603
7576B05603m8704M3134l0997j3746O5106L2089o9857k1831j1795k7897N7833l7968
$$ 205603 156899 200033 169036 155290 220396 252485 182628 160797 149002 121105 178938 140970
7564A40970j5577K1391p0229J4804O1554L6452l8235n7745K0965Q379N793R570
$$ 140970 125393 146784 76555 91359 152913 189365 151130 93385 114350 122729 128522 138092
7552A38092M3065j6714R957q731o825j0622J4222P9115K7157l3261P1547N255
$$ 138092 181157 164443 174400 165669 158844 148222 162444 241559 268716 235455 307002 312257
7540C12257j19488m8187R4228l7469m5223j3400K0329K4497k4865k1701n5373
$$ 312257 192769 144582 238810 201341 156118 142718 163047 187544 162679 140978 85605
7529H5605L0713N4282j00578j4613J00026m605o8426K348J9145L7365n334l4241
$$ 85605 116318 170600 70022 55409 155435 150830 82404 84752 103897 141262 135928 101687
7517A01687J7130J4096N1226r540p8110q848K5585K3434L8601L182m3322k9033
$$ 101687 118817 132913 184139 174599 96489 87641 113226 136660 175261 178443 135121 106088
7505A06088j8176J275K9762J517l2899m6093k5253J5646k1540M7872k4101m348
$$ 106088 87912 89187 118949 120466 87567 41474 16221 31867 10327 58199 34098 29750
7493B9750J7999M4619J3340l3977o608J379K3788K2056M9142n9728j5884J943
$$ 29750 47749 92368 105708 71731 65123 66502 90290 112346 161488 101760 85876 87819
7481H7819j0069J7573r875n739J1932q9375O029J2382J0005Q1408O642o018o2513
$$ 87819 77750 95323 85448 79709 91641 2266 8295 20677 30682 112090 118732 112714 50201
7468E0201M1337n1934m114O6964p0289p1144O8040O1833k1384N6215j7244j1108
$$ 50201 91538 39604 35490 102454 32165 -38979 29061 90894 69510 125725 108481 97373
7456I7373l2362K8940M078O047l849n9373K0354Q172k006K722p240n859r7855
$$ 97373 65011 93951 98029 104076 100227 40854 61208 69380 67374 70096 62856 56997 -40858
7443d0858R4849l89K9185J907o2015n903k1917M7931O9254k3512l6786N8420k501
$$ -40858 53991 53602 82787 84694 22679 16776 -5141 42790 112044 88532 51746 110166 107665
7430A07665j2992n9796J719L4899o006k0318m2618J04627j0036n8687K728P889
$$ 107665 94673 34877 36596 71495 65489 45171 2553 107180 97144 38457 41185 49074
7418D9074M2917n2052O4471j4246r995P774k5219O252l384L162N7546p8059M570
$$ 49074 91991 39939 104410 90164 80169 87943 62724 68976 65592 68754 126300 48241 52811
7405E2811k2110l0360j0881K6755J772m7587R5853j5048J1887k57J7505Q121L3309
$$ 52811 30701 341 -10540 16215 17987 -29600 66253 51205 63092 62835 80340 88461 121770
7392A21770R218n7254k5734K9437K9734j8977n8530M89K9971J1704J3484k2825
$$ 121770 130988 73734 48000 77437 107171 88194 29664 30153 60124 71828 85312 62487
7380F2487K7829P618j7435J4835K2102r893r730J5125m3421M3029k6648j9681
$$ 62487 90316 97934 80499 95334 117436 107543 97813 112938 69517 112546 85898 66217
7368F6217J9008m0134J7289Q382j3885M3961L0598l4321J1928n0679r2468j8031
$$ 66217 85225 45091 62380 70762 56877 100838 131436 97115 109043 58364 -34104 -52135
7356e2135N8294P7088O3954l7120m0614M6846P849p8148M3508j7192K7012n848
$$ -52135 6159 83247 147201 110081 69467 116313 124162 46014 89522 72330 99342 93494
7344I3494l6138k1366j7129J04261j7616q8587P8051j105R680L3909L0062l8959
$$ 93494 57356 35990 18861 123122 105506 16919 94970 93865 103545 137454 167516 128557
7332A28557o9609l7347M5392K7693j6700R544K679P4148n3136k8367R487n021
$$ 128557 58948 21601 66993 94686 77986 87530 90209 164357 111221 82854 92341 87320
7320H7320m0482M9781K0044l7151j1020l2881j8829Q9371N3744m7447j5805M5633
$$ 87320 46838 96619 116663 79512 68492 35611 16782 106153 159897 112450 96645 142278
7308A42278N353o542J7616k5860K2979P0241j3809J1585j8000q1381l1751J23807
$$ 142278 147631 141089 158705 132845 155824 226065 212256 223841 205841 124460 92709 216516
7296B16516K5612m2350m6195l333m631k7369O786M4467L9406Q162L7100j2881
$$ 216516 242128 199778 153583 150250 145619 118250 125036 169503 208909 217071 254171 241290
7284B41290k959P334L0815k4010m2888p4j8572k0133J3445O0045K979J6696m1726
$$ 241290 238331 245665 276480 252470 209582 209508 190936 170803 184248 244293 247272 263968 222242
7271B22242L5152M7145k9371j8330P438q9850J9026P6388m6288L6325J8002L9604
$$ 222242 257394 304539 275168 256838 264276 174426 193452 269840 223552 259877 277879 317483
7259C17483n2857l8000k5194o017O3810L9664N75j6193J4094K5932P882J2383
$$ 317483 264626 226626 201432 195415 259225 298889 299464 283271 297365 323297 331179 343562
7247C43562n0491j3693k1269O3002M0050r75L1243M7228j164L6931K8888m6863
$$ 343562 293071 279378 258109 321111 361161 360186 391429 438657 437493 474424 503312 456449
7235D56449k9373P912K2329Q4568J4095j0178j7053m0857N5184J803J5186j531
$$ 456449 427076 434988 457317 541885 555980 545802 528749 487892 543076 544879 560065 558534
7223E58534L6004n7389l4482j451N7358L9839j4939O1159l1509l2529K7037q94
$$ 558534 594538 537149 502667 501216 558574 598413 583474 644633 613124 580595 607632 606738
7211F06738k2643J4194l6269K5583L0856m2507n3503Q3932O5683K3787o787j5349
$$ 606738 584095 598289 562020 587603 618459 575952 522449 606381 672064 695851 689064 673715
7199F73715Q4702j8550O9140N8936l9179m2049J5894P8408R5616P999N1990K935
$$ 673715 758417 739867 809007 867943 828764 786715 802609 881017 976633 984632 1036622 1039557
7187A039557j3643M7378L3401N0783M8865J15041Q4879M8480O2473J20184J12629
$$ 1039557 1025914 1073292 1106693 1157476 1206341 1321382 1406261 1454741 1517214 1637398 1750027
7176A750027J13568J22165J07498R7102J64339K07132J59990J93079K17313J72353
$$ 1750027 1863595 1985760 2093258 2190360 2354699 2561831 2721821 2914900 3132213 3304566
7166C304566K75686K00328J39099J77226K00325K07805J95768K80227K93637L64637
$$ 3304566 3580252 3780580 3919679 4096905 4297230 4505035 4700803 4981030 5274667 5639304
7156E639304L52209M82295N80811O10855P59130Q62694Q73405Q59035J103094
$$ 5639304 5991513 6473808 7054619 7665474 8424604 9287298 10160703 11019738 12122832
7147A2122832J476602J857905K321195K612040K911617K698280J511137k53599
$$ 12122832 13599434 15457339 17778534 20390574 23302191 26000471 27511608 27258009
7139B7258009k046416l101993l106807k540195k172010j898289j718987j453391
$$ 27258009 25211593 22109600 19002793 16462598 14290588 12392299 10673312 9219921
7131I219921j103893r29904q49372n81583n00297m33032l47181k90787k93840
$$ 9219921 8116028 7186124 6336752 5755169 5254872 4821840 4474659 4183872 3890032
7122C890032k21912j33272j52170j91256k02995j45209j09736p3987j53451j85603
$$ 3890032 3668120 3534848 3382678 3191422 2988427 2843218 2733482 2659495 2506044 2320441
7112B320441j49623r6818n5975j00994o5950n4423m9695j12179r1758M0669l3441
$$ 2320441 2170818 2074000 2018025 1917031 1851081 1796658 1746963 1634784 1543026 1583695 1550254
7101A550254m5163q5639M53j7144n7722p7408p6606R102k8022L5722o6357p6271
$$ 1550254 1505091 1419452 1419905 1402761 1345039 1267631 1191025 1200127 1172105 1207827 1141470 1065199
7089A065199k2830r0787L0676L0621L3770j424l8230k8205l2814L0961n9634m9151
$$ 1065199 1042369 951582 982258 1012879 1046649 1045225 1006995 978790 945976 976937 917303 868152
7077H68152O503l5770k3599m5051J3150o2957k9328l2042J8447K4610L992o3645
$$ 868152 874655 838885 815286 770235 783385 720428 691100 659058 677505 702115 706107 642462
7065F42462J4257k981m6321p363m8391n1690O1739P2267o6195q7198p1999M0998
$$ 642462 656719 653738 607417 600054 551663 499973 561712 633979 567784 480586 408587 449585
7053D49585L7675l3882l4300m0958M0379P7741l670n9377O0687j6489r9233N4721
$$ 449585 487260 453378 419078 378120 418499 496240 492570 433193 493880 477391 378158 432879
7041D32879M8077J088l3088k2706n9290M6950J1201n628P760k4345n8272J8206
$$ 432879 480956 482044 448956 426250 366960 413910 425111 419483 427243 402898 344626 362832
7029C62832j2701K1004p9963M457M9470j7035K1506l438J9669o926J8559Q4927
$$ 362832 350131 371135 291172 295629 345099 328064 349570 346132 365801 358875 377434 462361
7017D62361j3033r2874P5504l812k8297l4903L1340q1389j0968j7552K9700n4100
$$ 462361 449328 356454 431958 428146 399849 364946 396286 314897 303929 286377 316077 261977
7005B61977m6788k6973k1791K920k2131J4447L1250N9397Q188p7073l5262K3721
$$ 261977 215189 188216 166425 169345 147214 161661 192911 252308 260496 183423 148161 171882
6993A71882k4076J8516k2498J2594J3813M152p8543j1368l0488l3679J6887K6573
$$ 171882 147806 166322 143824 156418 170231 174383 95840 84472 53984 20305 37192 63765
6981F3765l0170N2972Q361Q557O104j5166O3492L6880J6507m3782m1271m4526
$$ 63765 33595 86567 94928 103485 109589 94423 157915 194795 211302 167520 126249 81723
6969H1723M3994O7034M554r450j6524M8288k2417J8027m5419m5165m9943j4792
$$ 81723 125717 192751 197305 187855 171331 219619 197202 215229 169810 124645 74702 59910
6957E9910J1116q469N8557L6594k9507r2550p620O4399L9326P526K4793j2133
$$ 59910 71026 62557 121114 157708 128201 35651 28031 92430 131756 139282 164075 151942
6945A51942l9014L6597j2443p205J4423j8234m5283O2836p180n8907K7811R094
$$ 151942 112928 149525 137082 129877 144300 126066 80783 143619 136439 77532 105343 114437
6933A14437m3747O7574n1985j9186N0326J8271o435m9861q9824Q6626P0970o3488
$$ 114437 70690 138264 86279 67093 117419 135690 129255 79394 -10430 76196 147166 83678
6921H3678L9104r156K2464o3701l1493J11934M0745m3695j5932k8548j0203k0745
$$ 83678 122782 113626 136090 72389 40896 152830 193575 149880 133948 105400 95197 74452
6909G4452k3480Q367N0744K203J4165p6051L0408K0116k377p0169m8534L5786
$$ 74452 50972 59339 110083 112286 126451 50400 80808 100924 98547 28378 -20156 15630
6897A5630l997N002N6433O1836n1257M0346N3489N2638J3550l3037j08937k5138
$$ 15630 11633 16635 73068 134904 83647 123993 177482 230120 243670 210633 101696 76558
6885G6558M1054j0503m3635q601P069K8181k9455k5824K798n9222Q5960L1891
$$ 76558 117612 107109 63474 54873 61942 90123 60668 34844 37642 -21580 64380 96271
6873I6271P8036l9393q1870K3217O5235o1432k7708J6258k1796J5252K371J6032
$$ 96271 174307 134914 53044 76261 141496 80064 52356 68614 46818 62070 64441 80473
6861H0473Q450l3762P170j4802M3897m2190N2318J2530k8625k8216j02K1412j2598
$$ 80473 88923 55161 62331 47529 91426 49236 101554 114084 85459 57243 57141 78553 65955
6848F5955j0489j3644l1931L0961K6153J3077M8388k124p9103K5835O3785r0645
$$ 65955 55466 41822 9891 40852 67005 80082 128470 126346 47243 73078 136863 46218
6836D6218j0002L7818j832L052j4131K9255j8341r4614K1050J17506l6896J6210
$$ 46218 36216 74034 72202 75254 61123 90378 72037 -22577 -1527 115979 79083 95293
6824I5293j7669o380L6499k3138J1323q8695M3543L7471j1039L2226l9957n9960
$$ 95293 77624 71244 107743 84605 95928 7233 50776 88247 77208 109434 69477 9517
6812I517m9631J2407J03843M8594K805k5803o1265M8041L7279n7306Q06m844P3660
$$ 9517 -40114 -27707 76136 124730 127535 101732 40467 88508 125787 68481 69287 64443 138103
6799A38103j01458q704Q1578P9070k8585j7025j7923o978J7468m4125O5305o2410
$$ 138103 36645 27941 109519 188589 160004 142979 125056 118078 135546 91421 156726 94316
6787I4316k8945k1432q4154M5877J6527J1472m0181J09960K6414j09179k3703
$$ 94316 65371 43939 -40215 5662 22189 33661 -6520 103440 129854 20675 -3028
6776c028J07808o3867J3520n5615k8348O6416P4644L0269p6103p815L6666O550
$$ -3028 104780 40913 54433 -1182 -29530 36886 111530 141799 65696 57881 94547 101097
6764A01097l67n5792J03J4359O4824J0577o7824o3534J3702J8437q0446K4842
$$ 101097 100730 44938 45041 59400 124224 134801 66977 3443 17145 35582 -44864 -20022
6752b0022O9067m5618K8359M5689q40K0181J6703L632O1680n497n8707K1127l3190
$$ -20022 49045 3427 31786 77475 76635 96816 113519 117151 178831 173334 114627 135754 102564
6739A02564M3187j2676J5919q767j4245J0014l5863k3947M6490j6056M0235n1637
$$ 102564 145751 133075 148994 140227 125982 135996 100133 76186 122676 106620 146855 95218
6727I5218J5506K6278j5484M2877J47o2306l7182J4243J2350K06K9514J3673l7093
$$ 95218 110724 137002 121518 164395 164542 102236 65054 79297 91647 91853 121367 135040 97947
6714I7947k8700l1889J6038N0656q965J2698k2287O3156R059j6882q1398l1418
$$ 97947 69247 37358 53396 104052 95087 107785 85498 148654 157713 140831 59433 28015
6702B8015K1853R857O5044j3145p4309K2450L3210Q577Q4142m6406n4662J2548
$$ 28015 49868 59725 124769 111624 37315 59765 92975 101552 185694 139288 84626 97174
6690I7174M4496L9240m4864l0595P5112L0309j06666K0945K2186K7786J8658j1132
$$ 97174 141670 180910 136046 105451 180563 210872 104206 125151 147337 175123 193781 182649
6678A82649J9934Q1552o427n7435l9952N071L2230O304R151M7474K1017j2837
$$ 182649 202583 284135 277708 220273 180321 185392 217622 223926 233077 280551 301568 288731
6666B88731N641n0017J1753M7458j185m0219l7916K3554K5951L0449J10366l8534
$$ 288731 294372 244355 256108 303566 302381 262162 224246 247800 273751 304200 414566 376032
6654C76032p1901K5820P1065j1208k5405P2206l8728L2879m4506M4480n3340j1386
$$ 376032 304131 329951 401016 389808 364403 436609 397881 430760 386254 430734 377394 366008
6642C66008o5134J8589N7416r454m3741j4625N2028Q628M5299n3979L2943n0951
$$ 366008 300874 319463 376879 367425 323684 309059 361087 369715 415014 361035 393978 343027
6630C43027K679K3455l8561N9312L4741o0012l3931o2572J6051k884L1275q0026
$$ 343027 345706 369161 330600 389912 424653 364641 330710 268138 284189 281305 312580 232554
6618B32554M8043M2028P4529K3287k457j0393l2675q2232n5231L0419L0096L7763
$$ 232554 280597 322625 397154 420441 417984 407591 374916 292684 237453 267872 297968 335731
6606C35731L1403K6570r714q2146j9425P7310J6612n5900j7712J5148O0828O0758
$$ 335731 367134 393704 383990 301844 282419 359729 376341 320441 302729 317877 378705 439463
6594D39463l7535j8206J4707P3463P1221k1762n0037p77j9447K623k7193J9906
$$ 439463 401928 383722 398429 471892 543113 521351 471314 470537 451090 453713 426520 446426
6582D46426l1094R31P7761l6747N669K6355P1440m4400m0351j1318J22540l9536
$$ 446426 415332 416263 494024 457277 462946 489301 560741 516341 475990 464672 587212 547676
6570E47676q7202N0203l9159K6263L3830O333L3109K1325m3889O7122J0394m6748
$$ 547676 460474 510677 471518 497781 531611 537944 571053 592378 548489 615611 626005 579257
6558E79257J3409q364M1255k5774n9704m3719O6525K1210k6404M1782m925q1347
$$ 579257 592666 584302 625557 599783 540079 496360 562885 584095 557691 599473 594548 513201
6546E13201q78R4017j1465k3729j3845j04532r7573Q0042m7178N5709J3928J9662
$$ 513201 512323 606340 594875 571146 557301 452769 355196 435238 388060 443769 457697 477359
6534D77359k7392m6764k5838K3625L4599p8789l8651j1754J4452J3407M4020j3219
$$ 477359 449967 403203 377365 400990 435589 356800 318149 306395 320847 334254 378274 365055
6522C65055n6543j8901k8604K7055N6341m4760O10M7026m2257R4320n9248j29266
$$ 365055 308512 289611 261007 288062 344403 299643 300253 347279 305022 399342 340094 210828
6510B10828O4812J4279k2606K1017K494m5250Q294M6488l8486l2566k7131M2869
$$ 210828 275640 289919 267313 288330 290824 245574 253868 300356 261870 229304 202173 245042
6498B45042N2431l1705j0154j9570j0399p1998O3522K1921L7057k8564m5619L1921
$$ 245042 297473 265768 255614 236044 225645 153647 217169 239090 276147 247583 201964 233885
6486B33885K4142k9636l8742K1179K4369o3847k5288K7497j4081j5357l1216L5702
$$ 233885 258027 228391 189649 210828 235197 171350 146062 173559 159478 144121 112905 148607
6474A48607J8148J08092p733k9969j4924Q555M9582j2268k653k1075K216q96m6323
$$ 148607 166755 274847 267114 237145 222221 230776 280358 268090 265437 244362 246578 245682 199359
6461A99359q629m048J9202k8985p576P5432m5153K597Q0332L3891p9083l1769
$$ 199359 190730 186682 205884 176899 169323 244755 199602 202199 282531 316422 237339 205570
6449B05570k7755M2448P5294l4553j6850L2134P096m1438r34K958m1795J1926
$$ 205570 177815 220263 295557 261004 244154 276288 283384 241946 241012 243970 202175 214101
6437B14101R326K2054L4004J08L3152l6238K7417J2200j6532m7309j583p3788
$$ 214101 223427 245481 279485 279593 312745 276507 303924 316124 299592 252283 250700 176912
6425A76912q382N5059l980j9226r854M6681J977K2627q2443N377J09311M9527
$$ 176912 168530 223589 219609 200383 190529 237210 239187 261814 179371 184748 294059 343586
6413C43586k2198l9775M6131R910k0020J4430k8472N059M1734M4986m0874l5681
$$ 343586 321388 281613 327744 337654 317634 332064 303592 308651 350385 395371 354497 318816
6401C18816J4282n6775J9997j8189K1688L0651k8359k1645O6020m5818q89L0687
$$ 318816 333098 276323 296320 278131 299819 330470 302111 280466 346486 300668 299779 330466
6389C30466p872n6112k2848J3134N8125L1303L1407l4952k6983K1337l6428j9879
$$ 330466 322594 266482 243634 256768 314893 346196 377603 342651 315668 337005 300577 280698
6377B80698P499J24536J661l6992J6896P7267Q865j0662l6824N5831K984O550
$$ 280698 288197 412733 414394 377402 394298 471565 480430 469768 432944 488775 491759 498309
6365D98309m3407l576j5732j1539L2315L6024l1598l719J3205l2725l0439O1740
$$ 498309 454902 451326 435594 424055 456370 492394 460796 457077 470282 437557 407118 468858
6353D68858N726n8354M6999Q5224p901l0412j2915N109j3750j8513O1158P217
$$ 468858 474584 416230 463229 548453 540552 510140 497225 502334 488584 470071 531229 538446
6341E38446q5107Q9617J5981q0628N8384J2900J8992j6387j4207l1187j5168L7509
$$ 538446 453339 542956 558937 478309 536693 549593 568585 552198 537991 506804 491636 529145
6329E29145M4950q34l6584j8072j4795L2738L0033K3433J7852j4016J2023L8196
$$ 529145 574095 573261 536677 518605 503810 536548 566581 590014 607866 593850 605873 644069
6317F44069L6388n4639P0396Q404k7766K4878J3566j0418o3003l6833K6738N3695
$$ 644069 680457 625818 696214 704618 676852 701730 715296 704878 641875 605042 631780 685475
6305F85475J6625n2504p436J11551O4059k8527j4581k7894J9019N9292l1371m0468
$$ 685475 702100 649596 642160 753711 817770 789243 774662 746768 765787 825079 793708 753240
6293G53240N0237K8342j323j9039N9951K0481j9111J7886Q8611P2221p4285l305
$$ 753240 803477 831819 830496 811457 871408 891889 872778 890664 979275 1051496 977211 973906
6281I73906N1391J7352L5456R9708O2543P1312q0419L303Q3628j6731L720K6529
$$ 973906 1025297 1042649 1078105 1177813 1240356 1311668 1231249 1234552 1318180 1301449 1305169 1331698
6269A331698N9512J5125P6564n6118l8460p068k8332R4214O8876M368R7815J10962
$$ 1331698 1391210 1406335 1482899 1426781 1388321 1381253 1352921 1447135 1516011 1520379 1618194 1729156
6257A729156O952J07P9594n8161L3829P2826O076J7477N9945O0232P3040M0624
$$ 1729156 1736108 1736215 1815809 1757648 1791477 1864303 1870379 1887856 1947801 2008033 2081073 2121697
6245B121697q3518M1914l4144M9408R8051k1835k0068J1785m1041R879k5134K5349
$$ 2121697 2038179 2080093 2045949 2095357 2193408 2171573 2151505 2163290 2122249 2132128 2106994 2132343
6233B132343J8515J8270n5386l4475j7065K9850M3213j3826n7648q222K4078K2456
$$ 2132343 2150858 2169128 2113742 2079267 2062202 2092052 2135265 2121439 2063791 2055569 2079647 2102103
6221B102103K3727O6514L825o329L4010J5812q178k3832N5897m0556M7619L7551
$$ 2102103 2125830 2192344 2196169 2189840 2223850 2239662 2231484 2207652 2263549 2222993 2270612 2308163
6209B308163j7905l7910R5847J3058j5862N1877J17539j6880J4452l686Q0965
$$ 2308163 2290258 2252348 2348195 2361253 2345391 2397268 2514807 2497927 2512379 2508693 2589658
6198B589658O8239l9793Q9132K2728L2997L2009N5642J01072O4838K2660j8845
$$ 2589658 2657897 2618104 2707236 2729964 2762961 2794970 2850612 2951684 3016522 3039182 3020337
6187C020337k2317m6719J0595N5601M2368l7086j6114K8299M5296k5193l9330
$$ 3020337 2998020 2951301 2961896 3017497 3059865 3022779 3006665 3034964 3080260 3055067 3015737
6176C015737N0307n2701p35J0229K9733L4695k7818m4876m3597M9222K6015J5661
$$ 3015737 3066044 3013343 3012608 3022837 3052570 3087265 3059447 3014571 2970974 3020196 3046211 3061872
6164C061872n9297o6416m42N991J3542K9499J0153K1646j5899j31775L672O4301
$$ 3061872 3002575 2936159 2935717 2941708 2955250 2984749 2994902 3016548 3000649 2868874 2872546 2936847
6152B936847l4120n6638L0732j1113J8913o4925j0959O0281q967l8650o2524m905
$$ 2936847 2902727 2846089 2876821 2865708 2884621 2819696 2808737 2869018 2860051 2821401 2758877 2753972
6140B753972L3739J3788O1036k7677M4993O8051P3445O1405m4595n378L2513N3342
$$ 2753972 2787711 2801499 2862535 2834858 2879851 2947902 3021347 3082752 3038157 3032779 3065292 3118634
6128C118634j6262L4952K8883n7816M0451n750j9240N007p8926n4939k6936o294
$$ 3118634 3102372 3137324 3166207 3108391 3148842 3143092 3123852 3128859 3049933 2994994 2968058 2961764
6116B961764M5145J6305n6447N2876J9345q1972M5581P1962j0821J1990K9036
$$ 2961764 3006909 3023214 2966767 3019643 3038988 2957016 3002597 3074559 3063738 3075728 3104764
6105C104764O9403m2392M9857Q8687l9240q051R5504Q8305N5163N1170R0428J07303
$$ 3104764 3174167 3131775 3181632 3270319 3231079 3223028 3318532 3406837 3462000 3513170 3603598 3710901
6093C710901m149n2021Q0865N3989j15197N7599O6325L6286J10770R1968M2083
$$ 3710901 3706752 3654731 3735596 3789585 3674388 3731987 3798312 3834598 3945368 4037336 4079419
6082D079419Q727l2368O0211N2114M8282J04141N2679J1530J20746N8751J00075
$$ 4079419 4088146 4055778 4115989 4168103 4216385 4320526 4373205 4384735 4505481 4564232 4664307
6071D664307J61942J65541O3141J79637K75408J44119J97247K41837L15143L09920
$$ 4664307 4826249 4991790 5054931 5234568 5509976 5654095 5851342 6093179 6408322 6718242
6061F718242K86043L76453M16898K97569K10889J64805J02888J397j04270j73047
$$ 6718242 7004285 7380738 7797636 8095205 8306094 8470899 8573787 8575184 8470914 8297867
6051H297867j69782j11415n8863m5313L2069J03918N6926J45290J73274J2952
$$ 8297867 8128085 8016670 7957807 7912494 7944563 8048481 8105407 8250697 8423971 8436923
6041H436923n1835j84830j51119k07687l61286l80767l48350l42159k94434k49386
$$ 8436923 8385088 8200258 8049139 7841452 7480166 7099399 6751049 6408890 6114456 5865070
6031E865070k81043j82598j20211p0164q8923j14249m7253k685Q517O3244K8562
$$ 5865070 5584027 5401429 5281218 5211054 5122131 5007882 4960629 4957944 4966461 5029705 5058267
6020E058267L6879J6400L522J08110K3786P2085J3413J12678O9424O0377J16688
$$ 5058267 5095146 5111546 5115068 5223178 5246964 5319049 5332462 5445140 5514564 5574941 5691629
6009E691629Q9085J74782J37032Q0249J67556K16383K62612K16541K48971L19994
$$ 5691629 5780714 5955496 6092528 6172777 6340333 6556716 6819328 7035869 7284840 7604834
5999G604834K31733L04376L84677M21578M54332M69726N92859O20162O29567N72510
$$ 7604834 7836567 8140943 8525620 8947198 9401530 9871256 10464115 11084277 11713844 12286354
5989A2286354O30801N06646L43390J37086K8749p8054k53323k00332j12232j05510
$$ 12286354 12917155 13423801 13767191 13904277 13933026 13854972 13601649 13401317 13289085 13183575
5979A3183575p7875j4972P2947K18414J46054J33688J33189p5264k32914l59386
$$ 13183575 13105700 13090728 13163675 13382089 13528143 13661831 13795020 13719756 13486842 13127456
5969A3127456n54442n97680o74375o07488n64305n45486m68529m84292l75340
$$ 13127456 12573014 11975334 11300959 10693471 10129166 9583680 9115151 8630859 8255519
5960H255519k95305k87430k33108j41529j76660j99273r9642j55751j48374j91262
$$ 8255519 7960214 7672784 7439676 7298147 7121487 6922214 6822572 6666821 6518447 6327185
5950F327185j37864j31671j46049j81879j57066j66421k12325j16615j47122p0842
$$ 6327185 6189321 6057650 5911601 5729722 5572656 5406235 5193910 5077295 4930173 4859331
5940D859331j12471j13880l5898m2936m3920p1334q9887p825J3865L4746M3449
$$ 4859331 4746860 4632980 4597082 4554146 4510226 4438892 4349005 4341180 4355045 4389791 4433240
5929D433240o8977l2355r3979J6672k8183q3248r1670j45305r9876j08185j19058
$$ 4433240 4364263 4331908 4237929 4254601 4226418 4143170 4051500 3906195 3806319 3698134 3579076
5918C579076j32704q8355j52755j67672j05149j35208j14749N98j9567l8363r344
$$ 3579076 3446372 3358017 3205262 3037590 2932441 2797233 2682484 2683082 2663515 2625152 2615808
5907B615808o7323o5238k8663l182J7584R037M06K7323n5756K427q271N549K8657
$$ 2615808 2548485 2483247 2454584 2451402 2468986 2478023 2478429 2505752 2449996 2452423 2444152 2449701 2478358
5894B478358K956L8277J03o7764O6593M7059l7857K1267Q3624J8875N4639K6023
$$ 2478358 2481314 2519591 2519694 2451930 2518523 2565582 2527725 2548992 2632616 2651491 2706130 2732153
5882B732153K0296J7349l4159O9704J15264l8009m7430Q9077P4622Q7207J17653
$$ 2732153 2752449 2769798 2735639 2805343 2920607 2882598 2835168 2924245 2998867 3086074 3203727
5871C203727Q9234J55650J42498O7434m159J01726J24719J08430J21789R5664
$$ 3203727 3292961 3448611 3591109 3658543 3654384 3756110 3880829 3989259 4111048 4206712
5861D206712R0045J00296J12331J97734K18461J35469J19106J68820K54973K44715
$$ 4206712 4296757 4397053 4509384 4707118 4925579 5061048 5180154 5348974 5603947 5848662
5851E848662K74477K61647L09817K58705L47325M46057M70862M27868N46343N47850
$$ 5848662 6123139 6384786 6694603 6953308 7300633 7746690 8217552 8645420 9191763 9739613
5841I739613N92383N72315N76758N18780L50919J56697k2460k04120k57864l02836
$$ 9739613 10331996 10904311 11481069 11999849 12350768 12507465 12485005 12280885 12023021 11720185
5831A1720185k77774k65715k70376j77110j22553k6656K377J29920K43432K34233
$$ 11720185 11442411 11176696 10906320 10729210 10606657 10580001 10582378 10712298 10955730 11189963
5821A1189963K53681L23039L00760K83878J00456q4646j99580m29012n28054o76739
$$ 11189963 11443644 11766683 12067443 12351321 12451777 12367131 12167551 11738539 11210485 10533746
5811A0533746n77707n84722n22607m60384m02662m80707l48323k41822k45400
$$ 10533746 9956039 9371317 8848710 8388326 7985664 7504957 7156634 6914812 6669412
5802F669412k83710j40902j48484r1930j12781j20687j3390q2691n9939p039k4908
$$ 6669412 6385702 6244800 6096316 6004386 5891605 5770918 5757528 5674837 5614898 5607859 5582951
5791E582951L1024k7305j3172J33906N8768R8231O1603J72650J15122J67807R6870
$$ 5582951 5613975 5586670 5573498 5707404 5766172 5864403 5926006 6098656 6213778 6381585 6478455
5780F478455J28151Q6073J32915J50147K05950J87691J95211K10161L65249L26991
$$ 6478455 6606606 6692679 6825594 6975741 7181691 7369382 7564593 7774754 8140003 8466994
5770H466994K85021K54526J64481K3862j13872j77406k60084k58078k66111k33939
$$ 8466994 8752015 9006541 9171022 9194884 9081012 8903606 8643522 8385444 8119333 7885394
5760G885394j63268j89075r6473j12771m5453M1476K7211J63182J19331J69364
$$ 7885394 7722126 7533051 7436578 7323807 7278354 7319830 7347041 7510223 7629554 7798918
5750G798918J77423J67657j6078p9727j85311k07853l15716m01620l38848l72117
$$ 7798918 7976341 8143998 8127920 8048193 7862882 7655029 7339313 6937693 6598845 6226728
5740F226728l25703k94929k60273j98512k18623k26951p4321p8390k7120m1885
$$ 6226728 5901025 5606096 5345823 5147311 4928688 4701737 4627416 4549026 4521906 4480021
5730D480021j07514q5430o9210j88135j10182o0137q4018q0448o9825o6652j644
$$ 4480021 4372507 4287077 4217867 4029732 3919550 3859413 3775395 3694947 3625122 3558470 3556826
5719C556826p184k7458j1221p9443k3447j78656j49645k8042j21775j50484R043
$$ 3556826 3549642 3522184 3510963 3431520 3408073 3229417 3079772 3051730 2929955 2779471 2788514
5708B788514j13020q1582r410j15478m0467n5180M063n1320k4507O8823q4363
$$ 2788514 2675494 2593912 2584502 2469024 2428557 2373377 2377440 2326120 2301613 2370436 2286073
5697B286073q3192K4755j0614n1672o7662o8099p061J8781l6887o1236k5664q5125
$$ 2286073 2202881 2227636 2217022 2165350 2097688 2029589 2022528 2041309 2004422 1943186 1917522 1832397
5685A832397n6579M08O356J7081m9097k0737m3520l1831K0651o0535l1830J230
$$ 1832397 1775818 1776226 1782582 1799663 1750566 1729829 1686309 1654478 1675129 1614594 1582764 1583994
5673A583994k9716O0753L6162m9201k8682q579J1010n3126n1387k2539M2061m678
$$ 1583994 1554278 1615031 1651193 1601992 1573310 1564731 1575741 1522615 1471228 1448689 1490750 1486072
5661A486072R374k7183o1612L0669n0325o1055M2772j9481q1130J7770M410P0588
$$ 1486072 1495446 1468263 1406651 1437320 1386995 1325940 1368712 1349231 1268101 1285871 1290281 1360869
5649A360869M039M351q0951n5667Q7854O4053k2097n8832J913J627l3991m9892
$$ 1360869 1364908 1369259 1288308 1232641 1320495 1384548 1362451 1303619 1305532 1307159 1273168 1223276
5637A223276L6864o1337j1025j7949K6459m03p868p870n934J0660j3140M7605
$$ 1223276 1260140 1198803 1187778 1169829 1196288 1195885 1188017 1180147 1174213 1184873 1171733 1219338
5625A219338Q557l589k3311J5087N732q6275l7071J4472k616K9955M2073J2219
$$ 1219338 1227895 1224306 1200995 1216082 1221814 1135539 1098468 1112940 1110324 1140279 1182352 1194571
5613A194571p1302L2322O893r4754K4709L4199k1648l3917l0271j8686l1494M0970
$$ 1194571 1123269 1155591 1162484 1067730 1092439 1126638 1104990 1071073 1040802 1022116 990622 1031592
5601A031592L8443O590j9668k5226N038K9911M7557q6047M6076r316J5262J973
$$ 1031592 1070035 1076625 1056957 1031731 1036769 1066680 1114237 1028190 1074266 1064950 1080212 1082185
5589A082185j5535k9894P3778K6759n4982M2296M777O8938p8540k6371r957P5627
$$ 1082185 1066650 1036756 1110534 1137293 1082311 1124607 1129384 1198322 1119782 1093411 1083454 1159081
5577A159081N9486j0577K5478q795m8389l5334l1618o1154N00L9124J7248J541
$$ 1159081 1218567 1207990 1233468 1224673 1176284 1140950 1109332 1048178 1048678 1087802 1105050 1106591
5565A106591Q277J1779l7580k7826O72J2715L5781K5012o1874k7249J07577L3527
$$ 1106591 1114868 1126647 1089067 1061241 1061913 1074628 1110409 1135421 1073547 1046298 1153875 1187402
5553A187402k1168m6263P53P4864n6658l4553M2629m2813K3576N6694J6886n7060
$$ 1187402 1166234 1119971 1120724 1195588 1138930 1104377 1147006 1104193 1127769 1184463 1201349 1144289
5541A144289j4023K5297J9402j9213j9739l6145l6567p0304j5459P3595N4531
$$ 1144289 1130266 1155563 1174965 1155752 1136013 1099868 1063301 992997 977538 1051133 1105664
5530A105664n175N9462N1214j00561k2337o737R8859l0416j3404O031m0181r969
$$ 1105664 1100489 1159951 1211165 1110604 1088267 1081530 1180389 1149973 1136569 1142600 1102419 1092450
5518A092450J24949k8726j4214k4404j8866k618K0707n4083n1190L2647J7098
$$ 1092450 1217399 1188673 1174459 1150055 1131189 1128571 1149278 1095195 1044005 1076652 1093750
5507A093750r592m3699K6059Q471M878l7782n1209j2520L040J0029M304N4179
$$ 1093750 1084158 1040459 1066518 1074989 1079867 1042085 990876 978356 981396 991425 995729 1049908
5495A049908M0245l0756J7034l5799K1311J167J4657k1484K5431k7133k7919o0621
$$ 1049908 1090153 1059397 1076431 1040632 1061943 1063110 1077767 1056283 1081714 1054581 1026662 966041
5483I66041P981J1153M8834K8022p7257p821j0619J209K2281l8907M653q576J8339
$$ 966041 974022 985175 1034009 1062031 984774 976953 966334 967543 989824 950917 955570 946994 965333
5470I65333J2085O6533j5538n3264N9630L6336p80j0632k2231K7068o478O7602
$$ 965333 977418 1043951 1028413 975149 1034779 1071115 1070335 1059703 1037472 1064540 1058062 1125664
5458A125664m0520q3509P157K1043K1036K0943j4788J6102Q8435j9840n520Q7162
$$ 1125664 1085144 1001635 1008792 1029835 1050871 1071814 1057026 1073128 1161563 1141723 1136203 1223365
5446A223365L9045j7088R7084m6993J0175k0232M9911n264k5536J0836J948K0125
$$ 1223365 1262410 1245322 1342406 1295413 1305588 1285356 1335267 1330003 1304467 1315303 1317251 1337376
5434A337376P7052J8094K1660R3408J08962J4082l5379O7173L5968L2768J20619
$$ 1337376 1414428 1432522 1454182 1547590 1656552 1670634 1635255 1702428 1738396 1771164 1891783
5423A891783M9322k2328O5386N6873l6808J248n299n5329o7094m1774p381j0232
$$ 1891783 1941105 1918777 1984163 2041036 2004228 2005476 2000177 1944848 1877754 1835980 1828599 1818367
5411A818367m5053l4781M9043r605J4458m4429P029J04300O3554R725M8469O8134
$$ 1818367 1773314 1738533 1787576 1777971 1792429 1748000 1755029 1859329 1922883 1932608 1981077 2049211
5399B049211Q2079O2718K4966J29053M5691M0355N2610j4459L0255k7843j13516
$$ 2049211 2131290 2194008 2218974 2348027 2393718 2434073 2486683 2472224 2502479 2474636 2361120
5388B361120J4586o1295r7706M7950R201L9666j6226K2538k6548J7605Q3557L1034
$$ 2361120 2375706 2314411 2216705 2264655 2273856 2313522 2297296 2319834 2293286 2310891 2394448 2425482
5376B425482l0913J01653P4510Q78P3663R8699M5828j9865N4750M6326o165J15326
$$ 2425482 2394569 2496222 2570732 2571610 2645273 2743972 2789800 2769935 2824685 2871011 2864846 2980172
5364B980172P4801O012q629J8107Q5163P3619J12113N8503R1423J87103J34465
$$ 2980172 3054973 3060985 3052356 3070463 3155626 3229245 3341358 3399861 3491284 3678387 3812852
5353C812852J57928J74315J28301J85620K31043J63849K45038L28843K09989L56796
$$ 3812852 3970780 4145095 4273396 4459016 4690059 4853908 5098946 5427789 5637778 5994574
5343E994574L26883K76874L47777L32976L08586K81542K41543K47818K74758K60297
$$ 5994574 6321457 6598331 6946108 7279084 7587670 7869212 8110755 8358573 8633331 8893628
5333H893628K51169L34158L98162L27788M22361M61522M02011N00821M69299M11977
$$ 8893628 9144797 9478955 9877117 10204905 10627266 11088788 11490799 11991620 12460919 12872896
5323A2872896M52261L65335L07687L19649K42412K77945K15577K36247K23491
$$ 12872896 13325157 13690492 13998179 14317828 14560240 14838185 15053762 15290009 15513500
5314A5513500J35093J30459J75126K18017K13837J96347J51626O2462K2931q3892
$$ 15513500 15648593 15779052 15954178 16172195 16386032 16582379 16734005 16796467 16819398 16735506
5304A6735506j30440k09240l34675l21307m16002l58870k87103k83847k48190
$$ 16735506 16605066 16395826 16061151 15739844 15323842 14964972 14677869 14394022 14145832
5295A4145832j72539k32881k34795k46082j81504k51824k57453k65479l11647
$$ 14145832 13973293 13740412 13505617 13259535 13078031 12826207 12568754 12303275 11991628
5286A1991628l21351m53372l92664m08321m38863l50614l46321k88857k81222
$$ 11991628 11670277 11216905 10824241 10415920 9977057 9626443 9280122 8991265 8710043
5277H710043k13875j93109l14928k13536k41428k89498k95523l33062l62495l28777
$$ 8710043 8496168 8303059 7988131 7774595 7533167 7243669 6948146 6615084 6252589 5923812
5267E923812k95684l03154k59184j81912j73286j26516j48405j71051o1630l8318
$$ 5923812 5628128 5324974 5065790 4883878 4710592 4584076 4435671 4264620 4202990 4164672
5257D164672n1140n7094j01052m5218n0352L583l3943j00155k5087j7675M4672
$$ 4164672 4113532 4056438 3955386 3910168 3859816 3863399 3829456 3729301 3704214 3686539 3731211
5246C731211J1659n4130k7297J4354R0875L9151J78934Q6464R1471J34791J17479
$$ 3731211 3742870 3688740 3661443 3675797 3766672 3805823 3984757 4071221 4162692 4297483 4414962
5235D414962K13898J97174J82460N5199l7146m5781j28399k04061j90397j60364
$$ 4414962 4628860 4826034 5008494 5063693 5026547 4980766 4852367 4648306 4457909 4297545
5225D297545j59525j45499r1243j01759o3830n4979m5468o7331l5345j4892m8915
$$ 4297545 4138020 3992521 3901278 3799519 3735689 3680710 3635242 3567911 3532566 3517674 3468759
5214C468759k8277o9551M1865J9010r7298k2392q3558M016k2569m2571J9768L5060
$$ 3468759 3440482 3370931 3412796 3431806 3334508 3312116 3228558 3232574 3210005 3167434 3187202 3222262
5202C222262o6942m2288n0671n3392K7954k4955l9704m0260p3613K4038M1462
$$ 3222262 3155320 3113032 3062361 3008969 3036923 3011968 2972264 2932004 2858391 2882429 2923891
5191B923891k3167j08541p4790p6692l0313j0772M3686k7865p4876k8804n4373
$$ 2923891 2900724 2792183 2717393 2640701 2610388 2599616 2643302 2615437 2540561 2511757 2457384
5180B457384l5808r1943m0306O5002j680l0299j6522o485o1061J5473n1269q9799
$$ 2457384 2421576 2329633 2289327 2354329 2352649 2322350 2305828 2299343 2238282 2253755 2202486 2112687
5168B112687o9954o838M4605K1177k6519j2077L5432L896M2984K6183M6501Q131
$$ 2112687 2042733 2035895 2080500 2101677 2075158 2063081 2098513 2102409 2145393 2171576 2218077 2226208
5156B226208K2463k9252R8238n1132O529P6553j1585p5770j28217j7740r860l0725
$$ 2226208 2248671 2219419 2317657 2266525 2273054 2349607 2338022 2262252 2134035 2116295 2106435 2075710
5144B075710l0194o2830k3539m2577l992p0464n25n258l8849O3672L6305K9581
$$ 2075710 2045516 1982686 1959147 1916570 1912578 1842114 1841589 1836331 1797482 1861154 1897459 1927040
5132A927040N670k822r131N4331J1794N3334J460N8758J00517K5721k4548k26
$$ 1927040 1932710 1929888 1920757 1975088 1986882 2040216 2041676 2100434 2200951 2226672 2202124 2201898
5120B201898M9097N3230P7410J05156J12740M013M0101O7452Q7031j1358k4620
$$ 2201898 2250995 2304225 2381635 2486791 2599531 2603544 2643645 2711097 2798128 2786770 2762150
5109B762150J7267J857j37705l7488r3782m9172L4710K4256M2200Q7905J08113
$$ 2762150 2779417 2781274 2643569 2606081 2512299 2463127 2497837 2522093 2564293 2652198 2760311
5098B760311M8583L9704R6025K9859P253J7314K6787M6982M628N0633j2495N6682
$$ 2760311 2808894 2848598 2944623 2974482 2981735 2999049 3025836 3072818 3077446 3128079 3115584 3172266
5086C172266J30758Q629j2982M9582M8123J6463P1130L9734N6192Q2602K5044
$$ 3172266 3303024 3311653 3298671 3348253 3396376 3412839 3483969 3523703 3579895 3662497 3687541
5075C687541J4236M0596j7180L7527Q2150P7162J29067K0428N7664O0796P3857
$$ 3687541 3701777 3742373 3725193 3762720 3844870 3922032 4051099 4071527 4129191 4189987 4263844
5064D263844M1141K28060P7257J42642K08671J80701K05457J03592J17142K38320
$$ 4263844 4304985 4533045 4610302 4752944 4961615 5142316 5347773 5451365 5568507 5806827
5054E806827K22513J43107K18160J18144J70501J28227K15461J94326J68575L27181
$$ 5806827 6029340 6172447 6390607 6508751 6679252 6807479 7022940 7217266 7385841 7713022
5044G713022L18203K71424L32225M38990L25315K72798L02087L05499J51757K15400
$$ 7713022 8031225 8302649 8634874 9073864 9399179 9671977 9974064 10279563 10431320 10646720
5034A0646720K16054L10080L49918L17511L50588M15347L82005M85062N10001
$$ 10646720 10862774 11172854 11522772 11840283 12190871 12606218 12988223 13473285 13983286
5025A3983286N15073L78555L94983M63521N28468N17629N56850O96988P01042
$$ 13983286 14498359 14876914 15271897 15735418 16263886 16781515 17338365 18035353 18736395
5016A8736395P01684P86670P30925O23756P19206P20432O65948P26864Q00811
$$ 18736395 19438079 20224749 20955674 21579430 22298636 23019068 23685016 24411880 25212691
5007B5212691Q06248R34790R99144J181295J456225J552406J629659J738216J920913
$$ 25212691 26018939 26953729 27952873 29134168 30590393 32142799 33772458 35510674 37431587
4998C7431587J985484K066070K077386J916179J557889Q28594K36887n16071j032991
$$ 37431587 39417071 41483141 43560527 45476706 47034595 47863189 48100076 47584005 46551014
4989D6551014j519468j592893j523468j381714j119389p24604l81249r9198K33792
$$ 46551014 45031546 43438653 41915185 40533471 39414082 38689478 38308229 38209031 38442823
4980C8442823M59325O47394Q01037P41972P34920N66326L59214K71808J18645
$$ 38442823 38902148 39549542 40350579 41092551 41827471 42393797 42753011 43024819 43143464
4971D3143464q6924j12995R0492K75266N53987Q63032J144924J413917J575157
$$ 43143464 43056540 42943545 43034037 43309303 43863290 44726322 45871246 47285163 48860320
4962D8860320J960679K349620K590786K853802L114536L274611L329908L269477
$$ 48860320 50820999 53170619 55761405 58615207 61729743 65004354 68334262 71603739
4954G1603739L260592L082551L053306L080702K980479L233062L509058L716645
$$ 71603739 74864331 77946882 81000188 84080890 87061369 90294431 93803489 97520134
4946I7520134M157009M888415N665348O569360P719386Q798072R992516J1225862
$$ 97520134 101677143 106565558 112230906 118800266 126519652 135317724 145310240 156536102
4938A56536102J2462106J3732738J4830443J6237915J9039879K3056544K7225360
$$ 156536102 168998208 182730946 197561389 213799304 232839183 255895727 283121087
4931B83121087L0736572L2821001L0702171K1067939N434884j2523880k7461293
$$ 283121087 313857659 346678660 377380831 398448770 403883654 391359774 363898481
4924C63898481l4729684l4567498l1338091k8261697k5713469k3108243j9982076
$$ 363898481 329168797 294601299 263263208 235001511 209288042 186179799 166197723
4917A66197723j6915158j4157301j1861279j0117136q572542p356356o373742
$$ 166197723 149282565 135125264 123263985 113146849 104574307 97217951 90844209
4910I0844209n682708n001168m455154m006147l653431l377490l048761k827744
$$ 90844209 85161501 80160333 75705179 71699032 68045601 64668111 61619350 58791606
4902E8791606k713800k512903k198477j980152j850292j641543j547960j524817
$$ 58791606 56077806 53564903 51366426 49386274 47535982 45894439 44346479 42821662
4894D2821662j437933j366242j232324j180133j139034j130298j134440r78381
$$ 42821662 41383729 40017487 38785163 37605030 36465996 35335698 34201258 33222877
4886C3222877r80473r23236q98446q83785q51736p77691q63729q08645p78863
$$ 33222877 32242404 31319168 30420722 29536937 28685201 27907510 27043781 26235136 25456273
4877B5456273o86984o62363o86394n96287n14203m19362m43101l99765l13966
$$ 25456273 24769289 24106926 23420532 22824245 22310042 21890680 21447579 21047814 20733848
4868B0733848k87832k56452j85705j81277j36140j16108j47964j37635j48398
$$ 20733848 20446016 20189564 20003859 19822582 19686442 19570334 19422370 19284735 19136337
4859A9136337q4108p6165j16761R670k3473M9056J14524P7197P3782J78422J48683
$$ 19136337 19052229 18976064 18859303 18868973 18845500 18894556 19009080 19086277 19160059 19338481 19487164
4848A9487164L28983K81218M15559N15141N56329N57928M35237N14396K62254
$$ 19487164 19816147 20097365 20512924 21028065 21584394 22142322 22577559 23091955 23354209
4839B3354209J8600k55494l37987k02287n7765n4584o3475J05664J80493K05881
$$ 23354209 23372809 23117315 22779328 22577041 22519276 22464692 22401217 22506881 22687374 22893255
4829B2893255J96232p6448l42076m38334m81908m62943l11244j99609k60349j50872
$$ 22893255 23089487 23013039 22670963 22232629 21750721 21287778 20976534 20776925 20516576 20365704
4819B0365704j98613l42001m49287n85550o70006o02030n25407m11002l33209
$$ 20365704 20167091 19825090 19375803 18790253 18120247 17518217 16992810 16581808 16248599
4810A6248599k81917k11142k44648k03478l73834n44300o60817p54345p77996
$$ 16248599 15966682 15755540 15510892 15307414 14933580 14389280 13728463 12974118 12196122
4801A2196122p34511o72297n48926n61462n47266m01829l92038m02674l22644
$$ 12196122 11461611 10789314 10240388 9678926 9131660 8729831 8337793 7935119 7612475
4792G612475k82601k65700k77874k05568j21143j44707j67878j74617j05757j28124
$$ 7612475 7329874 7064174 6786300 6580732 6459589 6314882 6147004 5972387 5866630 5738506
4782E738506j37824j67029j36712r6714r5821j45998p6345o0211r3159j39571
$$ 5738506 5600682 5433653 5296941 5200227 5104406 4958408 4882063 4821852 4728693 4589122
4772D589122j18431k0054j7130p6915J3211n3573l300o9974l8899L3478J4164
$$ 4589122 4470691 4450637 4433507 4356592 4369803 4316230 4312930 4242956 4204057 4237535 4251699
4761D251699P660j2465k013n3028M7813J8282j478m7895Q621L8040k6216n0196
$$ 4251699 4259359 4246894 4244881 4191853 4239666 4257948 4256470 4208575 4217196 4255236 4229020 4178824
4749D178824o386L621j3471p0736j03020o0718N0029L8120k3429L0561O64M1471
$$ 4178824 4172438 4176059 4162588 4091852 3988832 3928114 3978143 4016263 3992834 4023395 4024059 4065530
4737D065530J09531Q3007M5964M1365N2676J52486J25488J19381J26725J47126
$$ 4065530 4175061 4258068 4304032 4345397 4398073 4550559 4676047 4795428 4922153 5069279
4727E069279J05964L2892R8751N9316m4675l5870k2396q5100L4122P7689M2617
$$ 5069279 5175243 5208135 5306886 5366202 5321527 5285657 5263261 5178161 5212283 5289972 5332589
4716E332589l2469q729j10168k6518j11582j51862p8174l4160m5003p8771m8139
$$ 5332589 5300120 5291391 5181223 5154705 5043123 4891261 4813087 4778927 4733924 4655153 4607014
4705D607014j4817j4267p6511j44108k2741q9695j72961p0441j8740l1122o4917
$$ 4607014 4592197 4577930 4501419 4357311 4334570 4244875 4071914 4001473 3982733 3951611 3886694
4694C886694q2065p1406L9903k8796j58765k01603j91716r1081q8384j79221q0965
$$ 3886694 3804629 3733223 3773126 3744330 3585565 3383962 3192246 3101165 3012781 2833560 2752595
4683B752595m0027n1983p2051q3756q5066o8431l1349J5008r0432r4180M3671
$$ 2752595 2712568 2660585 2588534 2504778 2419712 2351281 2319932 2334940 2244508 2150328 2193999
4672B193999o7739n9192k3527k3416j10246l231J8964o5683n4372J0841L7014
$$ 2193999 2126260 2067068 2043541 2020125 1909879 1906648 1925612 1859929 1805557 1816398 1853412
4661A853412j27837p635l3816l5986L6807N2203N8686k0847p0001M6715Q580j9716
$$ 1853412 1725575 1717940 1684124 1648138 1684945 1737148 1795834 1774987 1704986 1751701 1760281 1740565
4649A740565m9939l5945O2846O8604P869j7121j2382k5373j9504L8786M2626M1267
$$ 1740565 1690626 1654681 1717527 1786131 1794000 1776879 1764497 1739124 1719620 1758406 1801032 1842299
4637A842299L2067N4415J6887R080l1341R253R0932Q5296N1696P9745J22792J24784
$$ 1842299 1874366 1928781 1945668 1954748 1923407 1932660 2023592 2108888 2160584 2240329 2363121 2487905
4625B487905N9431J39268J87510J83847J11791N2538N4826o8016j59314j35755
$$ 2487905 2547336 2686604 2874114 3057961 3169752 3222290 3277116 3209100 3049786 2914031
4615B914031j77549j83615l8432j16455j29260j55779o3414j40825j07429k4629
$$ 2914031 2736482 2552867 2514435 2397980 2268720 2112941 2049527 1908702 1801273 1776644
4605A776644m2540K40q1217n1672j1308j3253o0675L001L9318l3077r1550J9040
$$ 1776644 1734104 1734344 1653127 1601455 1590147 1576894 1516219 1519220 1558538 1525461 1433911 1452951
4593A452951K5882l8745N454o2135o976L9718L1628k3480K4151J4260p082k6353
$$ 1452951 1478833 1440088 1445542 1383407 1376431 1416149 1447777 1424297 1448448 1462708 1455626 1429273
4581A429273q5621j8093J498l4840j9530p512k3391p1318j8598M0929l2643J7535
$$ 1429273 1343652 1325559 1327057 1292217 1272687 1265175 1241784 1170466 1151868 1192797 1160154 1177689
4569A177689N4399j6771n0715m3006p613K1319m2112q1747L9177k8551l9343K0686
$$ 1177689 1232088 1215317 1164602 1121596 1113983 1135302 1093190 1011443 1050620 1022069 982726 1003412
4557A003412P3280N7431J1666k2047m2570P9126K3962O209r5240L2588o201K0940
$$ 1003412 1076692 1134123 1145789 1123742 1081172 1160298 1184260 1190469 1095229 1127817 1121616 1142556
4545A142556R9628L4869L6399n1458M1547M2337j26780k2194m2532m6865K2564
$$ 1142556 1242184 1277053 1313452 1261994 1303541 1345878 1219098 1196904 1154372 1107507 1130071
4534A130071p7311l5461J1378m4166L9634l3372o9102J6964k1390j0897L5094
$$ 1130071 1052760 1017299 1028677 984511 1024145 990773 921671 938635 917245 906348 941442
4523I41442j3735j1656L0497p1635J6236J1789K445L8058P097q9262k3814j8145
$$ 941442 927707 916051 946548 874913 891149 902938 905383 943441 950538 861276 837462 819317
4511H19317O3671o2785j3461L6342p1407l9065j2616L5073l174L5116l0776j5590
$$ 819317 882988 820203 806742 843084 771677 732612 719996 755069 751895 787011 756235 740645
4499G40645J0851L4596m0154j6079M867j2310N3571L833J17493o7709j7958j1871
$$ 740645 751496 786092 745938 729859 734726 722416 775987 779820 897313 829604 811646 799775
4487G99775n4998m741N479Q063K6324n6751j3195K1377r5064L7540J9976k644
$$ 799775 744777 740036 745515 753578 779902 723151 709956 731333 636269 673809 693785 691141
4475F91141L2165l8299l0822J1101K5256k2932K1569J9362m7400N8703p599j4039
$$ 691141 723306 685007 654185 665286 690542 667610 689179 708541 661141 719844 712245 698206
4463F98206m9521N3053K3077m6915K3261k7601J6293n1151N1985L7509m2996n4843
$$ 698206 648685 701738 724815 677900 701161 673560 689853 638702 690687 728196 685200 630357
4451F30357j1573N5322O1105O9955q1588o4381K1207o361P614L7636m1331k655
$$ 630357 618784 674106 735211 805166 723578 659197 680404 674043 681657 719293 677962 675307
4439F75307q219M1595q84q3819L1483L2809n6707L5425k2753M8229n8424j0757
$$ 675307 667088 708683 707799 623980 655463 688272 631565 666990 644237 692466 634042 623285
4427F23285N5051P505q798m4137k7947R715L7775l5299J6409J7459M6489L7965
$$ 623285 678336 685841 677043 632906 604959 614674 652449 617150 633559 651018 697507 735472
4415G35472k2927r380Q8k4982K0794L7299n7209O8113k0796l7470J4394J885M5414
$$ 735472 712545 703165 703253 678271 699065 736364 679155 747268 726472 689002 703396 705281 750695
4402G50695J4345J6351O953l2581O1978L2417J3906K0324n375o7391j3535L1022
$$ 750695 765040 781391 788344 755763 817741 850158 864064 884388 879013 811622 798087 829109
4390H29109p4808N0296j9863j9913j6549k7355r537k1150K6164j1816l6413L565
$$ 829109 754301 804597 784734 764821 748272 720917 711380 690230 716394 704578 668165 671730
4378F71730J9686J7442l9607M1105k8382J698M918L2578O5869k8519p195P2586
$$ 671730 691416 708858 669251 710356 681974 683672 688590 721168 787037 758518 751323 823909
4366H23909N555o151n893L5418M3817J3908M1823N0160J1089L8304J4453K910
$$ 823909 829464 823313 817420 852838 896655 910563 952386 1002546 1013635 1051939 1066392 1069302
4354A069302m3858k2020q305k4934j1338l1017n6556M2861O2531m3110m0000j191
$$ 1069302 1025444 1003424 995119 970185 958847 927830 871274 914135 976666 933556 893556 892365
4342H92365q0105o5915P5502o689P005m6246K8593q800m2304k1774P4473L7075
$$ 892365 812260 746345 821847 815158 822163 775917 804510 795710 753406 731632 806105 843180
4330H43180n9565m5667r495O0087K7974L2118K512p6858Q0517N8120j9977J7883
$$ 843180 783615 737948 728453 788540 816514 848632 851144 774286 854803 912923 892946 910829
4318I10829J05388J30073K5134J4619R2526J43107P4642J63390J33858O7027m3431
$$ 910829 1016217 1146290 1171424 1186043 1278569 1421676 1496318 1659708 1793566 1860593 1817162
4307A817162r1343o3271j40807j84064j71570r5567j2228k6281o691j03568n1635
$$ 1817162 1725819 1662548 1521741 1337677 1166107 1070540 1058312 1032031 1025340 921772 870137
4296H70137J04227o4815n9488j9889n1304q6209l8343K7278m5035l8871j3709
$$ 870137 974364 909549 850061 830172 778868 692659 654316 681594 636559 597688 583979
4285E83979k5109K035L0808J9761J8422o8443k751k2724o4719M6185J2848L9074
$$ 583979 558870 560905 591713 611474 629896 561453 558702 535978 471259 517444 530292 569366
4273E69366k1077k2737R116K724l6446J9896L4997q1532L6281K6048P0136r098
$$ 569366 548289 525552 534668 537392 500946 520842 555839 474307 510588 536636 606772 597674
4261E97674j30638M1577j5301l9472M0180M5490l347k507L6916m8906K8981q0088
$$ 597674 467036 508613 493312 453840 494020 539510 536163 533656 570572 521666 550647 470559
4249D70559n1671K5185l0895l8293P3126O6867m6070K008J2292J4230n6313L9741
$$ 470559 418888 444073 413178 374885 448011 514878 468808 470816 483108 497338 441025 480766
4237D80766Q1262n3123m4503P7592J0850m9146J742O7615m9097l7906N2199l5336
$$ 480766 562028 508905 464402 541994 552844 503698 505440 573055 523958 486052 538251 502915
4225E02915m643Q316K6969p322L5426J977o0665L7926N9007q5019l1963O498j4079
$$ 502915 498272 506588 533557 526235 561661 563638 502973 540899 599906 514887 482924 489422 475343
4212D75343q685j2873O8207K648l6064L1164l7306k0433j804J3751M6348j9622
$$ 475343 466658 453785 521992 524640 488576 519740 482434 462001 460197 473948 520296 500674
4200E00674j588M1138j4040o2946M0825J03231K2507o9356o3180p5255j4995N5511
$$ 500674 499086 540224 526184 463238 504063 607294 629801 560445 497265 422010 407015 462526
4188D62526J6037k4617L2376M8034j6244K7775p933k1335K7181q2016J1978p928
$$ 462526 478563 453946 486322 534356 518112 545887 537954 516619 543800 461784 473762 465834
4176D65834K2569Q7063j6322m8670o1100L571O2221l2601k1273q0432L7193O7999
$$ 465834 488403 575466 559144 510474 449374 452945 515166 482565 461292 380860 418053 486052
4164D86052n2274J9912o3372M9316L2201n8909M9571K0117j6300k4012j279j9518
$$ 486052 433778 453690 390318 439634 471835 412926 462497 482614 466314 442302 441023 421505
4152D21505M9488n1195l1388M5131N7674m0809N2700L1027n3566n3374J094L7908
$$ 421505 470993 419798 388410 433541 491215 450406 503106 534133 480567 427193 428287 466195
4140D66195k7099M5636m207o3298o969P4230R616K549l9776n8807L4735P9372
$$ 466195 439096 484732 480525 417227 410258 484488 494104 496653 456877 398070 432805 512177
4128E12177k6960j6047K7189m3847k3829m7242O7391k7353p5990P2306L9436j7889
$$ 512177 485217 469170 496359 452512 428683 381441 448832 421479 345489 417795 457231 439342
4116D39342k4269M7406N3951K3435L167l5449p3821J1065l0978k5562P527K3329
$$ 439342 415073 462479 516430 539865 543032 507583 433762 444827 413849 388287 395814 419143
4104D19143n2818M5570N1608P3146j9609l449M136m8606j6214O692M6626l339
$$ 419143 366325 411895 463503 536649 517040 513591 517727 469121 452907 459599 506225 502886
4092E02886l1692k0666N4242Q749K0549k4276r6850L1139j3700K691J0963r110
$$ 502886 471194 450528 504770 513519 534068 509792 412942 444081 430381 433072 444035 434925
4080D34925j0620M2662J7960k3771L0424L4064K6204l1651o7248m2162M4080J3570
$$ 434925 424305 466967 484927 461156 491580 525644 551848 520197 452949 410787 454867 468437
4068D68437J0110K9727O1178q3029o536O4802m6249M6017j2264j6000k8449K4466
$$ 468437 478547 508274 569452 486423 479887 544689 498440 544457 532193 516193 487744 512210
4056E12210j4490p545Q107J3285m6197P141m6321L9542O3568o3674k1428N1684
$$ 512210 497720 490175 498282 511567 465370 472511 426190 465732 529300 465626 444198 495882
4044D95882J2319j24280K625J2498M2745N6583n370L429M6276K2049n7462n659
$$ 495882 508201 383921 386546 399044 441789 498372 493002 496431 542707 564756 507294 501635
4032E01635K351k982m232l6348j5811Q960k8115J1347K9396L4526N4513q0333
$$ 501635 503986 501004 496772 460424 444613 453573 425458 436805 466201 500727 555240 474907
4020D74907N3372J3759j8531m2317J8642L3785N013l3432m9050k5975n601M829
$$ 474907 528279 542038 523507 481190 499832 533617 538630 505198 456148 430173 424572 429401
4008D29401N932n569M1356k9699N8079q841K1556j8831J4543o029l130n789M8310
$$ 429401 435333 429764 471120 441421 499500 490659 512215 493384 507927 501898 498768 492979 541289
3995E41289k2558J0473m0337k5765M4382l4234P6525M4745k6449r3676K2561k9589
$$ 541289 518731 529204 488867 463102 507484 473250 549775 594520 568071 474395 496956 467367
3983D67367M7989n6428K0649J7731O5237j8237j620L6892K7436j4161L703J7883
$$ 467367 515356 458928 479577 497308 562545 544308 542688 579580 607016 592855 596558 614441
3971F14441j4812j3839o5353L5082L4615m7814N2820K8218p3394m7135l7370K3108
$$ 614441 599629 585790 520437 555519 590134 542320 595140 623358 549964 502829 465459 488567
3959D88567R9157N61M6111K2079q0849n1445L2029N152O032M9296q049M7694n2334
$$ 488567 587724 588285 634396 656475 575626 524181 556210 561362 567394 616690 608641 656335 604001
3946F04001O0832J4313K5609m0368l3877K5516J991n2063M8663J299j18019K621
$$ 604001 664833 679146 704755 664387 630510 656026 658017 605954 654617 655916 537897 540518
3934E40518M8224j1173K5652K3317k8062M2903O6128K743m486R068n4974l3N5881
$$ 540518 588742 577569 603221 626538 598476 641379 707507 710250 705764 714832 659858 659825 715706
3921G15706N14p925k3234m394Q719n1170M0447P754Q7014P6007O207o3682k3955
$$ 715706 716220 708295 685061 680667 689386 638216 678663 686417 773431 849438 855645 791963 768008
3908G68008R067M2784l0936K3532O905o9616J2739M5594k9245j2886M1137m7760
$$ 768008 777075 819859 788923 812455 819360 749744 762483 808077 778832 765946 807083 759323
3896G59323Q793P7724J0487o3703J5070J4025l8832M5470o205K7489j7548k7789
$$ 759323 768116 845840 856327 792624 807694 821719 782887 828357 822152 849641 832093 804304
3884H04304J3561l0303k3235K0973o162l4355N0810P820K8107o899O020k0980
$$ 804304 817865 787562 764327 785300 779138 744783 795593 803413 831520 824621 830641 809661
3872H09661o4076J1642J02057l35n4837K2808R9969r18k2801J1012l2634K4970
$$ 809661 745585 757227 859284 858949 804112 826920 926889 925971 903170 914182 881548 906518
3860I06518m9530l9873L2315m8468m895N6991l0127J999Q4918m3473K8301p5073
$$ 906518 856988 817115 849430 800962 796067 853058 822931 824930 909848 866375 894676 819603
3848H19603o1189O3717j4035N0651l865k5318l8685L1819j0519N4423O667j12307
$$ 819603 758414 822131 808096 858747 854882 829564 790879 822698 812179 866602 873269 760962
3836G60962j4950J4810K3997J06606J1595n9004k3909j5079m1750Q576O6162o396
$$ 760962 746012 760822 784819 891425 903020 844016 820107 805028 763278 771854 838016 831620
3824H31620k8703j6037l3242K9623j1196n4820k0113L6079M1054K8587k6073r870
$$ 831620 802917 786880 753638 783261 772065 717245 697132 733211 774265 802852 776779 766909
3812G66909N0154l27j9065o3008j0664K1747J2995K4959j4204N1031K9958l4104
$$ 766909 817063 816736 797671 734663 723999 745746 758741 783700 769496 820527 850485 816381
3800H16381k6991k2208K330n8809K5991K7349l3004R337M4569j8257J2431n9285
$$ 816381 789390 767182 769512 710703 736694 764043 731039 740376 784945 766688 779119 719834
3788G19834J01125L7616k0869J8270r6201m4690J6541L9196j2791L8704L7228
$$ 719834 820959 858575 837706 855976 759775 715085 731626 770822 758031 796735 833963
3777H33963j5523m5522N1573L5430j9102m0265K504N1312m9117j2707k65m9986
$$ 833963 818440 772918 824491 859921 840819 800554 803058 854370 805253 792546 792281 742295
3765G42295K7207L2984l879L1514k6607l8070N9747L3267l7151k4632r287L8746
$$ 742295 769502 802486 798607 830121 803514 765444 825191 858458 821307 796675 787388 826134
3753H26134p0346P014K4547M968O714j0943R041L2069m0678N3703L7842J2624
$$ 826134 755788 762802 787349 792317 799031 788088 797129 829198 788520 842223 880065 892689
3741H92689k6357l6894L2384n6008L0010p5385N6930J8573j0677M4380q0512K8647
$$ 892689 866332 829438 861822 805814 835824 760439 817369 835942 825265 869645 789133 817780
3729H17780j9052N8821o967O141j0776r1626N5244Q20R748m321O0929N000j4855
$$ 817780 798728 857549 850582 856723 845947 754321 809565 810385 820133 815812 876741 881741 866886
3716H66886j9488K8796l6053k0838N1654O7352k8741l9967k7004M6072N4403k1750
$$ 866886 847398 876194 840141 819303 870957 938309 909568 869601 842597 888669 943072 921322
3704I21322m6256M8549K4515l1640K3211j8124J6382n156m683L7185J8930m4389
$$ 921322 875066 923615 948130 916490 939701 921577 937959 932803 928120 965305 984235 939846
3692I39846L0807k835m9507m8307K9185Q5339l6029n661l044k5229k4384N9412
$$ 939846 970653 967818 918311 870004 899189 984528 948499 942838 939794 914565 890181 949593
3680I49593M1113M435J9957J0549p2041LN3255j0075k7159Q4647K2775n6091L8440
$$ 949593 990706 995141 1015098 1025647 953606 953609 1006864 996789 969630 1054277 1077052 1020961 1059401
3667A059401N978j8433q4519J1840O1983k6575K5110K486r098L0894p7740J05300
$$ 1059401 1065379 1046946 962427 974267 1036250 1009675 1034785 1037271 1028173 1059067 981327 1086627
3655A086627P8691K9780j00354L4532K2566j7491k4071j4024j139M0397Q4175
$$ 1086627 1165318 1195098 1094744 1129276 1151842 1134351 1110280 1096256 1095117 1135514 1219689
3644A219689k6758q1055l2999P5579M5255q867m5342P401N4893L3450k0803k7829
$$ 1219689 1192931 1111876 1078877 1154456 1199711 1190844 1145502 1152903 1207796 1241246 1220443 1192614
3632A192614K0341O1211O4380R0080n2252j6698k3209p5893M3960M7790K1719
$$ 1192614 1212955 1274166 1338546 1428626 1376374 1359676 1336467 1260574 1304534 1352324 1374043
3621A374043k350K7506M3206r1717k7744J7475M1814j7951K7237o114l2800N5209
$$ 1374043 1371693 1399199 1442405 1350688 1322944 1340419 1382233 1364282 1391519 1385405 1352605 1407814
3609A407814P755j1893J9343L4694m470J7566Q918O8078Q862o3245M5548L0251
$$ 1407814 1415569 1403676 1423019 1457713 1453243 1470809 1479727 1547805 1556667 1493422 1538970 1569221
3597A569221j6397j2225O3257o971L9137M4592j6947L8253m526K2852r117K3679
$$ 1569221 1552824 1540599 1603856 1596885 1636022 1680614 1663667 1701920 1697394 1720246 1711129 1734808
3585A734808P4233o4658p8768R1146O5378J37M3139J22379o2514J4422O3711O879
$$ 1734808 1809041 1744383 1665615 1756761 1822139 1822276 1865415 1987794 1925280 1939702 2003413 2010292
3573B010292O5595j0931L0871k342O1137O3448K3338J8096N6702J2351p4484o221
$$ 2010292 2075887 2064956 2095827 2093485 2154622 2218070 2241408 2259504 2316206 2328557 2254073 2247852
3561B247852J43300L3565k5634K8753K6065O5281N106M9627K1775Q2569O9280
$$ 2247852 2391152 2424717 2399083 2427836 2453901 2519182 2524288 2573915 2595690 2678259 2747539
3550B747539R789J33968M1413K3296j5848K8077O8039O3088J5584J23448P0332
$$ 2747539 2757328 2891296 2932709 2956005 2940157 2968234 3036273 3099361 3114945 3238393 3308725
3539C308725q1023R6234R4291J6265N6914Q2692P7857J7221P748Q5876L4670N7105
$$ 3308725 3227702 3323936 3418227 3434492 3491406 3574098 3651955 3669176 3676924 3762800 3797470 3854575
3527C854575J05628J32307R9007M9616K7633P1706J18629J51581P8384J51220
$$ 3854575 3960203 4092510 4191517 4241133 4268766 4340472 4459101 4610682 4689066 4840286
3517D840286J49864R3533J30866J27634J53323J58235K03864J27817K06502K01189
$$ 4840286 4990150 5083683 5214549 5342183 5495506 5653741 5857605 5985422 6191924 6393113
3507F393113J10284K04059J90323K36473K49865J64417J87999K93145L09596K74452
$$ 6393113 6503397 6707456 6897779 7134252 7384117 7548534 7736533 8029678 8339274 8613726
3497H613726L15151L89723L88899M22703M36906M86603N43882N73769N54742N66945
$$ 8613726 8928877 9318600 9707499 10130202 10567108 11053711 11597593 12171362 12726104 13293049
3487A3293049N76382N37583M55083M24124L39520J95571l0287j88159m19740n07591
$$ 13293049 13869431 14407014 14862097 15286221 15625741 15821312 15791025 15602866 15183126 14675535
3477A4675535o23935o67896o33663o69521o71023o10817n44450m64689m27326
$$ 14675535 14051600 13383704 12750041 12080520 11409497 10798680 10254230 9789541 9362215
3468I362215l88334l42199l30038j64850k62779l13856j48812j30371j53959j08652
$$ 9362215 8973881 8631682 8301644 8136794 7874015 7560159 7411347 7280976 7127017 7018365
3458G018365j43273j48384j15729j90461j31790o6356j31303j78300k08631p9293
$$ 7018365 6875092 6726708 6610979 6420518 6288728 6222372 6091069 5912769 5704138 5624845
3448E624845l0582j06043j02861j23004o4925j21154j13159p6441j02488n4765
$$ 5624845 5594263 5488220 5385359 5262355 5197430 5076276 4963117 4886676 4784188 4729423
3438D729423j94406q0510q6404m2923p6503n1402j04003j01080p5526m6872k5272
$$ 4729423 4535017 4454507 4368103 4325180 4248677 4197275 4093272 3992192 3916666 3869794 3844522
3427C844522K109k7809m0024j37416n5767m3211q2684p4421k4538n7263k8002
$$ 3844522 3846631 3818822 3778798 3641382 3585615 3542404 3459720 3385299 3360761 3303498 3275496
3416C275496j815j30704o1292m0682q7450m4304q140m7449n0675n000j7582r9168
$$ 3275496 3273681 3142977 3081685 3041003 2953553 2909249 2901109 2853660 2802985 2797985 2780403 2681235
3404B681235p4123K456k365q2242L3928N781q5123n6997M9800m3827r0819L539
$$ 2681235 2607112 2609568 2607203 2524961 2558889 2564670 2479547 2422550 2472350 2428523 2337704 2341243
3392B341243o711l4337p696L166o2017n0277J5957j00049n3595M3035P3738q2972
$$ 2341243 2334532 2300195 2292499 2295665 2233648 2183371 2199328 2099279 2045684 2088719 2162457 2079485
3380B079485o7911L5465n9219n9402L0969l9682P021L3185l8421l4684l0937q5525
$$ 2079485 2011574 2047039 1987820 1928418 1959387 1919705 1926726 1959911 1921490 1886806 1855869 1770344
3368A770344L0494J3408q5456K3526j6537j06442L2633M1337N9146n3079j05288
$$ 1770344 1800838 1814246 1728790 1752316 1735779 1629337 1661970 1703307 1762453 1709374 1604086
3357A604086P1268O9059j2838m9773J7m8475J2403l2009j6597J3322r4453J3552
$$ 1604086 1675354 1744413 1731575 1681802 1681819 1633344 1645747 1613738 1597141 1610463 1516010 1529562
3345A529562r135j2753K2638O939j6839J2471M4324l3449Q594l2190m8646L8061
$$ 1529562 1520427 1507674 1530312 1537251 1520412 1532883 1577207 1543758 1552352 1520162 1471516 1509577
3333A509577K0500L1168n2660j6581J4118l6202l3463K7416O7840n1479m416K37
$$ 1509577 1530077 1561245 1508585 1492004 1506122 1469920 1436457 1463873 1531713 1480234 1475818 1476055
3321A476055O363M7990P983k8277o9051m0091Q765l0044j8798m5301J9866j8473
$$ 1476055 1482418 1530408 1538391 1510114 1441063 1400972 1409737 1379693 1360895 1315594 1335460 1316987
3309A316987N184J9966n3916k5211J4287n7867K5842J3123P705N850L7602J8483
$$ 1316987 1322171 1342137 1288221 1263010 1277297 1219430 1245272 1258395 1266100 1271950 1309552 1328035
3297A328035n7955R768K1262K8169M7897p6687m4155N405J3429R173j6768n3732
$$ 1328035 1270080 1279848 1301110 1329279 1377176 1300489 1256334 1261739 1275168 1284341 1267573 1213841
3285A213841j6329N3756K1670O211m6189n276l7071J5886j6294J0307P5350l0423
$$ 1213841 1197512 1251268 1272938 1279149 1232960 1227684 1190613 1206499 1190205 1200512 1275862 1245439
3273A245439q5774L8490K9482j6828L8669n5480m0271J0669P6049j8183K6785
$$ 1245439 1159665 1198155 1227637 1210809 1249478 1193998 1153727 1164396 1240445 1222262 1249047
3262A249047L9079j5270n107k9063R1417L7768l686J9146N7501l293N8470Q4j2708
$$ 1249047 1288126 1272856 1267749 1238686 1330103 1367871 1364185 1383331 1440832 1437539 1496009 1496093 1483385
3249A483385K6407L7929J12018K4751l5374m2035j094J36323K4296j5858N1872
$$ 1483385 1509792 1547721 1659739 1684490 1649116 1607081 1605987 1742310 1766606 1750748 1802620
3238A802620n87L7256P041l6103K1093n6332K4680O2684p301l8228J3714o0104
$$ 1802620 1802033 1839289 1846330 1810227 1831320 1774988 1799668 1862352 1855051 1816823 1830537 1770433
3226A770433J7719R9673O906l899K7620R844M6564N5353j5863R1622R5106L1502
$$ 1770433 1788152 1887825 1894731 1890832 1918452 1928296 1974860 2030213 2014350 2105972 2201078 2232580
3214B232580N1151J39438L7751m4352J10080J09303R1807P3714M3925l0247j6887
$$ 2232580 2283731 2423169 2460920 2416568 2526648 2635951 2727758 2801472 2845397 2815150 2798263
3203B798263k7244J904M123l9812K4712J1040l3273o3333o347n8585J434l2315
$$ 2798263 2771019 2772923 2777046 2737234 2761946 2772986 2739713 2676380 2670033 2611448 2612882 2580567
3191B580567k2321n8327P1422O6004m752Q107J1544L9414L269L9526N6831J01830
$$ 2580567 2558246 2499919 2571341 2637345 2632593 2640700 2652244 2691658 2694927 2734453 2791284 2893114
3179B893114J48831Q0448R654J25360R4065K1260K1151N5543N8668M0068O8982
$$ 2893114 3041945 3122393 3132047 3257407 3351472 3372732 3393883 3449426 3508094 3548162 3617144
3168C617144l0948N0591J7843n119J1348J8321o071k4674l126M6643L4410j2799
$$ 3617144 3586196 3636787 3654630 3649511 3660859 3679180 3673109 3648435 3645309 3691952 3726362 3713563
3156C713563L4888m95J6442M7110Q7576J16712J37840Q8231J0571O4258K1919
$$ 3713563 3748451 3747956 3764398 3811508 3899084 4015796 4153636 4241867 4252438 4316696 4338615
3145D338615J29993J65914P3224J613l5472K8000n5318j42977j15346l7228j07576
$$ 4338615 4468608 4634522 4707746 4709359 4673887 4701887 4646569 4503592 4388246 4351018 4243442
3134D243442l5371n5116P6968q6489l1669Q2543N9708J5252l4819P8282P7953
$$ 4243442 4208071 4152955 4229923 4143434 4111765 4194308 4254016 4269268 4234449 4312731 4390684
3123D390684O1265k9473J03824P4293M3985K1328K5852J482j7855k4992J5116
$$ 4390684 4451949 4422476 4526300 4600593 4644578 4665906 4691758 4693240 4675385 4650393 4665509
3112D665509m7048j31871j63674j11234j24857j03695l6571j32312j79647n9272
$$ 4665509 4618461 4486590 4322916 4211682 4086825 3983130 3946559 3814247 3634600 3575328
3102C575328k3398j1789l5956M2383m2072r5592J554r772l6373m2382j3855n9927
$$ 3575328 3551930 3540141 3504185 3546568 3504496 3408904 3410458 3400686 3364313 3321931 3308076 3248149
3090C248149j07362m7341l5740n9177r9165j75184q4265o4953j08815o1139m1891
$$ 3248149 3140787 3093446 3057706 2998529 2899364 2724180 2639915 2574962 2466147 2405008 2363117
3079B363117j47495m1316l8654q0486k5739m5469n9335o6496o9413q7969j5849
$$ 2363117 2215622 2174306 2135652 2055166 2029427 1983958 1924623 1858127 1788714 1700745 1684896
3068A684896L0081j05241o765j6035m9964m6408l8460o1950n6723J0420L7937
$$ 1684896 1714977 1609736 1602971 1586936 1536972 1490564 1452104 1390154 1333431 1343851 1381788
3057A381788r4983k7931M1044k7194p1140L096R997l1284o1288p3127J6918j776
$$ 1381788 1286805 1258874 1299918 1272724 1201584 1204680 1214677 1183393 1122105 1048978 1065896 1064120
3045A064120M6646k2856l9557r6422r613K9820j11881O41l8106P9522j9684m9946
$$ 1064120 1110766 1087910 1048353 951931 942318 972138 860257 860898 822792 902314 882630 832684
3033H32684N6431k5031p3580l6554J8551q5536K4887j1015k8442Q1809o6130j5149
$$ 832684 889115 864084 790504 753950 772501 686965 711852 700837 672395 754204 688074 672925
3021F72925M6002K3381k4211m1338M4385j0680k3017j1086n8909l7435L4616p399
$$ 672925 718927 742308 718097 676759 721144 710464 687447 676361 617452 580017 614633 607234
3009F07234m542K0615k424n1472Q052m887j605N5659p6649n7800O421j2341J806
$$ 607234 602692 623307 620883 569411 577463 572576 570971 626630 549981 492181 498602 486261 488067
2996D88067K69k2941k8848k253k6657N5314j940l5552n1919K8532L5666J415m750
$$ 488067 488336 465395 436547 434294 407637 462951 461011 425459 373540 402072 437738 439153 434403
2983D34403k6849p758K7657m6873j9754m8054l8471L4363M2805k8199n6370K7812
$$ 434403 407554 399796 427453 380580 360826 312772 274301 308664 351469 323270 266900 294712
2971B94712P2893k0024r2002J3847J1807O500k2204j4019Q3444K6949j4099l7185
$$ 294712 367605 347581 255579 269426 281233 287733 265529 251510 334954 361903 347804 310619
2959C10619J4563N4388m332j1162j6630l1429l0131K0873l8959j3623J7900L681
$$ 310619 325182 379570 375238 364076 347446 316017 285886 306759 267800 254177 272077 275758
2947B75758K4762m048L767O6647J9500k3561m4269k382o6891k4251K8261J535
$$ 275758 300520 296472 300239 366886 386386 362825 318556 316174 249283 225032 253293 254828
2935B54828q091k1434k9627N8925M5837o27k1690J0723J0945o1029k1993m2329
$$ 254828 246737 225303 195676 254601 300438 299811 278121 288844 299789 238760 216767 174438
2923A74438L7818M3150L7866k2415O1919K4638l3915j9793o0J8805P951j7406
$$ 174438 212256 255406 293272 270857 332776 357414 323499 303706 303646 322451 330402 312996
2911C12996r6060k6424J6354N2684k9369O784K4776J3245M0202k7494R721m238
$$ 312996 216936 190512 206866 259550 230181 236965 261741 274986 315188 287694 297415 293177
2899B93177L4414m4840j4880k1528k7071O6085P0968L7380j1875M5170O7952k2219
$$ 293177 327591 282751 267871 246343 219272 285357 356325 393705 381830 427000 494952 472733
2887D72733j8497p2963M255K5282n6965M6669o1214M0424K3520o92R0517r3911
$$ 472733 454236 381273 385528 410810 353845 400514 339300 379724 403244 402552 493069 399158
2875C99158l4816N8754n401N4439o4723J8490L0037k9218k3017o817N1570N6145
$$ 399158 364342 423096 417695 472134 407411 425901 455938 426720 403703 396886 448456 504601
2863E04601j6379J6391J6417j6749k5959K1367N60p257J13521L6691l5814M8561
$$ 504601 488222 504613 521030 504281 478322 499689 500249 492992 606513 643204 607390 655951
2851F55951o0015m3484L5291m4467N6963R254k3650J6579l4454N8062M4065J2364
$$ 655951 595936 552452 587743 543276 600239 609493 585843 602422 567968 626030 670095 682459
2839F82459l4619k4920k4802N1373O3573m9354J5665O318N5576m1614j6917l28
$$ 682459 647840 622920 598118 649491 713064 663710 679375 685693 741269 699655 682738 682410
2827F82410J3753M9849m4749o380k8206O3610K1073q9344k1048k8432R823n767
$$ 682410 696163 746012 701263 694883 666677 730287 751360 662016 640968 612536 622359 616592
2815F16592K7337l6554k2557j0854j0279l4888M194j5002m1638K7375k794N434
$$ 616592 643929 607375 584818 573964 563685 528797 532991 517989 476351 503726 500932 506366
2803E06366K6805O7521j5981o0490j3868J1231K4151o6939q436Q0330j0413n9071
$$ 506366 533171 600692 584711 524221 510353 521584 545735 478796 470360 550690 540277 481206
2791D81206L0726q817j5185J6812r037P205j6792K6700n9356p7416r8630o095
$$ 481206 511932 503115 487930 504742 495705 502910 486118 512818 453462 376046 277416 271321
2779B71321J7806O714M9349N5626j0759q3597P7197m3277k9393m5020j4675J971
$$ 271321 289127 295841 345190 400816 390057 306460 383657 340380 310987 265967 251292 253263
2767B53263O113Q3829K6285l8477k7829m7010L8640j648j021o494K669J3549k7366
$$ 253263 259376 343205 369490 331013 303184 256174 294814 293166 292145 285651 288320 301869 274503
2754B74503l2314P060k7801l8764Q50p7550k4991k8901Q3834Q328j2355L7799
$$ 274503 242189 249249 221448 182684 183534 105984 80993 52092 135926 144254 131899 169698
2742A69698M0244o7048M9753q3076K165N3179J8451k079o3729k1757j2848n185
$$ 169698 209942 142894 192647 109571 111736 164915 183366 181287 117558 95801 82953 77768
2730G7768k5287L4442k1521J6237N415j7274J6949M9912O0138p083k5520J7395
$$ 77768 52481 86923 65402 81639 87054 69780 86729 136641 196779 189696 164176 181571
2718A81571j0529k8612l6365L0141l920j5817p8948L2964L9016o9663k7158M5224
$$ 181571 171042 142430 106065 136206 132286 116469 37521 70485 109501 39838 12680 57904
2706E7904O6989l52r060J9626k5232j5787m1722n5092l157l1288M7196O6808l431
$$ 57904 124893 124541 115481 135107 109875 94088 52366 -2726 -5883 -37171 10025 76833 73402
2693G3402j8469M7589m3241M099L8760J1465n3129m5053M3856l7864P47l504j9352
$$ 73402 54933 102522 59281 63380 102140 113605 60476 15423 59279 21415 22162 18658 -694
2680f94O0611P418J5797J2135j640l0503J3300P602K2124j7438m8307J3535k881
$$ -694 59917 67335 83132 95267 93627 63124 76424 84026 106150 88712 40405 53940 51059
2667E1059q7198J0956j3956K1572L5357q0K6135k1742M0480l5734L539O739J6749
$$ 51059 -36139 -25183 -39139 -17567 17790 17710 43845 22103 62583 26849 30388 37127 53876
2654E3876l4489m1224O0356J2875n344L3815o5556O5090K5488p8173l8879N1570
$$ 53876 19387 -21837 38519 51394 46050 79865 14309 79399 104887 26714 -12165 39405
2642C9405J4217P820n3126Q8078Q3827m5203n617J7339m8183l918L1649l7769
$$ 39405 53622 61442 8316 96394 180221 135018 129401 146740 98557 94639 126288 88519
2630H8519q786M6614j3304q2985l5012l093M873p813K5701O7849K0553n9841p9507
$$ 88519 79733 126347 113043 30058 -4954 -8047 -3174 -10987 14714 82563 103116 43275 -36232
2617c6232O2802R1174K4042l1184K876N0977l7374n950K5078m6567O0196j2476
$$ -36232 26570 117744 141786 110602 113478 164455 127081 121131 146209 99642 159838 147362
2605A47362m9757K6060j8423j6295j8688r910j2790O098r2994P1004O455k6523
$$ 147362 97605 123665 105242 88947 70259 60349 47559 53657 -39337 31667 38122 11599
2593A1599Q9127p8903q0671L9938O301M2885K9301L3838k8490k724k7261j5063
$$ 11599 100726 21823 -58848 -18910 -12609 30276 59577 93415 64925 62201 34940 19877
2581A9877m6220P8414k6988k7484Q1016J0070o6418j3166R4766n473q7392N5524
$$ 19877 -26343 52071 25083 -2401 78615 88685 22267 9101 103867 98394 11002 66526
2569F6526R615o1867P9514n624o159j532l3092k8464J674J2636O522j8239L8977
$$ 66526 76141 14274 93788 88164 82005 80473 47381 18917 20591 33227 39749 21510 60487
2556F0487J9728m5536j2964j2384j4174L8606J5236j4428j8911L942J5328l1948
$$ 60487 80215 34679 21715 9331 -4843 33763 48999 34571 15660 19602 34930 2982
2544B982P2509K4042p8028K2705R485R919j309n1970L8041N133O487n410m4593
$$ 2982 75491 99533 21505 44210 53695 63614 62305 10335 48376 53509 59996 54586 9993
2531I993k4661r151K8357j3459L0218j05l6726Q211O673Q199M9916l072m9398
$$ 9993 -14668 -23819 4538 -8921 21297 21192 -15534 -7323 -650 7549 57465 54393 4995
2518D995o963N5541M271j9683o5051l4314Q7314K8225k6967K2647j1106r655k6814
$$ 4995 -1968 53573 57844 38161 -26890 -61204 26110 54335 27368 50015 38909 29254 2440
2505B440r828O6774K0050l2743l9461n6177J8589K9007Q672K2440J4723n364J6429
$$ 2440 -7388 59386 79436 46693 7232 -48945 -30356 -1349 7323 29763 44486 39122 55551
2492E5551O624m2968o190N5872K3185n9848m8355O032N9698M7815j185J0282P5493
$$ 55551 62175 19207 13017 68889 92074 32226 -16129 -10097 49601 97416 96231 106513 182006
2479A82006p7670k3632K987r385K6192J6381k5508p2128N3644q22M5017N5263
$$ 182006 104336 80704 83691 74306 100498 116879 91371 19243 72887 72065 117082 172345
2467A72345n2867l7451P415k062R1460n180j6667m632m5466J8422o5870l5868
$$ 172345 119478 82027 89442 87380 178840 173660 156993 152361 106895 125317 59447 23579
2455B3579N9229K5924k1575K0142n432j5316K9833J7895L6161r898k280j2103
$$ 23579 82808 108732 87157 107299 101867 86551 116384 134279 170440 160542 158262 146159
2443A46159L2923R895K21J4708k7346k9546L0478J5281L1045J0993j8100M2952
$$ 146159 179082 188977 189198 203906 176560 147014 177492 192773 223818 234811 216711 259663
2431B59663o8738p7905Q776O1922L2205J05195l5678o8059N2122M460l2019K1056
$$ 259663 190925 113020 121796 183718 215923 321118 285440 217381 269503 273963 241944 263000
2419B63000R5215O909l1032K2052j5481l0882j7293j5805R4687L2206M2272n929
$$ 263000 358215 365124 334092 356144 340663 309781 292488 276683 371370 403576 445848 439919
2407D39919j7114M529j3716J6082Q4487n3471J0081N9890K633P5250k946M861
$$ 439919 422805 427334 413618 429700 514187 460716 470797 530687 533320 608570 605624 610485
2395F10485M3779K1652K3980Q5916P7978j3457N6583L6793M2583J14588N6942
$$ 610485 654264 675916 699896 785812 863790 850333 906916 943709 986292 1100880 1157822
2384A157822Q3768K9690J14935R6348J34317J29446J20761O8485J29634J60474
$$ 1157822 1241590 1271280 1386215 1482563 1616880 1746326 1867087 1935572 2065206 2225680
2374B225680J76786K11629K18042J70718K90679K41558K34220J91436K09825K38906
$$ 2225680 2402466 2614095 2832137 3002855 3293534 3535092 3769312 3960748 4170573 4409479
2364D409479L00304K72322L08376M06638M32967L99159M38830N34705N41821O33912
$$ 4409479 4709783 4982105 5290481 5697119 6130086 6529245 6968075 7502780 8044601 8678513
2354H678513P25142R02559J007893J009335J247256J592831K180335K577440L045823
$$ 8678513 9403655 10306214 11314107 12323442 13570698 15163529 17343864 19921304 22967127
2345B2967127L370823K429999Q17573j222640k875030l568224l005395k449159
$$ 22967127 26337950 28767949 29585522 28362882 25487852 21919628 18914233 16465074
2337A6465074k134253j925820j752293j395417j096537q41039o95227o00692m65646
$$ 16465074 14330821 12405001 10652708 9257291 8160754 7319715 6624488 6023796 5558150
2328E558150l25303l71915l72005k59613l87158k45175k53516j41366j73091k14395
$$ 5558150 5232847 4860932 4488927 4229314 3842156 3596981 3343465 3202099 3029008 2814613
2318B814613j60897j73905j39049k01381o3321r7883o2024j09999n5949l4693
$$ 2814613 2653716 2479811 2340762 2139381 2076060 1978177 1916153 1806154 1750205 1715512
2308A715512j35396q8986m1311j06321j4242k7322q3956o8200o4201n5215o7844
$$ 1715512 1580116 1491130 1449819 1343498 1329256 1301934 1217978 1149778 1085577 1030362 962518
2297I62518l2683J839j5304n8276L1078p6779l9921k1053j5006l6166N292k65
$$ 962518 929835 931674 916370 858094 889172 812393 772472 751419 736413 700247 705539 705274
2285G05274j6832n6648k4688l1452k1074J9865o2529K6638l5492o2706L5160M1293
$$ 705274 688442 631794 607106 575654 554580 574445 511916 538554 503062 440356 475516 516809
2273E16809J7824k7767j24102M4731p1811p1355Q5762K4116J9772K7435m0557
$$ 516809 534633 506866 382764 427495 355684 284329 370091 394207 413979 441414 400857
2262D00857k2523o8528L7906N4747l0474k0117L2795k7887r1020l7999M5050K9393
$$ 400857 378334 309806 347712 402459 371985 351868 384663 356776 265756 227757 272807 302200
2250C02200q803k6520L757M0943p5734L2095J9342j2861l2223j8097J1430J6590
$$ 302200 293397 266877 270634 311577 235843 267938 287280 274419 242196 224099 235529 252119
2238B52119k7396n5575L191O0637j7111M57N903r3251K8182J9133L9944p7938
$$ 252119 224723 169148 172339 232976 215865 216322 222225 128974 157156 176289 216233 138295
2226A38295p7698R0218P506J7168j8418j9991J1968K9696k2712P204M0057k1580
$$ 138295 60597 150815 158321 175489 157071 137080 149048 178744 156032 163236 203293 181713
2214A81713j15571l4673P0357J9028K4183K6805k5178r262Q931n3162N2635j4091
$$ 181713 66142 31469 101826 120854 145037 171842 146664 137402 146333 93171 145806 131715
2202A31715O480L0281q8841l3586N9180P7709J6278n3731n8864q0291k8944J31215
$$ 131715 138195 168476 79635 46049 105229 182938 199216 145485 86621 6330 -22614 108601
2190A08601N1585l3203k033k6880l7146J8665J4515m110K2728l6360K7136K9761
$$ 108601 160186 126983 124950 98070 60924 79589 94104 89994 112722 76362 103498 133259
2178A33259j2201N950n0654m1923p251l1299J5556O3363n791k0322j1992N2314
$$ 133259 121058 127008 76354 34431 27180 -4119 11437 74800 69009 48687 36695 89009
2166H9009l2796j1848O1637m928j2995L3933m7443k21M794k2515M6598m3970m1278
$$ 89009 56213 44365 106002 101074 88079 122012 74569 74348 79142 56627 103225 59255 17977
2153A7977j7817N7619L7861o3351K5112k495M4864j6766k978K5938l6047o097
$$ 17977 160 57779 95640 32289 57401 54906 99770 83004 80026 105964 69917 63820
2141F3820m5214j0760k2445n6041Q3562J178l1648L2098k8436J5456r936O8963
$$ 63820 18606 7846 -14599 -70640 12922 14100 -17548 14550 -13886 1570 -8366 60597
2129F0597M3373M0956j6258r4220n521J4569L8779N6059k9711M7530o3023o2488
$$ 60597 103970 144926 128668 34448 28927 43496 82275 138334 108623 156153 93130 30642
2117C0642J895K6176q168L2818M1434p5718k1399K1021K3497K6626k3953k6775
$$ 30642 32537 58713 50545 83363 124797 49079 27680 48701 72198 98824 74871 48096
2105D8096J7990k0395o312k6933k5963Q5052L5440M1995p8101l0529L4067O6071
$$ 48096 66086 45691 39379 12446 -13517 71535 106975 148970 70869 40340 74407 140478
2093A40478l5820n4880Q068l6438K0592o587l714o0878K9541J8480N4279k2398
$$ 140478 104658 49778 57846 21408 42000 35413 31699 -29179 362 18842 73121 50723
2081E0723j8366O8188q843L9277M8251l5114l5353N3100J3252O731k3695j4681
$$ 50723 32357 100545 91702 130979 179230 144116 108763 161863 175115 181846 158151 143470
2069A43470o8925K1180m895m7757n4725K294J8400p8184R2773L761k7327j0167
$$ 143470 74545 95725 90830 43073 -11652 -9358 9042 -69142 23631 27392 65 -10102
2057a0102J8834K684M3425q9621r056J9624K7796Q3148j4346p0193l1519L337
$$ -10102 8732 11416 54841 -34780 -43836 -24212 3584 86732 72386 2193 -29326 -25989
2045b5989J7116j5639l3582P1370m3991J9827N0636l6626j1499k0332K9769o327
$$ -25989 -8873 -24512 -58094 13276 -30715 -10888 39748 3122 -8377 -28709 1060 -5267
2033e267L0329O0874l7893K9979p9831R030L9540O27Q824o0535n2822K077k619
$$ -5267 25062 85936 48043 78022 -1809 7221 46761 47388 56212 -4323 -57145 -55068 -57687
2020e7687K7538L7180j4403k1739p085J4858K8284N0468k7377k5261j08973J5994
$$ -57687 -30149 7031 -7372 -29111 -36196 -21338 6946 57414 30037 4776 -104197 -88203
2008h8203K9617m2016N6410N3319Q496P4600m6869j07665J4803J9321M7504k6792
$$ -88203 -58586 -100602 -44192 9127 17623 92223 45354 -62311 -47508 -28187 19317 -7475
1996g475L3872J0243j026k0320M0145l4973p0188P6233o558M2649q3062K434P689
$$ -7475 26397 36640 35614 15294 55439 20466 -49722 26511 19953 62602 -20460 -18026 -10337
1983a0337K1128K0384o262m2943l3141k141N6028l3449J8739K8429l0722j561
$$ -10337 10791 31175 24913 -18030 -51171 -53312 2716 -30733 -11994 16435 -14287 -15848
1971a5848k3336n862r636L1150l0255k2501N1652n369j1298L6677J295K5080j6202
$$ -15848 -39184 -45046 -54682 -23532 -53787 -76288 -24636 -30005 -41303 -4626 -3331 21749 5547
1958E547K9801J4651O578M0893p377l1508O200n4072n5486O136L5943j2855j0689
$$ 5547 35348 49999 56577 97470 90093 58585 64785 10713 -44773 -38637 -2694 -15549 -26238
1945b6238m9221N4395L1313J884J0542J115J5873L3190n5987n8878n753Q905M416
$$ -26238 -75459 -21064 10249 12133 22675 23790 39663 72853 16866 -42012 -47765 -38860 -34444
1932c4444O0359n189m1209J8945L9672K239p0982j4716n428J2170n3363L3511
$$ -34444 25915 20726 -20483 -1538 38134 40373 -30609 -45325 -50753 -38583 -91946 -58435
1920e8435O1058q012k2818K9385N472k9114o190J4387L7871j6600r246k0257p587
$$ -58435 2623 -5389 -28207 1178 6650 -22464 -28654 -14267 23604 7004 -2242 -22499 -30086
1907c0086J3690K5543J8472K2417J3075l5529J0267n0523M6679J5265M310K0896
$$ -30086 -16396 9147 27619 50036 63111 27582 37849 -12674 34005 49270 53580 74476
1895G4476j9127k1652p6347k9707J9713L40o602L4185O9134k9470p8581O858j8280
$$ 74476 55349 33697 -42650 -72357 -52644 -52304 -58906 -24721 44413 14943 -63638 -56780 -75060
1882g5060P339r28K9665K65J7930J0327j4985j0448m01K7163p665J5823m575Q5862
$$ -75060 -67721 -68649 -38984 -38719 -20789 -10462 -25447 -35895 -36296 -9133 -16798 -975 -5550 80312
1868H0312k2142p7733M5315R78M9553J9975j7197j00749Q2492p7445j7759n015
$$ 80312 58170 -19563 25752 26730 76283 96258 79061 -21688 60804 -16641 -34400 -39415
1856c9415p8258O4166j0230N9441j1356j2363L144k0086M7415m3124Q8360r25
$$ -39415 -117673 -53507 -63737 -4296 -15652 -28015 -24871 -44957 2458 -40666 47694 46769
1844D6769j4425k9164r312M3735Q501k4567o5185k0523n410m1L9302N6996k9572
$$ 46769 32344 3180 -6132 37603 46104 21537 -43648 -64171 -69581 -69622 -30320 26676 -2896
1831b896k8873j4555O4666m8363l3488J8701J1398P923K314K6667K4119J4351
$$ -2896 -31769 -46324 18342 -30021 -63509 -44808 -33410 -25487 -23173 3494 27613 41964
1819D1964j8761p8378P2807M8706o5167k1009P1767j5845M451l589m3024M2610
$$ 41964 23203 -55175 17632 66338 1171 -19838 51929 36084 40535 36946 -6078 36532
1807C6532l0586l1125P3569k4228J5061L112J887j6019J7988j5973o2578K0319
$$ 36532 5946 -25179 48390 24162 39223 42335 44222 28203 46191 30218 -32360 -12041
1795a2041J2087l3495M6666J7422n2885J5440K7266l0189M544j3079L2353l7865
$$ -12041 46 -33449 13217 30639 -22246 -6806 20460 -9729 -5185 -18264 14089 -23776
1783b3776k8691N5742K9452p321r586J2220m9542j2389P6239q525j6711P7986
$$ -23776 -52467 3275 32727 25406 15820 28040 -21502 -33891 42348 33823 17112 95098
1771I5098k9441J9532j2904r7528K0281K1358j0052l1786J6569K49j0406n9096
$$ 95098 65657 85189 72285 -25243 -4962 16396 6344 -25442 -8873 -8624 -19030 -78126
1759g8126O0322N9341N7969j2600r0593l5103Q477J8526m3634L0682J7418J1500
$$ -78126 -17804 41537 99506 86906 -3687 -38790 -30313 -11787 -55421 -24739 -7321 4179
1747D179l633K9489k4600q11j0601r8021O568M653L3359L1249L4847R2976J5868
$$ 4179 546 30035 5435 4624 -5977 -103998 -97430 -92777 -59418 -28169 6678 99654 115522
1734A15522n0814m983o9888j0712L4329o7023N6627J2251k5611k057P3898m4894
$$ 115522 64708 59725 -10163 -20875 13454 -53569 3058 15309 -10302 -12359 61539 16645
1722A6645m3068j3864J9064q444K1777l1336P6770p8796p3877M2327J0255n490
$$ 16645 -26423 -40287 -21223 -29667 -7890 -39226 37544 -41252 -115129 -72802 -62547 -68037
1710f8037Q331J3872l6443P3307L1599J9516n723j0990q027p0599J6377K3798
$$ -68037 -59706 -45834 -82277 -8970 22629 42145 36422 25432 17405 -53194 -36817 -13019
1698a3019k9022m0970Q1193J0029J1814k814q2555o45J5491N9854J0779k143n7587
$$ -13019 -42041 -83011 -1818 8211 20025 17211 -65344 -65989 -50498 9356 20135 17992 -39595
1685c9595q284N0545l0699O299J1481M2873k2400n8942J997l7186K5266j6311
$$ -39595 -47879 2666 -28033 -21734 -10253 32620 10220 -48722 -46725 -83911 -58645 -74956
1673g4956J5970M7520n8873K426K7584N5050k631l713k4440m8598k672K6864N8855
$$ -74956 -58986 -11466 -70339 -67913 -40329 14721 12090 8377 -16063 -64661 -67333 -40469 18386
1660A8386n348n0926k9775Q4025K6821j7010K3989k9305j1349L4968n6004J0483
$$ 18386 13038 -37888 -67663 16362 43183 26173 50162 20857 9508 44476 -11528 -1045
1648a045k756k6894o300q5276K7851J07358m6245q500L5844J5816k02K2288j4841
$$ -1045 -3801 -30695 -36995 -122271 -94420 12938 -33307 -41807 -5963 9853 9651 31939 17098
1635A7098j986K8342k2383K2283J7754J054k5851l7183m4836J4812p545k2593
$$ 17098 15112 43454 21071 43354 61108 62162 36311 -872 -45708 -30896 -38441 -61034
1623f1034q676K4424L5609K5559L1087k9648p380o3639j1072L4594K7144n6596
$$ -61034 -69710 -45286 -9677 15882 46969 17321 9941 -53698 -64770 -30176 -3032 -59628
$$ [...]
##END NTUPLES=NMR SPECTRUM
##END=
