##TITLE=1H_DE-80H_X3
 200.13MHz, d2o
 8 sc
 
 19ns.26.2.2025
##JCAMPDX= 6.0         $$ Bruker NMR JCAMP-DX V2.0
##DATA TYPE= NMR SPECTRUM
##DATA CLASS= NTUPLES
##ORIGIN= UXNMR, Bruker Analytische Messtechnik GmbH
##OWNER= pz
$$ XWIN-NMR		Version 3.5
$$ Thu Jun  5 11:21:34 2025 Russian Standard Time (UT+4h)  Yarkov@DPX200
##.OBSERVE FREQUENCY= 200.1313
##.OBSERVE NUCLEUS= ^1H
##.ACQUISITION MODE= SIMULTANEOUS
##.ACQUISITION SCHEME= undefined
##.AVERAGES= 8
##.DIGITISER RES= 18
##SPECTROMETER/DATA SYSTEM= spect
##.PULSE SEQUENCE= zg30
##.SOLVENT NAME= CDCl3
##.SHIFT REFERENCE= (INTERNAL, CDCl3, 0, 15.5056)
##AUDIT TRAIL= $$ (NUMBER, WHEN, WHO, WHERE, WHAT)
$$ ##TITLE= Audit trail, XWIN-NMR		Version 3.5
$$ ##JCAMPDX= 5.01
$$ ##ORIGIN= Bruker BioSpin GmbH
$$ ##OWNER= Yarkov
$$ C:/Bruker/XWIN-NMR/data/yarkov2/nmr/H-C/1/pdata/1/auditp.txt
$$ ##AUDIT TRAIL=  $$ (NUMBER, WHEN, WHO, WHERE, WHAT)
(   1,<2025-06-05 11:20:39.62 +0400>,<Yarkov>,<DPX200>,
      <created by zg, POWCHK disabled, PULCHK disabled
       configuration hash MD5:
       00 E9 B6 7A A2 85 ED C7 34 08 36 98 17 FE 4E 26
       data hash MD5: 16K
       79 3D 25 AA A8 EA DF A8 7C 08 68 B9 49 2C 95 79>)
(   2,<2025-06-05 11:20:45.37 +0400>,<Yarkov>,<DPX200>,
      <Start of raw data processing
       efp BC_mod = 2 LB = 0.25 FT_mod = 6 PKNL = 1 PHC0 = -1710.501 PHC1 = 9.76656 SI = 16K 
       data hash MD5: 16K
       4F 92 C6 71 B5 E3 42 68 5C 48 56 A1 AC 87 1D D4>)
(   3,<2025-06-05 11:20:52.17 +0400>,<Yarkov>,<DPX200>,
      <abs ABSG = 5 
       data hash MD5: 16K
       93 AE 37 D6 CF 0F 85 7C A6 7B DB D7 48 96 27 CD>)
$$ ##END=
$$ 
$$ hash MD5
$$ AC E6 9E 85 B0 82 07 39 BD 8C CC AF 0B 7A 7D 97
##$RELAX= 
##$RELAX= 
##$RELAX= 
##$RELAX= 
##$RELAX= 
##$RELAX= 
$$ Bruker specific parameters
$$ --------------------------
##$DU= <C:/Bruker/XWIN-NMR>
##$EXPNO= 1
##$NAME= <H-C>
##$PROCNO= 1
##$TYPE= <nmr>
##$USER= <yarkov2>
##$AMP= (0..31)
100 100 100 100 100 100 100 100 100 100 100 100 100 100 100 100 100 100 
100 100 100 100 100 100 100 100 100 100 100 100 100 100 
##$AQSEQ= 0
##$AQ_mod= 1
##$AUNM= <au_zg>
##$AUTOPOS= <>
##$BF1= 200.13
##$BF2= 200.13
##$BF3= 200.13
##$BF4= 200.13
##$BF5= 200.13
##$BF6= 200.13
##$BF7= 200.13
##$BF8= 200.13
##$BYTORDA= 1
##$CFDGTYP= 0
##$CFRGTYP= 5
##$CHEMSTR= <none>
##$CNST= (0..31)
1 1 145 1 1 1 1 1 1 1 1 1 1 1 1 1 1 1 1 1 1 1 1 1 1 1 1 1 1 1 1 1 
##$CPDPRG= <>
##$CPDPRG1= <>
##$CPDPRG2= <>
##$CPDPRG3= <>
##$CPDPRG4= <mlev>
##$CPDPRG5= <mlev>
##$CPDPRG6= <mlev>
##$CPDPRG7= <mlev>
##$CPDPRG8= <mlev>
##$CPDPRGB= <>
##$CPDPRGT= <>
##$D= (0..31)
0 0.7 0 0 0 0 0 0 0 0 0 0.03 0 0 0 0 0 0 0 0 0 0 0 0 0 0 0 0 0 0 0 0 
##$DATE= 1749108039
##$DBL= (0..7)
120 120 120 120 120 120 120 120 
##$DBP= (0..7)
150 150 150 150 150 150 150 150 
##$DBP07= 0
##$DBPNAM0= <>
##$DBPNAM1= <>
##$DBPNAM2= <>
##$DBPNAM3= <>
##$DBPNAM4= <>
##$DBPNAM5= <>
##$DBPNAM6= <>
##$DBPNAM7= <>
##$DBPOAL= (0..7)
0.5 0.5 0.5 0.5 0.5 0.5 0.5 0.5 
##$DBPOFFS= (0..7)
0 0 0 0 0 0 0 0 
##$DE= 6
$$ [...]
##$SUBNAM3= <"">
##$SUBNAM4= <"">
##$SUBNAM5= <"">
##$SUBNAM6= <"">
##$SUBNAM7= <"">
##$SUBNAM8= <"">
##$SUBNAM9= <"">
##$SW= 18.0517328524113
##$SWIBOX= (0..15)
0 0 2 0 0 0 0 0 0 0 0 0 0 0 0 0 
##$SW_h= 3612.71676300578
##$TD= 16384
##$TD0= 1
##$TE= 0
##$TE2= 300
##$TE3= 300
##$TEG= 300
##$TL= (0..7)
0 120 120 120 120 120 120 120 
##$TP= (0..7)
150 150 150 150 150 150 150 150 
##$TP07= 0
##$TPNAME0= <>
##$TPNAME1= <>
##$TPNAME2= <>
##$TPNAME3= <>
##$TPNAME4= <>
##$TPNAME5= <>
##$TPNAME6= <>
##$TPNAME7= <>
##$TPOAL= (0..7)
0.5 0.5 0.5 0.5 0.5 0.5 0.5 0.5 
##$TPOFFS= (0..7)
0 0 0 0 0 0 0 0 
##$TUNHIN= 0
##$TUNHOUT= 0
##$TUNXOUT= 0
##$USERA1= <user>
##$USERA2= <user>
##$USERA3= <user>
##$USERA4= <user>
##$USERA5= <user>
##$V9= 5
##$VALIST= <valist>
##$VCLIST= <CCCCCCCCCCCCCCC>
##$VD= 0
##$VDLIST= <DDDDDDDDDDDDDDD>
##$VPLIST= <PPPPPPPPPPPPPPP>
##$VTLIST= <TTTTTTTTTTTTTTT>
##$WBST= 1024
##$WBSW= 4
##$XGAIN= (0..3)
0 0 0 0 
##$XL= 0
##$YL= 0
##$YMAX_a= 325330
##$YMIN_a= -325614
##$ZGOPTNS= <>
##$ZL1= 120
##$ZL2= 120
##$ZL3= 120
##$ZL4= 120
##$ABSF1= 15.5056
##$ABSF2= -2.546249
##$ABSG= 5
##$ABSL= 3
##$ALPHA= 0
##$AQORDER= 0
##$ASSFAC= 0
##$ASSFACI= 0
##$ASSFACX= 0
##$ASSWID= 0
##$AUNMP= <proc_1d>
##$AZFE= 0.1
##$AZFW= 0.1
##$BCFW= 0
##$BC_mod= 2
##$BYTORDP= 0
##$COROFFS= 0
##$CY= -3
##$DATMOD= 1
##$DC= 0
##$DFILT= <>
##$DTYPP= 0
##$F1P= 0
##$F2P= 0
##$FCOR= 1
##$FTSIZE= 16384
##$FT_mod= 6
##$GAMMA= 0
##$GB= 0
##$INTBC= 1
##$INTSCL= 3.241238e-09
##$ISEN= 128
##$LB= 0.25
##$LEV0= 0
##$LPBIN= 0
##$MAXI= 10000
##$MC2= 0
##$MEAN= 0
##$ME_mod= 0
##$MI= 1.114404
##$NCOEF= 0
##$NC_proc= -6
##$NLEV= 6
##$NOISF1= 3.799351
##$NOISF2= 2.8
##$NSP= 0
##$NTH_PI= 0
##$NZP= 0
##$OFFSET= 15.5056
##$PC= 1
##$PHC0= -1710.501
##$PHC1= 9.76656
##$PH_mod= 1
##$PKNL= yes
##$PPARMOD= 0
##$PSCAL= 0
##$PSIGN= 0
##$REVERSE= no
##$SF= 200.130003222588
##$SI= 16384
##$SIGF1= 3
##$SIGF2= 2
##$SINO= 0.751879
##$SIOLD= 32768
##$SREGLST= <19F.Aceton>
##$SSB= 0
##$STSI= 16384
##$STSR= 0
##$SW_p= 3612.71676300578
##$SYMM= 0
##$S_DEV= 0
##$TDeff= 16384
##$TDoff= 0
##$TI= <>
##$TILT= no
##$TM1= 0
##$TM2= 0
##$TOPLEV= 0
##$USERP1= <user>
##$USERP2= <user>
##$USERP3= <user>
##$USERP4= <user>
##$USERP5= <user>
##$WDW= 1
##$XDIM= 16384
##$YMAX_p= 388394358
##$YMIN_p= -179766
$$ End of Bruker specific parameters
$$ ---------------------------------
##NTUPLES= NMR SPECTRUM
##VAR_NAME=  FREQUENCY,     SPECTRUM/REAL,   SPECTRUM/IMAG
##SYMBOL=    X,             R,               I
##VAR_TYPE=  INDEPENDENT,   DEPENDENT,       DEPENDENT
##VAR_FORM=  AFFN,          ASDF,            ASDF
##VAR_DIM=   16384,         16384,           16384
##UNITS=     HZ,            ARBITRARY UNITS, ARBITRARY UNITS
##FACTOR=    0.220516191357247, 1,           1
##FIRST=     3103.13577308217, 0,            0
##LAST=      -509.580989923606, 0,           0
##MIN=       -509.580989923606, -179766,     0
##MAX=       3103.13577308217, 388394358,    0
$$ Real data points
##PAGE= N=1
##DATA TABLE= (X++(R..R)), XYDATA
$$ [...]
10289 16373 35986 12643 -18273 -65612 -52128 1437 87602 82083 76889 39423 14978 84622
10277 84622 36100 -47100 7017 23161 -5183 -18795 -17256 -48338 5225 20886 27757 53949
10265 53949 37709 59872 76941 53471 -20963 1831 8570 40409 43438 14431 48695 72316
10253 72316 53643 14422 -26601 -2155 -1068 -34296 17554 75734 57753 -44391 -40826 1317
10241 1317 45770 -21900 -63128 -105848 -80195 -14202 6086 -70918 -84787 -109145 -86345 -93245
10229 -93245 -51174 -4382 -14773 -28571 -38689 -55486 -13938 -85346 -98898 -72241 -77709 -47477
10217 -47477 -13160 -3516 46710 30660 -38913 -10077 -67535 -38580 590 -33216 -36190 44010
10205 44010 47040 57078 -11907 -25457 2198 -24774 -35857 40645 7998 -59561 -86373 -59841
10193 -59841 -22209 -24676 -40010 -45712 -18955 -10658 -55293 7100 -9233 -3671 21577 34344
10181 34344 13048 42826 12580 -41733 -32149 -31092 -40914 -49691 -147807 -92527 -29490 -29139 -9572
10168 -9572 -42549 17992 14536 39494 53637 51437 -27396 39652 56180 59635 54289 14471 -1518
10155 -1518 80899 84851 91800 56551 51604 126358 110261 65282 1001 -38271 18342 58789
10143 58789 -1863 3496 14923 6509 51593 79629 45252 -15106 -31363 -49557 14028 -3275
10131 -3275 -13217 17470 -28234 -355 36707 54240 56366 49307 -43053 -126157 -114429 -34873
10119 -34873 32282 10492 -28573 43631 23983 17442 72979 62386 72344 99580 87049 132374
10107 132374 70890 71230 133904 55786 25431 55168 96542 139711 130882 164720 176424 167672
10095 167672 104987 54026 61653 88363 105349 86407 92735 135068 227086 169449 197676 235731
10083 235731 246779 273710 318841 297200 324937 463228 508992 598132 545655 637586 761271
10072 761271 898873 936237 919699 983187 934933 848733 713316 603204 489441 427656 425154
10061 425154 361884 257512 218582 210554 161872 159561 204490 257473 262443 212245 220721 193462
10049 193462 136715 148612 123257 120872 149800 52201 20984 55086 32251 70998 110674 50264
10037 50264 80827 136126 50552 7872 36462 75777 84456 61657 102114 103259 67450 136261
10025 136261 137429 200603 198479 121843 176833 184482 141416 148535 187644 212756 226202 161615
10013 161615 122736 95853 63609 74043 57814 74788 100835 31200 51880 56064 85167 59558
10001 59558 -43041 -44259 15537 36181 38747 10457 -10582 -1485 76165 52387 -15248 11327
9989 11327 -1193 17258 3990 26050 62560 86194 109964 48557 63305 -35591 -79718 12931
9977 12931 53493 78130 90193 61914 79364 89781 98234 67989 -23644 20994 26821 28434
9965 28434 -9229 -49939 39112 5215 -25758 57660 3985 25939 10281 39381 60626 -9408
9953 -9408 -16523 17714 79886 92705 90032 105669 88684 46687 65108 108487 111297 45486 51143
9940 51143 118379 141057 159937 116021 85769 150472 88151 -1630 -23234 -7162 29787 58319
9928 58319 7805 -69363 -58443 9419 37812 65942 84388 95343 71552 39589 120383 54063
9916 54063 19860 17307 -9040 32839 19067 -78529 -69562 -66598 -31336 55762 -17006 -62560
9904 -62560 -20753 56070 25942 48795 34696 19717 33603 20560 42366 52626 57669 46539
9892 46539 44024 42532 40774 -13542 23605 30776 25503 -1533 12174 37367 54530 26533 70915
9879 70915 86602 88664 65951 27368 54644 48910 69121 115256 83839 59773 56429 43725
9867 43725 84747 51870 83692 62839 105789 70847 53214 103460 78607 29990 -63948 14733
9855 14733 -2399 2918 38233 30895 74097 57592 60059 -17161 -36543 1718 16425 9343 15874
9842 15874 -11356 -9729 -75900 -75122 -1066 41684 23607 45597 48797 87380 40131 -5180 -8254
9829 -8254 -11200 -9078 28539 67233 12541 -11875 -6814 19146 36621 53068 49841 53783 76380
9816 76380 77263 97980 24841 -24974 27628 29174 10206 17073 54410 36080 93613 15609 46682
9803 46682 36168 38526 28702 19343 -9 -2028 11529 -28104 21444 74527 4759 -49151 -18174
9790 -18174 -60822 -51910 5501 -7017 36088 72047 68974 12392 -1105 23909 53509 36063
9778 36063 12958 -93944 -69018 -28789 53405 107810 29987 38651 -24039 -17596 -24964 -14109
9766 -14109 -12350 2088 18400 63467 81109 72602 -6303 16481 77408 111933 79388 28401
9754 28401 111791 94119 67793 98119 65882 59984 70221 80553 119738 37135 59045 67448
9742 67448 25543 18098 24484 57003 -13362 -82140 7748 78863 34615 -9372 -43659 19571
9730 19571 21773 16690 78606 83057 44455 54104 92722 65177 44101 74627 64897 54140 31481
9717 31481 23523 74864 148813 164120 165048 131031 201885 134108 116222 96285 77838 63111
9705 63111 145601 158387 161923 182396 146643 157387 186247 220967 243338 209405 229520 255051
9693 255051 276396 331813 314757 265557 304475 305312 314221 327329 243213 272002 320358 377842
9681 377842 386559 446224 494599 537849 554033 637406 638750 633006 687276 742113 845035 933756
9669 933756 1041360 1115666 1239560 1413206 1459200 1414181 1347668 1376452 1371188 1383054 1368445
9658 1368445 1258807 1136343 1093185 959170 891161 848118 785513 740321 668242 632733 669033
9647 669033 685957 680382 719539 626106 576189 593055 688704 706916 679936 708599 717620 727621
9635 727621 671718 731976 754401 703035 724356 846842 931995 912089 910994 923196 1017300 1080420
9623 1080420 1189320 1175711 1222032 1367779 1392493 1472702 1603790 1737267 1827523 1934378
9613 1934378 2115224 2340846 2470116 2627393 2663309 2670682 2404111 2137170 1956943 1774546
9603 1774546 1609022 1502821 1367897 1230521 1093399 974590 983082 831728 827326 884926
9593 884926 787614 745940 707394 657376 651003 609233 642810 654998 629511 590679 584908 578430
9581 578430 505001 458264 580143 566320 512630 533383 556403 544979 467220 497765 487265
9570 487265 458871 384578 360718 384545 365808 370923 439546 432443 357605 379893 410796 444607
9558 444607 406251 437757 477179 476959 535038 495551 554805 647171 647075 642450 629251 587676 466005
9545 466005 455066 444315 508035 535418 486612 398813 437124 424381 421896 452346 385389 426162
9533 426162 411215 387316 378485 440037 351365 381154 355061 312694 320135 308603 373531 349459
9521 349459 395322 375469 370330 350434 391195 458846 490186 527641 528485 520834 561949 548799
9509 548799 568292 527551 496713 538216 439015 384923 386438 346630 327093 331257 373761 391024
9497 391024 300154 234583 246661 310960 288365 232825 330699 340873 376602 335861 364079 353915
9485 353915 340903 269260 262331 285341 272098 232155 264498 307693 252204 215856 243604 275207
9473 275207 257440 239568 226405 284386 325643 247430 186854 246548 295987 270506 244382 274136
9461 274136 278089 225537 218123 252842 284037 245944 233850 207558 203821 242367 276797 342600
9449 342600 305303 231115 220129 261259 265632 300116 291883 330894 296775 296466 298240 316164 320257
9436 320257 421170 362701 398506 344036 408252 415558 405511 387209 390594 459387 485558 451447
9424 451447 500286 519671 515932 446199 473524 537785 453691 481100 464443 384741 381065 435361
9412 435361 445896 498178 550322 546988 509646 562362 592947 606083 569124 557553 552378 626600
9400 626600 615640 636990 612893 535489 500088 482473 543247 531253 513385 532359 523173 516410
9388 516410 529660 493740 443026 470340 464308 466148 473228 433725 471027 502254 530179 526323
9376 526323 475863 520168 523378 491036 515387 554600 508402 505867 507544 432926 442948 528930
9364 528930 569541 595751 532715 491644 450565 457626 510135 535056 499879 477328 441260 441325
9352 441325 448887 452668 486716 445518 426753 387989 305585 324281 363222 293012 251463 329938
9340 329938 337352 287313 294301 341667 315573 275284 300549 286837 239057 244551 284397 322851
9328 322851 303813 264157 319199 367968 369220 315353 281807 263434 243618 370937 358633 378067
9316 378067 389126 349080 368862 330567 330852 350013 382244 432896 349522 301025 363173 328334
9304 328334 352231 390210 391278 322117 305791 368765 337466 304937 366277 373925 429123 388864
9292 388864 330610 349897 398549 417722 377671 420770 432477 365185 318278 360305 384243 476457
9280 476457 478699 421687 417246 416620 413814 424059 450960 494152 570249 546269 534573 527133 523416
9267 523416 576290 644511 639564 574038 558490 600897 553470 476003 488352 480101 532894 561262
9255 561262 568921 508016 490398 599763 565918 474963 498443 508953 516203 531711 552118 515615
9243 515615 534409 622153 611599 632408 618130 573612 608535 635291 632048 619464 654707 681843
9231 681843 628742 618752 628860 671290 679260 691460 747332 780527 724898 764997 775079 722849
9219 722849 697361 781483 819000 729177 784835 821688 817085 834689 883995 931767 961362 956829
9207 956829 964360 990691 987308 1064956 1122312 1213067 1328814 1352926 1303805 1403116 1499628 1467211
9195 1467211 1521582 1636008 1624455 1666717 1646548 1589262 1638441 1628020 1679157 1719482 1791514
9184 1791514 1844559 1871387 1949433 1988043 2061599 2149523 2201470 2335425 2440116 2501298 2639812
9173 2639812 2646441 2698558 2718401 2582039 2536048 2594299 2593536 2573555 2612867 2582790 2522994 2522154
9161 2522154 2505112 2522154 2590585 2658470 2714475 2746012 2818865 2818355 2865876 2911343 3010252 3050090
9149 3050090 3080662 3116192 3052500 3077686 3126556 3183523 3173797 3212977 3212533 3239139 3273120 3327672
9137 3327672 3376109 3429722 3478290 3511357 3552331 3459826 3403470 3253206 3102313 3004367 2884953
9126 2884953 2864273 2752166 2595198 2489380 2493666 2440938 2452775 2416463 2383693 2371029 2306938
9115 2306938 2369369 2358054 2285110 2237776 2267751 2308575 2364428 2375368 2383529 2365014 2440421 2397445
9103 2397445 2387362 2406511 2447317 2524005 2440130 2375928 2417682 2444876 2438806 2428025 2380035 2314587
9091 2314587 2268358 2219909 2171154 2038112 2000463 1933447 1854732 1856815 1887377 1858924 1741421
9080 1741421 1638446 1637301 1586945 1591812 1610984 1548638 1535788 1523631 1435470 1418239 1455407 1425566
9068 1425566 1397404 1324190 1284484 1259540 1264161 1257115 1253283 1231079 1252032 1318423 1293980 1296734
9056 1296734 1248405 1273408 1259605 1203474 1180491 1158225 1178681 1222335 1208387 1211515 1217172 1246964
9044 1246964 1318167 1343761 1305068 1297207 1215120 1254104 1340045 1309141 1274954 1327148 1369162 1324416
9032 1324416 1320990 1249699 1206931 1248696 1283958 1252434 1264493 1187111 1172032 1169654 1224577 1186225
9020 1186225 1190547 1240255 1232158 1208658 1182618 1153034 1124673 1164209 1199904 1161806 1207042 1160685
9008 1160685 1140260 1092280 1104243 1105794 1158006 1097949 1079995 1152379 1190529 1164317 1152259 1133136
8996 1133136 1104282 1202911 1301695 1227951 1172525 1168812 1168021 1195743 1247535 1276672 1227779 1266492
8984 1266492 1301892 1338197 1360750 1323571 1340396 1403887 1478521 1532515 1502818 1538672 1508655
8973 1508655 1568532 1625077 1676285 1725614 1758851 1862218 1876840 1930602 2098280 2121733 2251565
8962 2251565 2241060 2335633 2441635 2513119 2713052 2695519 2714117 2804124 2856712 3026129 3123754
8951 3123754 3229443 3329781 3449674 3632079 3728145 3873219 4013266 4209558 4393149 4675690
8941 4675690 5007106 5321374 5773975 6223945 6745413 7340764 7934039 8629701 9350836 10203634
8931 10203634 11256447 12651277 14405637 16581686 18724415 20579871 21747498 21848280
8923 21848280 20257347 17316214 14593526 12648145 11025816 9475929 8196827 7185745
8915 7185745 6473781 5874611 5338965 4865028 4528001 4322821 4072928 3795712 3631017 3451229
8905 3451229 3315769 3175962 3020354 2873356 2827597 2765996 2691662 2565641 2490597 2376662
8895 2376662 2298775 2245798 2198911 2137487 2058183 2052155 2051501 2025675 2049327 2039168 2012597 1965099
8883 1965099 1902108 1934144 1890103 1808040 1817007 1826089 1877643 1902845 1883775 1854773 1921662 1920482
8871 1920482 1879906 1801419 1755701 1769736 1695427 1715943 1695898 1659432 1675604 1646663 1623833
8860 1623833 1632622 1538519 1524239 1574513 1575291 1588526 1564055 1569349 1592094 1565651 1605499 1597920
8848 1597920 1638545 1654442 1634695 1566884 1583470 1624997 1571192 1640269 1685532 1649898 1705487
8837 1705487 1679403 1601464 1630945 1662922 1594946 1676422 1738166 1738076 1811657 1817583 1881540 1924741
8825 1924741 1912207 1943927 1935764 1959082 2023223 2046447 2055887 2050942 2084478 2051431 2061614 2017056
8813 2017056 2042054 2022678 2049248 2082975 2044718 2113522 2142410 2221318 2194588 2263280 2351057
8802 2351057 2352461 2419173 2489408 2506951 2548980 2658247 2753859 2836529 3005785 3036029 3116166
8791 3116166 3177175 3227290 3298567 3364378 3473322 3515092 3479258 3446410 3380559 3199993 3125224
8780 3125224 3039531 2950631 2893908 2835669 2844302 2757837 2684178 2736157 2720371 2716636 2770840 2761128
8768 2761128 2866431 2896040 2961333 2975627 2986137 3136561 3207944 3252075 3291854 3404131 3468802
8757 3468802 3530550 3526911 3628473 3711622 3775832 3722056 3682954 3596070 3469351 3281977 3199293
8746 3199293 3170366 3036059 2940220 2783293 2701090 2700682 2697446 2651485 2622293 2541956 2537185 2538647
8734 2538647 2561177 2567061 2483508 2453664 2469970 2494017 2489894 2467336 2514221 2499348 2516903 2476178
8722 2476178 2449817 2417299 2452712 2447043 2425079 2540483 2569641 2588947 2580072 2646413 2757142
8711 2757142 2796196 2833952 2854360 2914710 2972326 2950941 2864285 2828839 2805016 2814436 2764280 2679926
8699 2679926 2632227 2651936 2629267 2609233 2604040 2557559 2597461 2579386 2583051 2590770 2524200 2491719
8687 2491719 2458263 2444599 2467960 2467513 2409793 2445670 2453746 2450644 2460464 2416154 2545082 2501309
8675 2501309 2497114 2542835 2470064 2533656 2655273 2689042 2712378 2795627 2876428 2849170 2842552 2831024
8663 2831024 2805550 2789471 2812877 2833187 2867160 2895181 2895671 2928216 2977448 3018414 3038011 2982377
8651 2982377 2984579 3044854 3123709 3118474 3141873 3111514 3127538 3201411 3240305 3238203 3192693 3206769
8639 3206769 3207311 3233667 3324280 3356493 3454236 3449799 3455675 3527039 3586132 3555744 3633472 3799968
8627 3799968 3904971 4011128 4052921 4189028 4350757 4561827 4723695 4765605 4894308 4939125
8617 4939125 5019583 5050073 5200407 5280043 5232206 5281097 5345190 5450364 5545391 5612151 5582942
8606 5582942 5699266 5830485 5964339 6030891 6104100 6285222 6493060 6654373 6873308 7060726
8596 7060726 7300795 7615755 7958597 8291716 8611803 8902072 9276819 9592881 9785070 9993817
8586 9993817 10238259 10396580 10631586 10754855 11033206 11303850 11513114 11934835 12368855 12802384
8576 12802384 13288048 13677692 14148332 14673624 15201443 15754217 16379281 17057604 17894768
8567 17894768 18835055 19911670 21063403 22384198 23978441 25811378 27901949 30060299
8559 30060299 32248356 34340732 36119982 37246532 37664624 37329560 36288538 34666764
8551 34666764 32764409 30758968 28913833 27237333 25726526 24507518 23433910 22527611
8543 22527611 21819618 21322216 20949199 20695230 20594965 20608402 20702988 20838996 21197261 21638964
8533 21638964 22169687 22827998 23616728 24490902 25450233 26592384 27753318 29113159 30514925
8524 30514925 32105825 33935013 35877820 37917039 39810523 41444085 42526459 42836566
8516 42836566 42272484 40745696 38338864 35412857 32276171 29176997 26387543 23980796
8508 23980796 21813124 20046424 18506614 17224178 16108098 15194521 14410159 13669837 12996629
8499 12996629 12387478 11795657 11241249 10702083 10134935 9690558 9190655 8800028 8443591
8490 8443591 8073732 7785449 7489628 7237658 7033115 6790589 6517787 6303629 6199026 6056540
8480 6056540 5783005 5614016 5495695 5418008 5268709 5164308 5108314 4986016 4842804 4789864
8470 4789864 4759347 4688973 4580428 4556886 4538965 4500377 4473057 4360992 4300671 4249756 4172163
8459 4172163 4149494 4124269 4101074 4051241 4059688 4080316 4141391 4129822 4096833 4111061 4031850 3976167
8447 3976167 3966510 4006972 4004783 3984486 3929935 3876622 3905129 3889239 3843057 3900507 3851332 3806605
8435 3806605 3758498 3839005 3872499 3902144 3941104 3924130 3928420 3912250 3961786 3946063 3958331 4016351
8423 4016351 4035663 4093316 4185731 4196038 4267241 4314044 4396001 4391899 4368771 4375926 4480443 4556777
8411 4556777 4562394 4565272 4676971 4729252 4728730 4790971 4831781 4829501 4928157 5058783 5116315 5162828
8399 5162828 5177641 5313107 5455853 5551945 5621492 5755957 5868261 5968870 6146006 6289873
8389 6289873 6324903 6468006 6652014 6839723 7038223 7226815 7349520 7633124 7857474 7958619
8379 7958619 8159519 8402886 8465963 8543416 8656689 8847146 9120065 9382555 9710483 10016196
8369 10016196 10293554 10573245 10912632 11318366 11800036 12249647 12714721 13272122 13759156
8360 13759156 14368880 15023043 15682945 16364182 17069066 17727361 18398345 19099674 19830764
8351 19830764 20412307 20919835 21251829 21527851 21597563 21434202 21344511 21207923 21019866 20755636
8341 20755636 20495380 20398730 20433275 20522961 20727717 20985237 21365035 21795257 22261634 22789324
8331 22789324 23353167 23810312 24389164 25051623 25732000 26538384 27357318 28324205 29345560
8322 29345560 30556663 31952369 33438910 35206774 37170669 39482735 42146561 45166349
8314 45166349 48546584 52100217 55590748 58755838 61466107 63694198 65470479 67002540
8306 67002540 68807321 71383934 74801795 79076228 83834310 88892371 93513109 97150475
8298 97150475 98997731 98802862 96901820 93325758 88247004 82244551 76014445 69979122
8290 69979122 64554624 59982739 56109060 52909743 50296288 48039554 46027119 44267396
8282 44267396 42726246 41258870 39666922 38058542 36527687 35173929 33886314 32714550
8274 32714550 31809882 30993337 30410031 29871269 29541469 29318644 29166988 29275470 29500430
8265 29500430 29769908 30215417 30865864 31630901 32551805 33621550 34547396 35319289 35820786
8256 35820786 35968517 35514163 34522456 33266461 31879303 30505697 29311457 28428996 27710568
8247 27710568 27169623 26700887 26247777 25707571 25139441 24287245 23169812 21894353 20551786
8238 20551786 19332311 18268941 17217007 16189155 15340980 14542609 13925490 13357372 12890330
8229 12890330 12409812 11946280 11626214 11332207 11047563 10829167 10639614 10485527 10322701
8220 10322701 10162020 9996644 9783809 9549002 9308465 9035447 8727106 8463501 8252127
8211 8252127 7995172 7772328 7634330 7487994 7312756 7270618 7103402 6968006 6905983 6963017
8201 6963017 6915723 6865850 6831796 6845929 6818578 6839468 6791090 6878567 6771073 5746078 6046663
8190 6046663 6377023 6403450 6442765 6400122 6355077 6330509 6410680 6421793 6441430 6352961 6291384
8179 6291384 6263209 6226673 6088970 5983052 5902269 5819307 5775714 5766561 5795187 5849297 5789385
8168 5789385 5807199 5796459 5823298 5859007 5982442 6092335 6260502 6373203 6552673 6719307
8158 6719307 6734418 6809650 6904916 6958675 7001059 6948851 6824710 6651047 6569835 6388080 6262030
8147 6262030 6125111 5961266 5736484 5531487 5383314 5182648 4974731 4821866 4735492 4699658
8137 4699658 4596252 4510577 4440246 4383420 4419444 4353253 4255151 4237127 4271755 4212823 4132940
8126 4132940 4092890 4061839 3995881 4054794 4147312 4173786 4111041 4140501 4152373 4068378 3977550
8115 3977550 3972082 3916383 3938416 3931807 3908616 3904854 3909582 3911558 3906580 3943361 3912863 3993674 3962003
8102 3962003 3954509 3946361 3900434 3918465 4001984 3994660 4017376 4032567 4050646 4147708 4203415 4256963
8090 4256963 4276362 4291335 4267846 4189999 4066443 3994780 3931547 3823475 3656292 3565590 3516722
8079 3516722 3430667 3298194 3184506 3096243 3009039 2980679 2850144 2805653 2825066 2755001 2697376
8068 2697376 2665484 2652214 2688238 2673620 2635168 2691343 2638581 2643766 2674184 2685089 2741382 2827841
8056 2827841 2904052 2922697 2987348 3033131 2991672 2937961 2932525 2925764 2839220 2754895 2759398 2722940
8044 2722940 2692528 2637183 2646888 2688350 2613532 2634107 2611624 2500252 2381404 2252132 2230182
8033 2230182 2206025 2149966 2127267 2095031 2041667 2072365 2010191 1898975 1920779 1929597 1896243
8022 1896243 1885112 1797935 1709225 1714902 1682954 1655973 1582973 1557278 1599630 1555450 1497988 1423885
8010 1423885 1422784 1510048 1539788 1553223 1534039 1399705 1338515 1324785 1352842 1380950 1366321
7999 1366321 1380989 1417095 1432340 1380208 1405701 1391521 1387791 1411750 1376563 1316549 1331382 1294412
7987 1294412 1360147 1324463 1338486 1360456 1386588 1327758 1298498 1278146 1263484 1190679 1231785
7976 1231785 1313499 1318551 1239524 1208748 1219011 1260523 1282924 1209907 1232497 1171972 1148885 1189583
7964 1189583 1175081 1125010 1141208 1199450 1235764 1244371 1188887 1168504 1272223 1226431 1244396
7953 1244396 1230804 1231904 1321913 1417237 1371742 1433102 1445518 1374872 1350456 1346579 1398287 1430465
7941 1430465 1397670 1362570 1293987 1375564 1319078 1344982 1376076 1310349 1337942 1270699 1228761
7930 1228761 1255566 1248562 1210274 1209027 1235417 1201676 1120992 1158070 1171289 1181844 1184888 1208827
7918 1208827 1191013 1089339 1084623 1151570 1168858 1071401 978307 1018849 1107022 1070174 1041646
7907 1041646 968713 977137 1011484 937101 913095 999007 1008794 996397 951180 972535 957514 988119
7895 988119 910292 825666 856757 842104 852191 838263 874389 860112 837479 840355 851796 852456
7883 852456 803356 797956 784771 847928 823521 745774 734977 778950 806963 783896 775283 731729
7871 731729 738574 780857 823418 822458 800737 800552 733433 748748 763449 743000 763418 778038 740240
7858 740240 751181 725796 689524 757854 728521 669174 677013 792670 782356 776993 766511 756234
7846 756234 687846 710338 683159 702468 710870 746148 689828 650071 596682 705310 716604 647371
7834 647371 667925 698726 744204 683727 669619 658329 595400 565368 608179 630857 618935 664937
7822 664937 618790 599146 576130 528449 522427 531978 479306 482836 488861 501383 564478 537168
7810 537168 503532 468836 464389 461512 428370 516171 477334 405102 409165 763524 818811 641325
7798 641325 641109 578497 566194 478625 464734 528655 503288 495491 599029 523887 471831 421494
7786 421494 431576 489958 510970 507886 556124 472830 427055 483113 533764 582486 564272 542980
7774 542980 590716 592880 508962 515211 541995 550962 549852 468757 463644 453816 466747 438225 417284
7761 417284 512791 573824 498050 449751 507246 644176 632691 593745 498674 501125 543165 582302
7749 582302 572464 563119 622991 578403 668883 638617 633946 642393 588441 523285 492257 624797
7737 624797 599086 487372 480899 602726 547121 503143 601227 646950 568930 576820 583010 610770
7725 610770 557722 617473 596138 547603 568564 554826 562610 572521 531566 532367 521064 550407
7713 550407 554736 526633 532344 562182 629887 532070 501702 584571 635488 620647 592670 605225
7701 605225 611272 591108 585345 613803 601987 622667 623848 587022 594242 549478 550807 511793 426229
7688 426229 419991 421077 432369 515198 565713 536492 473047 535044 525145 542759 577085 582344
7676 582344 613076 588252 625317 578438 557317 673913 643470 632284 646088 608269 509403
7665 509403 393600 364136 397483 396984 434899 392680 393327 317765 314172 402309 452865 403382
7653 403382 418562 433302 447962 487981 510551 466287 517312 524023 511664 472628 475388 486955
7641 486955 491757 477866 490446 456904 436090 323111 332139 411059 372327 377719 357678 389762
7629 389762 436358 402744 385147 433478 444595 461707 529140 484485 481073 490110 370310 398434
7617 398434 362027 330591 363730 336343 290581 255290 258547 277812 271481 302017 251853 300299
7605 300299 268836 238695 242748 239874 284829 320948 294115 254160 272656 291337 347061 306662
7593 306662 248602 212253 137634 144037 131189 221431 224448 185968 209256 274886 177189 204278
7581 204278 232742 238639 241323 187123 228445 193545 177930 182314 160784 165379 146827 156372 208497
7568 208497 142888 57634 90115 140947 145843 149347 161850 170788 132665 152370 110884 124710
7556 124710 104228 100504 123482 145939 180571 132728 143429 67154 96114 207313 211680 147844
7544 147844 154583 192441 197959 184023 216446 163099 141194 118879 128228 148113 235487 250496
7532 250496 226305 222667 198181 246002 300161 342056 349076 325171 382850 399288 395100 360929
7520 360929 278483 310571 264781 207117 186202 222212 199372 179095 229487 185554 137303 169909
7508 169909 133248 116792 85028 70953 49280 103693 183927 197951 157151 76881 123904 107809
7496 107809 35222 112500 145128 69275 67058 15314 50761 140730 151300 154221 102040 42710
7484 42710 77529 95036 62727 30842 30855 53601 62713 103521 50742 64505 145655 105616 91363
7471 91363 112773 11656 73154 118389 77491 96017 135416 39341 62066 52962 80452 109953
7459 109953 101902 42065 31298 88498 140729 73357 75603 119934 176947 233984 215007 269707
7447 269707 226966 240863 161743 104039 92249 109980 63279 7316 -4776 45986 72923 116669
7435 116669 103594 70132 86117 67461 64613 119105 160752 153716 130311 84462 131402 20367
7423 20367 -41230 94891 147791 147811 158758 147901 154426 117855 48528 72198 102218 60240
7411 60240 12637 9395 114280 148715 69524 22360 23542 57641 47970 64683 93437 61114
7399 61114 54885 16438 3098 -17007 44332 74834 89201 106467 100413 97138 90837 129073 155173
7386 155173 55598 50728 106014 105623 77660 92568 58991 -38587 -38697 3056 91754 31830 29359
7373 29359 97508 154292 33687 44533 67880 101855 47268 47928 7639 27035 52663 26180
7361 26180 33307 5841 118948 107058 77465 74254 35090 51497 53646 162228 157397 55001
7349 55001 47074 37752 30907 24684 56787 69178 42012 122238 153557 181920 151642 133310 119767
7336 119767 132095 150860 113950 141973 123250 112534 63776 24383 51348 45487 71496 82999
7324 82999 78272 54127 39573 165118 196026 115840 110914 73812 77369 106943 107763 114515 124953
7311 124953 170429 137782 120698 124189 197151 245753 240331 250786 250475 226854 186788 210825
7299 210825 289068 218177 175326 137850 219915 216378 174922 137116 160434 165351 187586 182078
7287 182078 160645 200890 214520 187730 150986 97989 204746 172016 170060 217478 165405 193882
7275 193882 200958 194163 158388 247939 234833 170495 188767 204457 119599 110263 112973 95316
7263 95316 185561 202423 221255 241009 207499 227625 273793 336612 308043 311076 334145 359775
7251 359775 389976 411488 373703 332592 290336 308196 343636 399775 319012 313178 285242 233678
7239 233678 331440 234955 261465 319577 339687 299676 316536 336424 329794 372088 359079 400595
7227 400595 411789 389017 438026 463251 483195 426325 458276 447423 470354 464975 476061 518818
7215 518818 510863 558652 494235 531940 516059 435676 429026 497311 550094 578738 640972 646681
7203 646681 654681 742321 676927 663353 683967 755921 793429 800628 772416 775279 754804 692957
7191 692957 763990 775187 833457 875246 819877 855738 908102 963449 995380 959429 980100 1060961
7179 1060961 1075533 1127013 1204188 1249298 1344850 1384195 1446545 1541794 1585207 1691076 1770470
7168 1770470 1808314 1909137 1922467 2082199 2258835 2409150 2547057 2649114 2779935 2918783
7158 2918783 3117888 3249555 3337803 3404903 3441935 3522948 3642200 3583212 3652416 3749929 3832726
7147 3832726 4018738 4196235 4359003 4601953 4697794 4939703 5303359 5649040 6088802 6576203
7137 6576203 7191331 7914583 8507846 9275370 10180629 11059256 12126103 13317143 14884863
7128 14884863 17140306 19892529 22978384 25938272 28136156 29260554 28387930 24919319
7120 24919319 20469351 17198153 14739047 12532470 10583992 9075364 7849486 6855822
7112 6855822 6088150 5455729 4923060 4526780 4238527 3979818 3741939 3521413 3403966 3190048
7102 3190048 2946944 2804793 2638297 2557508 2526765 2516438 2398683 2335678 2216013 2137192
7092 2137192 2103606 2018272 1959450 2025793 1960872 1933498 1924056 1889730 1996876 1941036 1841849
7081 1841849 1789540 1786312 1798563 1791044 1783663 1795489 1790516 1728252 1686350 1664568 1699994 1688585
7069 1688585 1681977 1717565 1705977 1664853 1683532 1736395 1733540 1670138 1598755 1584812 1560299 1530556
7057 1530556 1552306 1558985 1482565 1493142 1374949 1298983 1311071 1303217 1212800 1089290 1030724
7046 1030724 988534 916542 900794 896137 897672 888082 812528 751980 764370 764421 765429 755804 727759
7033 727759 703336 683129 692317 725633 751967 736287 742212 780915 823096 777113 789431 849248
7021 849248 908742 930255 978259 1072406 1099519 1089365 1065931 1059350 1068255 1002207 957434 1043581
7009 1043581 999989 980927 940049 898866 910393 847249 800201 827456 786356 703868 641577
6998 641577 714017 677655 604876 596830 555118 523431 503417 452128 427559 399467 403755 412051
6986 412051 385354 349423 292896 310786 320369 316829 400964 326746 273862 288150 273567 324019
6974 324019 298142 275608 315179 317675 269156 255631 313439 293128 237688 284194 246615 215234
6962 215234 221039 286069 281593 228300 237546 302953 320452 267246 319181 288342 267052 351724
6950 351724 357159 348256 324791 358872 331208 364233 365494 329473 333343 286036 301226 342321
6938 342321 326191 332655 336858 312707 296742 306416 336073 259746 209671 240779 241061 225729 237715
6925 237715 267627 240662 356419 347027 366214 331305 283460 329777 352491 334965 334269 348889
6913 348889 328071 319760 329885 375087 389477 360726 372565 392275 419618 449323 426452 380221
6901 380221 391637 379705 355258 326450 309027 348012 371787 354910 374271 403936 326280 355778
6889 355778 351513 382099 368625 362320 301900 280557 327944 325810 356622 342561 272547 234442
6877 234442 303066 305169 360344 357244 340211 377272 383664 400106 410650 387108 342708 363186
6865 363186 363190 336045 255307 321357 376608 398149 393724 365736 318095 393442 432402 346333 371513
6852 371513 451688 462250 411192 366423 379515 436477 449968 478148 482560 439806 430925 436899
6840 436899 460321 477705 507062 531813 504595 414122 371326 433109 428336 440006 402805 398171
6828 398171 372666 315322 297916 354712 308219 206305 261048 294248 315536 353101 318803
6817 318803 285878 344555 360909 318806 288786 318840 298809 266289 236689 277228 298785 274507
6805 274507 309670 313311 255104 214949 262616 206179 262717 268776 264412 283950 244800 312571
6793 312571 298977 284581 218477 186816 168575 117197 124473 151990 97746 174908 169921 170989
6781 170989 159538 164523 252482 206065 187405 188177 212655 191941 119655 114599 183865 168766
6769 168766 114336 143442 93090 94122 142951 145662 200198 164402 168598 220534 204849 160773
6757 160773 117345 100516 50717 80905 184730 120601 130891 225741 138977 134144 126578 167799
6745 167799 171451 144180 236271 225978 189411 207240 180990 186365 193344 177702 212598 210342
6733 210342 218822 202115 264666 182285 246511 303554 267817 233834 252843 240859 294716 282612
6721 282612 271055 315659 313583 325738 329680 293383 290225 287092 254823 221337 214023 217904 253111
6708 253111 229408 152271 124999 137068 189511 174375 149465 111129 205728 173904 146918 138783
6696 138783 150075 192400 151786 157276 157834 136872 199261 240767 216530 175271 155043 137164
6684 137164 152196 188150 206607 280591 284945 242029 256557 236414 232314 229787 237369 230787 220851
6671 220851 244955 216976 195584 234197 308190 272543 245122 269826 258948 284529 295282 289583
6659 289583 252456 228118 182850 210076 223811 267115 233668 226674 254613 209686 247065 230118
6647 230118 225541 246244 255994 280141 249220 276203 250923 287746 297827 356911 330727 305268
6635 305268 261512 267284 312211 328717 387789 366981 424499 444070 361358 343747 383838 370369
6623 370369 378778 365238 391423 404651 432443 390577 330468 308058 328655 396945 421912 357820
6611 357820 357682 322864 324324 345241 359302 390185 351077 314994 263551 206836 250372 329813
6599 329813 375478 342961 315665 373567 253492 265130 343885 342983 407282 289061 294412 331382
6587 331382 291344 331607 309443 295144 350712 357164 347811 304069 291231 278305 313582 337025
6575 337025 326457 306247 304715 275232 306818 281015 255979 273419 336458 390645 409350 354193
6563 354193 294649 276306 278619 246091 254395 303356 346606 361302 328445 364504 362139 385867
6551 385867 396587 391308 322869 345594 350289 365244 355701 365527 298390 376077 431256 415359
6539 415359 430289 447635 411673 329887 345706 400380 384475 421369 486723 481761 511367 557650
6527 557650 539748 512937 542490 516548 514438 519290 508664 488621 485466 466031 426355 450692
6515 450692 456350 407455 429174 414909 480156 501407 444620 446144 475832 465142 431171 423513
6503 423513 489291 512715 420469 369420 365565 461573 430827 444198 443649 477925 461047 481758
6491 481758 455694 339207 317376 397946 388411 396850 427178 443978 488490 424413 419916 347235
6479 347235 372222 414207 440744 480306 402710 376320 354154 403960 485780 412335 344478 365101
6467 365101 395158 458728 485596 442425 490756 443960 476038 475039 499189 538003 532116 516493
6455 516493 562430 515258 488972 536870 606221 616901 581239 570069 586785 614105 647804 666761
6443 666761 711231 802529 742528 698483 697932 663552 680512 665845 702465 689005 699208 705731
6431 705731 687179 793602 772243 769783 800367 828998 810024 770958 719060 683656 721272 654207
6419 654207 638502 687903 693934 731128 769352 761618 800285 784895 703467 798461 841665 863942
6407 863942 904410 879898 892027 930688 941848 976194 947084 919751 927282 811398 786788 754732
6395 754732 738177 766483 792377 803183 850573 860607 840522 857897 883301 958212 988190 958668
6383 958668 980080 983584 934383 958165 905304 828617 845339 852044 893141 963929 931812 890498
6371 890498 875424 940728 907820 895804 840639 810026 799690 855873 780943 734175 690206 667631
6359 667631 671898 695796 747474 704019 663414 768945 760945 738341 717911 705360 776653 802217
6347 802217 768196 689089 717906 651146 651265 669603 690482 694516 683802 751103 811364 785105
6335 785105 752451 724191 777552 724528 735313 786676 798407 807745 784572 801214 803445 853615
6323 853615 871267 825869 760588 775297 830241 812214 836926 772233 762416 805404 788616 747440
6311 747440 743974 734623 782848 786335 856066 883083 859070 876321 863747 842823 880740 913501
6299 913501 907957 902483 870258 880130 852674 815512 941627 919750 877102 924761 931700 930272
6287 930272 920673 910166 865693 941728 968689 992748 993840 1056395 1088508 994410 930801 1015005
6275 1015005 972542 1011641 1078274 1044382 1046247 1106460 1091077 1118316 1144255 1091763 1079457 1152970
6263 1152970 1126226 1088243 1084652 1112517 1128297 1056994 1179356 1247443 1233719 1205782 1292322
6252 1292322 1294462 1253106 1340477 1319627 1362672 1425883 1429314 1432710 1482510 1485193 1405372 1354589
6240 1354589 1403506 1426375 1430478 1539826 1568782 1634225 1647121 1632924 1671511 1747095 1751099 1759577
6228 1759577 1807650 1827341 1824870 1896615 1953247 1992431 2025351 2009067 1951817 1961610 2004006 2053831
6216 2053831 2074135 2031363 1948347 1927569 1915433 1919624 1923122 1939853 1987558 1920588 1894848 1888465
6204 1888465 1936272 1897528 1913661 1947909 1929647 1974998 2026642 2054743 2082207 2147592 2100132
6193 2100132 2133847 2194180 2209147 2209469 2234141 2268041 2230382 2274694 2396515 2411289 2407149 2480481
6181 2480481 2536382 2607007 2647465 2620004 2688133 2743229 2849772 2915435 2896078 2965142 2958785
6170 2958785 2907754 2964306 2990846 3048202 3061632 3125611 3166174 3158898 3103147 3077132 3054643 3069205
6158 3069205 3172446 3056924 3058188 2999165 2981767 3018834 2990666 2904653 2932239 2948840 2995353
6147 2995353 2941262 2904978 2911975 2941153 2970390 3031405 2998385 2894569 2873266 2914475 2939694
6136 2939694 3001089 2973002 3009506 2964849 2934257 2959018 2946078 3019989 3008706 3012160 2993078 3018966
6124 3018966 3056792 3087846 3126704 3124394 3086237 3019861 3055883 3161023 3232189 3223849 3165614 3164602
6112 3164602 3230001 3276231 3359839 3452212 3461831 3622550 3655300 3781666 3886100 3907659 3920487
6101 3920487 3969779 4112479 4136694 4164027 4157853 4141706 4194669 4221039 4327252 4376440 4385480
6090 4385480 4405908 4380559 4311287 4299778 4327761 4266747 4212255 4171979 4170018 4277961 4249716
6079 4249716 4267482 4291798 4312580 4273655 4322631 4437614 4558303 4610101 4651099 4756735 4788288
6068 4788288 4840905 4985126 4997622 5003349 5076530 5187309 5280972 5368129 5433394 5429745 5449732
6057 5449732 5587572 5740224 5705628 5882106 5988672 6157872 6275951 6374100 6477426 6621025
6047 6621025 6815328 7049838 7329155 7516327 7725853 7996013 8261523 8445695 8678002 8905853
6037 8905853 9193595 9377444 9516533 9663515 9796368 9863585 9847771 9821819 9889633 9882481 9850886
6026 9850886 9810353 9787365 9805561 9847733 9866152 9846845 9813502 9672073 9588028 9501117 9352162
6015 9352162 9158881 8979755 8818392 8635145 8488722 8373328 8316032 8257663 8194785 8225975
6005 8225975 8212073 8260167 8283736 8361049 8420113 8491154 8488257 8545504 8628517 8805618 8920121
5994 8920121 9002114 9069166 9076923 9188979 9290512 9335359 9398214 9486545 9569299 9689464 9760151
5983 9760151 9873529 9988225 10099758 10197046 10496320 10865428 11116184 11399198 11663222 11974924
5973 11974924 12237944 12597604 12983330 13324063 13660231 13950075 14276994 14518004 14667592
5964 14667592 14795483 14844110 14816573 14777141 14724740 14640009 14538876 14455291 14313098 14246456 14159991
5953 14159991 14019105 13933916 13794723 13605666 13368752 13021849 12670790 12268546 11903976 11615617
5943 11615617 11331868 10999355 10597979 10298673 10088463 9859355 9664691 9525116 9421384
5934 9421384 9393306 9443798 9363248 9290053 9142336 9024977 8975301 8991713 8996992 8897321 8843542
5923 8843542 8613424 8372872 8220721 8108599 7988395 7806833 7659073 7438656 7183101 7003145
5913 7003145 6937325 6839293 6819403 6879704 6989849 7159883 7240354 7232911 7198744 7148225 7225677
5902 7225677 7323976 7420682 7381105 7250923 7192585 7010885 6755806 6592063 6469904 6260950
5892 6260950 6060537 5871145 5634675 5366419 5184762 5054484 4849782 4634686 4530925 4487916
5882 4487916 4454457 4465783 4391652 4248997 4336440 4339306 4320464 4330689 4308155 4260470 4250158
5871 4250158 4264300 4334223 4391095 4407142 4461245 4530562 4610658 4665652 4767207 4829390 4896551
5860 4896551 5024059 5166766 5337472 5472282 5538147 5575255 5525278 5388329 5403005 5381386
5850 5381386 5458283 5556752 5670641 5806641 5900505 6025164 6098847 6179877 6145653 6129131 6224332
5839 6224332 6242180 6282276 6332343 6402069 6547269 6670902 6746222 6837703 7054870 7209374 7289553
5828 7289553 7487338 7695302 7869306 8070397 8250459 8462450 8759804 9001881 9240381 9551299
5818 9551299 9997283 10396692 10757317 11212617 11679460 12213406 12721062 13262261 13796007 14373546
5808 14373546 14837216 15275669 15707476 16164429 16433030 16695212 16970851 17226262 17480566
5799 17480566 17749757 17938061 18098099 18278352 18350234 18396434 18415195 18275785 18127129 17938148
5789 17938148 17667896 17463190 17339012 17232194 17128676 17048745 17015040 17060097 17000841 16985333
5779 16985333 16914971 16841230 16766336 16511204 16214750 15833744 15475866 15168305 14815729 14545046
5769 14545046 14198105 13821012 13489901 13273493 13081418 12879750 12747625 12744771 12773329 12836052
5759 12836052 12945175 12973128 12901865 12797083 12616940 12397964 12206673 11984329 11917777 11924248
5749 11924248 11874451 12042743 12211416 12456700 12654711 12707461 12682357 12612928 12473965 12320058
5739 12320058 12245081 12131556 12202187 12266619 12245619 12286655 12404781 12519074 12695799 12863581
5729 12863581 12962849 12955508 12975128 12972979 12938730 12897404 12797126 12815068 12851260 12884614 12864496
5718 12864496 12889912 12960749 12994729 13021355 13066123 13155026 13194962 13276489 13339102 13363899 13351650
5707 13351650 13332350 13249310 13127759 12944820 12724716 12380821 11853089 11498241 11178490 10892967
5697 10892967 10712109 10462238 10395827 10379016 10226109 10002068 9803107 9569502 9257346 8874700
5687 8874700 8505303 8250298 7982774 7804506 7682409 7529798 7404423 7323284 7271284 7222337
5677 7222337 7138306 7072789 6968559 6898092 6752059 6651161 6558774 6486084 6442073 6384247 6324711
5666 6324711 6256594 6140477 6104122 6121691 6117821 6104227 6130855 6170042 6161848 6201093 6263196 6232827
5654 6232827 6227766 6258519 6192557 6221027 6261137 6306763 6298641 6271857 6309953 6313302 6263228 6144879
5642 6144879 6101544 6064338 5989169 5910021 5853880 5809894 5727008 5636439 5544221 5502870 5371017
5631 5371017 5387043 5418384 5395410 5370275 5314149 5274104 5194164 5170340 5232038 5245559 5192944
5620 5192944 5138475 5087795 5125327 5058577 5061546 5035220 4998206 4980180 5042191 5050445 5011323 5074502
5608 5074502 5015974 4991329 4988588 4960778 4892007 4831459 4784157 4810801 4793038 4757244 4718283 4777514
5596 4777514 4811847 4778116 4807816 4786770 4801141 4823188 4867351 4861094 4942799 5117136 5216721
5585 5216721 5329818 5341272 5372378 5537172 5751240 6053213 6366657 6635122 6900542 7146159
5575 7146159 7280974 7228378 7058699 6901823 6767090 6716621 6730441 6782824 6869029 6990933
5565 6990933 7259426 7521523 7741544 7805894 7841117 7797727 7764835 7592454 7565863 7659168 7754356
5554 7754356 7865287 8000468 7943960 7726263 7395261 7029567 6763982 6606568 6462380 6312331
5544 6312331 6242628 6162825 6160398 6214250 6372046 6550995 6715722 6801148 6745605 6573501 6418574
5533 6418574 6188362 5996116 5692968 5430292 5222984 5066417 4854369 4682439 4681443 4665848
5523 4665848 4636360 4581884 4471361 4374816 4388586 4439589 4349559 4340862 4346499 4258048 4269642 4231308
5511 4231308 4186319 4254141 4210369 4261598 4321337 4384576 4365313 4306291 4293116 4288398 4326322 4361236
5499 4361236 4429425 4435804 4447589 4448263 4595547 4712906 4757654 4848408 4894313 4868125 4766897
5488 4766897 4670565 4602795 4604540 4542130 4458341 4365059 4342729 4251817 4190438 4123450 4173882 4208043
5476 4208043 4117241 4141196 4218084 4222212 4232959 4358287 4386936 4475093 4591032 4676256 4729017
5465 4729017 4849506 4908044 4886142 4745872 4565849 4453911 4332152 4283238 4259648 4166557
5455 4166557 4100854 4174003 4213680 4212075 4333000 4431337 4423040 4411869 4549227 4679441 4731991
5444 4731991 4898119 5055964 5209322 5308349 5446209 5526851 5613935 5712218 5765750 5837921 5814004
5433 5814004 5916873 6113598 6271462 6527356 6680740 6692862 6736235 6699040 6656281 6587178
5423 6587178 6508990 6411962 6418568 6501882 6513818 6584444 6675122 6885086 7119454 7325569 7597189
5412 7597189 7798199 7967684 8017532 8120754 8290116 8442644 8584429 8782030 9025696 9389546
5402 9389546 9736644 10041053 10289078 10501925 10539956 10623587 10797506 10924439 11165736 11480930
5392 11480930 11861816 12256910 12576753 12832093 12941456 12843172 12680919 12563753 12347489 12159352
5382 12159352 12021297 11751007 11511148 11401867 11382260 11298739 11214127 11141445 11011742 10875980
5372 10875980 10813970 10770338 10765460 10825627 10944857 10953867 11061262 11215105 11295961 11369855 11369016
5361 11369016 11210603 10958938 10733043 10473378 10224355 10001223 9854403 9748733 9651221 9704414
5351 9704414 9661557 9680303 9709305 9630336 9589265 9440415 9353746 9221361 9185742 9215158 9257290
5340 9257290 9368722 9552169 9669434 9803078 9908841 9988236 10106997 10184426 10358284 10535253
5330 10535253 10690241 10901940 11064171 11231517 11521769 11803679 12095445 12404834 12797999
5321 12797999 13263934 13732312 14288182 14885741 15560741 16283731 17064591 17960787 18913215
5312 18913215 19891358 21042783 22229014 23243057 24270249 25282973 26391293 27613948
5304 27613948 29002295 30490901 32141915 33858543 35482233 36913535 38158863 39297949
5296 39297949 40376873 41125747 41549977 41668087 41671887 41885632 42319973 43011536 43774264 44732467
5286 44732467 45877904 47168556 48775169 50640992 52913402 55605117 58678399 62164300
5278 62164300 65903425 69833910 73730561 77303585 80225466 81928444 82590740 82940137
5270 82940137 82972100 82017942 80099253 77755468 75614864 74068138 73624137 74075888 75385363
5261 75385363 77347323 79726400 82317833 84957329 87237093 89159654 91023498 92409485
5253 92409485 93149533 93811187 95220135 97746080 101610539 106056486 110079362 112912924
5245 112912924 113509269 111343002 107978402 105400841 103648637 101467208 97908229 92490056
5237 92490056 85543343 78209127 72032220 67488469 64247371 61980312 60563529 59559060
5229 59559060 58707102 57576609 55992987 54071004 52283703 51122290 50647522 50358707 50137503
5220 50137503 49722986 48810306 47443474 46024148 44968600 44114297 43218055 41799366 39916339
5211 39916339 37874020 35994146 34518408 33413971 32697092 32420601 32250525 31971182 31600424
5202 31600424 30862585 29499240 27642247 25955104 24588338 23485961 22551770 21730549 20983532
5193 20983532 20376903 19837266 19352677 18920725 18515691 18091018 17739461 17381447 17178110
5184 17178110 17104134 16960912 16801344 16654147 16475302 16354466 16342720 16276779 16243670 16153489
5174 16153489 16043666 15988952 15990443 15913841 15839817 15749310 15712922 15730221 15763213 15814558 15862112
5163 15862112 15873300 15953055 15922415 15932462 16089108 16195433 16433129 16713268 16986685 17467792
5153 17467792 17963652 18594031 19290077 20020513 20876208 21863153 22986781 24228733 25848263
5144 25848263 27758636 29858377 32254155 34955146 37939999 40709469 42791453 43902685
5136 43902685 43954060 42703935 39993898 36445344 33006700 30085393 27747234 25670170
5128 25670170 23994871 22664634 21705722 20987493 20539251 20283082 20275785 20323346 20492033 20741737
5118 20741737 20959438 21315064 21834001 22398245 23011054 23852441 24842029 26089361 27493428
5109 27493428 29012176 30467870 31859862 33017224 34009415 35328000 37237436 39922983
5101 39922983 43260424 47065206 51017820 54258894 56312617 56510669 54421762 50811975
5093 50811975 47550012 45351508 43832936 42800210 42149309 41917391 42331939 43506960 45373758
5084 45373758 47552244 49584405 50818421 50484375 47879868 43606986 39402770 36105273
5076 36105273 33354932 30954855 28986979 27377853 26036473 24918017 23838395 22790088
5068 22790088 21895089 21292095 20820784 20501493 20293827 20158718 20088612 20055409 20118206 20312629
5058 20312629 20478202 20769844 21121579 21471832 21953046 22448792 23080239 23847582 24655845
5049 24655845 25629502 26879330 28268791 29922058 31674989 33339573 34952955 36234740
5041 36234740 36950475 37120081 37279660 37592591 38095087 38913059 40425102 42416245 44745171
5032 44745171 47386013 49961128 52371732 54221274 55136363 55399497 55868963 56365428 56469481
5023 56469481 55788863 54652771 53778824 53685900 54449346 55978550 58034825 60473980 63263090
5014 63263090 66203691 69158262 71895097 74632492 77288793 79584368 81073270 80906619
5006 80906619 78928580 76718487 75434121 74490519 73360132 71739849 70043464 68623457
4998 68623457 67592748 67204154 67631429 68499210 69584792 70538200 71179145 71834144 72568882
4989 72568882 72886435 72736581 72568036 72004925 70617125 68880440 67673958 66947440 66411430
4980 66411430 66044975 65999438 66544585 67529005 68942966 70673131 72494789 74374106 76310264
4971 76310264 78406502 80719119 83086289 85153603 86434191 86495735 85069709 82430026
4963 82430026 79087515 75719720 72880905 70589225 68882623 67660510 66908913 66539774
4955 66539774 66617236 67083955 67995304 69394627 71170546 73214419 75403322 77741195 79892202
4946 79892202 81748397 83483810 85061687 86152666 86785111 87215353 87433970 87537599 87804011
4937 87804011 88500802 89633556 91010952 92615712 94536256 96734473 99129129 101867611
4929 101867611 105035858 108370732 111712423 115087723 118383049 121569144 125079997 129198178
4921 129198178 134107418 139728899 145958274 152896992 160393849 168424920 177124336 186526604
4913 186526604 196826140 207906593 219877805 232763930 246318396 260575417 276046932
4906 276046932 293081095 311714443 331437836 350858599 368241301 381455837 388394358
4899 388394358 387517913 378359372 361815107 340031131 315771744 291244345 267670636
4892 267670636 245872766 226121739 208383308 192659653 178686441 166297484 155293110
4885 155293110 145608750 137144823 129673838 123006328 116787394 110999674 105348044 100007504
4877 100007504 94841640 90056338 85653008 81500911 77699670 74307257 71187788 68374557
4869 68374557 65867662 63584451 61591754 59692265 58020974 56569528 55260673 54039992
4861 54039992 52901147 51703513 50460576 49182864 47989709 46739695 45506336 44257784
4853 44257784 43071072 41915064 40871758 39835702 38901828 38117628 37562300 37074927 36616542
4844 36616542 36256695 36015728 35934755 35795812 35692319 35533273 35359766 35143579 34853558 34502941
4834 34502941 34169312 33848857 33525761 33179276 32976128 32825542 32797129 32803827 32948580 33127958
4824 33127958 33282386 33535916 33785902 34191004 34650136 35297482 36152405 37094639 37993977
4815 37993977 38732023 39175833 39114784 38418148 37457692 36600294 36036619 35718699 35632245 35845727
4805 35845727 36282948 36897961 37475498 37779999 37696515 37306478 36623925 36019584 35814456 35911007
4795 35911007 36074359 36221449 36228982 35808237 34849498 33370540 31819350 30356083 29081221
4786 29081221 27990494 27257501 26737524 26373147 26181269 26054647 25722750 25065752 24224607
4777 24224607 23081163 21869974 20794284 19956681 19162628 18502058 18026037 17656130 17361946
4768 17361946 17117022 16886329 16593469 16223190 15989090 15747489 15564955 15477718 15503108 15537284
4758 15537284 15480632 15489466 15442014 15340643 15194056 14973862 14825191 14712651 14772239 14842838
4748 14842838 14897428 15063071 15165490 15163329 15156230 15110425 15160744 15251379 15421942 15701802 16008216
4737 16008216 16357872 16620842 16809304 17029652 17193238 17289310 17452551 17656421 17942001 18337590
4727 18337590 18756888 19248004 19660109 19994025 20468521 20973892 21588849 22212794 22927360
4718 22927360 23838243 24921345 26102838 27452027 29013228 30726497 32624809 34622046
4710 34622046 36807304 39436316 42507577 46137996 50508765 55123278 59563203 63284284
4702 63284284 65497280 65626806 64064338 61954174 60787491 61082915 62262696 64098390
4694 64098390 65872750 67135079 67107555 65125077 61272693 57443261 54980114 53610045
4686 53610045 53102200 53404731 54450773 56029259 57714332 59075095 59594647 58726042 56837864
4677 56837864 54935884 53460077 52610648 52441610 52543487 52481039 51618348 49305002 45306371
4668 45306371 40352914 35716231 32052939 28916012 26189351 23865110 21826234 20037904
4660 20037904 18597011 17290134 16147676 15160085 14349831 13643735 12938313 12360529 11904037
4651 11904037 11490941 10973749 10496896 10109712 9797202 9484758 9211985 9007085 8745909
4642 8745909 8504092 8393900 8136970 7914373 7703618 7501999 7342657 7233296 7119247 7040481
4632 7040481 6908141 6775307 6632532 6550476 6479934 6359221 6240356 6125654 6085591 6059200
4622 6059200 5985586 5914738 5885153 5803786 5792300 5695272 5647369 5537323 5558437 5561972 5506974
4611 5506974 5491899 5519415 5587247 5595883 5591562 5518581 5561190 5541647 5539311 5588725 5611397 5687933
4599 5687933 5710393 5755121 5804752 5850894 5963100 6015909 5964792 5893148 5819206 5775159 5669575
4588 5669575 5517886 5378795 5177001 5060808 4917044 4737275 4672640 4519941 4402634 4252982
4578 4252982 4107440 4099742 4128879 4071559 4045214 3946058 3861713 3882151 3868613 3885180 3853141
4567 3853141 3809407 3826228 3749979 3731829 3690732 3623707 3607791 3567610 3459436 3417942 3421163
4556 3421163 3401682 3351797 3321217 3310647 3244041 3205418 3134100 3127048 3137271 3072906 2991273 2968329
4544 2968329 2919203 2879470 2915292 2879236 2753372 2768496 2721262 2683877 2646794 2609318 2616211
4533 2616211 2569713 2539895 2602172 2585521 2575643 2572508 2516019 2504651 2443820 2447366 2501193 2402982
4521 2402982 2340587 2357768 2365723 2343240 2322204 2327190 2353426 2354816 2361734 2352441 2203454 2193737
4509 2193737 2245854 2208581 2136503 2093159 2111381 2123942 2118073 2129665 2147576 2161300 2169373 2139986
4497 2139986 2136780 2177016 2183387 2163187 2101258 2136852 2185404 2094315 2073923 2034725 2043945 2070179
4485 2070179 2021514 1972219 1926164 1947407 1913204 1831872 1805775 1829321 1808743 1808527 1772725 1759420
4473 1759420 1783632 1716379 1673849 1680314 1737121 1747010 1723876 1685289 1718496 1746110 1705997 1733769
4461 1733769 1663301 1651214 1690393 1569728 1584756 1612612 1558942 1562635 1566796 1533783 1468548 1467685
4449 1467685 1473084 1462586 1463681 1459943 1439937 1396521 1438875 1508359 1546030 1528324 1468975 1504878
4437 1504878 1419614 1371315 1421189 1413035 1438157 1449954 1420291 1471804 1493758 1457966 1475196 1404328
4425 1404328 1375012 1429523 1447784 1435438 1467286 1397186 1345422 1381769 1376627 1416520 1443121 1436315
4413 1436315 1364404 1351914 1377553 1369079 1330448 1318621 1325564 1402586 1471979 1455345 1416975 1368600
4401 1368600 1329031 1342442 1374929 1383922 1399625 1390656 1446838 1423717 1381382 1390379 1323320 1279440
4389 1279440 1331474 1356041 1346212 1376540 1427280 1434888 1384847 1355053 1393507 1408544 1451767 1540197
4377 1540197 1499025 1453811 1491156 1554505 1579210 1556813 1549903 1553620 1612095 1660324 1673713 1702899
4365 1702899 1697642 1685223 1680958 1626577 1543190 1608812 1540628 1476701 1455713 1459671 1380290 1412819
4353 1412819 1443553 1415731 1405289 1366319 1401580 1418587 1372976 1354926 1408628 1339273 1336045 1333991
4341 1333991 1328859 1304589 1303647 1262054 1315007 1342142 1348150 1374864 1343410 1267792 1259982 1336213
4329 1336213 1340391 1322320 1418342 1404110 1360110 1362129 1433455 1454157 1443147 1503114 1522950 1549079
4317 1549079 1619305 1612778 1628696 1675629 1688344 1648196 1618746 1647915 1626501 1613412 1638558 1653966
4305 1653966 1582448 1579410 1552565 1578083 1659141 1672027 1684156 1640991 1586850 1608800 1718529
4294 1718529 1678637 1716550 1784155 1762938 1778653 1779428 1853059 1895565 1900155 2017240 2121143 2164310
4282 2164310 2245247 2205830 2178160 2077907 1950130 1844539 1779562 1708222 1701066 1670851 1626389
4271 1626389 1629760 1569665 1568482 1487817 1434795 1451746 1414157 1411405 1436545 1401675 1450591 1442313
4259 1442313 1403747 1409879 1398255 1349578 1329350 1387838 1427103 1407476 1315618 1283066 1313505 1356225
4247 1356225 1374551 1405792 1372282 1392815 1377361 1353356 1337318 1382701 1329140 1344627 1355296
4236 1355296 1426839 1419682 1429055 1464376 1543534 1629807 1610864 1648764 1646011 1723438 1766225 1817634
4224 1817634 1836474 1800318 1701177 1689543 1726589 1692263 1641888 1620163 1607450 1658047 1660012 1637648
4212 1637648 1636007 1603016 1612089 1608986 1667594 1702914 1718573 1719219 1750302 1675731 1692631 1692112 1758690
4199 1758690 1826690 1871725 1981430 2001667 2093446 2052177 1993825 1928085 1944691 1995201 2065012
4188 2065012 2085896 2127780 2088817 2133191 2196500 2286407 2274222 2332106 2379622 2344894 2419443
4177 2419443 2457092 2495994 2580718 2598494 2576889 2583138 2634667 2677996 2769834 2827274 2958022
4166 2958022 2987860 2915376 2995446 3062327 3139967 3178988 3227395 3309799 3332721 3356606 3420532
4155 3420532 3448021 3516103 3629592 3702918 3741914 3866435 3895303 3912800 3938241 3983403 4071683
4144 4071683 4103814 4224370 4333355 4408147 4474358 4521232 4537218 4616522 4655041 4722466 4756621
4133 4756621 4818134 4858669 4936417 5003836 4992964 5012687 5058411 5131694 5041882 5092652 5168008
4122 5168008 5177647 5179282 5185955 5146855 5119637 5106063 5041096 5062347 4986893 4945933 4865580 4857880
4110 4857880 4865982 4821940 4796157 4715995 4703868 4636370 4555836 4457991 4390237 4315532 4232230 4179252
4098 4179252 4161888 4037331 3966238 3881178 3835936 3790119 3779026 3680177 3575381 3547077 3539442
4087 3539442 3414357 3259119 3280530 3243953 3160185 3128005 3024625 2931056 2925045 2880150 2801312
4076 2801312 2731735 2678823 2669490 2622341 2573616 2504600 2533113 2509819 2516646 2430741 2379814 2278096
4064 2278096 2241920 2214164 2143470 2169807 2102403 2117085 2141421 2053507 2022206 2005860 1964764
4053 1964764 1955633 1910163 1853213 1791214 1804496 1785422 1762033 1739875 1686182 1586938 1603783 1630445
4041 1630445 1544098 1513237 1503493 1506671 1540995 1480703 1454088 1482227 1550728 1499649 1526711 1451838
4029 1451838 1383988 1370723 1348882 1378007 1370355 1284474 1280870 1297600 1265296 1284930 1313620 1320981
4017 1320981 1354902 1383192 1342924 1255762 1298838 1279677 1268157 1275459 1291408 1221790 1328804
4006 1328804 1316060 1187221 1245082 1290114 1278769 1213237 1201890 1246005 1269937 1232421 1198602
3995 1198602 1140613 1071551 1036097 1058800 981060 986968 993099 981300 954948 988450 967000 957585
3983 957585 1001243 993540 897523 846920 909292 896615 866120 865276 845142 904535 890765 821141
3971 821141 872565 830317 823810 857741 889716 875760 818802 830949 808323 830760 891470 872899
3959 872899 884129 888520 877009 817586 836028 898744 861855 878055 792448 735380 789778 791959
3947 791959 758780 793976 754801 700816 715017 760237 724069 697496 711634 775456 753926 745120
3935 745120 747554 683924 719693 714093 737462 749734 739375 704821 646072 681361 700241 772228
3923 772228 763125 749262 770065 706989 721499 713594 711015 679363 689105 697831 651343 654927 631154
3910 631154 708540 683329 611584 644658 664211 645977 605093 635677 630518 655893 642572 632542
3898 632542 636881 658114 703710 651819 675545 627340 658885 646870 621938 645661 630902 627352
3886 627352 593409 628995 730243 792527 721430 685883 680334 612486 623025 744066 727838
3875 727838 641617 670821 767721 734801 641770 645271 681009 683044 680822 663915 623339 639069
3863 639069 619140 581861 631834 590739 614808 587287 599304 577977 623134 643396 706566 676380
3851 676380 623187 585203 568573 625193 653847 600262 648926 737516 753824 796488 745588 759580
3839 759580 715587 762402 722355 738223 804096 782707 726970 647417 728218 762858 745385 765423
3827 765423 780929 771249 662792 725783 719112 715547 719336 709641 722511 611836 583828 565856
3815 565856 571754 636815 726007 733892 768295 819798 785483 747241 711496 729526 681495 752645
3803 752645 779382 788917 793345 837573 872108 869471 859352 876799 839619 864166 832663 839910
3791 839910 814734 823032 835790 754955 753323 727545 674262 678916 661478 589546 572573 657687
3779 657687 694220 667981 606658 567440 609468 638736 651014 645509 620596 558566 576563 600030
3767 600030 659455 621055 614730 565300 601118 588642 624323 603096 580013 565738 585904 558770
3755 558770 556785 615910 597489 545614 540131 518839 453458 443297 525255 561458 599149 539594
3743 539594 544826 567283 587242 609284 579578 551984 554906 569381 517520 509446 583072 664757
3731 664757 544555 567010 580312 593322 553262 556512 611329 534834 542415 599091 639311 568441
3719 568441 611867 610644 576517 626262 578760 598594 608787 573549 553907 548549 571785 590979
3707 590979 662243 677868 672570 600556 577457 627794 558594 593647 618275 660406 629488 602860
3695 602860 574215 610927 583764 603695 591433 604358 605239 605787 617699 583142 519073 549330
3683 549330 637149 638046 587267 546499 610496 690578 644747 567662 543436 524653 527323 589604
3671 589604 627507 575719 632366 646137 664905 642933 636582 548110 538116 625349 608712 556175
3659 556175 524445 523167 558259 573268 606160 650815 611456 602400 667799 648409 646391 674224
3647 674224 609781 649919 673750 650071 632233 657001 677889 728866 699790 727661 714145 661206
3635 661206 747797 742001 741099 747309 800603 807287 780095 760004 743396 716855 723410 722188 758757
3622 758757 760226 704964 713688 697691 694628 715673 687725 636594 606813 680762 715094 761120
3610 761120 676538 665554 709760 676603 702442 751867 787941 775269 788063 707516 722743 757143
3598 757143 807438 880584 833583 811478 842129 797846 773450 779203 775393 812262 860526 866343
3586 866343 798193 818766 835115 812992 858361 861718 896301 815762 800924 831172 841472 867874
3574 867874 945877 960569 975174 1004382 981759 953565 875619 920943 919502 943790 1050407 1021417
3562 1021417 1007200 959694 909779 974566 1003878 1044535 998036 914736 934289 998709 1048251
3551 1048251 1027972 1082268 1088433 1072334 1136177 1103176 1222536 1250765 1231352 1270737 1270430 1291258
3539 1291258 1248368 1336470 1343041 1350387 1358745 1287237 1279959 1279322 1278724 1279878 1356669 1351207 1348012 1414773
3525 1414773 1530387 1515749 1558931 1625851 1646909 1581768 1606699 1650115 1621096 1662504 1714007
3514 1714007 1761728 1768923 1794247 1845614 1907188 1870135 1827039 1914471 2013520 2012532 2037017 2038241
3502 2038241 2128064 2279021 2269733 2271905 2311628 2342784 2386255 2426341 2467991 2473618 2472587 2582449
3490 2582449 2692432 2691377 2785251 2906218 2980141 3020252 3116222 3166228 3316389 3394891 3463757
3479 3463757 3564229 3612000 3686906 3799524 3940973 4009228 4209517 4341907 4477598 4658450
3469 4658450 4868318 5127042 5324171 5666720 5958103 6204713 6457525 6729207 6986745 7294824
3459 7294824 7606939 7814164 7943634 8046198 8054837 7924513 7635856 7316307 7006546 6607077
3449 6607077 6225042 5843890 5551502 5235437 4945768 4757908 4571994 4344987 4204475 4179849
3439 4179849 4055105 3935880 3938875 3879948 3788511 3720581 3719579 3801319 3782517 3792013 3790786 3778849
3427 3778849 3761278 3794218 3800079 3669600 3563187 3353140 3208043 3065119 2990452 2859877
3417 2859877 2790620 2697126 2553485 2472699 2384779 2338754 2327241 2289967 2276057 2314850 2245954
3406 2245954 2151886 2162990 2182768 2089328 2030121 2100646 2091158 2054478 2141478 2150934 2105506 2118842
3394 2118842 2140382 2125506 2046401 1985198 1931454 1851315 1753416 1692840 1632171 1590467 1586977 1564529
3382 1564529 1542785 1487683 1425733 1345394 1331401 1351718 1375320 1367483 1400877 1335309 1273389 1235136
3370 1235136 1198713 1218778 1233313 1231506 1204125 1164220 1146653 1103932 1139746 1168828 1129658 1144582
3358 1144582 1065281 1019987 1029234 1078201 1068683 1076702 1078255 1026534 1019850 986151 966862 1000649
3346 1000649 945207 1002618 1022904 915721 952869 906220 853570 884187 881186 902784 955928
3335 955928 898588 910783 891247 864642 851394 815539 749627 758528 839803 875326 857807 831783
3323 831783 830022 791888 824036 824510 825474 856183 827069 770642 762433 774630 801506 791714 717062
3310 717062 750585 774381 697764 724717 733961 684258 690448 717990 738274 734699 702121 709403
3298 709403 723947 706379 653383 648665 699705 730941 662898 640881 658187 711345 702914 655002
3286 655002 674171 646218 674238 700276 686254 639350 641000 649676 719647 672734 695793 676558
3274 676558 662642 713702 670131 712185 670159 631116 649376 651580 558944 528870 585656 579217
3262 579217 575657 657374 677036 680442 641541 657733 699838 635051 620194 582096 519293 548908
3250 548908 572777 541247 569843 659769 629211 589656 534129 599185 637383 646383 650236 622326
3238 622326 662727 610531 628481 651055 669839 689367 705317 713962 776799 772442 777497 799979
3226 799979 768040 807348 786824 836121 842471 799266 859819 909302 935139 926854 873361 874920
3214 874920 904875 953429 993572 963674 1012404 998441 1002079 1005491 960384 949601 906679 955118
3202 955118 977076 983076 976771 970080 979478 979657 961089 1048357 1044466 1068871 1079428 1057626 1172229
3189 1172229 1232912 1281444 1289696 1406229 1465901 1446624 1531929 1556824 1455192 1438759 1404607
3178 1404607 1405459 1415375 1443127 1394648 1366044 1339627 1300655 1327306 1321247 1357828 1350211 1222164
3166 1222164 1200518 1228085 1238994 1300249 1274311 1282437 1248901 1278715 1327954 1288782 1386293 1437716
3154 1437716 1441009 1557777 1591520 1629545 1655389 1683821 1686017 1639315 1687879 1769483 1737655 1692675
3142 1692675 1657046 1786350 1807400 1811100 1847018 1847322 1863764 1827575 1829571 1806308 1814041 1775970
3130 1775970 1753905 1807136 1880660 1865628 1905929 1932902 1974526 2046176 2077912 2090017 2167905
3119 2167905 2211028 2205899 2250868 2250425 2245801 2239547 2189500 2174362 2115998 2102948 2050498 2038967
3107 2038967 2017183 1989989 1928399 1960370 1949263 1936326 1883324 1922201 1964531 2004594 2091617
3096 2091617 2106790 2098553 2132512 2154224 2126860 2187083 2168855 2214265 2283230 2223349 2146262 2074250
3084 2074250 2029399 2026048 1900912 1885411 1850891 1755441 1681181 1677785 1663016 1712058 1613794 1620850
3072 1620850 1657406 1621727 1588223 1547134 1523196 1466163 1521835 1455966 1317860 1277190 1279077
3061 1279077 1307501 1209261 1203682 1232982 1189671 1153876 1117442 1081704 1128322 1099365 1028101 972715
3049 972715 891603 817048 871885 840128 810454 808175 803936 731404 738008 752853 735410 735907 699750
3036 699750 714199 694402 664055 593272 608699 586484 604014 642736 585406 525344 569421 506178
3024 506178 470896 484053 519992 519772 500697 515198 521628 509048 505685 465058 510274 467238
3012 467238 436402 457269 438851 414478 403660 362004 292237 333639 356490 367175 369490 376890
3000 376890 414847 398978 322610 389044 416575 370907 335232 283812 300462 355119 359628 297980
2988 297980 350321 325426 286528 281177 315665 354401 358217 350374 322534 276782 254209 300543
2976 300543 289193 268361 270226 302575 199210 211613 281001 294637 223704 236424 304132 271545
2964 271545 292667 277693 333741 282478 247488 240386 206978 199392 183914 135120 165752 149598
2952 149598 151585 216917 262867 198037 162392 166207 162003 263042 262693 203478 179685 157344
2940 157344 128860 155745 128286 113879 117754 95273 127649 159628 189097 137391 108014 153293
2928 153293 204038 226684 199689 121655 115981 174279 106991 150516 135011 206218 197574 154250
2916 154250 179794 191599 186896 172710 221083 218427 251990 224934 165722 171508 200016 179101
2904 179101 159970 139722 83199 27777 81896 115928 92626 86934 155807 190018 139667 105483
2892 105483 120846 58977 84753 115474 133814 204429 257403 210604 195765 195212 127751 242798
2880 242798 232007 215250 212612 230932 194138 158620 176907 229120 222009 207516 217377 171483
2868 171483 154955 181308 207786 207053 210542 178121 164383 152524 175351 178737 181286 210910 228524
2855 228524 165233 166509 202682 170126 177214 202715 265981 247242 255847 277021 267399 262127 291149
2842 291149 317684 340295 305386 316174 314215 273027 308278 382225 360117 351425 304979 265021
2830 265021 263018 272195 278627 288487 282315 340987 391801 399531 454134 500543 442312 340033 313314
2817 313314 213775 291275 336215 321806 332046 329660 344961 349435 358686 398457 394400 391553 334451
2804 334451 354212 432867 466366 433680 404439 318746 349508 378907 414343 386983 343378 303069
2792 303069 305413 316376 324807 357267 304786 322901 326585 379319 395145 402748 372000 342925
2780 342925 361455 322067 322936 336934 385214 368877 376388 366155 301357 276575 220402 214551
2768 214551 228600 290908 268952 213553 194703 160074 182786 192534 244742 221114 187860 199728
2756 199728 223213 210837 192664 188001 201022 205343 197068 185902 155130 229226 171284 160845
2744 160845 146923 197454 213027 194320 196388 126215 72514 20714 45502 37875 44924 101743
2732 101743 75952 97651 96304 101653 98243 88887 74657 155770 139398 84227 125494 111675
2720 111675 114933 96825 65468 111866 99312 47132 71421 56109 52727 68108 27863 26872
2708 26872 76170 46289 76667 75227 101577 85424 52358 66810 117244 100091 73656 23043
2696 23043 54681 105083 36853 -17485 -16449 53846 52294 126758 60794 23986 66194 135541
2684 135541 128052 110387 101220 78381 46196 -14022 10378 40086 82381 101036 83736 57891
2672 57891 3914 16208 53709 -26223 -32423 -67 45842 24733 7430 19078 65987 118697
2660 118697 97115 103693 52291 29446 -17542 -8699 19617 27218 -31599 -50831 12598 26395
2648 26395 56245 49189 67715 68504 -7266 16254 31380 25811 40034 49930 75878 82472 155774
2635 155774 78500 -22080 5351 82185 36683 41876 34055 20444 21226 78652 73904 54043
2623 54043 61620 72282 73979 69777 66155 59623 74386 18428 -5746 13462 56123 110847 40084
2610 40084 28061 56334 44654 11125 -1052 64840 102019 128602 102528 107661 1010 -11837
2598 -11837 62910 118834 130327 104670 150317 147004 126677 123230 182741 174484 154881 174917
2586 174917 184028 179131 188707 216404 222686 166447 108692 130351 111906 132065 92375 93745 35295
2573 35295 23537 81482 34627 81684 89994 89784 45383 89917 81542 45694 59200 62955 84340
2560 84340 47866 31156 57210 134277 64603 72682 121745 151782 84291 57341 39050 4274
2548 4274 -16365 30278 25066 -12087 -27952 -36035 -19393 5686 23426 57064 59455 -32188 27209
2535 27209 46845 77834 103982 123828 195833 160332 78429 57109 8593 -11276 39349 35003
2523 35003 33224 60997 84176 77681 54391 27735 -4836 -15600 37245 39949 23066 94281
2511 94281 107346 25541 10086 -8402 73894 115031 136220 100263 103287 156582 104622 111807
2499 111807 50750 31038 123055 90331 55462 79696 -21669 -35519 -24980 0 -10598
2488 -10598 1135 43452 118969 84642 85077 151306 150739 124242 106007 79051 73975 32195 17769
2475 17769 38752 34054 4943 30998 33652 69446 76580 67637 45537 67625 -1433 27868 83520
2462 83520 37500 78512 61775 82495 81885 105546 81399 90858 80665 86837 77277 85784 55281
2449 55281 78299 68964 64580 105756 113066 107748 106616 93819 52214 105742 142684 80531 107905
2436 107905 170426 178869 139055 106531 120467 139128 125713 168874 224269 191283 126448 69649
2424 69649 41097 105188 142261 139520 147562 123562 142116 148857 197964 201124 128946 169545 242244
2411 242244 247568 199180 189657 223045 282872 223616 223375 193281 212387 223788 227265 263529 224417
2398 224417 218907 277949 327191 289193 292260 329885 303096 320986 431836 441728 486993 479846
2386 479846 514872 410066 457541 478731 459792 464465 537732 563663 529617 554778 649656 749350
2374 749350 761426 736898 664360 743708 841968 916639 980271 1087163 1097728 1143347 1230919
2363 1230919 1287175 1429375 1506867 1584367 1718313 1830510 1921096 2080418 2206571 2338124
2353 2338124 2509312 2766616 2834971 2832319 2873419 3012968 3113257 3208734 3451613 3681788
2343 3681788 3801422 4020415 4276721 4512893 4810941 5130982 5538918 6005774 6597728 7164866
2333 7164866 7727232 8355322 8965015 9640541 10448090 11381292 12452428 13550184 15016030
2324 15016030 16822626 19355664 22384424 25778323 28877861 31184459 32206355 31020593
2316 31020593 27030789 22341875 18945201 16359576 13973424 11867977 10213180 8858195
2308 8858195 7807869 6977534 6353769 5842365 5416021 5034197 4743439 4379875 4009593
2299 4009593 3686002 3433589 3164321 2958186 2786433 2609348 2499013 2317893 2155981 1999226
2289 1999226 1934104 1840470 1749661 1662132 1611088 1607314 1492610 1349617 1295799 1294730 1192105
2278 1192105 1122679 1012569 981851 1007643 992608 888425 845629 841214 834905 803605 758727
2267 758727 738012 678275 618549 638319 658251 661328 604605 511958 497591 527499 535649 575785
2255 575785 602991 582222 526604 444905 485220 537234 536776 571461 591829 468964 514350 470762
2243 470762 431002 411328 365415 379546 389738 428098 414237 430094 359258 319448 299780 353161
2231 353161 311677 341420 399696 328118 297026 356550 375286 323778 353689 271313 255708 291490
2219 291490 292436 283768 287616 255510 220520 238692 191669 200065 195106 257472 216600 196933 172258
2206 172258 165914 192479 215567 246723 232969 211423 120137 91074 181292 190245 166826 179466
2194 179466 198322 184343 136522 172964 191711 122557 89698 133099 153988 115959 165483 149294
2182 149294 111014 125796 144593 134120 129378 157980 140900 93948 61185 87255 129983 88734
2170 88734 145264 155978 157569 53074 50066 127448 70885 27813 15029 -7625 35878 129303
2158 129303 67261 61659 88859 75031 41497 53383 72433 113629 90325 55151 63278 111889
2146 111889 86850 80299 43886 64394 113272 92418 41420 85628 77699 45286 -17347 -35611
2134 -35611 -18631 12587 -26999 13757 65250 19714 62380 27763 -1846 65629 103989 73001
2122 73001 51151 49667 53388 80445 41274 12081 19403 37796 54969 2944 -57870 37407
2110 37407 83597 26867 -4209 4408 75553 28607 -28407 -52545 26636 103405 113670 56326
2098 56326 45402 71641 51239 78558 45309 82374 103250 143124 74204 -14044 -9553 -35555
2086 -35555 -42101 -40505 -21542 -35491 -62869 -1738 6000 42896 30097 68971 96660 27615
2074 27615 109699 125917 65017 27239 33317 33629 60922 28900 37403 82826 84834 109672 126730
2061 126730 150958 105353 86299 33564 110266 141831 104009 103194 173712 217742 233170 244540
2049 244540 223704 212868 150248 100853 71800 141009 93924 45852 53040 72872 99356 80002
2037 80002 99857 133057 122699 116817 113761 133238 78803 85995 104759 73977 41011 104046
2025 104046 73603 85466 59718 72772 30276 16077 -32164 -26107 13451 68548 103918 30552
2013 30552 -11806 37093 105810 20710 -10535 41197 -22306 -28201 -91430 -55794 -24607 8261
2001 8261 101348 58599 28269 39968 17480 -15527 18311 44522 24268 30223 16219 -57357
1989 -57357 -15809 19807 71982 4752 -29202 986 -30891 -27264 -14573 34436 79077 49230
1977 49230 -46046 -10324 65175 60041 100284 81837 23893 16024 28496 -12935 -28070 9315
1965 9315 22998 -31990 -2759 10082 -41409 -17426 -4228 13412 72344 28997 -13525 -26986
1953 -26986 -2496 11377 69466 47311 32145 35983 23340 22749 36762 66293 32865 12399
1941 12399 -15854 -5507 56682 65564 33649 55192 72290 59658 43702 -31814 32850 -31476
1929 -31476 1444 21270 -18402 -13983 64201 94454 52241 31744 -11136 31415 18720 16177
1917 16177 25363 44539 57390 1293 31616 26702 -15852 25816 87433 41281 -11781 4032
1905 4032 -65035 -23973 51192 49767 9911 -38458 -25428 11834 -46361 35692 36132 15832 98756
1892 98756 -9369 -51224 -76076 -93098 -59366 -41629 3255 -42240 -36012 -17428 -54809 35554
1880 35554 10874 5226 -18430 -42799 28707 39408 53557 -5065 -53673 -15960 37181 -66297
1868 -66297 -78794 -17545 55191 -7550 -66850 -64561 -44300 -98047 -53316 10071 -37259 38051
1856 38051 146814 76614 22244 60875 58642 35798 -8897 -21310 24991 68504 -7362 -44217
1844 -44217 15586 16450 15248 33412 46609 101203 97480 20428 -77640 -116090 -95615 -51386 9823
1831 9823 10849 13450 -5521 -56977 -19404 -54217 -40637 -49837 28829 69971 60229 39576 40091
1818 40091 -12270 13414 42501 -21055 78392 102303 20928 -41693 17207 98555 98641 120599
1806 120599 106412 36927 19480 -15766 -80371 -64520 -39477 -68321 -78111 -112744 -100663 -53720
1794 -53720 -37304 347 -65858 -43311 13052 -12418 24881 26485 3694 -20961 30407 -21432
1782 -21432 -57014 -117260 -51591 5772 -29547 -61840 -5356 -22093 -45596 -72797 -35613 6662
1770 6662 20237 7499 -10336 -16507 -50026 -71647 -28285 8055 22036 51712 -55095 -16040
1758 -16040 43704 37717 32563 -28912 -82936 -22725 12833 -54052 -45070 29913 46138 21274
1746 21274 -37304 -31548 -13209 -29292 -29074 14957 84878 13691 9380 -6824 -126847 -99636
1734 -99636 -50643 -25094 -48032 -40219 -35760 -50014 10505 -16812 -79377 -116788 -112927 -84363
1722 -84363 -33569 -49294 -34764 44068 26069 -6496 -44614 -40072 -36865 7214 13490 -8459
1710 -8459 -61849 29581 -39372 -45320 -40562 -14141 75815 71787 49912 17092 63093 -37138
1698 -37138 -51757 -94376 -88811 -64048 -69195 -34474 -54580 -26518 -14488 48646 1410 -5047
1686 -5047 66406 109236 19864 -50611 -61807 -32494 -65197 -101639 -82438 -77318 -98034 -56662
1674 -56662 -29919 -45561 -58484 -758 47350 44362 -36204 -37557 -29126 -14384 -12649 -38432 -31805
1661 -31805 15286 -30002 -62994 53797 83100 -4008 -75424 -30556 -72455 -115118 -103344 -76774
1649 -76774 -81833 -32128 -36604 -76722 -92301 -87172 -65280 -75054 -25949 53105 -42789 -33455 -52071
1636 -52071 -3282 17941 43275 19817 -10803 4205 45613 23980 25936 11870 -407 -41951
1624 -41951 -14247 36061 54212 30209 12688 62218 79142 36905 12860 4122 -63905 -107891
1612 -107891 -126828 -57162 38249 59340 7788 79160 24397 15285 -37741 -49828 -2886 -85725
1600 -85725 -48307 -24350 -32483 42957 26977 -58014 -73171 -32846 -5788 -32017 -2509 33253
1588 33253 25504 -23478 -39701 19064 44250 33612 116312 90749 45773 25794 50648 56560
1576 56560 88118 72288 53327 -2851 -75402 -21338 -16573 2280 -85854 -62863 -67198 -62831
1564 -62831 -77745 -71065 16309 -10805 13377 28002 68274 5294 -88239 -57469 -75024 -28686
1552 -28686 -56291 -35755 1104 -38885 -4816 -341 47713 86263 36379 4013 -11649 -67489
1540 -67489 -44103 -13026 -17816 -12170 -13237 -49032 -66315 -24982 7396 -22524 -32892 -67553
1528 -67553 -72885 35006 -1974 -93149 -71846 -56322 -31302 -20584 -62947 7199 -25192 547
1516 547 4950 -12445 -7185 93477 108862 49000 98508 48489 26931 15627 6142 8706 32488
1503 32488 107579 114245 54019 55649 88698 47895 -13134 -17569 -8486 -22727 19790 11743 -17241
1490 -17241 -9442 206 -34860 -48123 -74013 -64807 -44999 -73584 -50968 -27319 -14563 -21595 -78335
1477 -78335 -139232 -92860 -102275 -83088 -70658 -73074 -78179 -79878 -82365 -88266 -37803 74350 52397
1464 52397 -46931 -102043 -86402 -53641 -28459 -17061 31011 27801 -14964 -3897 -38973 -38064
1452 -38064 -41977 -43629 -79667 -58631 -99243 -125288 -38840 42378 -29799 -31352 -6593 -38031
1440 -38031 -19937 -22624 -13807 -58490 -114986 -54015 20178 45595 -78317 -72445 1269 15554
1428 15554 -58318 -112530 8325 9575 -8570 63256 79595 17012 13582 -24072 -29165 -44628
1416 -44628 -57493 -34997 -10788 12969 73916 63858 19893 -46272 -41458 -22729 18220 7969
1404 7969 -47731 -41313 -47099 -12656 86 18518 -12859 -20280 -48921 -59929 13904 595 -68686
1391 -68686 -62660 -29938 -81966 -94238 -94428 -41159 -50301 1605 35954 40482 26204 -24134 -16086
1378 -16086 27988 -31128 -75526 -56646 18552 67806 54037 43252 51758 14302 33302 37189
1366 37189 -15008 -3634 -30196 45140 11847 25371 28738 -12230 -6846 -35439 -18773 -561
1354 -561 -7693 -37950 -61722 31041 54860 13312 45959 5896 58047 32563 13124 4123 -3845
1341 -3845 -8279 -6145 35167 21458 26781 -50306 -117156 -53952 -4601 -43620 -36043 1814 37722
1328 37722 -19119 16697 -18920 -80459 -34461 -21693 1492 41276 32603 28767 -7287 24076
1316 24076 -70141 -120386 -106892 -105311 -109352 -15795 49684 34894 -63124 -10519 -12302 -43263
1304 -43263 -752 -34690 -36315 -26763 50835 50808 -7203 -49968 -60434 -24525 14230 3731 -15129
1291 -15129 -77039 6251 37339 38647 -18457 5784 64770 29933 -54687 -31138 -11360 -41246
1279 -41246 -23010 16446 122546 82201 20331 -55731 -39987 -65303 -65293 -54826 -89353 -79373
1267 -79373 -95801 -52586 -67928 -22080 10345 6066 -10632 13684 -19651 -42524 -27553 -58700
1255 -58700 -16700 96934 102199 44674 31869 39853 80813 43244 -15842 31360 109876 62662
1243 62662 18708 1899 14953 61728 28873 -13085 31188 101198 -3066 13301 37522 -8716
1231 -8716 13802 23296 -18382 -29343 16876 46550 39784 32405 23175 -53195 -89890 -119623 -73517
1218 -73517 -47295 -20933 72348 46843 19263 99290 99837 -5707 -38439 30887 59636 57796
1206 57796 12276 14596 18380 987 61282 56441 -22762 -57245 7414 -14721 -20378 8067 26877
1193 26877 18381 71355 38121 -64625 -71907 -40972 2989 -15941 -25448 -5396 45417 63692
1181 63692 38829 1400 38125 56164 34742 34186 21031 31356 11018 -5903 37023 -47574
1169 -47574 -55183 -25296 -44022 -26460 -64694 -103441 -19461 24262 -13461 -71111 -67542 15814
1157 15814 38722 19309 49558 -15223 -17799 57849 64961 35120 -63184 -32513 -12460 -16580
1145 -16580 -5786 -31700 -64505 8492 69753 34112 -11177 20571 84137 46645 -21577 -66723
1133 -66723 -63049 -55255 -23502 21665 29995 -10927 -14150 -44718 -35106 -74195 -58004 4350 48744
1120 48744 47909 21858 27734 16846 50814 38740 58863 39462 -10506 -5173 -40759 -25546 -20266
1107 -20266 -12606 36218 100577 54453 27078 115982 42230 15012 11204 -16398 13206 -37668
1095 -37668 -89388 -40471 -22157 -24964 22903 25912 -1266 27998 18890 -6338 13745 -24716
1083 -24716 -81412 -95528 -113083 -35810 -10652 -34207 -18175 -20613 -33449 3272 -9064 6535
1071 6535 -43093 3401 -63519 -92321 -65734 -6762 -46038 -142933 -46148 13086 49920 12769
1059 12769 -6080 4255 62649 103861 14720 -70528 9472 -24286 -44385 -34705 28182 2634
1047 2634 -31352 -12727 -41489 -88165 -24325 -9217 -60946 -81558 -84147 -28682 30768 9337
1035 9337 -45090 -24114 -111384 -67845 -4983 9183 -18307 -57612 -20974 -7709 -26354 25649
1023 25649 15304 -35260 -28049 29971 -66018 -34996 14110 -48281 -30219 45924 46077 28735
1011 28735 59357 -39622 -12657 14240 108930 65670 -476 -61295 -33174 -5917 -67463 -70031
999 -70031 -102334 -102967 -25485 -23750 3933 46127 28264 -21297 -41503 13506 60076 -13751 -52601
986 -52601 -62723 -60551 5648 -61314 -77841 -22416 -66706 -22372 -37714 -101617 -89528 -55894
974 -55894 9085 307 -33639 -17363 -3988 -37571 -5956 -4276 -67858 -48880 54856 -22556
962 -22556 -53407 -18289 -49485 -50304 -20570 -34593 -49837 -109569 -73762 -47386 7877 33474
950 33474 -15562 -26558 17572 581 -46706 31502 14415 21228 -27430 -133276 -73205 -39873
938 -39873 -90201 -80066 -60241 -18349 -24737 -14383 -81907 -27994 9066 -45929 -53403 -73094
926 -73094 -48571 -41910 -53999 5773 51162 -53983 -82806 -6546 24851 7084 -5027 10219
914 10219 69298 62499 -36487 -36074 -19173 -88437 -78656 -26304 49430 4935 45328 -16558 -28312
901 -28312 25868 20859 -24181 -25975 19364 -15281 -22640 -102361 -66946 -50264 -10269 -19152 13209
888 13209 40882 31998 -12059 -15866 -56797 -105417 6363 -8195 -15567 -10555 2337 7355 -2210
875 -2210 -25977 -17264 50555 52546 3052 8057 54872 12672 -40089 -65248 -35703 -18856 -50294
862 -50294 -28020 32475 11864 11942 -1097 -14264 -14718 3975 -29167 -29473 -11311 49607 38036
849 38036 -20992 -70673 -41816 -500 22536 48392 5471 9362 -47320 -72693 -38025 -6955
837 -6955 -39509 -17713 -2179 11751 42 -38091 -21062 -41118 -38322 43915 72741 73807 -27577
824 -27577 14461 21186 43429 -2562 -2722 2204 -20366 72085 38075 -17063 -50293 -39636 -34146
811 -34146 1069 15864 -6054 -44481 -50497 -17686 4319 -37334 -72820 14022 78760 106111
799 106111 -43176 -60716 -13278 32401 51999 33428 38151 776 21110 -25899 -48121 -43004
787 -43004 34748 48102 14182 98632 113381 84089 46727 14499 5781 -21418 9391 -62802
775 -62802 -2161 -11117 88926 8263 -44847 -21323 43635 3578 -70732 -59587 -100514 -98502
763 -98502 -71129 41438 -3868 23361 5778 76842 120994 56252 -12875 -33228 -40650 -17873
751 -17873 16182 18424 -8224 53799 43549 -33598 -17681 -24597 -56552 3864 10715 -39435 -42699
738 -42699 -7134 10964 46274 28445 -10254 -15199 36426 110763 126309 40074 29520 122876
726 122876 42614 -15398 -24549 26698 41355 5426 56581 63571 -23874 34080 60795 40515
714 40515 86780 95126 -48381 -13123 -20274 -53211 -49554 -23827 37768 40535 -43436 6024 28948
701 28948 -38580 -57588 -85919 -11227 27739 -19468 -27721 -57779 -56354 -38916 8306 20737
689 20737 -8033 -7358 7415 -36871 -52872 -20129 17839 15288 -37989 -33485 -51182 25306 -7768
676 -7768 43416 67831 51329 18406 14349 -5178 56029 26609 29350 96557 5398 4361 21091
663 21091 13813 -8308 746 9984 -18880 -5321 -77486 -63396 -45793 -19381 6661 -2024 -18771
650 -18771 -71362 -55541 -52503 -25971 52208 33648 73003 76959 40992 71025 60212 -1824
638 -1824 13347 -43124 -58218 -37397 25335 29199 13665 -45 -61747 -27640 10304 24889
626 24889 50253 49398 -38146 -14091 -3689 -26089 -32970 -19635 12958 -17716 -12114 82082 93841
613 93841 67883 -30455 -29748 -8805 -10762 -14167 -31631 -22326 55452 29521 26028 83968 -37439
600 -37439 14553 87569 7858 3609 87480 88861 -30071 11004 49766 101925 91407 87763
588 87763 108285 71227 -6500 -34015 -58866 -66496 -47856 44116 147189 65515 50038 66971
576 66971 76860 104519 61107 -2668 -49894 -41063 2933 17595 34981 -24511 -41011 -27681
564 -27681 -15194 16494 31154 23572 3165 -27113 -51953 -10955 51736 44648 75947 106722
552 106722 123322 61947 29658 66180 42481 31148 -16665 -48634 -129279 -38917 55360 58318
540 58318 31901 31401 7656 -25823 -56015 -42109 18816 -24098 4513 5450 -21014 -24608 28082
527 28082 77939 60049 83530 51161 1852 -12377 -44684 23839 75165 47961 15886 -36468
515 -36468 13467 51261 -65743 -22723 20640 40250 74812 85321 -10 -50413 -35165 9182
503 9182 -36622 -30521 -7739 -8841 4090 -2992 -38051 -16887 8565 -18360 2786 -33081 -55942
490 -55942 -26883 31176 23273 -11405 -76693 -32940 -16779 -43327 -36523 -18068 -17083 -10574 -12315
477 -12315 12999 -4670 -17551 13410 51000 28591 11025 17172 -23692 -29538 10566 2292 23110
464 23110 25907 17115 11344 21518 65153 80365 12425 -2838 55293 23692 2676 20326 40181
451 40181 42126 56268 -3302 5450 66873 58748 35229 -25104 -17959 -23909 30594 108177 26831
438 26831 -46576 -39557 16716 -39563 -61863 -30062 34095 40532 52252 76919 -2232 6364 -29728
425 -29728 -25846 -23269 -67628 -10972 28608 -21897 -28733 -50617 27558 32955 35402 -9567 -11091
412 -11091 28497 46356 73373 65801 90430 65313 43358 -54767 -46383 -5695 -6613 -34879 49670
399 49670 52222 44340 72081 72881 7727 76443 90330 59340 17256 10865 13557 6978 63774
386 63774 47885 38217 71713 60582 29412 -32167 12785 40485 -6236 60532 47972 39321
374 39321 46384 22100 45477 89901 86955 89164 98041 122433 104055 65998 48898 78413 78429
361 78429 -42009 -51820 -12736 -25325 16518 15714 21034 41319 48001 64235 81861 45291 11741
348 11741 -42027 -39027 -19939 5929 35659 86438 43613 31871 58429 59288 104960 89445 4693
335 4693 50141 12535 3570 18635 85061 89699 64324 74444 7757 -14120 -52466 31239 61762
322 61762 103783 78374 72481 57399 109654 81464 35018 38210 6374 22897 2156 -25824
310 -25824 59458 143956 118663 69043 97003 123596 90292 56035 91662 72646 15846 -18895
298 -18895 18140 -6933 6522 25060 29121 8463 20180 -4139 -13270 -31219 4856 23894
286 23894 -27190 68343 37828 16771 -6735 32528 -27895 3911 62554 45652 61151 83382
274 83382 25656 18627 71142 86805 121740 53594 -37470 -12325 -24410 -56777 -36988 26306
262 26306 3430 44879 28785 92295 90629 74609 68772 88977 65028 56996 103342 62246 -34010
249 -34010 -30002 50985 82985 -3258 25847 81376 47004 39687 15166 79002 103746 122875
237 122875 104532 32128 18451 416 50935 66030 42346 43116 11612 31916 43123 29651
225 29651 -50146 -40908 20971 28952 48454 37642 6616 68149 93406 50307 1131 26738
213 26738 35295 59823 -32570 -21701 5981 66520 97946 25548 -31779 45108 117839 102453
201 102453 56516 1857 -9539 -18051 -17321 13456 78760 56272 69741 76042 59681 114554 -323
188 -323 41144 23286 -16457 41563 103294 76017 67747 92139 87366 70778 63408 69577 92783
175 92783 96996 107127 92780 70269 92506 119619 99077 58669 28748 28856 53357 94936 87608
162 87608 -17080 8831 14228 49665 42810 33480 30961 43978 32929 50745 53130 76798 75458
149 75458 21263 5938 29733 42202 39138 81654 77688 58223 28121 26838 56266 39977 59890
136 59890 114381 99833 39984 17548 24896 53035 43406 21944 98760 49290 -9426 -38802
124 -38802 -45574 -18810 -4405 -35107 2438 85137 94430 96652 46072 38090 98075 134463 61240
111 61240 69138 -8943 17039 73215 8681 9533 26301 37715 46436 32633 53516 80044 50833
98 50833 -6075 -27611 -43058 -28297 23818 16764 15472 87581 76973 33809 71705 54267 41178
85 41178 95211 102413 40586 31477 51999 37663 33579 24438 34178 24202 27922 8263 5791 52689
71 52689 55120 -14710 20442 46572 38933 28674 89120 87642 36953 17837 36166 39523 64595
58 64595 53258 7851 5535 32365 41533 42800 76355 18274 31261 81297 57735 98249 84170
45 84170 62885 37633 27758 14135 71883 95119 83052 133759 103621 77767 75223 39466 12344
32 12344 10586 20261 56615 104937 153350 103900 83598 39677 39535 66850 90572 45370 9750
19 9750 7545 27888 30709 8881 -5083 18788 19375 16769 116666 132037 127308 111415 41163 17376
5 17376 38305 39894 -92 -18217 -6439
0 -6439
$$ Imaginary data points
##PAGE= N=2
##DATA TABLE= (X++(I..I)), XYDATA
16383 -809221 -769779 -745495 -736269 -731003 -729334 -710703 -702459 -693046 -627536 -577818 -579526 -549115 -588189
16370 -588189 -565453 -487407 -476065 -515175 -490494 -492748 -495581 -498720 -463255 -441580 -424414 -430481
16358 -430481 -397085 -405488 -384715 -300439 -253167 -231306 -173026 -185551 -232880 -221244 -192842 -161257
16346 -161257 -130844 -130857 -125852 -103334 -65786 -80055 -82938 -50563 -47664 -30034 10607 53699 63970
16333 63970 105588 172117 153014 119826 111444 131683 177787 213044 226658 227518 235445 245029 229590
16320 229590 243006 269924 291736 349063 403632 385023 418743 388662 413224 434572 437409 479424
16308 479424 456762 489400 467710 498836 566065 493509 571826 573009 586848 648207 662163 599611
16296 599611 591535 633497 637207 683174 710337 672070 724954 729988 716367 719422 756056 758433
16284 758433 743511 826709 820055 882950 850964 855319 903544 925485 915681 950454 960999 930265
16272 930265 986170 972386 976632 1009967 974420 1023354 1005725 1042589 1096947 1098724 1080910 1094863
16260 1094863 1091003 1112232 1110637 1119331 1162340 1183933 1186434 1225060 1272110 1263909 1242018 1238093
16248 1238093 1218371 1171529 1174443 1205308 1269571 1258117 1257992 1289880 1317192 1287609 1268445 1293849
16236 1293849 1315677 1305405 1365034 1410569 1389875 1393058 1403747 1396442 1424964 1496193 1504540 1460332
16224 1460332 1446380 1425984 1407865 1431589 1488899 1542939 1512637 1526743 1534147 1534143 1584742 1527286
16212 1527286 1472608 1521034 1533604 1557045 1590989 1571288 1584355 1607231 1656815 1618989 1616421
16201 1616421 1634596 1620406 1612459 1644511 1662472 1684722 1739141 1706304 1725427 1683509 1710229
16190 1710229 1708005 1729543 1722761 1708728 1666013 1664172 1682834 1717093 1694388 1684731 1656631 1664522
16178 1664522 1727516 1734471 1760786 1754277 1779364 1725745 1722013 1815990 1849005 1836062 1797173 1836169
16166 1836169 1821240 1885273 1892233 1827533 1872235 1904892 1925186 1878858 1795304 1833508 1819495
16155 1819495 1806027 1829696 1828541 1870681 1847693 1834986 1861896 1884562 1876593 1961757 1972984 1892109
16143 1892109 1810023 1831532 1849472 1842039 1895739 1904098 1869662 1904555 1869084 1891882 1937168 1912915
16131 1912915 1878587 1947705 1992654 1956679 1976685 1947244 1942581 1900766 1934511 1969957 1948932
16120 1948932 1950660 1979113 2011227 1995914 2033718 2010971 1998860 1940741 1927180 1925686 1858605 1870563
16108 1870563 1871468 1857960 1892174 1923071 1922223 2007024 2013440 1934330 1994869 2012416 2060389 2059043
16096 2059043 2033993 2053251 2033472 2022624 2022649 2077146 2035433 1976371 2049548 2061438 2033876 2048595
16084 2048595 2081289 2067280 2045354 2059414 2044113 2027133 2052216 2048683 1977141 2044084 2073287
16073 2073287 2023887 2032794 2002133 2023883 2008589 2022345 2052313 2051577 2058885 1951077 1929635 1955018
16061 1955018 1980574 2024434 2076357 2115472 2122256 2122255 2148147 2161362 2062747 2021965 2048416 2094649
16049 2094649 2028793 2024533 2040383 2057470 1998963 1918815 1927369 2010396 2117972 2133267 2076474
16038 2076474 2090127 2103113 2081976 2043443 2059352 2095491 2089330 2055499 2055084 2073474 2050538 2007487
16026 2007487 2054192 2115917 2065881 2080364 2074851 2068210 2017055 2018890 2028868 2032251 2012565 2059997
16014 2059997 2056586 2086791 2118286 2085777 2112647 2086383 2120839 2104736 2046481 2048391 2052758 2108374
16002 2108374 2150828 2086550 2045748 2091024 2108384 2075153 1983181 1897480 1923643 2061208 2108519
15991 2108519 2081599 2065732 2023153 2045129 2117910 2042340 1961474 1996118 2059156 2059946 2035161 2044617
15979 2044617 2082806 2060676 2069480 2048847 2046160 2084466 2057813 2040946 1995935 1998850 2070824 2028932
15967 2028932 2064728 2096781 2105555 2130323 2079485 2044116 2031256 2078317 2107745 2013807 2047586
15956 2047586 2140851 2163439 2032092 1991228 2046520 2090653 2052038 2024641 2131968 2130058 2076435
15945 2076435 2087985 2085779 2076297 2050843 2029936 2068599 2061627 2094855 2110652 2024304 2064206 2069255
15933 2069255 2074246 2073714 2076086 2136141 2127457 2078278 2072222 2093115 2056129 2075074 2028352 2064280
15921 2064280 2112671 2038812 1975257 1977385 2073705 2107219 2046096 2067145 2059658 2070047 2047697 2065276
15909 2065276 2094145 2107255 2055002 2058629 2074731 2064796 2038979 2063459 1980626 2099004 2134246
15898 2134246 2173641 2119658 2077994 2141919 2112756 2078949 2052404 2032112 2068144 2084764 2022438
15887 2022438 2058500 2048640 2039745 2044779 2067702 2065332 2047516 2069557 2093066 2068941 2105895 2044187
15875 2044187 2065207 2108776 2142053 2137491 2090715 2096124 2118912 2108853 2126295 2009994 2052371
15864 2052371 2103493 2102653 2107119 2010142 2044441 2057207 2074048 2070237 2057357 2098322 2051865 2065102
15852 2065102 2061404 1995659 1984528 2024844 2060816 2045005 2048895 2080863 2111803 2160650 2174371 2144373
15840 2144373 2107598 2112540 2114344 2053598 2084068 2072525 2065838 2042660 2068573 2087925 2076607 2082878
15828 2082878 2035413 2041467 2107564 2147705 2137899 2167906 2175458 2155700 2230612 2221735 2202592 2174370
15816 2174370 2156635 2116476 2103982 2126540 2083225 2091767 2052591 2088234 2149821 2134116 2115063
15805 2115063 2109193 2146090 2143997 2105372 2067572 2062211 2076744 2062778 2120417 2061381 2019693 2096025
15793 2096025 2134279 2186266 2165323 2117774 2132390 2127650 2123091 2068268 2034167 2001363 2074788 2115061
15781 2115061 2130422 2155528 2163493 2109971 2094144 2117318 2104621 2083471 2081322 2155172 2133632 2073806
15769 2073806 2018085 2026759 2058693 2132727 2093359 2131593 2101796 2095381 2056174 2053128 2057912 2076437
15757 2076437 2100747 2098878 2094761 2067159 2079454 2121456 2125120 2075539 2148891 2146140 2152929 2159913
15745 2159913 2184545 2157177 2099709 2057513 2103705 2163148 2187313 2191146 2141736 2171915 2183155
15734 2183155 2072528 2058050 2026516 2112712 2146207 2115335 2118708 2115575 2104861 2142320 2190423
15723 2190423 2173090 2156041 2160756 2126941 2138853 2129162 2138285 2124815 2112060 2093267 2045664 2104526
15711 2104526 2146278 2115708 2105588 2147430 2144244 2126901 2084063 2062076 2039539 2146584 2112116
15700 2112116 2120577 2112203 2084742 2166709 2140579 2158034 2118335 2073202 2074986 2117271 2138339 2152414
15688 2152414 2042979 2054322 2112955 2063758 2024412 2084434 2134354 2137133 2142403 2109660 2107804 2200126
15676 2200126 2176618 2069039 2100438 2122823 2046122 2103384 2165303 2163726 2169953 2115741 2177570
15665 2177570 2163969 2173589 2157198 2148403 2134078 2165534 2172789 2180690 2184969 2150376 2147612 2136212
15653 2136212 2044834 2034679 2101377 2186124 2107400 2127827 2127312 2148147 2161955 2115649 2148000 2136168
15641 2136168 2174787 2196538 2152694 2153274 2137979 2076156 2062387 2120928 2068504 2004639 2045860 2140778
15629 2140778 2142934 2110492 2069242 2087193 2154584 2186255 2181152 2141096 2148897 2109467 2023558 2016585
15617 2016585 2084672 2075882 2113846 2094587 2095798 2134933 2219390 2163914 2147513 2127290 2119624 2129545
15605 2129545 2166606 2235521 2225667 2209908 2148507 2171919 2173903 2146410 2135711 2163448 2135861 2121144
15593 2121144 2146179 2123407 2091107 2111717 2081321 2085471 2109814 2107278 2167961 2220537 2216517 2189361
15581 2189361 2180317 2156416 2151849 2204253 2223074 2156481 2126210 2193404 2203489 2154949 2176527 2138864
$$ [...]
##END NTUPLES=NMR SPECTRUM
##END=
