##TITLE=1H_DE-80H_X3
 200.13MHz, d2o
 8 sc
 
 19ns.26.2.2025
##JCAMPDX= 6.0         $$ Bruker NMR JCAMP-DX V2.0
##DATA TYPE= NMR SPECTRUM
##DATA CLASS= NTUPLES
##ORIGIN= UXNMR, Bruker Analytische Messtechnik GmbH
##OWNER= pz
$$ XWIN-NMR		Version 3.5
$$ Mon May 18 16:40:02 2026 Russian Standard Time (UT+4h)  Yarkov@DPX200
##.OBSERVE FREQUENCY= 200.1313
##.OBSERVE NUCLEUS= ^1H
##.ACQUISITION MODE= SIMULTANEOUS
##.ACQUISITION SCHEME= undefined
##.AVERAGES= 8
##.DIGITISER RES= 18
##SPECTROMETER/DATA SYSTEM= spect
##.PULSE SEQUENCE= zg30
##.SOLVENT NAME= DMSO
##.SHIFT REFERENCE= (INTERNAL, DMSO, 0, 15.5045)
##AUDIT TRAIL= $$ (NUMBER, WHEN, WHO, WHERE, WHAT)
$$ ##TITLE= Audit trail, XWIN-NMR		Version 3.5
$$ ##JCAMPDX= 5.01
$$ ##ORIGIN= Bruker BioSpin GmbH
$$ ##OWNER= Yarkov
$$ C:/Bruker/XWIN-NMR/data/yarkov2/nmr/H-C/1/pdata/1/auditp.txt
$$ ##AUDIT TRAIL=  $$ (NUMBER, WHEN, WHO, WHERE, WHAT)
(   1,<2026-05-18 16:38:57.21 +0400>,<Yarkov>,<DPX200>,
      <created by zg, POWCHK disabled, PULCHK disabled
       configuration hash MD5:
       00 E9 B6 7A A2 85 ED C7 34 08 36 98 17 FE 4E 26
       data hash MD5: 16K
       D0 94 61 A2 B1 C1 72 4C D8 14 7A EC 4D A0 B0 78>)
(   2,<2026-05-18 16:39:18.04 +0400>,<Yarkov>,<DPX200>,
      <Start of raw data processing
       efp BC_mod = 2 LB = 0.25 FT_mod = 6 PKNL = 1 PHC0 = -5656.716 PHC1 = 11.42193 SI = 16K 
       data hash MD5: 16K
       9D 03 B3 DF 3A 31 38 EA A0 63 A2 16 BD 43 3A 20>)
(   3,<2026-05-18 16:39:25.34 +0400>,<Yarkov>,<DPX200>,
      <abs ABSG = 5 
       data hash MD5: 16K
       74 E3 FA 0E A3 1F DD 0B DD F3 D1 9E D1 81 78 9A>)
$$ ##END=
$$ 
$$ hash MD5
$$ 3F 60 9A 7A 40 17 5A 55 E0 10 47 55 64 4A E5 1A
##$RELAX= 
##$RELAX= 
##$RELAX= 
##$RELAX= 
##$RELAX= 
##$RELAX= 
$$ Bruker specific parameters
$$ --------------------------
##$DU= <C:/Bruker/XWIN-NMR>
##$EXPNO= 1
##$NAME= <H-C>
##$PROCNO= 1
##$TYPE= <nmr>
##$USER= <yarkov2>
##$AMP= (0..31)
100 100 100 100 100 100 100 100 100 100 100 100 100 100 100 100 100 100 
100 100 100 100 100 100 100 100 100 100 100 100 100 100 
##$AQSEQ= 0
##$AQ_mod= 1
##$AUNM= <au_zg>
##$AUTOPOS= <>
##$BF1= 200.13
##$BF2= 200.13
##$BF3= 200.13
##$BF4= 200.13
##$BF5= 200.13
##$BF6= 200.13
##$BF7= 200.13
##$BF8= 200.13
##$BYTORDA= 1
##$CFDGTYP= 0
##$CFRGTYP= 5
##$CHEMSTR= <none>
##$CNST= (0..31)
1 1 145 1 1 1 1 1 1 1 1 1 1 1 1 1 1 1 1 1 1 1 1 1 1 1 1 1 1 1 1 1 
##$CPDPRG= <>
##$CPDPRG1= <>
##$CPDPRG2= <>
##$CPDPRG3= <>
##$CPDPRG4= <mlev>
##$CPDPRG5= <mlev>
##$CPDPRG6= <mlev>
##$CPDPRG7= <mlev>
##$CPDPRG8= <mlev>
##$CPDPRGB= <>
##$CPDPRGT= <>
##$D= (0..31)
0 0.7 0 0 0 0 0 0 0 0 0 0.03 0 0 0 0 0 0 0 0 0 0 0 0 0 0 0 0 0 0 0 0 
##$DATE= 1779107936
##$DBL= (0..7)
120 120 120 120 120 120 120 120 
##$DBP= (0..7)
150 150 150 150 150 150 150 150 
##$DBP07= 0
##$DBPNAM0= <>
##$DBPNAM1= <>
##$DBPNAM2= <>
##$DBPNAM3= <>
##$DBPNAM4= <>
##$DBPNAM5= <>
##$DBPNAM6= <>
##$DBPNAM7= <>
##$DBPOAL= (0..7)
0.5 0.5 0.5 0.5 0.5 0.5 0.5 0.5 
##$DBPOFFS= (0..7)
0 0 0 0 0 0 0 0 
##$DE= 6
$$ [...]
##$SUBNAM3= <"">
##$SUBNAM4= <"">
##$SUBNAM5= <"">
##$SUBNAM6= <"">
##$SUBNAM7= <"">
##$SUBNAM8= <"">
##$SUBNAM9= <"">
##$SW= 18.0517328524113
##$SWIBOX= (0..15)
0 0 2 0 0 0 0 0 0 0 0 0 0 0 0 0 
##$SW_h= 3612.71676300578
##$TD= 16384
##$TD0= 1
##$TE= 0
##$TE2= 300
##$TE3= 300
##$TEG= 300
##$TL= (0..7)
0 120 120 120 120 120 120 120 
##$TP= (0..7)
150 150 150 150 150 150 150 150 
##$TP07= 0
##$TPNAME0= <>
##$TPNAME1= <>
##$TPNAME2= <>
##$TPNAME3= <>
##$TPNAME4= <>
##$TPNAME5= <>
##$TPNAME6= <>
##$TPNAME7= <>
##$TPOAL= (0..7)
0.5 0.5 0.5 0.5 0.5 0.5 0.5 0.5 
##$TPOFFS= (0..7)
0 0 0 0 0 0 0 0 
##$TUNHIN= 0
##$TUNHOUT= 0
##$TUNXOUT= 0
##$USERA1= <user>
##$USERA2= <user>
##$USERA3= <user>
##$USERA4= <user>
##$USERA5= <user>
##$V9= 5
##$VALIST= <valist>
##$VCLIST= <CCCCCCCCCCCCCCC>
##$VD= 0
##$VDLIST= <DDDDDDDDDDDDDDD>
##$VPLIST= <PPPPPPPPPPPPPPP>
##$VTLIST= <TTTTTTTTTTTTTTT>
##$WBST= 1024
##$WBSW= 4
##$XGAIN= (0..3)
0 0 0 0 
##$XL= 0
##$YL= 0
##$YMAX_a= 579562
##$YMIN_a= -613761
##$ZGOPTNS= <>
##$ZL1= 120
##$ZL2= 120
##$ZL3= 120
##$ZL4= 120
##$ABSF1= 15.49788
##$ABSF2= -2.553969
##$ABSG= 5
##$ABSL= 3
##$ALPHA= 0
##$AQORDER= 0
##$ASSFAC= 0
##$ASSFACI= 0
##$ASSFACX= 0
##$ASSWID= 0
##$AUNMP= <proc_1d>
##$AZFE= 0.1
##$AZFW= 0.1
##$BCFW= 0
##$BC_mod= 2
##$BYTORDP= 0
##$COROFFS= 0
##$CY= -3
##$DATMOD= 1
##$DC= 0
##$DFILT= <>
##$DTYPP= 0
##$F1P= 0
##$F2P= 0
##$FCOR= 1
##$FTSIZE= 16384
##$FT_mod= 6
##$GAMMA= 0
##$GB= 0
##$INTBC= 1
##$INTSCL= 3.241238e-09
##$ISEN= 128
##$LB= 0.25
##$LEV0= 0
##$LPBIN= 0
##$MAXI= 10000
##$MC2= 0
##$MEAN= 0
##$ME_mod= 0
##$MI= 1.114404
##$NCOEF= 0
##$NC_proc= -5
##$NLEV= 6
##$NOISF1= 3.799351
##$NOISF2= 2.8
##$NSP= 0
##$NTH_PI= 0
##$NZP= 0
##$OFFSET= 15.50449
##$PC= 1
##$PHC0= -5656.716
##$PHC1= 11.42193
##$PH_mod= 1
##$PKNL= yes
##$PPARMOD= 0
##$PSCAL= 0
##$PSIGN= 0
##$REVERSE= no
##$SF= 200.130003443921
##$SI= 16384
##$SIGF1= 3
##$SIGF2= 2
##$SINO= 0.751879
##$SIOLD= 32768
##$SREGLST= <19F.Aceton>
##$SSB= 0
##$STSI= 16384
##$STSR= 0
##$SW_p= 3612.71676300578
##$SYMM= 0
##$S_DEV= 0
##$TDeff= 16384
##$TDoff= 0
##$TI= <>
##$TILT= no
##$TM1= 0
##$TM2= 0
##$TOPLEV= 0
##$USERP1= <user>
##$USERP2= <user>
##$USERP3= <user>
##$USERP4= <user>
##$USERP5= <user>
##$WDW= 1
##$XDIM= 16384
##$YMAX_p= 303496458
##$YMIN_p= -653643
$$ End of Bruker specific parameters
$$ ---------------------------------
##NTUPLES= NMR SPECTRUM
##VAR_NAME=  FREQUENCY,     SPECTRUM/REAL,   SPECTRUM/IMAG
##SYMBOL=    X,             R,               I
##VAR_TYPE=  INDEPENDENT,   DEPENDENT,       DEPENDENT
##VAR_FORM=  AFFN,          ASDF,            ASDF
##VAR_DIM=   16384,         16384,           16384
##UNITS=     HZ,            ARBITRARY UNITS, ARBITRARY UNITS
##FACTOR=    0.220516191357247, 1,           1
##FIRST=     3102.91361681939, 0,            0
##LAST=      -509.803146186385, 0,           0
##MIN=       -509.803146186385, -653643,     0
##MAX=       3102.91361681939, 303496458,    0
$$ Real data points
##PAGE= N=1
##DATA TABLE= (X++(R..R)), XYDATA
$$ [...]
$$ plain form
6773 161214 65342 6217 -34500 -101230 -8892 23764 -38255 -47807 -98113 36750 51945 91620
6761 91620 36683 -48806 -98811 -146103 -136863 2 -84998 -157056 -9617 2936 -10643 33512
6749 33512 -10948 -56732 -160500 -152066 -202320 -203105 -43885 -70964 -154143 -252447 -144899 -174289
6737 -174289 -144621 -104955 -63589 -144387 -27677 28660 -56478 -46540 -190193 -194754 -134765 -67166
6725 -67166 -150405 -127779 -19357 -36810 -121051 -170240 -145054 -166511 -48998 12015 46115
6714 46115 31235 21360 44221 -111031 -126721 -124922 -173301 -116274 131256 47472 29883 13494
6702 13494 97014 71178 6854 85990 -48894 -94746 -65747 -55169 -25348 75669 9756
6691 9756 28318 -391 -149004 -55442 -120192 -22441 -97736 -253532 -308292 -319485 -187082
$$ packed form
6773A61214r5872n9125m0717o6730R2338L2656o2019r552n0306J34863J5195L9675
6761I1620n4937q5489n0005m7292R240J36865q5000p2058J47439J2553j3579M4155
6749C3512m4460m5784j03768Q434n0254p85J59220k7079q3179r8304J07548k9390
6737a74289K9668L9666M1366q0798J16710N6337q5138R938j43653m561N9989O7599
6725f7166q3239K2626J08422j7453q4241m9189K5186k1457J17513O1013L4100
6714D6115j4880r875K2861j55252j5690J799m8379N7027K47530q3784j7589j6389
6702A3494Q3520k5836o4324P9136j34884m5852K8999J0578K9821J01017o5913
6691I756J8562k8709j48613R3562o4750R7751p5295j55796n4760j1193J32403
$$ plain form
6680 -187082 -45228 8027 -45780 7303 34257 160649 1734 -37328 44454 98786 90542
6669 90542 -11953 -4402 -12487 -32192 -146943 -175595 -155950 -137925 -228519 -280551 -215674 -124756
6657 -124756 -63102 -172038 -152767 -87841 -118583 -174885 -156422 -86690 -86151 -19930 1426 -59386
6645 -59386 -92717 39827 7743 -20182 69972 -109877 -102028 -141965 -258951 -325812 -158289
6634 -158289 -69358 -113543 -211124 -187508 -188957 16442 -2900 -33517 4988 -83943 -66815 17052
6622 17052 -124481 -122688 4191 -22641 -82938 -182068 -153900 13452 -34007 -205 42233
6611 42233 14785 -22221 -34545 -139296 -176668 5302 56232 -24071 -82514 4735 -1256 39175
6599 39175 70486 -65753 -162851 -190399 -192243 -213926 -170826 -95919 -58266 -216719 -272845 -282426
$$ packed form
6680a87082J41854N3255n3807N3083K6954J26392j58915l9062Q1782N4332q244
6669I0542j02495P551q085j9705j14751k8652J9645J8025r0594n2032O4877R0918
6657a24756O1654j08936J9271O4926l0742n6302J8463O9732N39O6221K1356o0812
6645e9386l3331J32544l2084k7925R0154j79849P849l9937j16986o6861J67523
6634a58289Q8931m4185r7581K3616j449K05399j9342l0617L8505q8931J7128Q3867
6622A7052j41533J793J26879k6832o0297r9130K8168J67352m7459L3802M2438
6611D2233k7448l7006j2324j04751l7372J81970N0930q0303n8443Q7249n991M0431
6599C9175L1311j36239r7098k7548j844k1683M3100P4907L7653j58453n6126r581
$$ plain form
6587 -282426 -220428 -193469 -144997 -193056 -154722 -36153 -78668 -9286 19643 -9868 -56483
6576 -56483 -129159 -111909 -151965 -159779 -105799 29033 -34411 -147241 -172616 -141359 -97717 -128780
6564 -128780 -89373 -273704 -140582 -196918 -164555 -163127 -50759 -159546 -83963 -65309 63509
6553 63509 157389 -78651 6873 86354 183635 245419 -41007 -61000 -6510 92695 -47707
6542 -47707 11275 -136369 -177044 -321895 -312023 -240659 -228991 -194079 -249993 -147855 -153883 -203864
6530 -203864 -193712 -122949 -94956 -103371 -42465 282 -23742 -66256 -41896 4133 48118 68635
6518 68635 -96607 -208571 -115464 -55038 -160787 -247789 -283138 -247853 -283026 -234267 -294523
6507 -294523 -233387 -340205 -320627 -176372 -222151 -252560 -223324 -180481 -121890 -102340 -184133
$$ packed form
6587b82426O1998K6959M8472m8059L8334J18569m2515O9382K8929k9511m6615
6576e6483p2676J7250m0056p814N3980J34832o3444j12830k5375L1257M3642l1063
6564a28780L9407j84331J33122n6336L2363J428J12368j08787P5583J8654J28818
6553F3509R3880k36040Q5524P9481R7281O1784k86426j9993N4490R9205j40402
6542d7707N8982j47644m0675j44851R872P1364J1668L4912n5914J02138o028m9981
6530b03864J0152P0763K7993q415O0906M2747k4024m2514K4360M6029M3985K0517
6518F8635j65242j11964R3107O0426j05749q7002l5349L5285l5173M8759o0256
6507b94523O1136j06818J9578J44255m5779l0409K9236M2843N8591J9550q1793
$$ plain form
6496 -184133 -245922 -69518 -41050 130431 92367 -38091 -266919 -233677 -182932 -173662 -141349
6485 -141349 -133055 -104384 -111311 -148173 -192797 -49035 -25528 -126105 -262299 -313515 -153532
6474 -153532 -140634 -190156 -169094 -68900 -156135 -167007 -192585 -161538 -6920 -20950 28978
6463 28978 -51310 -71551 -181336 -129293 -100012 -80378 -86059 -36009 39889 2851 -95217 -33571
6451 -33571 108725 80181 -104380 -143743 -183014 -70153 13565 -140614 -96664 -75743 -54657
6440 -54657 -87634 -82110 -118109 -186479 -124299 -157769 -205921 -285374 -304804 -405051 -409268 -184012
6428 -184012 -200448 -68978 -152574 -193136 -177891 -141731 -224264 -216800 -236513 -171857 -90908 -115656
6416 -115656 -50572 -60753 -38850 -139179 -254259 -148844 -61979 -120418 -118870 -88312 -205617
$$ packed form
6496a84133o1789J76404K8468J71481l8064j30458k28828L3242N0745R270L2313
6485a41349Q294K8671o927l6862m4624J43762K3507j00577j36194n1216J59983
6474a53532J2898m9522K1062J00194q7235j0872k5578L1047J54618j4030M9928
6463B8978q0288k0241j09785N2043K9281J9634n681N0050P5898l7038r8068O1646
6451c3571J42296k8544j84561l9363l9271J12861Q3718j54179M3950K0921K1086
6440e4657l2977N524l5999o8370O2180l3470m8152p9453j9430j00247m217K25256
6428a84012j6436J31470q3596m0562J5245L6160q2533P464j9713O4656Q0949k4748
6416a15656O5084j0181K1903j00329j15080J05415Q6865n8439J548L0558j17305
$$ plain form
6405 -205617 -161131 -118966 -108902 -69182 -116075 -191320 -165977 -149192 -65648 -98647 -104320 -130916
6393 -130916 -85816 -69104 -132874 -47273 -878 74722 265 -2869 -61073 -20323 -40604 -113497
6381 -113497 -91740 -102893 -1148 -93335 -8167 -17314 -107333 -71231 -205920 -149249 -211396
6370 -211396 -284424 -244738 -81543 -146578 -29778 -32193 -39107 -32811 -164211 -127856 -114664 -146427
6358 -146427 -266927 -359872 -181249 -80907 -141083 -141063 -31351 -34392 28544 -39640 -144559
6347 -144559 -338347 -344158 -309128 -220809 -206040 -254700 -253358 -211180 -103723 -214761 -268072
6336 -268072 -324046 -320931 -360417 -275779 -229602 -210936 -191661 -146182 -33370 2192 -81037 37109
6324 37109 96428 213597 116755 -60709 18814 -81279 -176853 -113572 -72741 -16926 -78128
$$ packed form
6405b05617M4486M2165J0064L9720m6893p5245K5343J6785Q3544l2999n673k6596
6393a30916M5100J6712o3770Q5601M6395P5600p4457l134n8204M0750k0281p2893
6381a13497K1757j1153J01745r2187Q5168r147r0019L6102j34689N6671o2147
6370b11396p3028L9686J63195o5035J16800k415o914O296j31400L6355J3192l1763
6358a46427j20500r2945J78623J00342o0176K0J09712l041O2936o8184j04919
6347a44559j93788n811L5030Q8319J4769m8660J342M2178J07457j11038n3311
6336b68072n5974L115l9486Q4638M6177J8666J9275M5479J12812L5562q3229J18146
6324C7109N9319J17169r6842j77464P9523j00093r5574O3281M0831N5815o1202
$$ plain form
6313 -78128 -162681 -122118 -45494 -102515 -192950 -151177 -79247 -11944 -180572 -6435 65144
6302 65144 16026 -117808 885 153162 167407 71250 -3439 -88323 -46609 -34165 -194212
6291 -194212 -214996 -167262 -268638 -130179 7369 103656 120203 1000 -46782 -207232 -271064
6280 -271064 -272950 -140191 -129112 -168478 -218244 -105221 -28255 6357 -96469 -76076 -23797
6269 -23797 -48864 -51318 -118152 -71850 -16644 -66299 -8876 37930 -6500 3920 75321 -29270
6257 -29270 -19780 -78165 -7523 -12404 -27980 -92911 -353970 -250640 -155730 -76800 -61599 -132564
6245 -132564 -168652 -60389 49443 52757 211848 155222 141628 107744 141035 98588 53416
6234 53416 94476 147619 135203 26749 -33028 -97494 -54009 21668 -62631 -182035 -353929
$$ packed form
6313g8128q4553M0563P6624n7021r0435M1773P1930O7303j68628J74137P1579
6302F5144m9118j33834J18693J52277J4245r6157p4689q4884M1714J2444j60047
6291a94212k0784M7734j01376J38459J37548R6287J6547j19203m7782j60450o3832
6280b71064j886J32759J1079l9366m9766J13023P6966L4612j02826K0393N2279
6269b3797k5067k454o6834M6302N5206m9655N7423M6806m4430J0420P1401j04591
6257b9270R490n8385P0642m881j5576o4931k61059J03330R4910P8930J5201p0965
6245a32564l6088J08263J09832L314J59091n6626j3594l3884L3291m2447m5172
6234E3416M1060N3143j2416j08454n9777o4466M3485P5677q4299j19404j71894
$$ plain form
6223 -353929 -370632 -182019 -45133 18500 7127 -96299 -114993 -30995 73684 63735 75181
6212 75181 107778 84234 108178 79176 72681 77816 13007 -34106 42534 -5710 -133134 -231306
6200 -231306 -139724 -69787 -51022 -93107 -167362 -275583 -264477 -235923 -182117 -50566 -157685
6189 -157685 -318399 -316330 -129719 -129565 -139802 -158776 -83727 40120 -35726 -62188 -38107 -88909
6177 -88909 -157887 -117457 -17814 -75376 -146553 -204144 -169754 -112267 -57357 -235046 -243406 -166836
6165 -166836 -165722 -81711 -240908 -290322 -229791 -151379 -221730 -210579 -167970 -134789 12702
6154 12702 -29661 -136671 -111458 -137752 -200797 -118024 -122501 -107012 10471 -47938 44485 10866
6142 10866 23604 -49468 -115626 -137953 -50003 -193063 -156720 15992 -37541 -127341 -158738
$$ packed form
6223c53929j6703J88613J36886O3633j1373j03426j8694Q3998J04679r949J1446
6212G5181L2597k3544K3944k9002o495N135o4809m7113P6640m8244j27424r8172
6200b31306R1582O9937J8765m2085p4255j08221J1106K8554N3806J31551j07119
6189a57685j60714K069J86611J54j0237j8974P5049J23847p5846k6462K4081n0802
6177h8909o8978M0430R9643n7562p1177n7591L4390N7487N4910j77689q360P6570
6165a66836J114Q4011j59197m9414O0531P8412p0351J1151M2609L3181J47491
6154A2702m2363j07010K5213k6294o3045Q2773m477J5489J17483n8409R2423l3619
6142A0866J2738p3072o6158k2327Q7950j43060L6343J72712n3533q9800l1397
$$ plain form
6131 -158738 -114062 -192904 -123197 -81940 -227658 -208513 -31452 2341 -140360 -71438 -167410
6120 -167410 -241731 -118340 -109659 -145527 -190060 -129244 -138279 -133232 -123398 -174504 -136342 11995
6108 11995 119701 13567 -11370 -64602 -75858 15154 -103838 -42477 -24904 6958 -38393
6097 -38393 -94790 -4014 6017 50318 -39088 -36945 -123218 -353090 -321717 -173590 -182393 -255756
6085 -255756 -209556 -205906 -178286 -277811 -292520 -105174 59801 73556 -77993 -43041 105897
6074 105897 172345 231351 127180 99110 13875 24570 104867 163427 32300 -89109 -85336
6063 -85336 -40650 -38949 -58849 -81334 -50887 13734 108410 47561 -81987 -148481 -53526 29674
6051 29674 37459 -15776 -148812 -130433 56585 177540 34904 -127636 -98833 -192391 -221581
$$ packed form
6131a58738M4676p8842O9707M1257j45718J9145J77061L3793j42701O8922r5972
6120a67410p4321J23391Q681l5868m4533O0816r035N047R834n1106L8162J48337
6108A1995J07706j06134k4937n3232j1256R1012j18992O1361J7573L1862m5351
6097c8393n6397R0776J0031M4301q9406K143q6273k29872L1373J48127q803p3363
6085b55756M6200L650K7620r9525j4709J87346J64975J3755j51549L4952J48938
6074A05897O6448N9006j04171k8070q5235J0695Q0297N8560j31127j21409L773
6063h5336M4686J701j9900k2485L0447O4621R4676o0849j29548o6494R4955Q3200
6051B9674P785n3235j33036J8379J87018J20955j42636j62540K8803r3558k9190
$$ plain form
6040 -221581 -204482 -53233 -8065 -117403 -27471 -86015 -113725 -115546 -104295 -187129 -169845
6029 -169845 -275098 -186756 -125415 -80809 -88114 -90641 -145888 -102834 59941 48542 -45390 53245
6017 53245 -83505 -90420 62167 26186 57691 91047 -28561 -31900 31226 -904 -49179 55588
6005 55588 63205 173029 38159 -65277 132667 219519 181747 129061 148956 -11479 180328
5994 180328 104399 142392 260823 258899 364246 433700 560398 532057 521999 687399 814085
5983 814085 947709 1018429 1167478 1307237 1740664 1841641 1834562 1713918 1517545 1469543
5973 1469543 1431995 1456531 1540413 1611481 1742788 2061800 2170164 2166962 2012612 1776539 1734270
5962 1734270 1496573 1431730 1487493 1474591 1574163 1690254 1750100 1848337 2073584 2466132 3013708
$$ packed form
6040b21581J7099J51249M5168j09338Q9932n8544k7710j821J1251q2834J7284
6029a69845j05253Q8342O1341M4606p305k527n5247M3054J62775j1399r3932R8635
6017E3245j36750o915J52587l5981L1505L3356j19608l339O3126l2130m8275J04767
6005E5588P617J09824j34870j03436J97944Q6852l7772n2686J9895j60435J91807
5994A80328p5929L7993J18431j924J05347O9454J26698k8341j0058J65400J26686
5983H14085J33624P0720J49049J39759M33427J00977p079j20644j96373m8002
5973A469543l7548K4536Q3882P1068J31307L19012J08364l202j54350k36073m2269
5962A734270k37697o4843N5763j2902R9572J16091N9846R8237K25247L92548N47576
$$ plain form
5951 3013708 3407924 3957247 4460163 4812230 5019916 5060213 4831130 4580664 4477565 4370700
5941 4370700 4465218 4700876 5114062 5367854 5424398 5338749 5082298 4713354 4285048 3863283
5931 3863283 3236972 2700045 2378871 2185573 2036992 1840847 1567588 1377120 1313520 1051298
5921 1051298 873398 799223 779716 709706 610506 670483 525127 459744 421720 479981 571181
5910 571181 548009 353335 220387 333694 306551 303146 361589 389239 409775 286470 221644
5899 221644 233387 272295 283701 299964 280334 306426 363747 379433 482594 536274 535902 384433
5887 384433 278327 225377 255457 319543 211009 91354 105815 76303 86649 153913 159411
5876 159411 159503 249971 152819 207445 329979 224585 179308 269001 369250 272606 333889 282073
$$ packed form
5951C013708L94216N49323N02916L52067K07686M0297k29083k50466j03099j06865
5941D370700R4518K35658M13186K53792N6544q5649k56451l68944m28306m21765
5931C863283o26311n36927l21174j93298j48581j96145k73259j90468o3600k62222
5921A051298j77900p4175j9507p0010r9200N9977j45356o5383l8024N8261R1200
5910E71181k3172j94674j32948J13307k7143l405N8443K7650K0536j23305o4826
5899B21644J1743L8908J1406J6263j9630K6092N7321J5686J03161N3680l72j51469
5887C84433j06106n2950L0080O4086j08534j19655J4461k9512J0346O7264N498
5876A59411R2R0468r7152N4626J22534j05394m5277Q9693J00249r6644O1283n1816
$$ plain form
5864 282073 362080 368109 287504 297381 391978 431497 336502 337465 415452 562154 610590 550663
5852 550663 596794 379831 430230 510445 539707 556558 636440 591992 669150 704222 538217
5841 538217 525743 628818 760396 618291 562127 409684 330846 344104 342900 330099 210264
5830 210264 195096 235255 219220 230084 279902 298306 241170 298256 210390 133266 44754 126567
5818 126567 157682 225974 215982 146472 91206 71133 214223 230844 158906 83505 21443 51324
5806 51324 81800 92959 193095 263643 228774 122310 37237 174430 302342 264669 111974
5795 111974 77328 213682 246938 198502 99823 62719 154813 335443 268903 239271 153446
5784 153446 125002 149355 310011 410960 188390 59595 77610 214451 112450 95756
$$ packed form
5864B82073Q0007O029q0605R877R4597L9519r4995R63P7987J46702M8436n9927
5852E50663M6131k16963N0399Q0215K9262J6851P9882m4448P7158L5072j66005
5841E38217j2474J03075J31578j42105n6164j52443p8838J3258j204j2801j19835
5830B10264j5168M0159j6035J0864M9818J8404n7136N7086q7866p7124q8512Q1813
5818A26567L1115O8292r992o9510n5266k0073J43090J6621p1938p5401o2062K9881
5806E1324L0476J1159J00136P0548l4869j06464q5073J37193J27912l7673j52695
5795A11974l4646J36354L3256m8436r8679l7104R2094J80630o6540k9632q5825
5784A53446k8444K4353J60656J00949k22570j28795J8015J36841j02001j6694
$$ plain form
5774 95756 98474 45985 54695 97721 176019 196579 332093 407249 450416 462741 555396 614801
5762 614801 706919 881229 969210 1100261 1241073 1379207 1477979 1683575 2061781 2428928
5752 2428928 2931553 3864729 5162165 7328200 10199116 13602034 16448786 16596354 14697005
5743 14697005 12345488 9924965 8025308 6449579 5336013 4384404 3677900 3157563 2839876
5734 2839876 2473351 2280183 1989069 1830436 1702896 1391451 1173735 976608 1023329 1011112
5724 1011112 860076 763164 671510 608936 565540 665566 661984 574405 454172 481246 708547
5713 708547 697077 671171 630162 701098 561543 636982 631114 812702 873782 911240 848259
5702 848259 851533 751574 568401 671636 850946 847103 848319 750121 738023 767364 870652
$$ packed form
5774I5756K718n2489Q710M3026P8298K0560J35514P5156M3167J2325R2655N9405
5762F14801R2118J74310Q7981J31051J40812J38134R8772K05596L78206L67147
5752B428928N02625R33176J297436K166035K870916L402918K846752J47568j899349
5743A4697005k351517k420523j899657j575729j113566r51609p06504n20337l17687
5734B839876l66525j93168k91114j58633j27540l11445k17716j97127M6721j2217
5724A011112j51036r6912r1654o2574m3396J00026l582q7579j20233K7074K27301
5713G08547j1470k5906m1009P0936j39555P5439n868J81588O1080L7458o2981
5702H48259L274r9959j83173J03235J79310l843J216r8198j2098K9341J03288
$$ plain form
5691 870652 763321 762306 689917 761175 840313 703182 525683 470169 513870 590377 501712
5680 501712 264200 292980 414412 372235 397767 371782 320851 445361 343799 478437 471320
5669 471320 490769 372902 374809 314339 362771 359901 289750 430127 499524 470907 620126
5658 620126 731792 648170 390437 417085 380105 460049 534424 581123 620192 456168 333515
5647 333515 409951 360771 450811 427259 405947 407082 388961 343036 273477 317165 254637 227160
5635 227160 139613 156761 34384 47485 63725 44457 84376 -31731 -85710 126867 259669
5624 259669 220585 259099 330810 373615 581993 619319 702165 701445 885411 1172821 1257437
5613 1257437 1340812 1379687 1357014 1498787 1688039 1863361 2035624 2071222 1940894 1957943
$$ packed form
5691H70652j07331j015p2389P1258P9138j37131j77499n5514M3701P6507q8665
5680E01712k37512K8780J21432m2177K5532k5985n0931J24510j01562J34638p117
5669D71320J9449j17867J907o0470M8432k870p0151J40377O9397k8617J49219
5658F20126J11666q3622k57733K6648l6980P9944P4375M6699L9069j64024j22653
5647C33515P6436m9180R0040k3552k1312J135j8121m5925o9559M3688o2528k7477
5635B27160q7547J7148j22377J3101J6240j9268L9919j16107n3979K12577J32802
5624B59669l9084L8514P1711M2805K08378L7326Q2846p20J83966K87410Q4616
5613A257437Q3375L8875k2673J41773J89252J75322J72263L5598j30328J7049
$$ plain form
5603 1957943 1997157 2049439 2115302 2110281 1966969 1922029 1971665 1915711 1998014 2090496 2143772
5592 2143772 2218181 2167746 2175537 2184833 2243533 2335960 2304464 2206088 2334919 2335577 2538827 2715823
5580 2715823 2798518 2827006 2794199 2909906 2948780 2883893 3035760 3173069 3253032 3542790 3615145
5569 3615145 3774083 4007072 4310800 4665792 5080034 5566666 6179673 6657442 7296948 7981812
5559 7981812 8583723 9255782 10260515 11330082 12695400 14131404 15741105 17554982 19631550
5550 19631550 22198126 25564321 29812004 35279365 42266410 51154649 62128608 75247655
5542 75247655 89994465 104441853 116011314 122270941 123036246 120150156 115589879 111964634
5534 111964634 110711370 112720792 117993346 124648204 130570666 133104948 129924098 121205270
$$ packed form
5603A957943L9214N2282O5863n021j43312m4940M9636n5954Q2303R2482N3276
5592B143772P4409n0435P791R296N8700R2427l1496r8376J28831O58K03250J76996
5580B715823Q2695K8488l2807J15707L8874o4887J51867J37309P9963K89758P2355
5569C615145J58938K32989L03728L54992M14242M86632O13007M77769O39506O84864
5559G981812O01911O72059J004733J069567J365318J436004J609701J813877K076568
5550A9631550K566576L366195M247683N467361O987045Q888239J0973959J3119047
5542G5247655J4746810J4447388J1569461O259627P65305k886090m560277l625245
5534A11964634j253264K009422N272554O654858N922462K534282l180850q718828
$$ plain form
5526 121205270 109493389 96368144 83414258 71704857 61623478 52939903 45638081
5519 45638081 40025845 35440921 31526316 28293484 25370001 22937087 20769091 19072943
5511 19072943 17374269 15878136 14926136 14014200 13067642 12208264 11353062 10701135 10132003
5502 10132003 9611350 9225791 9013240 8529309 8265187 8068049 7906735 7806616 7536525
5493 7536525 7270920 7043732 7049526 6957630 6711145 6363723 6257739 6227931 6016002 5760263
5483 5760263 5620364 5559365 5361666 5252432 5026117 4828523 4884749 4688680 4553528 4467078
5473 4467078 4419697 4389274 4472052 4355603 4291202 4135633 4077021 4050031 3951860 3746613 3663151
5462 3663151 3690648 3702828 3716557 3677042 3589237 3611901 3542463 3517768 3440138 3325895 2984584
$$ packed form
5526A21205270j1711881j3125245j2953886j1709401j0081379q683575p301822
5519D5638081n612236m584924l914605l232832k923483k432914k167996j696148
5511A9072943j698674j496133r52000r11936r46558q59378q55202o51927n69132
5502A0132003n20653l85559k12551m83931k64122j97138j61314j00119k70091
5493G536525k65605k27188N794r1896k46485l47422j05984k9808k11929k55739
5483E760263j39899o0999j97699j09234k26315j97594N6226j96069j35152q6450
5473D467078m7381l0423Q2778j16449o4401j55569n8612k6990r8171k05247q3462
5462C663151K7497J2180J3729l9515q7805K2664o9438k4695p7630j14243l41311
$$ plain form
5451 2984584 2863776 2788941 2806044 2830348 2754814 2717289 2770844 2724531 2618951 2485449 2353615
5440 2353615 2378792 2357142 2388731 2211133 2286002 2380026 2360743 2340823 2383270 2405932 2364016
5429 2364016 2447035 2414504 2305206 2263076 2284268 2186623 2072813 2331993 2177226 2060044
5419 2060044 2016527 2047526 1935084 1953150 1883615 1739756 1725494 1737744 1723480 1703863 1660934
5408 1660934 1514249 1416330 1334415 1104251 1082501 1201034 1201426 1149831 1166830 1259882 1332711
5397 1332711 1289394 1270714 1225258 1318847 1446061 1343072 1237281 1234245 1211819 1396169 1624316
5386 1624316 1538198 1526952 1643302 1657916 1670248 1761578 1742583 1752966 1739879 1721734 1698285
5375 1698285 1838647 2035013 2074131 1983426 2057943 2143920 2134268 2198285 2353777 2361462 2279243
$$ packed form
5451B984584j20808p4835J7103K4304p5534l7525N3555m6313j05580j33502j31834
5440B353615K5177k1650L1589j77598P4869R4024j9283j9920M2447K2662m1916
5429B364016Q3019l2531j09298m2130K1192r7645j13810K59180j54767j17182
5419B060044m3517L0999j12442J8066o9535j43859j4262J2250j4264j9617m2929
5408A660934j46685r7919q1915k30164k1750J18533L92n1595J6999R3052P2829
5397A332711m3317j8680m5456R3589J27214j02989j05791l036k2426J84350K28147
5386A624316q6118j1246J16350J4614J2332R1330j8995J0383j3087j8145k3449
5375A698285J40362J96366L9118r0705P4517Q5977r652O4017J55492P685q2219
$$ plain form
5364 2279243 2204828 1967462 1794546 1913719 2017921 1905560 1816282 1816558 1828109 1991074 2010369
5353 2010369 1915186 1900456 1839708 1627106 1483464 1594188 1773191 1860928 1843160 1832302 1766395
5342 1766395 2056480 2284792 2228486 2244058 2296269 2251867 2204681 2366759 2322489 2385780 2612194
5331 2612194 2680974 2790782 3187224 3559742 3821079 4077767 4277113 4534309 4753668 5130593
5321 5130593 5446683 5906928 6529720 7236876 8101141 9438246 10795388 12570860 14845958
5312 14845958 17773082 22009374 28160037 36690151 47540767 58461647 65425967 65715096
5304 65715096 61063958 54646267 48612730 44372499 42447591 43333328 47210709 54282604
5296 54282604 63211361 70401103 71256049 65636981 57056585 47809884 39669875 33066744
$$ packed form
5364B279243p4415k37366j72916J19173J04202j12361q9278K76J1551J62965J9295
5353B010369r5183j4730o0748k12602j43642J10724J79003Q7737j7768j0858o5907
5342A766395K90085K28312n6306J5572N2211m4402m7186J62078m4270O3291K26414
5331B612194O8780J09808L96442L72518K61337K56688J99346K57196K19359L76925
5321E130593L16090M60245O22792P07156Q64265J337105J357142J775472K275098
5312A4845958K927124M236292O150663Q530114J0850616J0920880O964320K89129
5304F5715096m651138o417691o033537m240231j924908Q85737L877381P071895
5296E4282604Q928757P189742Q54946n619068q580396r246701q140009o603131
$$ plain form
5288 33066744 27619005 23406802 19949362 17424145 15325962 13802240 12337533 11063289
5280 11063289 9921705 8906419 7941381 7272824 7002588 6592652 6208743 5928933 5554285
5271 5554285 5254400 4843035 4552306 4351147 4328780 4037485 3823781 3813396 3724460 3610592
5261 3610592 3478915 3470359 3445935 3278041 3163153 3018305 2898158 2873540 2989369 2826910
5251 2826910 2764843 2756542 2493290 2492801 2552315 2628467 2591269 2537177 2427842 2197637 2216917
5240 2216917 2234543 2231749 2256864 2203652 2092320 2079410 2089291 2090554 2217815 2062740 1948468
5229 1948468 1856761 1784066 1987897 2172349 2132091 2185885 2139555 2103308 2082799 2094174 2042985
5218 2042985 1985295 1926177 1915155 1743168 1787638 1980822 2065420 1917475 1750098 1605416
$$ packed form
5288C3066744n447739m212203l457440k525217k098183j523722j464707j274244
5280A1063289j141584j015286r65038o68557k70236m09936l83909k79810l74648
5271E554285k99885m11365k90729k01159k2367k91295k13704j0385q8936j13868
5261C610592j31677q556k4424j67894j14888j44848j20147k4618J15829j62459
5251B826910o2067q301k63252m89N9514P6152l7198n4092j09335k30205J9280
5240B216917J7626k794K5115n3212j11332j2910R881J263J27261j55075j14272
5229A948468r1707p2695K03831J84452m0258N3794m6330l6247k0509J1375n1189
5218B042985n7690n9118j1022j71987M4470J93184Q4598j47945j67377j44682
$$ plain form
5208 1605416 1567607 1627664 1603129 1413602 1280739 1300859 1310488 1304228 1316779 1342639 1290918
5197 1290918 1065109 974260 939643 1065434 1125440 1081920 987828 850049 952872 1146704
5187 1146704 1153496 1110066 1156747 1060502 882185 889449 910393 993930 994568 1027675 1005814 1033814
5175 1033814 1106528 1075852 942840 824514 680453 603744 579823 639707 625177 508311 501101
5164 501101 444600 478479 416746 367121 352963 381342 409098 344956 305081 320638 421100
5153 421100 459865 436211 459649 401854 418227 553259 638827 631144 615259 529398 471782 502761
5141 502761 479129 446279 477369 478146 398037 358773 388792 435880 554607 496713 412009 443387
5129 443387 493272 472760 326734 351272 377610 318339 365935 325685 307303 350465 411204
$$ packed form
5208A605416l7809O0057k4535j89527j32863K0120R629o260J2551K5860n1721
5197A290918k25809r0849l4617J25791O0006m3520r4092j37779J02823J93832
5187A146704O792m3430M6681r6245j78317P264K0944Q3537O38L3107k1861K8000
5175A033814P2714l0676j33012j18326j44061p6709k3921N9884j4530j16866p210
5164E01101n6501L3879o1733m9625j4158K8379K7756o4142l9875J5557J00462
5153D21100L8765k3654K3438n7795J6373J35032Q5568p683j5885q5861n7616L0979
5141E02761k3632l2850L1090P77q0109l9264L0019M7088J18727n7894q4704L1378
5129D43387M9885k0512j46026K4538K6338n9271M7596m0250j8382M3162O0739
$$ plain form
5118 411204 497507 455280 349250 297426 198408 343728 487095 367134 251062 411495
5108 411495 481656 456660 396239 383567 396170 414721 496723 462039 498998 507278 522715 593728
5096 593728 610173 544584 352404 261408 434572 559264 524200 508317 552964 560688 687712
5085 687712 587110 555455 580695 490975 540370 557037 480439 505663 472732 439215 449470
5074 449470 459832 591345 607822 462332 355944 364484 342243 433610 487581 624409 503423
5063 503423 573553 603744 618372 646367 677986 639568 528620 559989 587257 600223 679148
5052 679148 792105 783357 644812 782992 782925 766333 788466 921819 764498 815378 744536
5041 744536 638911 793408 813476 627861 513693 562915 591767 736811 857213 745674
$$ packed form
5118D11204Q6303m2227j06030n1824r9018J45320J43367j19961j16072J60433
5108D11495P0161k4996o0421j2672J2603J8551Q2002l4684L6959Q280J5437P1013
5096E93728J6445o5589j92180r0996J73164J24692l5064j5883M4647P724J27024
5085F87712j00602l1655K5240q9720M9395J6667p6598K5224l2931l3517J0255
5074D49470J0362J31513J6477j45490j06388Q540k2241R1367N3971J36828j20986
5063E03423P0130L0191J4628K7995L1619l8418j10948L1369K7268J2966P8925
5052F79148J12957q748j38545J38180o7j6592K2133J33353j57321N0880p0842
5041G44536j05625J54497K0068j85615j14168M9222K8852J45044J20402j11539
$$ plain form
5031 745674 564411 516638 519409 462759 401638 559706 516930 395923 556246 597928 484794
5020 484794 546420 598928 658603 778556 785062 537382 548349 610838 714462 656853 770107
5009 770107 644839 718598 817858 737905 719257 836471 824465 797839 770493 820475 781066
4998 781066 868213 1095679 1066315 949525 1011976 1076098 1277185 1434050 1331347 1186225
4988 1186225 1174623 1037991 907959 922513 902098 875067 879130 912342 880878 879758 818078
4977 818078 780376 716600 860189 766094 604045 668609 701564 646353 575179 592427 549529
4966 549529 473260 397527 481706 554061 572582 562609 484926 540860 487356 450536 533805 750174
4954 750174 691171 699122 664209 565596 760703 707919 684871 633361 760737 804702 782892
$$ packed form
5031G45674j81263m7773K771n6650o1121J58068m2776j21007J60323M1682j13134
5020D84794O1626N2508N9675J19953O506k47680J0967O2489J03624n7609J13254
5009G70107j25268P3759R9260p9953j8648J17214j2006k6626k7346M9982l9409
4998G81066Q7147K27466k9364j16790O2451O4122K01087J56865j02703j45122
4988A186225j1602j36632j30032J4554k0415k7031M063L3212l1464j120o1680
4977H18078l7702o3776J43589r4095j62049O4564L2955n5211p1174J7248m2898
4966E49529p6269p5733Q4179P2355J8521r973p7683N5934n3504l6820Q3269K16369
4954G50174n9003P951l4913r8613J95107n2784k3048n1510J27376M3965k1810
$$ plain form
4943 782892 818736 947123 853677 906053 985593 705618 715504 823025 735820 851972 870274
4932 870274 860817 781290 789326 700772 677885 749496 732975 732411 747648 664739 594566 708570
4920 708570 716430 698210 795214 748876 752979 845302 838118 889564 865889 841120 688232 846728
4908 846728 858773 895425 802525 695899 731843 805439 664020 590760 796835 887192 801360
4897 801360 806095 636632 826596 1089006 1060449 823582 913712 900078 805214 934828 961391
4886 961391 893366 963467 964677 824403 901213 931351 900492 959505 910044 970492 915022 919253
4874 919253 1005519 859731 821928 905332 854959 979878 983278 827839 1004716 1135453 1109488
4863 1109488 1124973 1131020 1061214 1048057 1090994 1146600 1244663 1368664 1308483 1424078 1682891
$$ packed form
4943G82892L5844J28387r3446N2376P9540k79975R886J07521q7205J16152J8302
4932H70274r457p9527Q036q8554k2887P1611j6521n64J5237q2909p0173J14004
4920G08570P860j8220R7004m6338M103R2323p184N1446k3675k4769j52888J58496
4908H46728J2045L6652r2900j06626L5944P3596j41419p3260K06075R0357q5832
4897H01360M735j69463J89964K62410k8557k36867R0130j3634r4864J29614K6563
4886I61391o8025P0101J210j40274P6810L0138l0859N9013m9461O0448n5470M231
4874I19253Q6266j45788l7803Q3404n0373J24919L400j55439J76877J30737k5965
4863A109488J5485O047o9806j3157M2937N5606R8063J24001o0181J15595K58813
$$ plain form
4852 1682891 1827323 1780698 1704707 1710952 1704708 1528955 1425896 1413616 1498859 1373972 1374109
4841 1374109 1486792 1478622 1529336 1592324 1603142 1597530 1515476 1557103 1672975 1733465 1774314
4830 1774314 1781200 1632666 1905905 2147605 2290189 2581735 2862243 3097605 3779632 4949309
4820 4949309 6535507 8731477 11070078 12558272 12269817 10728749 9206067 7717981
4812 7717981 6583528 5570372 4741264 4105091 3683468 3517522 3288446 3099172 2859786
4803 2859786 2697398 2478259 2422893 2291458 2223960 2253485 2342626 2319875 2214970 2182998 2230112
4792 2230112 2307010 2582691 2520056 2596562 2613271 2851255 3050599 3226994 3413959 3473355
4782 3473355 3430432 3508319 3521855 3627840 3909074 4055087 4344300 4873515 5221895 5218707
$$ packed form
4852A682891J44432m6625p5991O245o244j75753j03059j2280Q5243j24887J37
4841A374109J12683q170N0714O2988J0818n612q2054M1627J15872O0490M0849
4830A774314O886j48534K73239K41700J42584K91546K80508K35362O82027J169677
4820D949309J586198K195970K338601J488194k88455j541068j522682j488086
4812G717981j134453j013156q29108o36173m21623j65946k29076j89274k39386
4803B859786j62388k19139n5366j31435o7498K9525Q9141k2751j04905l1972M7114
4792B230112P6898K75681o2635P6506J6709K37984J99344J76395J86965N9396
4782C473355m2923P7887J3536J05985K81234J46013K89213N29215L48380l188
$$ plain form
4772 5218707 4934582 4715044 4571598 4360058 3992975 3732245 3875535 3887590 3872833 3761427
4762 3761427 3723446 3548269 3352985 3222105 3018436 2955905 2851723 2772254 2692189 2750698
4752 2750698 2795197 2661136 2656992 2712764 2796892 2587840 2587771 2561153 2567502 2524972 2526975 2551159
4740 2551159 2581368 2594736 2392300 2336191 2512352 2614415 2694929 2695607 2759845 2650524 2659322
4729 2659322 2646814 2704830 2624912 2737909 2887793 2790870 2842283 3042895 3185504 3170189 3236947
4718 3236947 3242850 3086621 3111374 3196935 3433254 3529574 3524451 3463097 3380652 3472365 3548685
4707 3548685 3513362 3507860 3646742 3648130 3699054 3740749 3759745 3885383 3958604 3893520 3947571
4696 3947571 4067533 4097976 3936049 3971527 4039461 4154448 4159750 4035137 3992382 4136926 4337955
$$ packed form
4772E218707k84125k19538j43446k11540l67083k60730J43290J2055j4757j11406
4762C761427l7981j75177j95284j30880k03669o2531j04182p9469q0065N8509
4752B750698M4499j34061m144N5772Q4128k09052o9k6618O349m2530K003K4184
4740B551159L0209J3368k02436n6109J76161J02063Q0514O78O4238j09321Q798
4729B659322j2508N8016p9918J12997J49884r6923N1413K00612J42609j5315O6758
4718C236947N903j56229K4753Q5561K36319R6320n123o1354q2445R1713P6320
4707C548685l5323n502J38882J388N0924M1695J8996J25638P3221o5084N4051
4696C947571J19962L0443j61927L5478O7934J14987N302j24613m2755J44544K01029
$$ plain form
4685 4337955 4331707 4310290 4173742 4197011 4080060 4178172 4329872 4247362 4390986 4327661 4338905
4674 4338905 4324433 4458403 4547256 4504226 4575766 4566320 4663871 4826028 4921748 4871615 4872619
4663 4872619 4954309 4812398 4930271 5026458 5209292 5254274 5252912 5248636 5288499 5269418 5258276
4652 5258276 5441937 5427703 5448857 5455216 5539767 5608173 5612837 5683625 5689417 5773425 5760766 5821037
4640 5821037 5887501 6046813 5988030 6033501 6040456 6166236 6285230 6278747 6485252 6550127 6671530
4629 6671530 6840436 7222131 7690262 8200006 8881750 9199127 9158554 8892716 8504804 8160763
4619 8160763 8010602 7745891 7524632 7597873 7684154 7760481 7874972 8120263 8245334 8410269
4609 8410269 8709679 8979231 9340475 9622514 9753281 9928406 10012485 10302059 10490458 11117246
$$ packed form
4685D337955o248k1417j36548K3269j16951R8112J51700q2510J43624o3325J1244
4674D338905j4472J33970Q8853m3030P1540r446R7551J62157R5720n0133J004
4663D872619Q1690j41911J17873R6187J82834M4982j362m276L9863j9081j1142
4652E258276J83661j4234K1154O359Q4551O8406M664P0788N792Q4008j2659O0271
4640E821037O6464J59312n8783M5471O955J25780J18994o483K06505O4875J21403
4629F671530J68906L81695M68131N09744O81744L17377m0573k65838l87912l44041
4619H160763j50161k64711k21259P3241Q6281P6327J14491K45291J25071J64935
4609H410269K99410K69552L61244K82039J30767J75125Q4079K89574J88399O26788
$$ plain form
4599 11117246 11491649 11720826 11908589 11845254 11987549 12077435 12175689 12530284 13064350 13324388
4589 13324388 13269699 13017384 12694671 12504080 12224550 12158446 12085016 12057386 11944445 11582107
4579 11582107 11349394 11005255 10658227 10411781 10418908 10194518 10011532 9730349 9480877 9506978
4569 9506978 9380121 9127191 8930909 8703002 8586161 8366369 8146832 8178121 8143905 8181330
4559 8181330 8324270 8279574 8206883 8181042 8146921 8154765 8191136 8160094 8146789 8241815 8378916
4548 8378916 8342011 8156833 8152660 8039778 8121411 8268249 8464383 8566352 8611566 8679403 8627773
4537 8627773 8618720 8423693 8314690 8213551 8454891 8483708 8425954 8524264 8574888 8655653 8728823
4526 8728823 8772654 8716386 8773230 8874510 8973107 8918868 9076790 9335461 9594035 9916442
$$ packed form
4599A1117246L74403K29177J87763o3335J42295Q9886R8254L54595N34066K60038
4589A3324388n4689k52315l22713j90591k79530o6104p3430k7630j12941l62338
4579A1582107k32713l44139l47028k46446P127k24390j82986k81183k49472K6101
4569I506978j26857k52930j96282k27907j16841k19792k19537L1289l4216L7425
4559H181330J42940m4696p2691k5841l4121P844L6371l1042j3305R5026J37101
4548H378916l6905j85178m173j12882Q1633J46838J96134J01969M5214O7837n1630
4537H627773r053j95027j09003j01139K41340K8817n7754R8310N0624Q0765P3170
4526H728823M3831n6268N6844J01280R8597n4239J57922K58671K58574L22407
$$ plain form
4516 9916442 10222524 10610603 11062597 11562767 12478193 13636195 14864463 16437346 18496408
4507 18496408 21162319 24265435 27630959 31407356 35071344 38331684 40734517 42460583
4499 42460583 43577348 44988966 46823430 49807265 53971924 59047706 63995402 67882108
4491 67882108 69485180 68056659 64653939 60303828 56256590 52902500 50573043 48971140
4483 48971140 47923242 46853413 45150699 42657211 39484611 36064409 32473030 29094704
4475 29094704 26004384 23265235 20969397 19234763 18141957 17017819 16149043 15515663
4467 15515663 15113564 14934774 14978251 15233062 16229777 18040055 20174655 22961481 25619540
4458 25619540 26647156 25765580 24185282 22910196 21927085 21791841 22565189 24656954 28185687
$$ packed form
4516I916442L06082L88079M51994N00170R15426J158002J228268J572883K059062
4507A8496408K665911L103116L365524L776397L663988L260340K402833J726066
4499D2460583J116765J411618J834464K983835M164659N075782M947696L886706
4491F7882108J603072j428521l402720m350111m047238l354090k329457j601903
4483D8971140j047898j069829j702714k493488l172600l420202l591379l378326
4475B9094704l090320k739149k295838j734634j092806j124138q68776o33380
4467A5515663m02099j78790M3477K54811R96715J810278K134600K786826K658059
4458B5619540J027616q81576j580298j275086r83111j35244P73348K091765L528733
$$ plain form
4449 28185687 33009720 38129585 40700440 39076998 35453432 31420420 27621586 24822350
4441 24822350 22911857 21850738 21971107 23069213 24541777 25453470 24772266 22763320 20360994
4432 20360994 18007100 16037090 14367020 13033363 11834820 10986491 10385593 9867763 9361836
4423 9361836 9011662 8568401 8128311 7888474 7702869 7535895 7363554 7335427 7166689 7096408
4413 7096408 6999436 6777909 6577119 6444657 6132527 6059318 6124169 6125816 6006983 5864119
4403 5864119 5746879 5659165 5639940 5597098 5489556 5488368 5416253 5422127 5281232 5265093 5189546
4392 5189546 5238168 5314405 5195844 5151342 5236637 5230359 5091350 5104452 5081114 5191966 5183643
4381 5183643 4999496 5030159 5199678 5234190 5186220 5218291 5229268 5007927 4887940 4782353
$$ packed form
4449B8185687M824033N119865K570855j623442l623566m033012l798834k799236
4441B4822350j910493j061119J20369J098106J472564R11693o81204k008946k402326
4432B0360994k353894j970010j670070j333657j198543q48329o00898n17830n05927
4423I361836l50174m43261m40090k39837j85605j66974j72341k8127j68738p0281
4413G096408r6972k21527k00790j32462l12130p3209O4851J647j18833j42864
4403E864119j17240q7714j9225m2842j07542j188p2115N874j40895j6139p5547
4392E189546M8622P6237j18561m4502Q5295o278j39009J3102k3338J10852q323
4381E183643j84147L0663J69519L4512m7970L2071J0977k21341j19987j05587
$$ plain form
4371 4782353 4977170 4942614 4807395 4842763 4742882 4735349 4774255 4885114 4927935 4790997 4750966
4360 4750966 4672050 4696476 4701141 4723224 4908027 5139055 5004403 4930837 4945602 5140820 5424995
4349 5424995 5425656 5611377 5857385 5859314 5896906 5872586 5990224 6149461 6166339 6230421 6439276
4338 6439276 6484618 6633713 6949452 7103447 7280436 7296978 7337938 7462087 7489290 7564623
4328 7564623 7660260 7861556 7848751 7782383 7842028 7898702 7986473 8155147 8214518 8350762 8462308
4317 8462308 8324692 8516252 8486185 8517967 8601183 8690712 8584932 8589850 8434782 8471779 8483346
4306 8483346 8321652 8319325 8311016 8266592 8210219 8155218 8169683 8088049 8032990 7965104 7987455 7716048
4294 7716048 7547252 7474851 7585943 7575689 7467776 7329291 7267079 7299523 7098661 7022622
$$ packed form
4371D782353J94817l4556j35219L5368r9881p533L8906J10859M2821j36938m0031
4360D750966p8916K4426M665K2083J84803K31028j34652p3566J4765J95218K84175
4349E424995O61J85721K46008J929L7592k4320J17638J59237J6878O4082K08855
4338F439276M5342J49095L15739J53995J76989J6542M0960J24149K7203P5333
4328G564623R5637K01296j2805o6368N9645N6674Q7771J68674N9371J36244J11546
4317H462308j37616J91560l0067L1782Q3216Q9529j05780M918j55068L6997J1567
4306H483346j61694k327q309m4424n6373n5001J4465q1634n5059o7886K2351k71407
4294G716048j68796p2401J11092j0254j07913j38485o2212L2444k00862p6039
$$ plain form
4284 7022622 6940121 6951948 6762850 6555645 6434123 6500540 6624605 6565138 6459174 6283910
4274 6283910 6198260 6173920 6013990 6008698 6011140 5878574 5801351 5857627 5893762 5959830 6026584
4263 6026584 6029248 6017692 6078895 5975928 5994320 6167376 6250974 6336825 6272498 6410761 6535455
4252 6535455 6642304 6657343 6733381 6960805 7194934 7362067 7475078 7715180 7901701 8178349
4242 8178349 8488414 8935139 9212023 9378713 9593749 9950547 10618509 11092835 11564233 12268499
4232 12268499 12915072 13528087 14311500 15191394 15964529 16937010 17858325 18901064 20001893
4223 20001893 21044283 22258063 23517113 24777466 26071990 27249191 28702225 30220774
4215 30220774 31728703 33500074 35293994 37151596 39046908 40882867 42961957 45004487
$$ packed form
4284G022622q2501J1827j89098k07205j21522O6417J24065n9467j05964j75264
4274F283910q5650k4340j59930n292K442j32566p7223N6276L6135O6068O6754
4263F026584K664j1556O1203j02967J8392J73056Q3598Q5851o4327J38263J24694
4252F535455J06849J5039P6038K27424K34129J67133J13011K40102J86521K76648
4242H178349L10065M46725K76884J66690K15036L56798O67962M74326M71398P04266
4232A2268499O46573O13015P83413Q79894P73135R72481R21315J042739J100829
4223B0001893J042390J213780J259050J260353J294524J177201J453034J518549
4215C0220774J507929J771371J793920J857602J895312J835959K079090K042530
$$ plain form
4207 45004487 47058251 49190563 51220352 53295812 55135162 57014366 59169757 61095538
4199 61095538 62934605 64951573 66935677 68966776 70834292 72634235 74689975 76642099
4191 76642099 78357215 79862871 81264396 82613941 83878502 84784391 85786994 86608711
4183 86608711 87189923 87736951 88290782 88694557 89158702 89266550 89198151 89114232 88820435 88350462
4173 88350462 87738599 87206110 86463124 85587079 84505061 83430976 82218094 80608490 78916915
4164 78916915 77247844 75691398 74027738 72320872 70545064 68834554 67146251 65284279
4156 65284279 63477374 61562874 59813795 57778169 55846742 53937273 52119282 50255632
4148 50255632 48447578 46843493 45430811 43766981 42112374 40533770 39026860 37650422
$$ packed form
4207D5004487K053764K132312K029789K075460J839350J879204K155391J925781
4199F1095538J839067K016968J984104K031099J867516J799943K055740J952124
4191G6642099J715116J505656J401525J349545J264561R05889J002603Q21717
4183H6608711N81212N47028N53831M03775M64145J07848o8399q3919k93797m69973
4173H8350462o11863n32489p42986q76045j082018j074085j212882j609604j691575
4164G8916915j669071j556446j663660j706866j775808j710510j688303j861972
4156F5284279j806905j914500j749079k035626j931427j909469j817991j863650
4148E0255632j808054j604085j412682j663830j654607j578604j506910j376438
$$ plain form
4140 37650422 36076713 34516763 32927133 31325159 30040222 28704043 27285507 26273595
4132 26273595 25351100 24285483 23324136 22348207 21285798 20335031 19502016 18657467 17784674
4123 17784674 17031444 16199966 15466507 14761116 14239049 13712821 13165267 12642010 12253481
4114 12253481 11919535 11678632 11472020 11253213 10935775 10620831 10450976 10368628 10269752 10149982
4104 10149982 10198153 10198849 10170454 10258085 10367354 10631803 10929524 11013712 11324856 11905393 12577131
4093 12577131 13165383 14080203 15044915 16311995 17838862 19616500 21669395 23808234 25985918
4084 25985918 28050076 29937228 31287010 32190086 32534068 32591878 32540144 32114011 31647843
4075 31647843 31277782 30940568 30805953 30775006 30958074 31021454 30770421 30380859 29797263 29014260
$$ packed form
4140C7650422j573709j559950j589630j601974j284937j336179j418536j011912
4132B6273595r22495j065617r61347r75929j062409r50767q33015q44549q72793
4123A7784674p53230q31478p33459p05391n22067n26228n47554n23257l88529
4114A2253481l33946k40903k06612k18807l17438l14944j69855q2348r8876j19770
4104A0149982M8171O96k8395Q7631J09269K64449K97721Q4188L11144N80537O71738
4093A2577131N88252R14820R64712J267080J526867J777638K052895K138839K177684
4084B5985918K064158J887152J349782R03076L43982N7810n1734m26133m66168
4075C1647843l70061l37214j34615l0947J83068O3380k51033l89562n83596p83003
$$ plain form
4065 29014260 28053067 26612947 24850861 23174485 21560333 19898216 18266585 16866911
4057 16866911 15880059 14924352 13983001 13154738 12500995 11980172 11500231 10989491 10449883
4048 10449883 10024217 9679641 9438865 9162305 8776386 8556645 8320634 8096183 7880298
4039 7880298 7726613 7792070 7662174 7491134 7476827 7437882 7320273 7372053 7134909 6765205
4029 6765205 6673002 6582760 6435615 6304479 6232735 6071129 5785325 5852209 5957158 5927970
4019 5927970 5920395 5970576 5843997 5987578 6069177 6068820 6144040 6209953 6109341 6186964 6419729
4008 6419729 6574543 6649294 6615053 6835495 6965246 7105287 7274279 7555398 7764245 7853667
3998 7853667 7950177 8054444 8143355 8343243 8351331 8266405 8457701 8611119 8730535 8664342 8679034
$$ packed form
4065B9014260r61193j440120j762086j676376j614152j662117j631631j399674
4057A6866911r86852r55707r41351q28263o53743n20823m79941n10740n39608
4048A0449883m25666l44576k40776k76560l85919k19741k36011k24451k15885
4039G880298j53685O5457j29896j71040j4307l8945j17609N1780k37144l69704
4029F765205r2203r0242j47145j31136p1744j61606k85804O6884J04949k9188
4019E927970p575N0181j26579J43581Q1599l57P5220O5913j00612P7623K32765
4008F419729J54814P4751l4241K20442J29751J40041J68992K81119K08847Q9422
3998G853667R6510J04267Q8911J99888Q088q4926J91296J53418J19416o6193J4692
$$ plain form
3987 8679034 8971453 8950888 8964069 9006023 8978558 9045992 9156401 9108227 9100256 9178579 9230430
3976 9230430 9239709 9283486 9472036 9631413 9786610 9983388 10398328 10673451 10945258 11416217
3966 11416217 12019136 12536287 13275058 14035720 14862659 15835745 16876193 17887975 18823407
3957 18823407 19753549 20551158 21285796 22227386 23173081 24248663 25538645 27180101 29199570
3948 29199570 31287617 33968163 37400163 41202407 45316758 49954535 55050465 61248055
3940 61248055 68652070 77609890 88155782 100211449 113052825 126025535 137779623
3933 137779623 147158814 153635536 157238162 158603637 158211706 156397283 154411228 152639643
3925 152639643 151496543 151290885 152043069 153474261 155307383 156647728 157309123 156448352 153247587
$$ packed form
3987H679034K92419k0565J3181M1954k7465O7434J10409m8174p971P8323N1851
3976I230430R279M3777J88550J59377J55197J96778M14940K75123K71807M70959
3966A1416217O02919N17151P38771P60662Q26939R73086J040448J011782R35432
3957A8823407R30142P97609P34638R41590R45695J075582J289982J641456K019469
3948B9199570K088047K680546L432000L802244M114351M637777N095930O197590
3940F1248055P404015Q957820J0545892J2055667J2841376J2972710J1754088
3933A37779623R379191O476722L602626J365475l91931j814423j986055j771585
3925A52639643j143100k05658P52184J431192J833122J340345O61395q60771l200765
$$ plain form
3916 153247587 147250388 139052711 129178607 118272849 107006088 95998541 85553156
3909 85553156 76351109 68340860 61405554 55538646 50467217 46158860 42275644 39086668
3901 39086668 36295478 33699280 31631130 29951971 28390200 26977728 25797588 24897654
3893 24897654 24079319 23458898 22950214 22473477 21905777 21694941 21408534 21303917 21086691
3884 21086691 21047933 20883074 20822870 20880628 20891638 21006778 21354646 21594035 21803686 22052865
3874 22052865 22588687 22872955 23280533 23731620 24365621 25144088 26026067 27036700 28163954
3865 28163954 29272615 30153765 30952782 31719967 32556174 33319341 34052468 34930074 35853877
3856 35853877 37005368 37915735 38857314 39897843 40997865 41853399 42575978 43161410 43421071
$$ packed form
3916A53247587n997199q197677r874104j0905758j1266761j1007547j0445385
3909H5553156r202047q010249o935306n866908n071429m308357l883216l188976
3901C9086668k791190k596198k068150j679159j561771j412472j180140q99934
3893B4897654q18335o20421n08684m76737n67700k10836k86407j04617k17226
3884B1086691l8758j64859o0204N7758J1010J15140L47868K39389K09651K49179
3874B2052865N35822K84268M07578M51087O34001P78467Q81979J010633J127254
3865B8163954J108661Q81150P99017P67185Q36207P63167P33127Q77606R23803
3856C5853877J151491R10367R41579J040529J100022Q55534P22579N85432K59661
$$ plain form
3847 43421071 43819542 44301592 44520570 44740642 44993334 45385845 45762556 45999243 46460935
3838 46460935 46684978 46856366 46957219 46938340 46632978 46464385 46126577 45933597 45727477 45611646
3828 45611646 45476426 45248261 45336343 45293469 45227479 45187388 44978351 44908206 44878841 44975398 44913515
3817 44913515 44907492 44911885 45336572 45790623 46698816 47895762 49360234 51367113 53768358
3808 53768358 56684515 59877146 63703987 67893142 72638871 77878750 83715667 90167426
3800 90167426 97349462 105310036 114028506 123420890 133426486 143910542 154357807 164443581
3792 164443581 173769479 182374225 190113691 197188218 204078774 210891099 217673539 224343957
3784 224343957 231131384 238081683 244938135 251004277 256574078 261475711 265488096 268936072
$$ packed form
3847D3421071L98471M82050K18978K20072K52692L92511L76711K36687M61692
3838D6460935K24043J71388J00853j8879l05362j68593l37808j92980k06120j15831
3828D5611646j35220k28165Q8082m2874o5990m0091k09037p0145k9365R6557o1883
3817D4913515o023M393M24687M54051R08193J196946J464472K006879K401245
3808E3768358K916157L192631L826841M189155M745729N239879N836917O451759
3800I0167426P182036P960574Q718470R392384J0005596J0484056J0447265J0085774
3792A64443581R325898Q604746P739466P074527O890556O812325O782440O670418
3784B24343957O787427O950299O856452O066142N569801M901633M012385L447976
$$ plain form
3776 268936072 271763356 274409308 277215326 280449677 284143872 288678593 293436855 297974734
3768 297974734 301564011 303496458 303404107 300740396 295534486 288482367 280191242 270960138
3760 270960138 261757143 253131698 245601752 239254563 233530030 228611091 224191552 219292465
3752 219292465 212970887 204778479 194426702 182127718 168370020 153965377 139600937
3745 139600937 125960537 113479744 102244234 92646695 84432193 77459807 71506599 66384941
3737 66384941 62003193 58447608 55239212 52487763 50106111 47862548 46004679 44299324
3729 44299324 42833600 41499159 40386365 39515977 38742981 37975976 37523495 37258923 36779535
3720 36779535 36355841 35931186 35411393 34848773 34352664 33647616 32742539 31783822 30861596
$$ packed form
3776B68936072K827284K645952K806018L234351L694195M534721M758262M537879
3768B97974734L589277J932447r2351k663711n205910p052119q291125r231104
3760B70960138r202995q625445p529946o347189n724533m918939m419539m899087
3752B19292465o321578q192408j0351777j2298984j3757698j4404643j4364440
3745A39600937j3640400j2480793j1235510r597539q214502o972386n953208n121658
3737F6384941m381748l555585l208396k751449k381652k243563j857869j705355
3729D4299324j465724j334441j112794q70388p72996p67005m52481k64572m79388
3720C6779535m23694m24655n19793n62620m96109p05048r05077r58717r22226
$$ plain form
3711 30861596 30023563 29256968 28430436 27566916 26900451 26320764 25681288 25007515 24260383
3702 24260383 23543407 22839954 22038766 21271479 20570495 19966169 19368827 18678217 18028669
3693 18028669 17358799 16784416 16235998 15901206 15352021 14708282 14428178 14145291 14030199
3684 14030199 13707104 13376397 13145115 12753660 12287990 12086120 11981615 11858504 11603089
3675 11603089 11318498 11251875 11076105 10860222 10805637 10649772 10492947 10175023 9907044 9743415
3665 9743415 9636581 9545092 9290459 9035437 8927219 8884618 8693325 8577534 8469425 8365103
3655 8365103 8217381 8178211 8169479 8049554 7894619 7888992 7728356 7639330 7589717 7513071 7468900
3644 7468900 7290398 7168807 7149063 7126497 7085346 6970291 6839843 6802831 6705596 6607940 6594774
$$ packed form
3711C0861596q38033p66595q26532q63520o66465n79687o39476o73773p47132
3702B4260383p16976p03453q01188p67287p00984o04326n97342o90610o49548
3693A8028669o69870n74383n48418l34792n49185o43739k80104k82887j15092
3684A4030199l23095l30707k31282l91455m65670k01870j04505j23111k55415
3675A1603089k84591o6623j75770k15883n4585j55865j56825l17924k67979j63629
3665I743415j06834r1489k54633k55022j08218m2601j91293j15791j08109j04322
3655H365103j47722l9170q732j19925j54935n627j60636q9026m9613p6646m4171
3644G468900j78502j21591j9744k2566m1151j15055j30448l7012r7235r7656j3166
$$ plain form
3633 6594774 6576876 6626731 6750717 6722768 6695884 6537668 6420465 6297803 6185512 6165771
3623 6165771 6026844 5965118 5970712 5760648 5646795 5753173 5811369 5815920 5671051 5423604 5274938
3612 5274938 5208414 5189303 5255206 5231483 5400925 5309298 5166811 5231270 5259596 5251982 5183442
3601 5183442 5041779 4890273 4840294 4813350 4782992 4741103 4767630 4862933 4750942 4746122 4693486
3590 4693486 4616130 4574645 4560577 4429429 4329395 4317668 4066651 4132328 4096320 4104300 4140065
3579 4140065 4023620 3888014 3816158 3979648 4097797 4054247 4089556 4076450 3973684 4029942
3569 4029942 4009923 3994980 4103843 4094325 4025406 4028087 4092924 4106509 3999772 4105517 4036239
3558 4036239 3634018 3521925 3493846 3593790 3617214 3458518 3269654 3334339 3328555 3183780 3243094
$$ packed form
3633F594774j7898M9855J23986k7949k6884j58216j17203j22662j12291j9741
3623F165771j38927o1726N594k10064j13853J06378N8196M551j44869k47447j48666
3612E274938o6524j9111O5903k3723J69442r1627j42487O4459K8326p614o8540
3601E183442j41663j51506m9979k6944l0358m1889K6527R5303j11991m820n2636
3590D693486p7356m1485j4068j31148j00034j1727k51017O5677l6008P980L5765
3579D140065j16445j35606p1856J63490J18149m3550L5309j3106j02766N6258
3569D029942k0019j4943J08863r518o8919K681O4837J3585j06737J05745o9278
3558D036239m02221j12093k8079R9944K3424j58696j88864O4685n784j44775N9314
$$ plain form
3547 3243094 3356565 3281222 3106258 3084759 3032043 3041839 3099403 3116142 3220616 3165757 2991594
3536 2991594 2873629 3031533 3102369 3063756 2928549 2795842 2892475 2889813 2879972 2812685 2916346
3525 2916346 2858717 2743879 2761480 2784975 2787285 2932675 2999969 3011701 3012712 2941603 2924359
3514 2924359 2953478 2953816 3047955 3027632 2967550 3010544 3042044 3031651 3152067 3399930 3520014
3503 3520014 3507848 3437568 3421750 3594736 3710234 3701992 3720949 3636918 3702963 3851654 3927868
3492 3927868 4016268 3814569 3749027 3825141 3858434 3818300 3704422 3708416 4049373 4263840 4148076
3481 4148076 4084960 4041558 4093017 4047946 4010058 4113919 4185669 4211239 4068119 4102397 4232840
3470 4232840 4061955 4032314 3987686 3904900 3981557 4151797 4071260 4054987 3960461 3850707 3799538
$$ packed form
3547C243094J13471p5343j74964k1499n2716R796N7564J6739J04474n4859j74163
3536B991594j17965J57904P0836l8613j35207j32707R6633k662r841o7287J03661
3525B916346n7629j14838J7601K3495K310J45390O7294J1732J011p1109j7244
3514B924359K9119L38R4139k0323o0082M2994L1500j0393J20416K47863J20084
3503C520014j2166p0280j5818J72986J15498q242J8957q4031O6045J48691P6214
3492C927868Q8400k01699o5542P6114L3293m0134j13878L994L40957K14467j15764
3481D148076o3116m3402N1459m5071l7888J03861P1750K5570j43120L4278J30443
3470D232840j70885k9641m4628q2786P6657J70240q0537j6273r4526j09754n1169
$$ plain form
3459 3799538 3745551 3616586 3674369 3682148 3524157 3291198 3316949 3308027 3278792 3188004 3181035
3448 3181035 3238072 3285231 3299697 3229600 3172168 3258580 3374168 3297542 3242493 3428687 3357400
3437 3357400 3352647 3362151 3175223 2918154 2757913 2631110 2568812 2470337 2434571 2477458 2451134
3426 2451134 2263120 2111565 2035715 2045918 2026117 1834949 1970965 2058876 1900960 1888414
3416 1888414 1946307 1926173 1992936 1931526 1794773 1798023 1718207 1563404 1687008 1702723 1866471
3405 1866471 1886923 1823740 1562800 1663205 1722964 1635054 1767467 1698301 1425399 1443363 1546392
3394 1546392 1606760 1562650 1500586 1459207 1449060 1293158 1201427 1146782 1191062 1213585 1301962
3383 1301962 1300156 1228159 1156251 1299693 1280767 1263717 1423968 1301696 1163775 1162759 1224258
$$ packed form
3459C799538n3987j28965N7783P779j57991k32959K5751q922k9235r0788o969
3448C181035N7037M7159J4466p0097n7432Q6412J15588p6626n5049J86194p1287
3437C357400m753R504j86928k57069j60241j26803o2298r8475l5766M2887k6324
3426B451134j88014j51555p5850J0203j9801j91168J36016Q7911j57916j2546
3416A888414N7893k0134O6763o1410j36753L250p9816j54803J23604J5715J63748
3405A866471K0452o3183k60940J00405N9759q7910J32413o9166k72902J7964J03029
3394A546392O0368m4110o2064m1379j0147j55902r1731n4645M4280K2523Q8377
3383A301962j806p1997p1908J43442j8926j7050J60251j22272j37921j016O1499
$$ plain form
3372 1224258 1167258 1235967 1247752 1151175 1215533 1163211 1212460 1300849 1360931 1325057 1275161
3361 1275161 1212489 1143371 1324299 1271377 1228854 1352390 1313342 1194581 1303304 1347049 1400731
3350 1400731 1454707 1514034 1387587 1328089 1378347 1202238 1129876 1312225 1341575 1149818 1261007
3339 1261007 1323532 1408627 1407407 1335522 1350294 1385438 1503102 1440916 1537438 1587264 1564953
3328 1564953 1525190 1351720 1475023 1499036 1452016 1471780 1467835 1345412 1330160 1411180 1364936
3317 1364936 1430517 1295856 1249418 1301572 1367270 1388394 1439842 1465324 1400975 1361820 1197734
3306 1197734 1070882 1125479 1166893 1313456 1246458 1196189 1110369 1041083 1205355 1270776 1267936
3295 1267936 1140417 1242775 1162178 1128461 1166258 1086191 1029775 998304 1048714 990395 948101
$$ packed form
3372A224258n7000O8709J1785r6577O4358n2322M9249Q8389O0082l5874m9896
3361A275161o2672o9118J80928n2922m2523J23536l9048j18761J08723M3745N3682
3350A400731N3976N9327j26447n9498N0258j76109p2362J82349K9350j91757J11189
3339A261007O2525Q5095j220p1885J4772L5144J17664o2186R6522M9826k2311
3328A564953l9763j73470J23303K4013m7020J9764l945j22423j5252Q1020m6244
3317A364936O5581j34661m6438N2154O5698K1124N1448K5482o4349l9155j64086
3306A197734j26852N4597M1414J46563o6998n0269q5820o9286J64272O5421k840
3295A267936j27519J02358q0597l3717L7797q0067n6416l1471N0410n8319m2294
$$ plain form
3284 948101 943820 1072040 1112339 1123207 1086968 848228 816329 987842 1133085 1057251 1107702
3273 1107702 1194011 1151180 1287979 1252304 1352480 1458033 1456195 1269573 1285560 1224350 1391818
3262 1391818 1441671 1569434 1886474 2157878 2311922 2317189 2295196 2186152 2011160 1976033
3252 1976033 1748572 1583434 1447411 1176675 1211803 1506615 1479743 1421585 1367893 1302498
3242 1302498 1222637 1243099 1326752 1319411 1247650 1338972 1450388 1480675 1693092 1697126 1955705
3231 1955705 2331832 2457254 2291498 2206811 2047866 1943981 1867292 1828572 1662432 1466230
3221 1466230 1435148 1316106 1327911 1407604 1323648 1264235 1212587 1097905 1097406 1053452 1080442
3210 1080442 1298194 1247832 1179284 1159973 1030270 881999 887204 967003 951620 1019771 1056239
$$ packed form
3284I48101m281J28220M0299J0868l6239k38740l1899J71513J45243p5834N0451
3273A107702Q6309m2831J36799l5675J00176J05553j838j86622J5987o1210J67468
3262A391818M9853J27763L17040K71404J54044N267k1993j09044j74992l5127
3252A976033k27461j65138j36023k70736L5128K94812k6872n8158n3692o5395
3242A302498p9861K0462Q3653p341p1761R1322J11416L0287K12417M034K58579
3231A955705L76127J25422j65756q4687j58945j03885p6689l8720j66140j96202
3221A466230l1082j19042J1805P9693q3956n9413n1648j14682m99m3954K6990
3210A080442K17752n0362o8548j9311j29703j48271N205P9799j5383O8151L6468
$$ plain form
3199 1056239 1027056 1100272 1201417 1246160 1301098 1370275 1202541 1319305 1357932 1454594 1445342
3188 1445342 1461299 1346243 1247437 1261167 1260868 1253861 1210818 1271980 1205437 1076915 1081275 1005563
3176 1005563 965907 880818 979281 1042206 1113864 1201238 1337808 1353734 1359149 1396992 1306713
3165 1306713 1315847 1357706 1493498 1362539 1438839 1600317 1545370 1509787 1612748 1636274 1594822
3154 1594822 1595136 1482804 1409336 1408151 1246451 1147121 1277158 1287121 1254818 1411592 1312418
3143 1312418 1316508 1404358 1262313 1181090 1061058 1065942 1175320 1188776 1140220 1238506 1294955
3132 1294955 1270273 1217224 1284496 1280889 1215982 1223617 1156191 1217043 1375027 1353656 1315890 1409190
3120 1409190 1594476 1470162 1268982 1301943 1381607 1311360 1273701 1188547 1138278 1080561 1066885
$$ packed form
3199A056239k9183P3216J01145M4743N4938O9177j67734J16764L8627R6662r252
3188A445342J5957j15056r8806J3730k99p007m3043O1162o6543j28522M360p5712
3176A005563l9656q5089R8463O2925P1658Q7374J36570J5926N415L7843r0279
3165A306713R134M1859J35792j30959P6300J61478n4947l5583J02961K3526m1452
3154A594822L14j12332p3468j185j61700r9330J30037R963l2303J56774r9174
3143A312418M090Q7850j42045q1223j20032M884J09378J3456m8556R8286N6449
3132A294955k4682n3049O7272l607o4907P635o7426O0852J57984k1371l7766R3300
3120A409190J85286j24314k01180L2961P9664p0247l7659q5154n0269n7717j3676
$$ plain form
3109 1066885 1058870 1107357 1183011 1200149 1227239 1299855 1406060 1281255 1317774 1243296 1230939
3098 1230939 1035770 1013405 1072807 1080549 1106470 1092138 1014549 1017839 1124830 1020609 1028490
3087 1028490 1042602 924904 1133144 1171330 1204742 1107831 1076816 1236440 1281505 1120090 1072298
3076 1072298 1134879 1069192 1097132 1016997 855007 931053 1044957 1136827 1052292 955192 947115
3065 947115 934437 1043253 1096320 1078642 1013725 890880 836663 1091328 1241005 1285740 1174399
3054 1174399 973779 917848 894121 839925 926471 1000296 1037098 926272 862637 950357 893291
3043 893291 902918 868976 899541 993119 890299 698094 766659 899194 925851 772906 727661
3032 727661 641736 652314 706617 808154 821039 910464 754089 690976 760198 788341 754470
$$ packed form
3109A066885q015M8487P5654J7138K7090P2616J06205j24805L6519p4478j2357
3098A230939j95169k2365N9402P742K5921j4332p7589L290J06991j04221P881
3087A028490J4112j17698K08240L8186L3412r6911l1015J59624M5065j61415m7792
3076A072298O2581o5687K7940q0135j61990P6046J13904R1870q4535r7100q077
3065I47115j2678J08816N3067j7678o4917j22845n4217K54665J49677M4735j11341
3054A174399k00620n5931k3727n4196Q6546P3825L6802j10826o3635Q7720n7066
3043H93291R627l3942L0565R3578j02820j92205O8565J32535K6657j52945m5245
3032G27661q5925J0578N4303J01537J2885Q9425j56375o3113O9222K8143l3871
$$ plain form
3021 754470 772866 826543 797317 727692 846609 833911 828838 775618 820892 789555 558431
3010 558431 583892 635766 627699 557283 668695 649902 656977 676483 640460 656831 748327 711611
2998 711611 522428 519890 483370 293241 469511 460314 343119 241510 438068 493277 511873
2987 511873 372788 292737 337835 396045 334039 275928 335111 409480 523154 542740 400997
2976 400997 473077 394080 311568 393858 311290 220292 329751 363380 396146 406995 400660 283230
2964 283230 395435 328437 327959 440667 563585 509770 431555 537727 417473 367929 306577
2953 306577 405673 511275 596640 547331 554152 620325 306276 234484 139643 197943 276541
2942 276541 263634 352429 263558 396350 303010 532896 519923 468207 494412 539489 401638
$$ packed form
3021G54470J8396N3677k9226o9625J18917j2698n073n3220M5274l1337k31124
3010E58431K5461N1874q067p0416J11412j8793P075J9506l6023J6371R1496l6716
2998G11611j89183k538l6520j90129J76270r197j17195j01609J96558N5209J8596
2987E11873j39085q0051M5098N8210o2006n8111N9183P4369J13674J9586j41743
2976D00997P2080p8997q2512Q2290q2568r0998J09459L3629L2766J0849o335j17430
2964B83230J12205o6998m78J12708J22918n3815p8215J06172j20254m9544o1352
2953C06577R9096J05602Q5365m9309O821O6173l14049p1792r4841N8300P8598
2942B76541j2907Q8795q8871J32792r3340K29886j2973n1716K6205M5077j37851
$$ plain form
2931 401638 486997 593052 387659 516478 513256 406496 435036 501728 516753 617191 744072
2920 744072 603050 523145 381842 379190 519589 651573 586777 447329 379466 316598 405277
2909 405277 667646 647651 354020 338177 240648 268965 264327 351815 222806 230599 188222
2898 188222 211667 181136 229734 286371 331337 394803 304180 354257 222449 264475 401526
2887 401526 417818 409742 278503 263232 283889 494974 412419 361447 513696 390570 297814
2876 297814 294166 282005 337107 495681 356173 268665 301111 265640 163399 170752 330232
2865 330232 247579 217446 233944 200215 384049 363043 384154 455220 542946 344668 187378
2854 187378 187009 281250 291524 256949 306171 367057 300449 364126 359645 486673 507053 426327
$$ packed form
2931D01638Q5359J06055k05393J28819l222j06760K8540O6692J5025J00438J26881
2920G44072j41022p9905j41303k652J40399J31984o4796j39448o7863o2868Q8679
2909D05277K62369j9995k93631j5843r7529K8317m638Q7488j29009P793m2377
2898A88222K3445l0531M8598N6637M4966O3466r0623N0077j31808M2026J37051
2887D01526J6292q076j31239j5271K0657K11085q2555n0972J52249j23126r2756
2876B97814l648j2161N5102J58574j39508q7508L2446l5471j02241P353J59480
2865C30232q2653l0133J6498l3729J83834k1006K1111P1066Q7726j98278j57290
2854A87378l69R4241J0274l4575M9222O0886o6608O3677m481J27028K0380q0726
$$ plain form
2842 426327 353437 385174 408129 396754 354971 460303 573909 431122 359933 555915 471463
2831 471463 531787 447816 368361 350720 296161 136688 150576 319771 251561 174711 176091
2820 176091 131726 123165 264373 242003 266268 349904 173320 112710 254340 248121 340266
2809 340266 363170 321378 210886 290142 212661 293316 470883 353581 212364 248605 268669
2798 268669 305331 317861 335091 254917 361054 369907 375979 538146 517767 335129 453557
2787 453557 444951 288443 350957 463457 457725 583154 543764 392341 253741 220860 170115
2776 170115 258348 329670 259372 280677 340893 523207 633643 543226 408647 577701 677156
2765 677156 542741 514936 520752 332286 384597 499513 405741 452849 498150 380479 432371
$$ packed form
2842D26327p2890L1737K2955j1375m1783J05332J13606j42787p1189J95982q4452
2831D71463O0324q3971p9455j7641n4559j59473J3888J69195o8210p6850J380
2820A76091m4365q561J41208k2370K4265Q3636j76584o0610J41630o219R2145
2809C40266K2904m1792j10492P9256p7481Q0655J77567j17302j41217L6241K0064
2798B68669L6662J2530J7230q0174J06137Q853O072J62167k0379j82638J18428
2787D53557q606j56508O2514J12500n732J25429l9390j51423j38600l2881n0745
2776A70115Q8233P1322p0298K1305O0216J82314J10436r0417j34579J69054R9455
2765F77156j34415k7805N816j88466N2311J14916r3772M7108M5301j17671N1892
$$ plain form
2754 432371 555965 515974 381934 394216 372710 256498 303568 482922 626270 609310 462470
2743 462470 334502 357775 367848 310386 274886 341287 365684 346581 311066 303820 353479 381488
2731 381488 400230 326870 313127 312479 276201 340913 480383 379824 251429 122200 289622
2720 289622 445189 326680 340476 229577 218331 260310 188854 181197 195010 262562 290959
2709 290959 268147 302245 270532 164398 249823 286533 207918 313629 265530 284585 268854
2698 268854 262589 279007 257806 251705 316961 221501 330141 404148 320962 212908 81648
2687 81648 -22801 68753 169102 131062 113972 132002 25288 125414 196525 126046 141987
2676 141987 255550 110773 -30729 -8095 32585 223150 312652 235805 23855 54376 143753
$$ packed form
2754D32371J23594l9991j34040J2282k1506j16212M7070J79354J43348j6960j46840
2743D62470j27968K3273J0073n7462l5500O6401K4397j9103l5515p246M9659K8009
2731C81488J8742p3360j3743o48l6278O4712J39470j00559j28395j29229J67422
2720B89622J55567j18509J3796j10899j1246M1979p1456p657J3813O7552K8397
2709B90959k2812L4098l1713j06134Q5425L6710p8615J05711m8099J9055j5731
2698B68854o265J6418k1201o101O5256r5460J08640P4007q3186j08054j31260
2687H1648j04449R1554J00349l8040j7090J8030j06714J00126P1111p0479J5941
2676A41987J13563j44777j41502K2634M0680J90565Q9502p6847k11950L0521Q9377
$$ plain form
2665 143753 187987 278706 209059 28695 -105706 86530 290050 298933 296335 217151 138357
2654 138357 88870 95012 44082 127509 256289 224952 110950 154742 226523 226792 146180 195779
2642 195779 175200 67483 84881 79061 78317 164521 127383 143877 150800 178784 175347 202568
2630 202568 158722 104728 24965 129224 26115 99577 170939 125688 117927 206947 186223
2619 186223 159304 146236 178705 138966 215533 309012 209356 179084 212657 126608 184259 245301
2607 245301 238935 165136 210232 284043 465017 482192 342247 277428 196344 63818 -6821
2596 -6821 86425 123328 69870 -158738 -247178 -31127 48559 106159 131124 134384 129164 73264
2584 73264 56619 73533 240149 280005 287139 337812 308841 247393 275458 408987 273551
$$ packed form
2665A43753M4234R0719o9647j80364j34401J92236K03520Q883k598p9184p8794
2654A38357m9487O142n0930Q3427J28780l1337j14002M3792P1781K69q0612M9599
2642A95779k0579j07717J7398n820p44Q6204l7138J6494O923K7984l437K7221
2630B02568m3846n3994p9763J04259j03109P3462P1362m5251p761Q9020k0724
2619A86223k6919j3068L2469l9739P6567R3479r9656l0272L3573q6049N7651O1042
2607B45301o366p3799M5096P3811J80974J7175j39945o4819q1084j32526p0639
2596f821R3246L6903n3458k28608q8440K16051P9686N7600K4965L260n220n5900
2584G3264j6645J6914J66616L9856P134N0673k8971o1448K8065J33529j35436
$$ plain form
2573 273551 114809 143119 19376 89347 80107 111192 109414 145808 -77990 -127599 55054
2562 55054 177141 171518 168921 197740 189120 189445 296338 144483 62335 -42104 12335 1684
2550 1684 124453 150553 101209 5456 -45339 24659 164265 225499 276022 155428 80688
2539 80688 86501 113383 140662 323802 205004 150512 189430 186023 422029 389471 355958 347497
2527 347497 236589 183205 202402 282458 458230 379033 321429 148257 130795 108242 179436
2516 179436 425969 601034 493617 441434 345068 434025 506737 449799 311397 329388 328092
2505 328092 239549 191633 237337 258235 357879 240189 94332 92845 147383 179382 226441
2494 226441 150652 36556 73440 48143 135815 128665 165794 161089 126963 137499 165825 115605
$$ packed form
2573B73551j58742K8310j23743O9971r240L1085j778L6394k23798m9609J82653
2562E5054J22087n623k597K8819q620L25J06893j51855q2148j04439N4439j0651
2550A684J22769K6100m9344r5753n0795O9998J39606O1234N0523j20594p4740
2539H0688N813K6882K7279J83140j18798n4492L8918l407K36006l2558l3513q461
2527C47497j10908n3384J9197Q0056J75772p9197n7604j73172j7462k2553P1194
2516A79436K46533J75065j07417n2183r6366Q8957P2712n6938j38402J7991j296
2505C28092q8543m7916M5704K0898R9644j17690j45857j487N4538L1999M7059
2494B26441p5789j14096L6884k5297Q7672p150L7129m705l4126J0536K8326n0220
$$ plain form
2482 115605 162076 322155 354341 336502 350130 305643 356982 333505 452812 307164 292270
2471 292270 296107 298453 261220 180149 290108 242058 128910 84494 187547 168281 125072
2460 125072 121966 19086 61356 -6302 36467 128674 150336 171644 144001 125505 141718 81894
2448 81894 63675 83250 154593 175427 216580 227462 222115 232149 65323 -33462 36932 56323
2436 56323 110319 62194 -15466 125656 200598 198034 156563 -37970 -87675 56609 208433
2425 208433 248875 86566 34697 26019 17 24582 58205 70871 127627 91191 213863
2414 213863 163123 132182 116961 189135 98804 189709 18508 -86641 -135574 -139900 -39564
2403 -39564 -15143 -245333 -179464 -14193 -66604 90516 61468 60189 110837 85659 152618
$$ packed form
2482A15605M6471J60079L2186j7839J3628m4487N1339k3477J19307j45648j4894
2471B92270L837K346l7233q1071J09959m8050j13148m4416J03053j9266m3209
2460A25072l106j02880M2270o7658M2769R2207K1662K1308k7643j8496J6213n9824
2448H1894j8219J9575P1343K0834M1153J0882n347J0034j66826r8785P0394J9391
2436E6323N3996m8125p7660J41122P4942k564m1471j94533m9705J44284J51824
2425B08433M0442j62309n1869q678k6002K4565L3623J2666N6756l6436J22672
2414B13863n0740l0941j5221P2174r0331R0905j71201j05149m8933m326J00336
2403c9564K4421k30190O5869J65271n2411J57120k9048j279N0648k5178O6959
$$ plain form
2392 152618 162730 338211 305203 240856 295832 435251 535992 537719 338764 396639 525904
2381 525904 442337 474992 349970 358328 337831 280239 460740 471295 444678 495958 475743
2370 475743 511230 580618 470638 429073 482777 486534 570048 760288 730028 633375 532601
2359 532601 411898 361587 523063 506755 414262 451060 408227 459483 506396 618533 574291
2348 574291 636780 535355 560027 659733 782176 870564 915775 886136 894249 842691 902150
2337 902150 1110312 1367091 1569947 1722340 1757971 2008156 2413204 2942252 3487047 4030435
2327 4030435 4373238 4507385 4666423 5041856 5422284 6041342 6896707 8228255 10036308
2318 10036308 12729444 16811148 23320668 32623020 44522798 56090121 60182300 55176270
$$ packed form
2392A52618J0112J75481l3008o4347N4976J39419J00741J727j98955N7875J29265
2381E25904q3567L2655j25022Q358k0497n7592J80501J0555k6617N1280k0215
2370D75743L5487O9388j09980m1565N3704L757Q3514J90240l0260r6653j00774
2359E32601j20703n0311J61476j6308r2493L6798m2833N1256M6913J12137m4242
2348E74291O2489j01425K4672R9706J22443Q8388M5211k9639Q113n1558N9459
2337I02150K08162K56779K02856J52393L5631K50185M05048N29048N44795N43388
2327D030435L42803J34147J59038L75433L80428O19058Q55365J331548J808053
2318A0036308K693136M081704O509520R302352J1899778J1567323M092179n006030
$$ plain form
2310 55176270 47168149 38408385 30745255 24866578 20226185 16590223 13685164 11595823
2302 11595823 10224962 9286078 8467539 7905446 7348963 6673509 5910093 5275674 4630739
2293 4630739 4144614 3925256 3713820 3249262 2863191 2509655 2404129 2238218 2141752 1871908
2283 1871908 1746595 1791960 1744991 1630464 1763134 1874759 1755110 1691258 1572506 1496493
2273 1496493 1577443 1466873 1430738 1405433 1379660 1305096 1313428 1282874 1304628 1271986 1140452
2262 1140452 1080743 1054864 1061129 1065646 913837 929090 806196 680829 731060 581665 575964
2251 575964 536122 466237 554129 595821 601059 691948 686783 498064 530457 483416 717274 756426
2239 756426 715746 692817 558089 569078 633890 635392 535800 516861 518984 428851 533947 496985
$$ packed form
2310E5176270q008121q759764p663130n878677m640393l635962k905059k089341
2302A1595823j370861r38884q18539n62093n56483o75454p63416o34419o44935
2293D630739m86125k19358k11436m64558l86071l53536j05526j65911r6466k69844
2283A871908j25313M5365m6969j14527J32670J11625j19649o3852j18752p6013
2273A496493Q0950j10570l6135k5305k5773p4564Q332l0554K1754l2642j31534
2262A140452n9709k5879O265M517j51809J5253j22894j25367N0231j49395n701
2251E75964l9842o9885Q7892M1692N238R0889n165j88719L2393m7041K33858L9152
2239G56426m0680k2929j34728J0989O4812J502r9592j8939K123r0133J05096l6962
$$ plain form
2227 496985 527875 522274 374816 217340 210317 448567 460840 417446 395553 352287 175402
2216 175402 268256 266269 289482 407032 369272 323069 384811 395598 494163 415204 480567 480945
2204 480945 338415 296910 582767 620787 608616 514629 367654 470863 451895 348192 433922
2193 433922 441139 385364 389293 350491 367478 393842 277904 300268 265879 172254 281282 278815
2181 278815 218396 178271 240985 136065 97056 180108 196257 169011 211101 156354 159508 257559
2169 257559 255380 203941 234728 113796 203155 111236 84811 104175 169016 103418 130055 209144
2157 209144 173633 314878 446097 420840 316288 311655 496692 641645 689877 589401 445908
2146 445908 370824 495218 345224 235526 150930 98736 177712 153216 121459 250765 283033
$$ packed form
2227D96985L0890n601j47458j57476p023K38250J2273m3394k1893m3266j76885
2216A75402R2854j987K3213J17550l7760m6203O1742J0787R8565p8959O5363L78
2204D80945j42530m1505K85857L8020j2171r3987j46975J03209j8968j03703Q5730
2193D33922P217n5775L929l8802J6987K6364j15938K2364l4389r3625J09028k467
2181B78815o0419m0125O2714j04920l9009Q3052J6149k7246M2090n4747L154R8051
2169B57559k179n1439L0787j20932Q9359r1919k6425J9364O4841o5598K6637P9089
2157B09144l5511J41245J31219k5257j04552m633J85037J44953M8232j00476j43493
2146D45908p5084J24394j49994j09698q4596n2194P8976k4496l1757J29306L2268
$$ plain form
2135 283033 144765 227155 318738 333152 220876 190688 147476 129582 114967 139622 43982
2124 43982 154150 262348 382548 389750 354750 262473 206205 138972 214665 91520 5471
2113 5471 60901 100941 43198 277027 253405 217652 249324 208115 170964 360630 376568 123148
2101 123148 41248 91861 58479 -73103 -60063 -77297 68761 218165 256758 -11163 -66145
2090 -66145 -29750 -78218 35553 96662 71294 180093 58472 43505 163725 264603 330627
2079 330627 242786 181723 123172 -33189 66544 82746 -89732 -112589 -149497 -202750 -222856
2068 -222856 -110243 19217 47457 -10779 -31982 -123361 -127009 62969 162063 225433 373630
2057 373630 402403 403812 296905 293581 297447 290334 294541 380252 343386 214760 163711 252881
$$ packed form
2135B83033j38268Q2390R1583J4414j12276l0188m3212j7894j4615K4655r5640
2124D3982J10168J08198J20200P202l5000r2277n6268o7233P5693j23145q6049
2113E471N5430M0040n7743K33829k3622l5753L1672m1209l7151J89666J5938k53420
2101A23148q1900N0613l3382j31582J3040j7234J46058J49404L8593k67921n4982
2090f6145L6395m8468J13771O1109k5368J08799j21621j4967J20220J00878O6024
2079C30627q7841o1063n8551j56361R9733J6202j72478k2857l6908n3253k0106
2068b22856J12613J29460K8240n8236k1203r1379l648J89978R9094O3370J48197
2057C73630K8773J409j06907l324L866p113M207Q5711l6866j28626n1049Q9170
$$ plain form
2045 252881 482088 491306 337342 267569 223811 176413 234123 107007 -46170 -110083 -137313
2034 -137313 -222966 -24328 59468 141939 148594 177925 89978 43861 33240 41479 84904 140579
2022 140579 66021 -216610 -92680 75427 -42730 53836 119189 80355 89047 261629 56148
2011 56148 -28531 72793 13052 -103180 -110336 7223 -134631 -92284 -110753 12512 50816
2000 50816 -34474 -121953 -23508 40004 -89025 -147540 -53178 27326 22005 -146388 -163146 -75335
1988 -75335 136896 196090 153838 180189 130724 15965 -10866 -19630 71779 129247 88950 78368
1976 78368 96575 36842 89619 74545 -85151 -34660 19214 -21198 -92230 -127349 -82579 19462
1964 19462 97673 86840 18515 91809 155619 142056 200450 200978 100274 89096 -22309 90479
$$ packed form
2045B52881K29207R218j53964o9773m3758m7398N7710j27116j53177o3913k7230
2034a37313q5653J98638Q3796Q2471O655K9331q7947m6117j0621Q239M3425N5675
2022A40579p4558k82631J23930J68107j18157R6566O5353l8834Q692J72582k05481
2011E6148q4679J01324n9741j16232p156J17559j41854M2347j8469J23265L8304
2000E0816q5290q7479R8445O3512j29029n8515R4362Q0504n321j68393j6758Q7811
1988g5335K12231N9194m2252K6351m9465j14759k6831q764R1409N7468m0297j0582
1976G8368J8207n9733N2777j5074j59696N0491N3874m0412p1032l5119M4770J02041
1964A9462P8211j0833o8325P3294O3810j3563N8394N28j00704j1178j11405J12788
$$ plain form
1952 90479 101738 72703 166486 102760 -48094 32179 -36791 -24474 7477 -34338 -42068 20420
1940 20420 64027 45758 65941 18513 -102354 -178675 -32129 1089 -80060 -53699 -67977
1929 -67977 52512 -37204 -126326 21304 60651 176847 189123 103826 85542 5785 -40589
1918 -40589 40005 32424 -35741 -133597 -234920 -67419 -20459 -222931 -77431 121555 56357
1907 56357 -55387 46910 206663 141022 120138 106491 66308 88480 103081 33725 103053
1896 103053 202127 130263 -18348 19369 104012 74263 -18843 -52344 7315 59325 82306
1885 82306 14654 -35089 36952 65527 15032 192477 132934 28996 106273 127140 20248
1874 20248 93122 173612 268013 116674 190702 97731 31397 164014 126693 -134263 -92848
$$ packed form
1952I0479J1259k9035R3783o3726j50854Q0273o8970J2317L1951m1815p730O2488
1940B0420M3607j8269K0183m7428j20867p6321J46546L3218q1149K6361j4278
1929f7977J20489q9716q9122J47630L9347J16196J2276q5297j8284p9757m6374
1918d0589Q0594p581o8165r7856j01323J67501M6960k02472J45500J98986o5198
1907E6357j11744J02297J59753o5641k0884j3647m0183K2172J4601o9356O9328
1896A03053R9074p1864j48611L7717Q4643k9749r3106l3501N9659N2010K2981
1885H2306o7652m9743P2041K8575n0495J77445n9543j03938P7277K0867j06892
1874B0248P2874Q0490R4401j51339P4028r2971o6334J32617l7321k60956M1415
$$ plain form
1863 -92848 -41084 23186 109752 36668 -189390 -247677 -219626 -201323 -93001 -34389 68947
1852 68947 36525 63921 -33297 -91783 -70219 -138850 -197927 -172843 -86940 -31596 -30964 4699
1840 4699 2786 -121385 -353135 -332692 -319093 -109202 -48861 -37303 -59460 -34321 -111638 -140754
1828 -140754 -124696 -180908 -214960 -72650 -59699 -149 -16691 -86010 -104128 -29412 118929
1817 118929 89486 70209 -9160 -32502 -111046 -98630 -62962 -231193 -218946 -147407 -216213
1806 -216213 -155011 10680 69777 -81799 -91151 -136042 -85627 -126461 -107377 17061 121816
1795 121816 163243 27829 -40748 -8831 3072 -24320 -45171 -48130 4657 72785 68491 80223
1783 80223 71372 30188 -17514 -1691 17650 -115757 -188891 -66623 -23608 3939 -42442 -15344
$$ packed form
1863i2848N1764O4270Q6566p3084k26058n8287K8051J8303J08322N8612J03336
1852F8947l2422K7396r7218n8486K1564o8631n9077K5084Q5903N5344O32L5663
1840D699j913j24171k31750K0443J3599K09891O0341J1558k2157K5139p7317k9116
1828a40754J6058n6212l4052J42310J2951N9550j6542o9319j8118P4716J48341
1817A18929k9443j9277p9369k3342p8544J2416L5668j68231J2247P1539o8806
1806b16213O1202J65691N9097j51576r352m4891N0415m0834J9084J24438J04755
1795A21816M1427j35414o8577L1917J1903k7392k0851k959N2787O8128m294J1732
1783H0223q851m1184m7702J5823J9341j33407p3134J22268M3015K7547m6381K7098
$$ plain form
1771 -15344 -102868 -214613 -206156 -33371 98921 1496 -118972 -132059 -10593 72884 65337
1760 65337 -17641 -72179 13706 54189 18438 110655 160294 143148 111754 -19772 -72244 -104683
1748 -104683 -132463 -36965 107561 196424 37466 54836 -74588 -10016 -3484 -26695 52952
1737 52952 76092 -37720 57358 31911 28853 117653 180251 210551 187046 185041 174134 28773
1725 28773 1323 99410 -88131 -157056 -90601 -56947 -17306 201742 319726 190204 148700
1714 148700 -24807 -188019 45445 205393 35719 -98451 116370 24683 58638 -17826
1704 -17826 -108746 -144391 15074 25125 -59344 -11746 -25049 61637 125890 90571 -124518
1693 -124518 -87562 88978 85729 -97456 -177102 -63098 -115583 -80177 -12224 -82505 -70906
$$ packed form
1771a5344q7524j11745Q457J72785J32292r7425j20468j3087J21466Q3477p547
1760F5337q2978n4538Q5885M0483l5751R2217M9639j7146l1394j31526n2472l2439
1748a04683k7780R5498J44526Q8863j58958J7370j29424O4572O532k3211P9647
1737E2952K3140j13812R5078k5447l058Q8800O2598L0300k3505k005j0907j45361
1725B8773k7450R8087j87541o8925O6455L3654L9641K19048J17984j29522m1504
1714A48700j73507j63212K33464J59948j69674j34170K14821r1687L3955p6464
1704a7826r0920l5645J59465J0051q4469M7598j3303Q6686O4253l5319k15089
1693a24518L6956J76540l249j83185p9646J14004n2485L5406O7953p0281J1599
$$ plain form
1682 -70906 -49597 -48981 -55039 -62332 -43855 -199721 -215982 72784 -3108 -46791 35143 75626
1670 75626 135188 -1943 -133978 -163952 -117612 12136 -68342 -63983 44622 -61521 -48109
1659 -48109 19700 -45189 2630 52980 35266 95975 -2777 -109469 2183 51958 31245
1648 31245 -47498 -36133 63716 109494 105095 97901 123594 178777 243563 164917 -3175 11951
1636 11951 28319 89389 131436 14915 -60048 8926 -142288 -110202 24318 101286 -15912
1625 -15912 -165968 -63905 -27174 -98957 -121311 -90940 -111548 -174153 -274596 -224649 -10808
1614 -10808 -107513 -164882 -126354 -70402 118991 64966 8968 32123 71535 131557 90141 21134
1602 21134 148410 -2429 -53306 58107 -10283 -147302 -130246 -67680 21404 -32374 10148
$$ packed form
1682g0906K1309O16o058p293J8477j55866j6261K88766p5892m3683Q1934M0483
1670G5626N9562j37131j32035k9974M6340J29748q0478M359J08605j06143J3412
1659d8109O7809o4889M7819N0350j7714O0709r8752j06692J11652M9775k0713
1648C1245p8743J1365R9849M5778m399p194K5693N5183O4786p8646j68092J5126
1636A1951J6368O1070M2047j16521p4963O8974j51214L2086J34520P6968j17198
1625a5912j50056J02063L6731p1783k2354L0371k0608o2605j00443M9947K13841
1614a0808r6705n7369L8528N5952J89393n4025n5998K3155L9412O0022m1416o9007
1602B1134J27276j50839n0877J11413o8390j37019J7056O2566Q9084n3778M2522
$$ plain form
1591 10148 -170038 -247871 -162809 -175093 -189889 -103450 -75664 -23082 60244 122173 26959 143210
1579 143210 225559 186820 152655 171719 248495 99475 86849 32021 48374 51249 69313 55394
1567 55394 33240 6537 -99989 -20944 -9099 -121065 -251407 -159465 -39606 26411 3256
1556 3256 -123522 59124 219261 251410 174727 130260 172345 193702 143894 42801 26878
1545 26878 -124593 -226182 -94174 -14091 -75060 -18734 -89609 -187423 -101289 -95157 -300983
1534 -300983 -378212 -378842 -293701 -235108 -142319 13193 -94684 22074 26266 -49278 42161 164154
1522 164154 57933 -86268 -207460 -292746 -228133 -9800 26978 -20047 74286 104764 42105
1511 42105 85278 -34945 53851 24070 -191348 -332191 -346959 -256646 -1577 6282 -88890
$$ packed form
1591A0148j80186p7833Q5062j2284j4796Q6439K7786N2582Q3326O1929r5214J16251
1579A43210Q2349l8739l4165J9064P6776j49020j2626n4828J6353K875J8064j3919
1567E5394k2154k6703j06526P9045J1845j11966j30342R1942J19859O6017k3155
1556C256j26778J82646J60137L2149p6683m4467M2085K1357m9808j01093j5923
1545B6878j51471j01589J32008Q0083o0969N6326p0875r7814Q6134O132k05826
1534c00983p7229o30Q5141N8593R2789J55512j07877J16758M192p5544R1439J21993
1522A64154j06221j44201j21192q5286O4613K18333L6778m7025R4333L0478o2659
1511D2105M3173j20223Q8796k9781k15418j40843j4768R0313K55069P859r5172
$$ plain form
1500 -88890 -70433 -5501 -5509 -18005 16907 159511 88165 -102280 -216905 -158884 26868 165125
1488 165125 227953 188587 106364 193900 119339 -44640 14286 64591 18023 -34069 -44112
1477 -44112 12291 108680 106451 107419 -81826 -122092 -766 -72177 26419 141339 121092 24388
1465 24388 5492 35981 19550 53042 134184 169333 56859 -4717 49815 53843 -56406 -42080
1453 -42080 -59443 35525 143888 2456 -55174 125363 109058 -50463 -149151 -248319 -139357
1442 -139357 -81285 -117332 -171417 -57545 28552 -261461 -194853 -47844 76570 21663 28773
1431 28773 32985 11290 53062 91773 -104608 -85681 -154148 -218572 -51317 95072 -127666
1420 -127666 -124379 -33344 -154449 -256672 -211665 -63561 -1032 -38089 -64463 -152239 -116690
$$ packed form
1500h8890J8457O4932qj2496L4912J42604p1346j90445j14625N8021J85752J38257
1488A65125O2828l9366q2223Q7536p4561j63979N8926N0305m6568n2092j0043
1477d4112N6403R6389k229R68j89245m0266J21326p1411R8596J14920k0247r6704
1465B4388j8896L0489j6431L3492Q1142L5149j12474o1576N4532M028j10249J4326
1453d2080j7363R4968J08363j41432n7630J80537j6305j59521r8688r9168J08962
1442a39357N8072l6047n4085J13872Q6097k90013O6608J47009J24414n4907P110
1431B8773M212k1695M1772L8711j96381J8927o8467o4424J67255J46389k22738
1420a27666L287R1035j21105j02223M5007J48104O2529l7057k6374q7776L5549
$$ plain form
1409 -116690 82473 105915 -126481 7699 35203 -13169 215332 242100 172550 -45992 27699
1398 27699 -123405 -207219 -66058 -62649 -95084 -128179 -274865 -156672 -9600 50481 69985
1387 69985 68121 36202 38850 20093 130374 24177 -71371 -5202 -146347 -92357 -81666 11735
1375 11735 13089 75339 56656 -141825 -43157 -109773 -177426 -45335 -80073 -158163 -137487 -28940
1363 -28940 -55480 97692 -21985 16090 101887 83488 186843 98652 -75847 -149215 -77504
1352 -77504 -142245 -183060 -166422 -228269 -98320 13717 19640 -63668 -23665 142086 36400
1341 36400 29017 89701 231540 174700 223439 299869 327985 203270 197208 148618 120775 221566
1329 221566 140345 124766 100146 6275 -24724 -160714 -84906 -26507 -14465 -48194 -12884
$$ packed form
1409a16690J99163K3442k32396J34180K7504m8372K28501K6768o9550k18542P3691
1398B7699j51104q3814J41161L409l2435l3095j46686J18193J47072O0081J9504
1387F9985j864l1919K648j8757J10281j06197r5548O6169j41145N3990J0691R3401
1375A1735J354O2250j8683j98481R8668o6616o7653J32091l4738p8090K0676J08547
1363b8940k6540J53172j19677L8075Q5797j8399J03355q8191j74499p3368P1711
1352g7504o4741m0815J6638o1847J29949J12037N923q3308M0003J65751j05686
1341C6400p383O0684J41839n6840M8739P6430K8116j24715o062m8590k7843J00791
1329B21566q1221j5579k4620r3871l0999j35990P5808N8399J2042l3729L5310
$$ plain form
1318 -12884 93368 81887 102770 -1235 100435 207816 106388 67234 176085 78332 43627
1307 43627 100839 -19568 17024 67641 108457 148516 -727 37179 19460 134673 72814
1296 72814 -74733 -135379 -82299 -4785 27958 -83610 -159586 12707 -77271 -106544 -39615
1285 -39615 101064 -38035 -123127 -191780 -72627 -112916 -68120 -112684 -158479 -256572 -322814
1274 -322814 -250056 -102609 -53830 -153021 -131871 -41360 8364 83054 -25355 -61850 -120961
1263 -120961 -108343 -213745 -461 179201 61014 -173474 -22770 118138 -53136 -229923
1253 -229923 -264181 -213203 -324432 -197050 -187581 -178864 -71553 -13588 -140593 -135142 -86515
1242 -86515 -129754 -60673 112672 127790 -11445 -38228 10788 -95792 23754 -25294 -71789
$$ packed form
1318a2884J06252j1481K0883j04005J01670J07381j01428l9154J08851r7753l4705
1307D3627N7212j20407L6592N0617M0816M0059j49243L7906j7719J15213o1859
1296G2814j47547o0646N3080P7514L2743j11568p5976J72293q9978k9273O6929
1285c9615J40679j39099q5092o8653J19153m0289M4796m4564m5795r8093o6242
1274c22814P2758J47447M8779r9191K1150R0511M9724P4690j08409l6495n9111
1263a20961J2618j05402K13284J79662j18187k34488J50704J40908j71274j76787
1253b29923l4258N0978j11229J27382R469Q717J07311N7965j27005N451M8627
1242h6515m3239O9081J73345J5118j39235k6783M9016j06580J19546m9048m6495
$$ plain form
1231 -71789 -135203 -113010 -199009 -139666 -45807 -160727 -324266 -227556 -216063 -45230 -104626
1220 -104626 -166608 -249461 -166086 -128427 -143004 -154091 -205563 -82904 14803 24201 115018 177114
1208 177114 -58798 -208377 -108349 -124346 -51798 -158523 -191879 -194510 -199049 -127699 -152782
1197 -152782 -211531 -218576 -299717 -136951 -73298 -24966 -33969 -182855 -229247 -122893 -28665
1186 -28665 -254777 -215527 3961 68126 11706 49312 18787 -109921 -125489 -152371 -96529
1175 -96529 1693 -36984 -184134 -116518 -10017 13465 88424 69240 227638 200992 24238
1164 24238 9828 -20374 -48537 -13809 30055 -68943 -182486 -97758 -78440 89997 200062
1153 200062 117307 -38511 -3188 -115193 -75964 4479 126076 192440 98355 7805 -62836
$$ packed form
1231g1789o3414K2193q5999N9343R3859j14920j63539R6710J1493J70833n9396
1220a04626o1982q2853Q3375L7659j4577j1087n1472J22659R7707R398R0817O2096
1208A77114k35912j49579J00028j5997P2548j06725l3356k631m539P1350k5083
1197a52782n8749p045q1141J62766O3653M8332r003j48886m6392J06354R4228
1186b8665k26112L9250K19488O4165n6420L7606l0525j28708j5568k6882N5842
1175i6529R8222l8677j47150O7616J06501K3482P4959j9184J58398k6646j76754
1164B4238j4410l0202k8163L4728M3864r8998j13543Q4728J9318J68437J10065
1153B00062q2755j55818L5323j12005L9229Q0443J21597O6364r4085r0550p0641
$$ plain form
1142 -62836 -19397 46815 -7220 -29351 -113502 -115563 -107787 -144940 -142620 -21071 -81041 -28315
1130 -28315 -131895 -227966 -273376 -180507 67474 177668 27072 -53610 -55033 19160 91644
1119 91644 165859 21758 -5474 -2209 -70126 -104503 -132537 -65871 -67890 -193023 -186413 -89050
1107 -89050 -107226 -111147 7144 35651 -20913 -171265 -222198 -17412 17970 -29961 -152789
1096 -152789 -89870 -83551 -46955 5454 5412 62705 -43429 -111841 -100068 -77609 -86046 -196231
1084 -196231 -118416 -159263 -95368 -137524 11951 169816 153089 137820 183047 156659 29069
1073 29069 -32326 -176687 -16112 136071 -24625 -16223 -8839 -60845 -106861 38786 -20741
1062 -20741 -190904 -154849 -111684 -122533 -58790 -28572 -44171 -123543 -143906 -185407 -195946 -64335
$$ packed form
1142f2836M3439O6212n4035k2131q4151k061P776l7153K320J21549n9970N2726
1130b8315j03580r6071m5410R2869K47981J10194j50596q0682j423P4193P2484
1119I1644P4215j44101k7232L265o7917l4377k8034O6666k019j25133O610R7363
1107h9050j8176l921J18291K8507n6564j50352n0933K04786L5382m7931j22828
1096a52789O2919O319L6596N2409m2N7293j06134o8412J1773K2459q437j10185
1084a96231P7815m0847O3895m2156J49475J57865j6727j5269M5227k6388j27590
1073B9069o1395j44361J60575J52183j60696Q402P384n2006m6016J45647n9527
1062b0741j70163L6055M3165j0849O3743L0218j5599p9372k0363m1501j0539J31611
$$ plain form
1050 -64335 96316 40317 57925 45406 -59754 -60097 -15401 15640 23550 -174927 -219564 -23792
1038 -23792 52122 23020 -2579 -69049 -135201 -88825 -74519 -83089 -20807 -5818 -71876 -132971
1026 -132971 -180370 -96465 -154218 -188031 -187724 -27161 -22248 -35243 -74557 -1611 132266 150220
1014 150220 -32551 7495 152561 30869 -38185 28664 -2068 -16351 -28304 -9888 -95820
1003 -95820 26905 -36045 36243 56209 -20867 -121866 -116380 63262 51709 30925 -346
992 -346 37088 3257 63235 32105 34780 153273 43398 -81157 55121 83405 84199 144130
980 144130 134975 28184 -19289 -178421 -127075 -244918 -334988 -203142 -119649 -93891 65564
969 65564 -114450 -122291 -722 17322 -27054 74875 -39196 -147020 -195816 -74617 -14453
$$ packed form
1050f4335J60651n5999J7608j2519j05160l43M4696L1041P910j98477m4637J95772
1038b3792P5914k9102k5599o6470o6152M6376J4306q570O2282J4989o6058o1095
1026a32971m7399Q3905n7753l3813L07J60563M913j2995l9314P2946J33877J7954
1014A50220j82771M0046J45066j21692o9054O6849l0732j4283j1953J8416q5932
1003i5820J22725o2950P2288J9966p7076j00999N486J79642j1553k0784l1271
992c46L7434l3831N9978l1130K675J18493j09875j24555J36278K8284P94N9931
980A44130r155j06791m7473j59132N1346j17843r0070J31846Q3493K5758J59455
969F5564j80014p841J21569J8044m4376J01929j14071j07824m8796J21199O0164
$$ plain form
958 -14453 -102967 -61306 -24823 -114483 666 -61481 -62335 95888 76201 27871 -138492 -201485
946 -201485 -109716 -65507 57733 175880 95948 -11425 95046 87503 103714 107539 28742
935 28742 72376 -23041 -17911 -108529 -144528 -32727 95107 105784 37339 -76553 -131267 -51163
923 -51163 31259 -21139 37769 -43133 18009 -46993 -59378 23782 230264 211200 251065 154710
911 154710 64909 -21693 9270 -11903 -4577 -64549 -86552 -167997 -74939 -73703 -32222 22756
899 22756 -37896 -114598 -83093 -61291 -73084 -80099 -77042 -6664 -27522 -3203 13391 -41215
887 -41215 16192 148932 43199 112047 72058 -90646 -176618 -105947 -194324 -48744 -11231
876 -11231 -51365 -151042 -79974 136737 185318 133700 -33431 -244504 -220281 -41676 1340
$$ packed form
958a4453q8514M1661L6483q9660J15149o2147q54J58223j9687m8330j66363o2993
946b01485R1769M4209J23240J18147p9932j07373J06471p543J6211L825p8797
935B8742M3634r5417N130r0618l5999J11801J27834J0677o8445j13892n4714Q0104
923e1163Q2422n2398N8908q0902O1142o5002j2385Q3160K06482j9064L9865r6355
911A54710q9801q6602L0963k1173P326n9972k2003q1445R3058J236M1481N4978
899B2756o0652p6702L1505K1802j1793p015L057P0378k0858K4319J6594n4606
887d1215N7407J32740j05733O8848l9989j62704q5972P0671q8377J45580L7513
876a1231m0134r9677P1068K16711M8581n1618j67131k11073K4223J78605M3016
$$ plain form
865 1340 -28381 6938 43712 -3552 17771 97754 44035 68585 212642 42120 -102474 -74232
853 -74232 -23847 -132427 -171887 -152897 -78589 84626 139386 82034 161957 140980 -5399
842 -5399 -160550 -107388 -23547 -67309 -36868 -52930 52502 47230 9090 -81016 -94103 -162233
830 -162233 -268151 -229648 -39194 35562 -48004 -122252 -75785 -36991 -3416 53837 83503
819 83503 -5318 -19174 70731 28479 74304 13409 -84825 -76526 -23205 29482 -37497 -12552
807 -12552 -81054 -174026 -193459 -177331 -171534 -121791 -126128 -120756 -71023 -109750 -164216 -172852 -102540
794 -102540 -11568 -18469 -7319 -2417 77051 42679 6625 -76808 -2366 57487 47921 -56208
782 -56208 -114129 10410 37787 -94041 -156894 -121222 -221329 -209370 -143426 24114 192631
$$ packed form
865A340k9721L5319L6774m7264K1323P9983n3719K4550J44057j70522j44594K8242
853g4232N0385j08580l9460J8990P4308J63215N4760n7352P9923k0977j46379
842e399j55151N3162Q3841m3762L0441j6062J05432n272l8140r0106j3087o8130
830a62233j05918L8503J90454P4756q3566p4248M6467L8794L3575N7253K9666
819H3503q8821j3856Q9905m2252M5825o0895r8234Q299N3321N2687o6979K4945
807a2552o8502r2972j9433J6128N797M9743m337N372M9733l8727n4466q636P0312
794a02540R0972o901J1150M902P9468l4372l6054q3433P4442N9853r566j04129
782e6208n7921J24539K7377j31828o2853L5672j00107J1959O5944J67540J68517
$$ plain form
771 192631 185814 73713 -75748 -22964 80104 69992 27712 -2571 -30390 -24264 -12560 39982
759 39982 159261 -5516 -135728 -112552 -108489 -61414 -6481 -144430 -277555 -191413 -24406
748 -24406 30536 6190 -154083 -137066 43398 83605 5890 -29911 -174398 -95736 -133392
737 -133392 18548 77231 43596 -40700 -159466 -132220 -155863 -215497 -268409 -111294 -107073
726 -107073 -192343 -217901 -198232 -18781 -91187 -168889 -145114 -202816 -191551 -130695 30295
715 30295 52042 -1852 -17216 -59089 -91749 50948 -70040 -126733 -61812 -123001 -122818 60611
703 60611 -14848 22624 31457 -32621 -24641 75418 138188 133548 57800 -37647 -166088 -45186
691 -45186 -41092 -90970 -147639 27425 191112 95584 35583 19460 46623 42941 93819 113969
$$ packed form
771A92631o817j12101j49461N2784J03068j0112m2280l0283k7819O126J1704N2542
759C9982J19279j64777j30212K3176M063M7075N4933j37949j33125Q6142J67007
748b4406N4942k4346j60273J7017J80464M0207p7715l5801j44487P8662l7656
737a33392J51940N8683l3635q4296j18766K7246k3643n9634n2912J57115M221
726a07073q5270k5558J9669J79451p2406p7702K3775n7702J1265O0856J60990
715C0295K1747n3894j5364m1873l2660J42697j20988n6693O4921o1189J83J83429
703F0611p5459L7472Q833o4078P980J00059O2770m640p5748r5447j28441J20902
691d5186M094m9878n6669J75064J63687r5528o0001j6123K7163l682N0878K0150
$$ plain form
679 113969 240178 136524 64255 117245 93334 131314 193698 141351 222035 160129 181163
668 181163 93303 70262 49113 -98734 -214698 -242116 -161241 -15126 11455 2459 -81451
657 -81451 -101609 -219556 -117412 -85872 -25649 60816 98712 190155 81284 52206 -47793
646 -47793 -77403 23508 -9714 22090 7798 146559 101604 50583 -89489 12402 -110224
635 -110224 -76560 -53387 -38370 39372 -53973 -19461 -94958 -146293 -154113 -75479 -88757 22534
623 22534 6677 94414 139732 7353 -66090 -108878 -100724 -46855 -98604 120520 143471 137369
611 137369 149050 228258 89772 154651 93370 89931 87661 74660 1481 -122015 -98255 -136971
599 -136971 -298502 -124134 -140709 -151746 39457 72152 60052 -868 -127901 -217008 -109947
$$ packed form
679A13969J26209j03654p2269N2990k3911L7980O2384n2347Q0684o1906K1034
668A81163q7860k3041k1149j47847j15964k7418Q0875J46115K6581q996q3910
657h1451k0158j17947J02144L1540O0223Q6465L7896R1443j08871k9078r9999
646d7793k9610J00911l3222L1804j4292J38761m4955n1021j40072J01891j22626
635a10224L3664K3173J5017P7742r3345L4512p5497n1335p820P8634j3278J11291
623B2534j5857Q7737M5318j32379p3443m2788Q154N3869n1749K19124K2951o102
611A37369J1681P9208j38486O4879o1281l439k270j3001p3179j23496K3760l8716
599a36971j61531J74368j6575j1037J91203L2695j2100o0920j27033q9107J07061
$$ plain form
588 -109947 9089 48425 -14482 77901 218878 158587 80702 -15863 -189961 -131709 -56651
577 -56651 240608 184908 92378 13357 -100026 -154138 -108223 13469 -56884 -49078 -78976 -131578
565 -131578 -130054 -80966 -151065 -27364 -22050 -48038 -67194 -60234 85288 155923 88906 -7046
553 -7046 -85052 -183611 9958 112621 108464 85584 -48840 86599 118366 45258 -75447
$$ packed form
588a09947J19036L9336o2907R2383J40977o0291p7885r6565j74098N8252P5058
577e6651K97259n5700r2530p9021j13383n4112M5915J21692p0353P806k9898n2602
565a31578J524M9088p0099J23701N314k5988j9156O960J45522P0635o7017r5952
553g046p8006r8559J93569J02663m157k2880j34424J35439L1767p3108j20705
$$ [...]
##END NTUPLES=NMR SPECTRUM
##END=
