##TITLE=1H_DE-80H_X3
 200.13MHz, d2o
 8 sc
 
 19ns.26.2.2025
##JCAMPDX= 6.0         $$ Bruker NMR JCAMP-DX V2.0
##DATA TYPE= NMR SPECTRUM
##DATA CLASS= NTUPLES
##ORIGIN= UXNMR, Bruker Analytische Messtechnik GmbH
##OWNER= pz
$$ XWIN-NMR		Version 3.5
$$ Mon May 18 16:33:31 2026 Russian Standard Time (UT+4h)  Yarkov@DPX200
##.OBSERVE FREQUENCY= 200.1313
##.OBSERVE NUCLEUS= ^1H
##.ACQUISITION MODE= SIMULTANEOUS
##.ACQUISITION SCHEME= undefined
##.AVERAGES= 8
##.DIGITISER RES= 18
##SPECTROMETER/DATA SYSTEM= spect
##.PULSE SEQUENCE= zg30
##.SOLVENT NAME= DMSO
##.SHIFT REFERENCE= (INTERNAL, DMSO, 0, 15.4979)
##AUDIT TRAIL= $$ (NUMBER, WHEN, WHO, WHERE, WHAT)
$$ ##TITLE= Audit trail, XWIN-NMR		Version 3.5
$$ ##JCAMPDX= 5.01
$$ ##ORIGIN= Bruker BioSpin GmbH
$$ ##OWNER= Yarkov
$$ C:/Bruker/XWIN-NMR/data/yarkov2/nmr/H-C/1/pdata/1/auditp.txt
$$ ##AUDIT TRAIL=  $$ (NUMBER, WHEN, WHO, WHERE, WHAT)
(   1,<2026-05-18 16:32:14.78 +0400>,<Yarkov>,<DPX200>,
      <created by zg, POWCHK disabled, PULCHK disabled
       configuration hash MD5:
       00 E9 B6 7A A2 85 ED C7 34 08 36 98 17 FE 4E 26
       data hash MD5: 16K
       02 A7 98 4C 8D 06 76 54 AC D2 37 0B F3 A8 09 13>)
(   2,<2026-05-18 16:32:30.00 +0400>,<Yarkov>,<DPX200>,
      <Start of raw data processing
       efp BC_mod = 2 LB = 0.25 FT_mod = 6 PKNL = 1 PHC0 = -5654.516 PHC1 = 11.42193 SI = 16K 
       data hash MD5: 16K
       05 B2 68 AC 16 BA C3 74 97 6A 6D 93 FA 61 EC 34>)
(   3,<2026-05-18 16:32:48.56 +0400>,<Yarkov>,<DPX200>,
      <pk PHC0 = -2.2 PHC1 = 0 
       data hash MD5: 16K
       26 25 87 AF 26 88 72 FE 24 47 52 11 E8 CA 9A EA>)
(   4,<2026-05-18 16:32:54.56 +0400>,<Yarkov>,<DPX200>,
      <abs ABSG = 5 
       data hash MD5: 16K
       4C A1 62 A1 CC 20 F2 E0 9E B4 D2 46 FC 58 96 47>)
$$ ##END=
$$ 
$$ hash MD5
$$ 72 63 2E 74 38 2B 79 55 9B 1F 44 74 E8 2A 35 47
##$RELAX= 
##$RELAX= 
##$RELAX= 
##$RELAX= 
##$RELAX= 
##$RELAX= 
$$ Bruker specific parameters
$$ --------------------------
##$DU= <C:/Bruker/XWIN-NMR>
##$EXPNO= 1
##$NAME= <H-C>
##$PROCNO= 1
##$TYPE= <nmr>
##$USER= <yarkov2>
##$AMP= (0..31)
100 100 100 100 100 100 100 100 100 100 100 100 100 100 100 100 100 100 
100 100 100 100 100 100 100 100 100 100 100 100 100 100 
##$AQSEQ= 0
##$AQ_mod= 1
##$AUNM= <au_zg>
##$AUTOPOS= <>
##$BF1= 200.13
##$BF2= 200.13
##$BF3= 200.13
##$BF4= 200.13
##$BF5= 200.13
##$BF6= 200.13
##$BF7= 200.13
##$BF8= 200.13
##$BYTORDA= 1
##$CFDGTYP= 0
##$CFRGTYP= 5
##$CHEMSTR= <none>
##$CNST= (0..31)
1 1 145 1 1 1 1 1 1 1 1 1 1 1 1 1 1 1 1 1 1 1 1 1 1 1 1 1 1 1 1 1 
##$CPDPRG= <>
##$CPDPRG1= <>
##$CPDPRG2= <>
##$CPDPRG3= <>
##$CPDPRG4= <mlev>
##$CPDPRG5= <mlev>
##$CPDPRG6= <mlev>
##$CPDPRG7= <mlev>
##$CPDPRG8= <mlev>
##$CPDPRGB= <>
##$CPDPRGT= <>
##$D= (0..31)
0 0.7 0 0 0 0 0 0 0 0 0 0.03 0 0 0 0 0 0 0 0 0 0 0 0 0 0 0 0 0 0 0 0 
##$DATE= 1779107534
##$DBL= (0..7)
120 120 120 120 120 120 120 120 
##$DBP= (0..7)
150 150 150 150 150 150 150 150 
##$DBP07= 0
##$DBPNAM0= <>
##$DBPNAM1= <>
##$DBPNAM2= <>
$$ [...]
##$SUBNAM3= <"">
##$SUBNAM4= <"">
##$SUBNAM5= <"">
##$SUBNAM6= <"">
##$SUBNAM7= <"">
##$SUBNAM8= <"">
##$SUBNAM9= <"">
##$SW= 18.0517328524113
##$SWIBOX= (0..15)
0 0 2 0 0 0 0 0 0 0 0 0 0 0 0 0 
##$SW_h= 3612.71676300578
##$TD= 16384
##$TD0= 1
##$TE= 0
##$TE2= 300
##$TE3= 300
##$TEG= 300
##$TL= (0..7)
0 120 120 120 120 120 120 120 
##$TP= (0..7)
150 150 150 150 150 150 150 150 
##$TP07= 0
##$TPNAME0= <>
##$TPNAME1= <>
##$TPNAME2= <>
##$TPNAME3= <>
##$TPNAME4= <>
##$TPNAME5= <>
##$TPNAME6= <>
##$TPNAME7= <>
##$TPOAL= (0..7)
0.5 0.5 0.5 0.5 0.5 0.5 0.5 0.5 
##$TPOFFS= (0..7)
0 0 0 0 0 0 0 0 
##$TUNHIN= 0
##$TUNHOUT= 0
##$TUNXOUT= 0
##$USERA1= <user>
##$USERA2= <user>
##$USERA3= <user>
##$USERA4= <user>
##$USERA5= <user>
##$V9= 5
##$VALIST= <valist>
##$VCLIST= <CCCCCCCCCCCCCCC>
##$VD= 0
##$VDLIST= <DDDDDDDDDDDDDDD>
##$VPLIST= <PPPPPPPPPPPPPPP>
##$VTLIST= <TTTTTTTTTTTTTTT>
##$WBST= 1024
##$WBSW= 4
##$XGAIN= (0..3)
0 0 0 0 
##$XL= 0
##$YL= 0
##$YMAX_a= 388996
##$YMIN_a= -398649
##$ZGOPTNS= <>
##$ZL1= 120
##$ZL2= 120
##$ZL3= 120
##$ZL4= 120
##$ABSF1= 15.46704
##$ABSF2= -2.584809
##$ABSG= 5
##$ABSL= 3
##$ALPHA= 0
##$AQORDER= 0
##$ASSFAC= 0
##$ASSFACI= 0
##$ASSFACX= 0
##$ASSWID= 0
##$AUNMP= <proc_1d>
##$AZFE= 0.1
##$AZFW= 0.1
##$BCFW= 0
##$BC_mod= 2
##$BYTORDP= 0
##$COROFFS= 0
##$CY= -3
##$DATMOD= 1
##$DC= 0
##$DFILT= <>
##$DTYPP= 0
##$F1P= 0
##$F2P= 0
##$FCOR= 1
##$FTSIZE= 16384
##$FT_mod= 6
##$GAMMA= 0
##$GB= 0
##$INTBC= 1
##$INTSCL= 3.241238e-09
##$ISEN= 128
##$LB= 0.25
##$LEV0= 0
##$LPBIN= 0
##$MAXI= 10000
##$MC2= 0
##$MEAN= 0
##$ME_mod= 0
##$MI= 1.114404
##$NCOEF= 0
##$NC_proc= -6
##$NLEV= 6
##$NOISF1= 3.799351
##$NOISF2= 2.8
##$NSP= 0
##$NTH_PI= 0
##$NZP= 0
##$OFFSET= 15.49788
##$PC= 1
##$PHC0= -5656.716
##$PHC1= 11.42193
##$PH_mod= 1
##$PKNL= yes
##$PPARMOD= 0
##$PSCAL= 0
##$PSIGN= 0
##$REVERSE= no
##$SF= 200.130004767573
##$SI= 16384
##$SIGF1= 3
##$SIGF2= 2
##$SINO= 0.751879
##$SIOLD= 32768
##$SREGLST= <19F.Aceton>
##$SSB= 0
##$STSI= 16384
##$STSR= 0
##$SW_p= 3612.71676300578
##$SYMM= 0
##$S_DEV= 0
##$TDeff= 16384
##$TDoff= 0
##$TI= <>
##$TILT= no
##$TM1= 0
##$TM2= 0
##$TOPLEV= 0
##$USERP1= <user>
##$USERP2= <user>
##$USERP3= <user>
##$USERP4= <user>
##$USERP5= <user>
##$WDW= 1
##$XDIM= 16384
##$YMAX_p= 383986386
##$YMIN_p= -895636
$$ End of Bruker specific parameters
$$ ---------------------------------
##NTUPLES= NMR SPECTRUM
##VAR_NAME=  FREQUENCY,     SPECTRUM/REAL,   SPECTRUM/IMAG
##SYMBOL=    X,             R,               I
##VAR_TYPE=  INDEPENDENT,   DEPENDENT,       DEPENDENT
##VAR_FORM=  AFFN,          ASDF,            ASDF
##VAR_DIM=   16384,         16384,           16384
##UNITS=     HZ,            ARBITRARY UNITS, ARBITRARY UNITS
##FACTOR=    0.220516191357247, 1,           1
##FIRST=     3101.59079468386, 0,            0
##LAST=      -511.125968321921, 0,           0
##MIN=       -511.125968321921, -895636,     0
##MAX=       3101.59079468386, 383986386,    0
$$ Real data points
##PAGE= N=1
##DATA TABLE= (X++(R..R)), XYDATA
$$ [...]
9252 71937 21024 95807 33173 28154 77967 121932 189276 188764 136973 155598 97778 136686
9240 136686 188240 208768 164015 102176 106172 66765 69586 60633 42711 101826 108488 83062
9228 83062 8592 10171 107968 142001 152570 186373 220598 65657 136531 162967 100246 87779
9216 87779 54672 10775 3588 -16337 -28439 1359 106775 122720 178539 187166 121307 195634
9204 195634 136184 132489 79818 32243 122160 86881 101204 197015 108123 123834 106943 43304
9192 43304 104184 108410 114937 44763 36939 95973 91268 64287 78537 57122 48233 124471 107719
9179 107719 14444 -18979 102163 109496 66279 38825 27009 35106 127480 157379 126442 139706
9167 139706 157038 123976 27907 94725 188016 130361 69101 39067 105062 191230 114916 101938
9155 101938 57644 67037 17611 333 9955 6769 181523 158926 97314 153978 125799 39692
9143 39692 70058 132023 131426 153403 72057 50014 40325 42206 -348 48969 130968 48542 26142
9130 26142 70229 66978 -12240 3163 92890 26358 23243 34862 16501 -12093 22953 -92142
9118 -92142 -27679 12013 61158 26725 8477 104935 145093 96370 92523 62082 20419 57609
9106 57609 -42005 -18085 44361 85687 146217 140094 112493 105920 144841 209727 186096 83344
9094 83344 16502 91220 129122 80296 49458 -27644 -96611 -41480 28878 100825 105886 120656
9082 120656 189140 137565 103904 111961 38472 7376 84132 102829 94085 60564 -10663 52334
9070 52334 32221 -5566 -48926 -80681 2819 2044 29432 101081 1179 42444 30275 41722
9058 41722 20811 50928 84387 63798 24360 97755 130172 71636 -54534 68012 61696 23241
9046 23241 11736 145973 28927 93301 112292 121368 134575 138509 162050 81533 94979 10896
9034 10896 -36821 461 149213 179666 218920 235096 195492 168025 43418 -10277 50812
9023 50812 163959 199398 106356 116905 -6252 34120 -14214 22587 170796 54502 -3894
9012 -3894 53056 88432 143349 81035 117741 241081 195204 143133 143583 37892 111483 201122
9000 201122 146159 188540 176102 139218 135744 63897 108890 266007 181968 136443 136000 51340
8988 51340 59454 -67026 105371 156677 148750 218725 162833 118637 245767 305388 199397
8977 199397 116239 124071 119407 59923 -8657 79309 177787 149597 137635 161656 89884 -4197
8965 -4197 115109 241729 176737 183704 44429 159781 182329 92185 81428 63504 76243
8954 76243 63096 10848 87009 135731 169559 144486 111562 176111 114091 167497 153138 119295
8942 119295 122915 109085 140393 172985 107179 102924 131846 150115 84339 46455 48694 55228
8930 55228 84642 194409 126930 -7307 63458 118265 147148 78013 50406 83523 20266
8919 20266 34584 103729 84083 23191 -16707 59740 144584 128426 85721 -74140 -89685 -212
8907 -212 -5786 84165 59446 92354 62298 -3339 -73552 103397 132535 40600 186113 191119
8895 191119 104740 29867 50723 45971 35996 94761 55701 -103301 19981 88923 85498 78806
8883 78806 113920 -43007 26964 54191 50888 43481 91034 68547 13805 41063 -40476 -171816
8871 -171816 -57004 15313 -1735 51029 74410 53837 8619 -6898 -9029 40928 38750 66785
8859 66785 79347 121807 197166 60519 69827 72530 48470 95252 129528 84427 -39221 -119686
8847 -119686 -139643 -39236 5873 135284 130422 62471 70290 15662 7727 -45784 -89386 -58521
8835 -58521 3678 144142 99856 83675 63835 41087 91106 76374 77236 28587 51803 106563
8823 106563 88627 247215 201027 138186 75303 36588 151778 80829 38762 59953 37910
8812 37910 39960 176 -25345 11120 58556 51333 1535 1480 -18303 -25600 -30523 -20784 24357
8799 24357 112390 51823 80971 95613 87886 124749 76094 80038 96247 64393 17884 20559
8787 20559 4269 50463 61068 -89442 -47285 86376 45852 71051 80073 108155 162837 222687
8775 222687 158292 155433 73014 -38010 -6404 75821 97340 76569 -5267 8100 36898 5506
8763 5506 49627 1799 94489 171941 148454 113532 122535 191910 92282 128169 126434 84194
8751 84194 104469 49469 8288 29067 -66723 78669 101920 66425 119420 32254 -11181 -31015
8739 -31015 -62815 -62968 64472 139860 222770 200821 186790 180305 110376 184347 151489 185417
8727 185417 162895 119614 91210 47509 53800 123127 219039 197085 151598 85221 39157 83909
8715 83909 179301 144294 99187 129632 169626 156616 155338 149385 80205 59978 55237 11082
8703 11082 91566 129815 83825 194405 216957 -4730 -13578 183792 300803 116745 145755
8692 145755 128356 198320 251721 153895 160045 275661 282903 186376 129825 67766 146333 125304
8680 125304 253054 231374 173074 200435 295654 276201 201235 149670 63789 123724 191342
8669 191342 75310 110485 217423 209848 192472 74784 77516 3647 115641 30562 -99967
8658 -99967 60620 -7764 -4472 47566 32928 76585 70882 39055 74849 41905 -83873 12126
8646 12126 100609 141503 98348 -1097 -27625 -11245 106740 214410 116899 139434 105880
8635 105880 26257 -1196 -30073 -46609 21022 19257 45169 37893 -14882 60361 106202 109312
8623 109312 109395 74577 79205 10218 53137 74013 118501 89124 61145 100495 57689 77493
8611 77493 40777 121224 187745 102050 143640 154712 74273 -10642 2266 123836 195445 244648
8599 244648 156464 102042 134906 102134 -16814 50899 23638 120592 145682 151895 219139 190013
8587 190013 196015 181615 136066 176278 87958 88203 173772 218290 133419 194160 18104 -71254
8575 -71254 56432 75998 181457 279829 335327 305839 375828 413831 450486 478095 602086
8564 602086 603355 617673 793678 957829 880490 1124044 1443506 1650435 1936469 2589909
8554 2589909 3671822 5180444 7158488 8834716 9430757 8461759 6829518 5166049 3702487
8545 3702487 2648557 1878542 1431779 1223521 985150 877360 703343 672185 603545 507915
8535 507915 550233 545440 546402 434492 364744 428994 397838 461296 326653 248535 212570 192895
8523 192895 193003 301355 317892 290119 344968 310491 277628 318006 232774 213696 282064 178820
8511 178820 229677 171622 165271 147139 167511 67991 85392 112565 148393 167949 134664 130371
8499 130371 153143 72271 116 21480 99660 172046 105986 143527 98916 154263 34631
8488 34631 -14801 -21494 50821 153769 88263 68964 61217 128598 48889 86246 113438 122544
8476 122544 111031 164405 109737 99569 21436 -42328 75922 54081 -18994 95778 109158
8465 109158 121864 -7758 -19492 97134 6851 -60217 -56424 24735 27097 25834 64732 55555
8453 55555 129558 153418 58855 29320 78704 104266 -6573 -23121 23060 -6760 63606 3763
8441 3763 21135 44642 -76440 -18042 25714 23831 43236 23307 -15297 32465 98345 158451
8429 158451 12684 -62222 10096 -20853 -3354 -57131 -66839 -3539 78051 155713 56055 -15195
8417 -15195 -6335 -346 48209 32925 67650 13879 32479 102399 134533 95385 140372 181736
8405 181736 153278 85091 -1162 58695 86684 93032 34407 41327 58165 5710 -12456 7305
8393 7305 -38430 59823 -16160 -27571 -63548 -29540 -57892 -16422 -26709 -163477 -101544 -106064
8381 -106064 -93654 -22717 -72618 -66067 -1707 29117 60130 -34422 -19955 37824 -39933 -93189
8369 -93189 19821 71787 44793 81195 68088 -3601 32437 131861 49680 8438 1026 40245
8357 40245 39688 -2108 26988 84128 53581 90690 20073 27678 92464 80886 154311 144855 124600
8344 124600 26220 -59851 -39887 -7847 -43336 10476 -30310 -66884 -1187 -8361 58881 103227
8332 103227 91465 130533 -18161 11281 36964 76201 68440 146192 77018 43925 69203 6208
8320 6208 -12144 -34031 -51348 -99014 -148295 -160659 -54292 -83696 -95189 -9 -21303 -16101
8308 -16101 57248 -24043 -38057 -58923 -103906 -52893 37607 41980 -79578 -65967 25007 -48033
8296 -48033 -25558 -97516 -190130 -189969 -118929 -27266 6820 -84176 -62998 -51062 -37816 -26948
8284 -26948 -24749 8851 -54154 -98220 -140178 -148843 -227769 -187879 -108309 -94925 -101269 -53291
8272 -53291 58955 34114 6685 15594 -41120 -32016 -87543 -58880 -11544 -27936 -77238 -111400
8260 -111400 -13547 63610 -103235 -115803 -97367 -120844 -62794 -63429 -47221 -86411 7201 51584
8248 51584 1359 -35184 -68099 -99565 -82411 -12794 -83102 34730 44731 104626 118220 35238
8236 35238 13706 2895 26895 -29187 -36722 -30716 -86387 -69028 23105 -97829 -102553 -38330
8224 -38330 35993 109275 194201 124335 48785 128516 46186 50385 46416 -11346 9867 -30919
8212 -30919 -67481 -7202 74192 2275 -70615 38123 64683 24001 -63969 -146417 -161311 -149221
8200 -149221 -133834 -233878 -190462 -281567 -260453 -451264 -421436 -895636 -5505 835231 337120
8189 337120 212941 95939 140733 62440 130315 11689 4001 -17309 49093 144836 90005
8178 90005 39615 86823 36395 -44017 -46032 53140 70857 1137 -34554 132769 133604 118247
8166 118247 57784 114720 88710 57673 -21906 -67984 -40289 -104369 -76147 -29066 6426 -18715
8154 -18715 -45578 -97725 36656 108478 76269 152344 125218 94583 35971 -20963 -61925 -16258
8142 -16258 -33787 -74798 -26780 -29249 15027 30229 3670 -92 15240 109854 42789 -82865
8130 -82865 -9484 21414 -27028 -53161 -88748 -38891 53407 -39489 -94595 -89166 -74654 -72791
8118 -72791 -20263 -62784 -54156 8552 16710 64495 58493 26260 -14418 -53621 -61193 -25370 80860
8105 80860 19187 -60798 -26816 -16037 -49854 26761 67634 41948 7960 126325 174878 130608
8093 130608 117193 113040 65247 69781 218140 265085 305975 287100 246784 205997 105284 90714
8081 90714 25767 -4081 33647 72629 67882 56683 -37670 -98997 -2699 96322 119376 66055
8069 66055 51770 74656 111727 145175 58557 -111094 -131710 -46514 -53218 -88419 13887 96039
8057 96039 26563 -13059 45788 6070 38671 18487 -8578 43181 118400 11309 -83261 13352
8045 13352 73059 26955 27944 -27455 -104380 -41155 -4437 -1739 33129 41175 -14376 -69329 21343
8032 21343 47977 -236 -32866 -24728 -32029 13529 58323 -11779 -25821 -40346 -3019 -10716
8020 -10716 28654 -142503 -106486 7634 -5341 -130986 -96308 -45112 -61596 -53749 -2008
8009 -2008 82432 36563 -12625 1523 15737 -10816 15338 -79838 -30559 2719 17197 33428
7997 33428 -41487 59600 34866 -15783 -31046 39136 31038 812 90371 76370 31713 -17409
7985 -17409 -60461 -76936 74514 -44490 -33952 98956 101954 -59382 -127479 -36581 -13790
7974 -13790 -10503 -174133 -82663 -45410 -67333 55962 -16449 33026 66209 -35609 -84924
7963 -84924 -61197 -58994 102281 94292 84040 66818 31227 -6780 33870 -10094 -77159 108514
7951 108514 201807 118711 -47019 9935 72332 524 -21482 -58149 -3573 -31562 -27160 -43010
7939 -43010 -34035 12202 -17477 -55625 23092 67733 65298 -26028 -129500 -168823 -97657 56432
7927 56432 -62685 -31539 18052 -12385 -13024 -12954 104916 98377 69823 106198 80058 74689 -59366
7914 -59366 -124923 -59566 75024 104959 117 67898 132141 24557 7268 -79750 -47944
7903 -47944 -26017 -50780 -26229 37629 24065 -34363 -22716 -18823 -29723 -16189 -67770 -45154
7891 -45154 37952 70776 34618 -84947 -101133 -99581 -131071 -52135 -86610 -34174 -24315 -9192
7879 -9192 -50563 4596 2646 106438 117779 40941 83194 79210 28938 -50731 -53427 -85383
7867 -85383 -120890 -53067 -34834 -47149 -78057 -125494 -28439 32142 -84111 -60612 -39192 -63047
7855 -63047 -19337 -108232 -99147 33381 40171 84143 154112 89544 -214 -66622 40556 12143
7843 12143 80058 82153 -27468 -67414 -67297 -92394 -95124 -291 22578 28220 57826 18951 42196
7830 42196 -13286 72502 45985 -15105 -39595 -56084 -44790 -40363 -17511 35732 34786 60830
7818 60830 7407 46331 5267 32716 -19618 -101727 -165042 -145547 -96419 -51294 27219 157664
7806 157664 84470 41119 41910 14345 52048 607 90127 45249 57396 135163 92736 40097
7794 40097 39937 733 -48960 -59049 6632 -19428 -24532 5199 82467 100425 20061 29598 86360
7781 86360 60646 47625 203752 305753 287350 293763 277668 279167 179076 105470 67979 110282
7769 110282 -8171 -66776 59997 170489 62656 -12792 64840 -10720 -62480 27983 76151
7758 76151 129569 146660 138740 80878 2785 159033 338054 340571 510597 679590 773985
7747 773985 929623 1108822 1272842 1360567 1216073 1131415 955729 931103 859727 674675
7737 674675 666381 617165 459103 422303 416411 518917 547460 475788 365806 330681 267579
7726 267579 182300 304429 336665 348709 356436 328595 318366 418284 470831 588841 636449
7715 636449 815986 871171 865119 946043 885026 665263 555719 425169 313405 168525 27267
7704 27267 57544 175050 158514 189642 261164 261398 206418 199011 203417 235141 146194 175328
7692 175328 164820 40292 -6737 -11784 -2421 6018 86054 71465 138653 302296 369954 362127
7680 362127 338014 229958 195026 119742 45335 89053 77428 3766 -229 -48766 5608 16689
7668 16689 4779 47232 16391 3133 -16799 -14890 -5815 -24727 53757 57976 -35369 -110721
7656 -110721 -117940 -83331 -49933 -33003 1941 120526 74283 139892 133043 -2485 -34387 -34528
7644 -34528 -74821 -97104 -119857 -112285 -34106 2933 -44337 -137827 -56073 -13010 -203 -52828
7632 -52828 -56530 -105360 -135973 -85954 -98329 -50172 96910 -11461 -104070 -165686 -108152 -29340
7620 -29340 20824 105290 -21617 -90419 -152582 -211794 -199936 -109507 -30364 83647 85354 62647
7608 62647 51073 -65672 -48903 -59132 27699 6375 -44556 6576 4649 -50712 -89531 -80274
7596 -80274 -61247 -41140 78279 72950 93367 41436 63470 3751 -160034 -41490 -20051
7585 -20051 40681 30062 118757 -28921 -53005 -76057 -66417 -75323 -54455 -1819 30860 -15910
7573 -15910 52365 9144 39958 66970 -6827 -24156 -70707 -148050 -102163 -2153 -20626 -53854
7561 -53854 -21099 32760 -24515 -48112 -14811 58948 60444 20226 -84349 -93402 -66684 -36828
7549 -36828 -91592 -119773 -86917 -18484 6937 1050 -106957 -122844 -95676 -153450 -109437 -162182
7537 -162182 -11101 -3663 36284 47301 -102822 -100448 -139228 -21986 -46085 -97454 -113674
7526 -113674 -89190 -79833 22208 -127801 -109914 60783 -37422 -229527 -171148 -152044 -102260
7515 -102260 -81446 -17147 116492 29737 -21357 61913 -71480 -88746 -22627 28843 27803
7504 27803 36634 73505 40798 -14196 -11948 -40022 -24582 -51331 -91652 -74299 -46224 -36915
7492 -36915 -5453 22880 -192010 -61646 -32445 -41892 -6573 -74066 -7367 -15854 -31543 -63713
7480 -63713 79059 101957 24239 64445 -87745 -98516 -13455 -615 -121340 -114872 -51463
7469 -51463 -25652 -726 43227 51635 91267 7271 -68013 -138661 -79628 -28286 -81545 -136472
7457 -136472 -175663 -97849 -44707 -37413 15951 -36330 -31772 -100042 -10707 -120548 -219384 -123776
7445 -123776 -63099 -62266 -35825 48909 -21434 -74867 -165550 -128512 -41154 -57235 -89154 -73855
7433 -73855 -164298 -175847 -86722 -136604 -106027 -138301 -136321 -137004 -121596 -176681 -117171 -75766
7421 -75766 -92904 -42541 6072 99282 -25328 -40295 -111142 -45145 -54749 -35872 -85120 -151907
7409 -151907 -52386 -115701 -119631 6106 -57628 -94341 -39294 -33588 -81337 -7277 -47270 -148968
7397 -148968 -101516 -105805 -157662 -74364 -22607 -152325 -142247 -85359 -26798 -44531 -94086 -136069
7385 -136069 -95892 -55844 -72428 -168297 -98505 -15322 -71270 28526 23025 -40268 -12158 -4674
7373 -4674 -48010 -26852 -94547 -91570 -127062 -96770 -83479 -158670 -69540 -55824 -37535 -98392
7361 -98392 -83554 41715 21427 26225 -4654 -44311 -140684 -97289 -60635 -56442 -71483 -95832
7349 -95832 -79735 -38779 -88562 -144649 -93083 -96105 -118527 -127781 -42830 62127 -10271 -52735
7337 -52735 -78132 -160882 -101607 -91242 -1199 -50243 -121755 -93144 -129328 -80301 74356 117639
7325 117639 73947 32742 46112 -20591 -156805 -130272 1878 -10128 444 59092 80481
7314 80481 -140087 -207036 -129739 -109934 -46018 -23979 99904 128944 178010 282647 381152
7303 381152 450479 434331 442621 411706 193186 131063 113045 66268 79798 48441 50023 -64333
7291 -64333 -15320 41913 -100056 -34902 260 49463 44703 57434 -30710 -134908 -136918 -75321
7279 -75321 20673 61629 -29686 -96286 -80738 39479 72616 84986 112104 -21134 -51671
7268 -51671 -143351 -106047 -53125 -103187 -119276 -93419 45743 4257 -36592 -78174 -22618 10506
7256 10506 -140885 -19099 5751 13833 -79875 -36789 3652 24989 133158 134817 89197 86579
7244 86579 70171 27350 64814 140441 219236 231732 185382 291072 400168 452131 329451
7233 329451 215469 210260 152402 75514 134386 146568 131325 97181 3982 34085 -26911 -26389
7221 -26389 -32474 42369 -19356 -149300 -98276 30123 15619 -87986 -60805 62259 74654
7210 74654 -53120 -77706 -54679 -1795 -30529 -96765 -84822 -99274 -8072 63616 -7588 68212
7198 68212 -51690 -160819 -86158 29964 -101413 -139687 -176166 -204648 -230937 -180347 356
7187 356 -5034 -92007 -129344 -19455 -39581 -13954 33115 -11059 17235 -71210 -62904 66076
7175 66076 -49120 -37122 -108654 -35434 8195 37170 36919 36357 -24969 11160 11899 -46055 -69031
7162 -69031 -27806 -74511 -39479 40340 60395 12184 -59717 1281 56020 -47610 -140055 -41937
7150 -41937 -30862 25831 -14052 -19722 -34558 -151248 -32999 18354 60743 22630 -126918
7139 -126918 -46438 -103631 -94878 -16498 -21722 16312 14735 44032 15435 -9422 -62148 -39895
7127 -39895 30057 -9006 -89288 -134107 -198515 -224529 -122649 -112958 -62539 -74926 -124637 -17188
7115 -17188 -66824 -140567 -136273 -122407 -68900 -36856 -28263 2911 73537 99996 145310 107462
7103 107462 72087 -22358 -178553 -187732 -116790 -186041 -82687 -97828 -144429 -60728 -156757
7092 -156757 -164817 13782 -67360 -131890 -67246 -29966 20505 -34500 -18403 -31389 -125985 -7514
7080 -7514 -117132 -198906 -211571 -187283 -192906 -165548 -110976 -70608 -38400 -44291 67854 -24780
7068 -24780 -47268 -42862 -89699 -44994 65075 70157 -14762 -34971 -40609 -25982 -36375 -143707
7056 -143707 -55580 -88214 -159257 -76724 -12741 -49486 -87023 -91552 -103273 -47348 -78647 -87419
7044 -87419 -118140 25639 81979 37043 64175 19427 -16307 -60496 -67803 -87900 -48901 -84221
7032 -84221 -111410 -75804 -45298 -30456 -196172 -280219 -239326 -110950 -47068 -74784 20864
7021 20864 -37468 -28150 -37152 -113324 -134109 -3363 -105716 -149640 -108819 -121273 -38191 -81988
7009 -81988 -39973 427 -18750 -2179 -42543 -92356 1867 -24483 -96188 -85776 -155645 -201411
6997 -201411 -139381 -94249 -115482 -121994 -165209 -197511 -69876 -78531 -114631 -88718 -9820 -22123
6985 -22123 -93819 -25193 3134 -39593 -25241 -87612 -108325 54467 27639 -64069 -91578 -116291
6973 -116291 -107341 -28759 -23604 1224 25372 -25975 -12044 51827 162306 126563 78555 102703
6961 102703 7089 13440 66373 50374 14793 11910 39039 2187 -92458 -42138 -36991 13347
6949 13347 52683 -8419 -5328 53782 89701 125896 136927 49856 47275 64854 41973 -5188
6937 -5188 -19183 -73201 -84971 -12439 -35177 -31606 -1325 -54732 -91802 14055 -9971 -204458
6925 -204458 -230812 -123173 -34003 -12793 -103169 -24008 13960 24271 -17495 -20326 109204
6914 109204 -18395 -26756 5715 34657 14730 30695 86569 -8811 -29383 -44022 -52621 55365
6902 55365 48714 142155 106413 50471 10057 3218 36396 31194 -53825 -221402 -289816 -215617
6890 -215617 -76094 -90508 -73155 -8477 -29122 -112032 -75240 -75053 -76056 -71839 -108168 -26238
6878 -26238 18612 -82419 -192782 -155451 -43128 -45926 -33116 -25654 -143755 -109667 -66317
6867 -66317 -64824 -105743 35436 120637 39514 32164 -133212 -150380 -66172 -88010 -49297 -72311
6855 -72311 -77218 -83887 -41113 -135415 -84556 -3217 -53746 -71982 -3290 -7356 -85677 -150242
6843 -150242 -90009 -41533 -82267 3047 -4818 16402 -17624 -18272 9179 103623 107617 -36554
6831 -36554 -121966 -126577 -96697 -50658 -92381 -48500 -142633 -146345 -61970 -74559 -23017 -88699
6819 -88699 -66859 -77149 -137567 -187441 -130406 -77886 -98368 -58514 -31110 -6655 10566 -91702
6807 -91702 -73841 -52455 -101318 22046 -72444 -106530 -116991 -191559 -173751 -128129 -121079 -147008
6795 -147008 -109895 -74627 15271 -51704 -51164 -117902 -144865 38937 50179 129941 -1534 -29139
6783 -29139 -5422 -47841 -9168 -9730 -28067 -27899 -52546 10031 -79614 -116711 -185641 -31763
6771 -31763 -17121 -91009 -128482 -114698 -148995 -151056 -143945 -126620 -145640 -90571 -5089 -61179
6759 -61179 -171477 -205990 -133334 -130034 11691 -59785 -17048 3308 -37744 -34745 -9287 -88263
6747 -88263 -56915 -39726 -43273 -87470 -153387 -163286 -167474 -153891 -176923 -119610 -117219 -157137 -137710
6734 -137710 -97330 -117819 -53455 -44544 -161894 -132404 -126058 -107082 -106621 -90985 -129532 -130929
6722 -130929 -113261 -97611 -163580 -73112 -70848 -59880 -131365 -87129 18090 -65600 -170711
6711 -170711 -112298 -92143 -162448 -134763 -38000 -85255 -119544 -107405 -70983 -144302 -217234 -238875
6699 -238875 -78995 -48287 -101021 -72336 -113209 -187809 -241491 -235085 -141214 -142527 -157223 -59977
6687 -59977 -107421 -99898 -94036 -104145 -164298 -67860 58113 2102 -40290 -80751 -156960 -58005
6675 -58005 -70928 -109299 -97336 8189 -79450 -60292 -24156 -96264 -186337 -271123 -286071 -293039
6663 -293039 -195907 -90490 -109787 -83978 -20539 5609 -56578 -124502 -103969 -186633 -204014
6652 -204014 -103773 -145862 -42867 -5510 -86579 -138022 -213127 -63922 11609 -58791 -26238
6641 -26238 -54395 39515 87811 -8315 -113145 -122392 -39807 -135074 -179231 -171247 -170303 -137932
6629 -137932 -84462 -63709 -52753 13053 45738 31353 -102210 -134537 -175251 -193556 -88706
6618 -88706 -10835 -94782 -107918 -65533 -91777 -49158 -163786 -164228 -152591 -187864 -56180 -41945
6606 -41945 -110831 -80663 -102689 -71333 -154754 -214915 -151334 -75119 -86518 -94775 -85624 -137787
6594 -137787 -232267 -163638 -77724 -149507 -214906 -171005 -69384 -79248 -155971 -197147 -116806 -17683
6582 -17683 -20543 -74473 17149 21121 -107233 -126751 -83935 -125406 -94375 -34610 47201 9348
6570 9348 -34038 -78032 -93119 54781 69268 18606 -49489 -165163 -173140 -200536 -64480 -69704
6558 -69704 -61328 -69476 -76317 -1210 -61735 -513 13282 -149861 -32962 -85440 -46045 -53686
6546 -53686 -27089 -76213 -88766 -121896 -119600 19887 -139770 -142817 -72406 -33120 -83367 -128115
6534 -128115 -124670 -21988 -40414 -117419 -98805 -112096 -127214 -107471 -126059 -47315 -132653 -90446
6522 -90446 21000 -24494 -83287 -106227 -128223 -40610 -116855 -78493 -175270 -134150 -101715 -128388
6510 -128388 -198065 -104862 -69586 -155492 -119988 -113363 -164131 -110793 -37959 -25810 -60464 -59530
6498 -59530 -120827 -107927 -84801 -64645 -63622 -15884 19679 -47216 32567 6730 -91247 -146644
6486 -146644 -75003 -169089 -211255 -151511 -87664 -142287 -83005 -97873 -17686 3707 -82698 -77319
6474 -77319 -154484 -195302 -96772 -29402 -75454 -49596 -155817 -155600 7315 25355 -50717 -81234
6462 -81234 -163748 -113341 -102019 -43423 -55184 -96395 -124527 -140429 -151767 -128088 -144743 -141023
6450 -141023 -171191 -161273 -174758 -115195 -123318 -254731 -136489 -63127 -88054 -141437 -122303 -158670
6438 -158670 -165101 -74329 -66455 -144647 -126004 -127641 -109288 -67064 39344 -12124 -90765 -95737
6426 -95737 -81547 -102138 -125031 -182113 -144777 -141757 -47634 -73767 -176917 -194470 -188680 -145988
6414 -145988 -143642 -171427 -149082 -174700 -193119 -171434 -59951 -50480 -140465 -176511 -74713 -62899
6402 -62899 -19544 -179129 -204742 -129297 -144533 -218693 -121132 -114469 -138920 -47351 -39936 30904
6390 30904 -21471 22854 -12858 -55795 4796 27154 -101075 -116444 -56993 -65665 -71008 -51957
6378 -51957 -48803 -73592 -45024 -8408 35234 -141069 -159324 -156499 -148156 -54633 -68881 -43710
6366 -43710 -55647 -125835 -112999 -118363 -56245 -101404 -93036 -133675 -180608 -60754 -192184 -74869
6354 -74869 -78845 -166041 -132515 -36600 -7396 -160538 -224059 -178052 -153980 -174377 -107799 -80815
6342 -80815 -59977 28382 -88290 -124976 -128746 -119534 -75159 -6367 -93309 -116478 -145746 -136990
6330 -136990 -208607 -214390 -166455 -156757 -118591 -89713 -68650 -39112 -70836 -123612 -111928 -85117
6318 -85117 -96155 -68036 -139649 -70633 -59438 -105062 -73374 -61666 -56361 -81626 -105063 -172333
6306 -172333 -159228 -158088 -148552 -164238 -65081 8814 -177056 -163361 -220420 -147481 -84825 -71468
6294 -71468 -135970 -223588 -154069 -124292 -124016 -149520 -157166 -128212 -82648 -42219 9002 -55928
6282 -55928 -103146 -132077 -109435 -107975 -89554 -50370 -157602 -157757 -127070 -72577 -14223 -62590
6270 -62590 -80918 8869 90017 -6811 -29727 -139543 -210472 -139841 -124295 -170400 -189469 -159316
6258 -159316 -62771 -36899 -33347 -99685 -73240 -5515 -39778 -173164 -161500 -26364 8310
6247 8310 -77334 -144174 -106854 -62688 -97686 -166621 -166829 -152424 -137923 -106419 -139738 -125516
6235 -125516 -124804 -130202 -138815 -195247 -217821 -118864 -60927 -49248 -10924 -16603 -70600 -46393 -20626
6222 -20626 -51913 -191449 -199837 -104315 -177234 -182608 -134041 -186495 -232608 -200087 -138671 -112011
6210 -112011 -185646 -225122 -117585 -146172 -200451 -178813 -217565 -251062 -128060 -155629 -140168
6199 -140168 -81622 -80842 -157021 -117000 -46103 16937 -26541 -43817 -28577 -172521 -119073 -60701
6187 -60701 -55127 -19805 -64463 -89905 -35051 -31547 -43271 26052 9532 -24683 -25578 -20570 -94324
6174 -94324 -14132 -45673 -88839 -23661 -70234 -100295 -44414 -29361 -9725 -17441 -107994 -92770
6162 -92770 -112209 -295 -18333 -48375 -105902 -117567 -248537 -166572 -112953 -103551 -34292 4638
6150 4638 15410 41297 41562 -19904 34628 -6778 -77212 -2389 28610 -27739 -59843 -57878 8709
6137 8709 -41423 -92572 -81240 -10467 -51016 36016 85242 -36338 11472 13075 -101385 -99619
6125 -99619 -52462 28285 72901 8626 10782 -42022 -92012 -228314 -130697 -56171 -17736 -126703
6113 -126703 -84436 -93543 -84645 -34209 -46252 -53378 -60086 -35565 -19310 -82831 -22465 -511
6101 -511 8995 1214 -59918 -133206 -81777 -52907 -86938 -22638 -127522 -6107 -32697 -172587
6089 -172587 -164179 -186050 -80222 4497 -27946 -84382 -66492 70123 2235 77260 78020 80935
6077 80935 35614 -52514 -164411 -193751 -88576 20847 -36202 -50340 -24977 48614 66677
6066 66677 18864 95313 132214 20345 -28607 27431 35124 -76368 -144889 -126673 -57678 -165299
6054 -165299 -222826 -57567 -113669 -74317 -143791 -103653 -26108 -65106 -86706 -132508 -131229 -118780
6042 -118780 -79025 -89771 -48929 -60445 -109818 -90912 -119945 -32208 6783 -80420 -30833 5075
6030 5075 21538 2887 -14463 -19265 -37830 -186931 -142766 -46943 -51564 -29501 -100733 -91609
6018 -91609 -179138 -205874 -156339 -67358 -11071 -36688 8011 -72905 -40955 -72307 44543 220813
6006 220813 89339 38824 -24089 -42150 100499 142644 69520 181900 204720 172095 206550
5995 206550 190041 247856 203371 275053 254606 192043 270136 312583 370013 363084 499511 621302
5983 621302 609398 582520 633766 505339 435211 532907 419884 387618 449197 443349 471421
5972 471421 566364 648521 550967 428696 401008 278058 258754 164926 123764 163498 95408
5961 95408 124258 78758 86976 82620 -39885 -82039 -14049 -39235 -69739 -86773 -133076 -20674
5949 -20674 65021 -16960 -27454 27346 43067 -16967 -15095 178007 44974 -8951 123186
5938 123186 -61240 -65103 -10964 36898 34152 -15352 50475 54095 31388 -49472 -15575 12696
5926 12696 106955 151948 103723 43221 51419 41292 -16801 -7935 46519 -555 -133545 -70359
5914 -70359 -10738 20076 -7040 68052 86991 68978 65079 25380 -61090 32636 7241 -92078
5902 -92078 33413 96326 55856 76664 164398 41915 52964 72705 122208 82763 -53658
5891 -53658 -22653 31744 -3915 14745 33261 88728 99912 111480 102283 132561 265637 251465
5879 251465 283996 237158 203676 213446 253367 311534 434927 422849 479545 505829 476608 550208
5867 550208 598327 617762 708653 865774 1052381 1194164 1168932 1195740 1339878 1391385 1477603
5856 1477603 1446811 1487242 1444670 1409652 1506865 1492805 1554624 1494079 1599177 1566274 1581599
5845 1581599 1573690 1516666 1392258 1236847 1148449 1027568 881788 862152 747803 581005
5835 581005 547592 469350 470066 500693 425437 298825 309493 395088 490770 413912 376626 350931
5823 350931 340709 380695 515672 584754 643190 573984 648700 598861 565812 588558 541058
5812 541058 461146 375145 378179 470312 427597 296471 288292 323808 281666 339404 438823 487746
5800 487746 532852 571485 717988 706591 705710 676137 700833 700169 683593 808491 963684 970455
5788 970455 971862 907999 1003467 995999 1004643 894735 747903 647079 596473 521990 618287 686939
5776 686939 732450 920246 1011866 1075307 1172491 1288370 1481466 1628623 1681528 1835040 2031525
5765 2031525 2296866 2632963 3042818 3445400 3890671 4427674 5202385 5930915 7153610
5756 7153610 9032813 12090561 16568885 22909790 30746462 36505225 36934096 31965699
5748 31965699 25093643 19005255 14087581 10733501 8454230 6616982 5354628 4382726
5740 4382726 3682692 3187352 2852833 2547846 2339433 2231855 2138557 2032768 2005457 1900146
5730 1900146 1725972 1624005 1562190 1392095 1390444 1463682 1448301 1323266 1369263 1462729 1215510
5719 1215510 1194522 1215035 1177098 1201546 1068672 1136869 1070467 1073952 1137615 1196412 1181084
5708 1181084 1084934 1044695 1017685 1038777 1008751 1067260 1091088 1106161 1097326 1122779 1134830 1184793
5696 1184793 1209991 1167272 1086557 1094664 1039923 1031768 1088443 1089912 1037655 1009414 1028348 1098374
5684 1098374 1108441 1112702 1077659 1147623 1185683 1146987 1016273 1057850 1147929 1162102 1102138
5673 1102138 1030364 1025421 1033491 1087089 1196230 1185125 1146465 1064864 1109279 1100681 1118446 1190916
5661 1190916 1190899 1227246 1251738 1266975 1295295 1372979 1466591 1482600 1428694 1445814 1549133 1549768
5649 1549768 1465056 1500829 1536833 1505076 1602574 1636810 1656301 1729467 1690897 1701240 1702999 1758383
5637 1758383 1895689 1857144 1852663 1822505 1912291 1979237 2008081 2195679 2292101 2248567 2339155
5626 2339155 2475625 2450744 2476790 2600115 2754174 2926235 3071772 3037909 3176874 3273394
5616 3273394 3170710 3176190 3344118 3371458 3452326 3472705 3490518 3581574 3739654 3752754 3734419
5605 3734419 3573435 3620603 3713909 3666458 3807779 3845549 3889884 3864538 3935427 4160386 4300637
5594 4300637 4597821 4854343 5019283 5285418 5530699 5771900 6037488 6243713 6476161 6841630
5584 6841630 7327713 7866828 8231496 8592937 9105364 9455689 9755881 10046411 10384589 10823046
5574 10823046 11295446 11731883 12443374 13223266 14132733 15142123 16260548 17652816 19033710
5565 19033710 20494321 22268475 24048869 26247988 28859290 31893653 35329552 39413523
5557 39413523 44039469 49513944 56021761 63720155 73510902 85842465 101709975 121979816
5549 121979816 147342299 177147212 210077715 241927373 266129307 277407054 275315706
5542 275315706 263960656 249638741 238166437 233954759 238241397 249901841 265363204
5535 265363204 278326508 282041261 272143397 249536573 219661116 188183002 158633997
5528 158633997 132865868 111395457 94110096 80430801 69711482 61320541 54745524
5521 54745524 49575881 45568157 42333099 39583570 37090553 34795704 32669034 30638578
5513 30638578 28910982 27393802 25981183 24701653 23620166 22604210 21648731 20671662
5505 20671662 19726577 18906835 18042652 17152522 16380394 15714532 15191924 14660373 14189762
5496 14189762 13862411 13566229 13235107 12901297 12671193 12344956 12079321 11833319 11454284
5487 11454284 11295655 11033359 10771026 10587227 10352152 10144654 9883237 9648933 9441657
5478 9441657 9229690 8988968 8744933 8459860 8240942 8026429 7690948 7533803 7349115 6970192
5468 6970192 6884877 6689121 6453519 6276968 6057418 5921749 5843600 5746379 5609072 5523371
5458 5523371 5446388 5151091 5096129 5149895 5003419 4867193 4789962 4801727 4694884 4554962
5448 4554962 4455784 4429101 4343072 4358267 4343131 4256024 4247956 4133140 4075239 3991221 3841653
5437 3841653 3811210 3726525 3728409 3789274 3647868 3561576 3494467 3438428 3416149 3418320 3315280
5426 3315280 3207267 3149526 3272581 3172536 3051587 3116203 3171189 3147994 3071627 3049622 3012199
5415 3012199 2933394 3005587 3071535 2998027 2986220 3004828 3055252 2995765 3144112 3170991 3306802
5404 3306802 3458604 3650413 3709026 3675088 3688224 3523421 3321030 3228520 3197978 3167370 3241115
5393 3241115 3386264 3493084 3593471 3660014 3580685 3263717 3050459 2911913 2783440 2652630
5383 2652630 2592040 2505794 2524197 2653238 2681801 2676157 2587293 2590371 2620859 2605864 2549415 2676254
5371 2676254 2699170 2719364 2736484 2702580 2628603 2481164 2410707 2442014 2580472 2410385 2356713
5360 2356713 2310590 2247483 2275786 2317654 2420526 2325254 2276745 2314565 2328632 2317663 2391900
5349 2391900 2476061 2521576 2564436 2677354 2665919 2731294 2698126 2692158 2620361 2607523 2729972
5338 2729972 2815481 2810701 2975508 3127511 3257847 3423161 3707106 3938649 4043652 4193040
5328 4193040 4455266 4755226 5012389 5411670 5941109 6468708 7267896 8155364 9148913 10328795
5318 10328795 11694618 13357753 15768768 19349373 24419480 31456433 40352864 49311231
5310 49311231 54738327 54420086 49323366 42714525 36850289 33011626 31605652 32598863
5302 32598863 36120378 42291994 49772730 55357547 55665641 50396532 42188594 33941757
5294 33941757 26992891 21616431 17658436 14822176 12557033 10823535 9458390 8433989
5286 8433989 7734581 7149177 6666232 6342638 6035440 5591159 5322992 5065324 4904243 4737177
5276 4737177 4536923 4248314 4016117 3975973 3920058 3793857 3746565 3686753 3498576 3333006
5266 3333006 3136296 3090691 2991650 2852081 2761914 2707389 2549331 2628031 2702557 2653055 2577076
5255 2577076 2516231 2450977 2448975 2299640 2180346 2157721 2008253 2037820 2050753 2060010 2034977
5244 2034977 2007189 1990048 1990551 2075789 2047343 1987311 1804924 1671206 1816038 1860552 1854112
5233 1854112 1936492 1996630 2023937 2164333 2311507 2315899 2281903 2293553 2206367 2219315 2223429
5222 2223429 2181238 2193029 2246046 2266062 2273906 2245606 2208796 2152751 1995821 1827080 1789836
5211 1789836 1647140 1574983 1550806 1437920 1301006 1171101 1219543 1241288 1137592 1050432
5201 1050432 1002439 1007103 948229 1001909 934528 974808 1056278 990505 1016761 1014542 882120 778486
5189 778486 804059 856544 802632 793629 815723 855324 872214 795547 809131 778981 780720 726120
5177 726120 742386 696530 798484 789890 787643 841022 862701 854814 745355 769444 704336 765342
5165 765342 736320 739332 725240 788130 735456 680480 575342 531544 625581 645017 624693 506684
5153 506684 625072 669400 638385 589729 597012 613293 576259 409134 481237 574466 673190
5142 673190 538439 509792 620592 574998 620083 588717 631715 574279 560214 602190 568576
5131 568576 586775 650276 636480 659987 756480 780555 652035 670501 660706 677517 673153 606310
5119 606310 604279 605057 628426 599339 613060 549071 516110 542211 589208 540863 492915 528553
5107 528553 460191 480458 630715 592017 581031 543322 482203 431188 460729 530926 504939
5096 504939 462969 482998 581951 557752 592196 612331 597091 628967 653315 704909 678107 613294
5084 613294 645015 576173 508860 616779 696847 786714 796494 750922 731797 712374 673012 734748
5072 734748 784109 819006 980517 1059897 1026729 1026238 987454 989428 1088432 1083758 1022250 1184532
5060 1184532 1283732 1287697 1257948 1263704 1289612 1198403 1172426 1057625 949721 950580 910189 835431
5048 835431 893107 921282 872721 798940 782414 723854 700688 683090 676921 588252 653050 633100
5036 633100 737415 807504 739797 748783 773744 689027 725088 660856 642127 656303 622140 637288
5024 637288 529332 727416 849311 795895 732431 748380 788007 717200 669854 580979 526814
5013 526814 613048 633594 665116 586571 643877 644332 674723 635464 651798 641972 674111 602586
5001 602586 781898 991186 1127897 1367960 1497330 1593326 1559664 1422587 1320216 1123274
4991 1123274 995564 1040820 974617 964371 928258 952267 896774 827725 843872 896593 877467
4980 877467 825104 716727 709868 680215 727825 728346 703317 716257 716993 661445 705526 696614 738232
4967 738232 660124 576640 619301 614734 679487 747983 743859 647325 593503 484577 469944 543540
4955 543540 608817 643729 556899 492164 508323 606715 671978 625959 677755 725293 627851 632740
4943 632740 684735 628295 696267 604846 576576 554222 538565 488789 549863 610127 595983 619855
4931 619855 580465 602400 655531 708724 707530 637797 618694 696123 725599 719096 787001 826881
4919 826881 772145 744315 827981 859042 912898 794035 760452 725887 799928 847347 807712
4908 807712 864400 878568 866695 877707 825909 899338 938078 877673 827331 798149 839054 962799
4896 962799 1016119 924883 938051 930521 1016490 979813 938029 995995 1016557 777226 762912 839980
4884 839980 950248 1026739 851221 832234 848593 835481 1056515 1058808 1044609 946560 912693
4873 912693 933529 999644 948765 888185 996920 1067199 1066224 1097672 1005074 1027324 1092929 1155329
4861 1155329 1261399 1396342 1492311 1611375 1768746 1886004 1929453 1834032 1735890 1608719
4851 1608719 1485459 1381356 1325256 1371981 1439204 1502681 1549734 1584656 1664959 1706823 1862276
4840 1862276 1957685 2158509 2407232 2626078 2842663 3188785 3561489 3814696 4185399 4780037
4830 4780037 5589620 7039617 9125562 12208528 16562921 22006511 26217129 26731037 23590289
4821 23590289 18904454 14458670 11026520 8600034 6813242 5615113 4668380 3978772
4813 3978772 3493184 3268710 3121373 2881956 2696787 2575878 2524146 2510667 2378014 2287385
4803 2287385 2176139 2053393 1986859 1967907 2037699 2039624 2017323 1884865 1836595 1823346 1735313
4792 1735313 1702680 1578252 1550279 1657091 1565384 1516379 1481802 1478149 1530978 1490101 1422465
4781 1422465 1470295 1456914 1424480 1304189 1419962 1515100 1378442 1421864 1382325 1359861 1378748
4770 1378748 1310709 1292938 1389503 1432892 1422924 1430237 1397993 1345194 1363270 1402439 1333864 1351213
4758 1351213 1207885 1195916 1293391 1327961 1291352 1250900 1247336 1279855 1319345 1211279 1248641
4747 1248641 1167194 1210340 1297201 1268964 1158041 1263758 1240757 1175573 1260472 1358475 1364446
4736 1364446 1368794 1372781 1409120 1284972 1224013 1227470 1170900 1131920 1262654 1207956 1203914 1300632
4724 1300632 1308750 1339833 1287160 1308849 1257968 1368832 1452349 1406237 1571553 1573277 1622569
4713 1622569 1613491 1595347 1632535 1677597 1659935 1723173 1754196 1738362 1808673 1829273 1980086
4702 1980086 1996911 1945568 1817997 1823287 1771829 1670552 1581196 1554425 1601405 1641899 1691403
4691 1691403 1765870 1683370 1606716 1583934 1496461 1436599 1448240 1446322 1420594 1415679 1454288 1422107
4679 1422107 1513409 1503663 1534763 1509783 1579491 1566702 1636294 1611200 1650696 1767065 1799729
4668 1799729 1777629 1767207 1634769 1691736 1785925 1748507 1817594 1862520 1877444 1879247 1932023
4657 1932023 1835205 1787206 1828465 1890560 1866667 1997728 1951829 1953462 1924525 1966459 1984028
4646 1984028 2087649 2185251 2320704 2246559 2256663 2288445 2302011 2395543 2423690 2599461 2663141
4635 2663141 2687793 2794696 2884447 2875009 3032631 3381521 3831340 4367113 5174596 6377653
4625 6377653 7544447 8358726 8306032 7557987 6638656 5843514 5350226 4985570 4649797 4455211
4615 4455211 4514779 4690859 4845191 5079248 5477659 5998063 6732001 7479586 8159742 8461706
4605 8461706 8671838 8814781 8947503 9400449 10075461 11082118 12119716 12879033 13216034
4596 13216034 13100898 12933911 12898498 13239281 14068203 15060702 15888348 15993670 15497345 14625964
4586 14625964 13714638 13126668 12820742 12935471 13172861 13147650 12668885 11842293 10872660 10054501
4576 10054501 9399223 9029529 8915359 8894445 8630866 8045672 7366189 6658364 6125913 5805870
4566 5805870 5470165 5214574 5018672 4827046 4675362 4638909 4527004 4525174 4495567 4607651
4556 4607651 4562699 4500585 4633149 4648950 4695650 4680020 4694199 4820218 4858153 5004909 5189560
4545 5189560 5240217 5429122 5583577 5756972 5786281 5823203 5911451 6057101 6224047 6425886
4535 6425886 6602651 6868589 7023194 7212813 7404936 7770548 8074945 8431252 8689835 9070188
4525 9070188 9504556 10136134 10918061 11774356 12786216 13979123 15609802 17316568 19462410
4516 19462410 22169630 25432290 29657797 35005469 41403186 48828636 57057525 65560783
4508 65560783 73630943 80185080 84387950 86737534 88277834 90711955 95325044 102877160
4500 102877160 112990933 124592400 135020227 140985018 140082425 132840639 122399036 111403439
4492 111403439 101958349 94967052 90630261 88089208 86234981 83311543 78535769 72243342
4484 72243342 64858284 57091133 49681655 43000488 37064367 32231389 28267156 25213511
4476 25213511 22748745 20905624 19413118 18339260 17557544 17011648 16500243 16121118 15853206
4467 15853206 15810554 16017264 16403342 17350464 18817626 20790694 22806121 24152748 24044491
4458 24044491 22834384 21359419 20010788 19293250 19483904 20507783 22681101 26099361
4450 26099361 30244388 33277629 33727348 31116330 27286070 23656864 20920217 19154069
4442 19154069 18210536 18259066 19133694 20444739 21583082 21910188 20741458 18636195 16506329
4433 16506329 14604115 13031750 11926433 11021601 10347965 9825242 9388254 9130137 9125250
4424 9125250 8928722 8762968 8482834 8357715 8128568 7809700 7394458 7025215 6661722 6420390
4414 6420390 6254635 5990570 5864343 5722417 5726789 5543458 5404009 5167828 5002884 4990406
4404 4990406 4832005 4805159 4883198 4933211 4958422 4943800 4905307 4831755 4723632 4765179 4734562
4393 4734562 4583246 4542301 4526592 4511914 4491184 4561142 4564559 4630682 4584320 4451531 4350277
4382 4350277 4223961 4129882 4149444 4071693 4016326 4070213 4151773 4117348 3980714 3873790 3882362
4371 3882362 3827314 3856079 3814447 3767844 3758740 3729122 3541980 3564557 3557527 3502257 3537015 3529200
4359 3529200 3686709 3722017 3860062 4002032 4216001 4277866 4257029 4177179 4112332 4111881 4024425
4348 4024425 3955112 3920587 3778361 3655560 3641734 3748914 3727983 3730371 3846480 3819055 3796551
4337 3796551 3906138 3905574 3800399 3718990 3642306 3700002 3684848 3657460 3676492 3749979 3668602
4326 3668602 3648633 3644701 3616581 3743526 3825079 3809106 3831091 3847621 3791202 3970806 4003254
4315 4003254 4066010 4038010 4054114 4201163 4169197 4136066 4253289 4229091 4212403 4133265 4298614
4304 4298614 4368892 4203707 4292258 4330697 4450095 4527597 4530721 4442443 4472843 4556790 4507655
4293 4507655 4608282 4638307 4689975 4803079 4810930 4737348 4703529 4831964 4869598 4914923 5034867
4282 5034867 5111785 5050357 5154183 5146928 5028178 5125142 5292473 5424264 5414270 5425215 5456690
4271 5456690 5477504 5692851 5796971 5847133 6033620 6125251 6166634 6264761 6447869 6672753
4261 6672753 6913646 7047401 7236927 7522827 7759819 8098702 8326977 8653280 9015780 9367168
4251 9367168 9768284 10287365 10856592 11432797 11978471 12766464 13534894 14290678 15009365 15949502
4241 15949502 17017410 18105746 19384687 20619253 22121169 23687351 25234274 26927753
4233 26927753 28878558 30963050 33118817 35351542 37588740 40005225 42542672 45103412
4225 45103412 47759044 50426426 53275679 56247949 59370132 62568542 65921257 69472157
4217 69472157 73056156 76732040 80428337 83954100 87579132 91022878 94278707 97236465
4209 97236465 100102987 102896296 105581100 108066268 110490551 113062979 115576231 118086051
4201 118086051 120556584 122870531 124905455 126559073 127675291 128521247 129011103 129340586
4193 129340586 129347940 129027468 128762257 128395194 127850382 127142540 126364688 125268951 123991389
4184 123991389 122501239 120806203 118785673 116542751 114199163 111631862 108872444 106129963
4176 106129963 103415030 100515470 97637987 94758193 91733632 88720125 85814723 82914962
4168 82914962 79834784 76841698 73788779 70990109 68272230 65471342 62695474 60055680
4160 60055680 57480588 54910353 52437076 49961875 47754213 45652819 43579718 41586602
4152 41586602 39732951 37927747 36349612 34704794 33086503 31539226 30051426 28654442
4144 28654442 27291428 25969312 24819313 23635906 22584743 21606546 20699061 19783882 18965239
4135 18965239 18175389 17427123 16715589 16114266 15359160 14716788 14127130 13448274 12995168
4126 12995168 12649049 12235482 11736101 11227592 10881988 10618097 10409584 10127837 9860416
4117 9860416 9638666 9365948 9166592 8955886 8795094 8630303 8495468 8336524 8235156 8071244
4107 8071244 7970206 7842325 7765016 7750154 7751904 7497543 7331886 7274898 7204633 7155485 7123928
4096 7123928 7191795 7148146 7121522 7102178 7140066 7176831 7262435 7276513 7236315 7236607 7292862 7409460
4084 7409460 7315814 7378487 7530999 7587439 7545084 7480544 7381433 7318425 7322881 7276115 7260104
4073 7260104 7344240 7344499 7306209 7261446 7266714 7228784 7211985 7174846 7219784 7298866 7367948 7366530
4061 7366530 7363770 7371641 7230332 7168950 7225582 7243500 7195527 7220771 7269043 7268838 7280237 7327591
4049 7327591 7432442 7381449 7451845 7515073 7485522 7484616 7481568 7424211 7339105 7346676 7213645 7092814
4037 7092814 6914761 6813860 6782746 6786052 6742975 6553494 6440586 6436524 6415722 6480764 6467185
4026 6467185 6471515 6458795 6448394 6490002 6536595 6543510 6581752 6687390 6730830 6807974 6927690
4015 6927690 7122733 7126514 7135024 7249682 7253132 7455718 7579270 7726714 7772273 7919513 8004869
4004 8004869 8142332 8277500 8298499 8362348 8555503 8698433 8755272 8871341 8911119 8987893
3994 8987893 9188568 9300126 9438820 9678842 9857909 10021208 10310513 10654154 10874739 11111999
3984 11111999 11438584 11756052 11957064 12349439 12758491 12978516 13430348 13959900 14408795
3975 14408795 14994918 15611897 16293070 16744343 17370263 18112105 18799055 19689923 20643471
3966 20643471 21639858 22747353 24068081 25593996 27317039 29496805 31808151 34440383
3958 34440383 37346326 40808099 44875241 49800773 55429849 62124546 69961823 78525433
3950 78525433 87954255 98632477 111234656 126387936 144708117 166592627 191978174
3943 191978174 220237643 249782558 278150464 302634470 320999745 332504379 337174386
3936 337174386 336205362 331583534 325255243 318804808 313492015 310052846 309053177 310187666
3928 310187666 313245172 317014901 319958468 320473747 316920670 308081253 293300353 273283726
3920 273283726 249447567 223600524 197658761 173480438 151966425 133575236 118227637
3913 118227637 105522669 94990947 86298411 78976912 72847488 67563432 63069838 59091677
3905 59091677 55685245 52783783 50212383 48087347 46331758 44834621 43347528 42218280
3897 42218280 41131999 40061025 39115608 38188809 37220529 36384514 35514899 34795877 34048978
3888 34048978 33447231 32951346 32508932 32108207 31735691 31479877 31129159 30887304 30648376
3879 30648376 30488128 30256966 29855691 29638750 29482672 29307965 29115528 29219762 29398129
3870 29398129 29494330 29633416 29859942 30107262 30372203 30645544 30922951 31165021 31440874 31729000
3860 31729000 32015594 32097223 32238487 32452164 32655881 32981936 33269239 33644057 33971582 34409118
3850 34409118 34906637 35281472 35700740 35913809 35912569 35924884 35890769 35947030 35796636 35646080
3840 35646080 35742976 35900221 35919641 35844614 35834453 35930988 36004129 36065829 36185672 36251307 36423839
3829 36423839 36687691 36984662 37468272 38125957 38991399 39993709 41258695 42760416 44477997
3820 44477997 46512058 48875098 51510860 54752126 58543095 62976495 68244006 74345071
3812 74345071 81293140 89111483 97929239 107888968 118814953 131088942 144652131 159485536
3804 159485536 175490559 192504083 209788127 226722035 242542616 256684851 268799747
3797 268799747 279071668 288207563 296816415 305624548 315239209 325715711 336692233 347793793
3789 347793793 358485086 368018479 375832772 381226482 383843786 383986386 381800098 377923343
3781 377923343 372682936 366943256 361055518 355516518 350738373 346995055 344213517 341991692
3773 341991692 339664736 336487723 331411678 324146164 314467663 302585280 289186441 274888741
3765 274888741 260356596 246496990 234019070 223121758 213867010 206208614 199486335
3758 199486335 193234124 186722613 179180252 170138806 159616551 148145342 136047824 124034217
3750 124034217 112594361 102267327 93139429 85427224 79024649 73621908 69254415 65648447
3742 65648447 62505984 59688422 57314258 55222556 53348939 51676276 50110628 48678223
3734 48678223 47376442 46387935 45470131 44755026 44231152 43740605 43044120 42481613 41853155
3725 41853155 41012593 40139056 39103099 38055092 36957187 35811907 34723590 33562242
3717 33562242 32579870 31739132 30973466 30105002 29319327 28695862 27903079 27061568 26183127
3708 26183127 25303703 24394648 23514417 22622907 21810443 21032439 20394404 19664736 18897050
3699 18897050 18343304 17776895 17130727 16603779 16122534 15617445 15209631 14828280 14554591
3690 14554591 14219465 13767082 13444310 13169721 12908815 12684465 12492498 12291914 12043419
3681 12043419 11752091 11436535 11222874 11053894 10812838 10646050 10497603 10355176 10146430
3672 10146430 9967847 9836369 9658035 9586513 9506818 9315320 9252681 9238605 9132389 9009209
3662 9009209 8909966 8902871 8799404 8703174 8784514 8770820 8871893 8888985 8806292 8792199 8717758
3651 8717758 8686244 8737396 8722037 8800609 8623119 8550066 8506348 8321896 8246958 8166215 8055832
3640 8055832 7944837 7844630 7879265 7825338 7592964 7605919 7518167 7304332 7141581 7007007
3630 7007007 6920182 6711069 6554492 6483963 6287696 6125865 6034714 5989865 5804973 5647977
3620 5647977 5496328 5377013 5305330 5350406 5220414 5058535 5027656 4908268 4913644 4981185 4844120
3609 4844120 4737292 4686734 4632953 4561060 4551083 4550342 4444221 4361777 4382758 4357336 4341375 4234319
3597 4234319 4259551 4248886 4145089 4120696 4154718 4133859 4038895 4081813 4020071 3981631 3953368
3586 3953368 3977794 3976288 3847280 3761543 3770955 3843509 3807801 3749419 3778564 3774862 3786004 3746114
3574 3746114 3636523 3557730 3540089 3590238 3564382 3602432 3541021 3556109 3645901 3594061 3522090
3563 3522090 3411343 3361492 3335558 3358822 3411968 3386067 3512363 3495735 3388471 3396208 3434969
3552 3434969 3449132 3409923 3317645 3285330 3386880 3436983 3365820 3308591 3333192 3203169 3125994
3541 3125994 3208173 3301682 3257434 3312565 3255578 3207370 3227267 3059933 3014001 2953687 3003102
3530 3003102 2970408 3079513 3183135 3189448 3193711 3211391 3300613 3462840 3679136 3633060 3723359
3519 3723359 3807694 3837290 3853161 4027998 3974728 4041188 4186312 4192794 4298037 4409810 4423068
3508 4423068 4492777 4505187 4702531 4749675 4714513 4696895 4827517 4893329 4806490 4764201 4789775
3497 4789775 4883176 4935457 4926725 4994083 5021652 5045357 5071346 5148768 5180947 5083120 5211900
3486 5211900 5254495 5256654 5179488 5222267 5167757 5272723 5425281 5568994 5615018 5685256 5849214
3475 5849214 6008807 6266501 6475933 6635958 6860356 7073424 7225965 7248360 7360351 7283643
3465 7283643 7206120 6980989 6677969 6504289 6348908 6140949 5947846 5808527 5699024 5695884
3455 5695884 5568303 5469983 5406580 5221796 5145775 5279809 5216621 5185386 5141682 5110718 5103108
3444 5103108 4932082 4727685 4508235 4399920 4233690 3972072 3731671 3459019 3336127 3281307
3434 3281307 3188809 3062873 3024129 2995602 2882816 2707853 2584790 2541540 2557976 2608488 2536885
3423 2536885 2431981 2381493 2355473 2356147 2320920 2275683 2247461 2353022 2308236 2167904 2024318
3412 2024318 1952155 1977683 1966819 2009615 1954134 1876690 1911236 1854433 1739916 1748137 1760529
3401 1760529 1665872 1587845 1606426 1629169 1734219 1675464 1636278 1620509 1542453 1571364 1609443
3390 1609443 1552461 1509537 1524183 1540083 1524774 1511580 1466693 1566221 1617598 1510836 1593788
3379 1593788 1634117 1493815 1515523 1550706 1620786 1639244 1728806 1707296 1556421 1630291 1709551
3368 1709551 1652239 1627166 1582318 1557153 1618413 1559067 1535938 1403241 1346302 1271316 1352426
3357 1352426 1392751 1270239 1333698 1322975 1344547 1401977 1347737 1263078 1180144 1258026 1296125
3346 1296125 1258677 1196862 1203286 1200510 1235049 1241591 1301300 1319120 1357037 1399657 1404031 1387070
3334 1387070 1495954 1547041 1434680 1304466 1242681 1285044 1243597 1196760 1193793 1161058 1158621
3323 1158621 1197522 1190297 1167544 1094905 1170802 1096088 1104035 1131266 1144052 1106260 1177613 1270841
3311 1270841 1312597 1356414 1282640 1199736 1253914 1347188 1381708 1308124 1378887 1404291 1417648
3300 1417648 1390443 1356732 1357445 1347494 1302595 1232518 1286179 1279341 1364438 1320529 1303038 1210252
3288 1210252 1243981 1290057 1342284 1322974 1287928 1364996 1512295 1548004 1509785 1541959 1537158
3277 1537158 1612099 1587124 1549137 1704954 1821519 1869770 1940396 1945314 2134347 2335480 2700136
3266 2700136 3186988 3880567 4512693 4987196 4878475 4389707 3762943 3162314 2644560 2272887
3256 2272887 2051434 1923742 1854823 1674065 1677409 1728997 1744344 1625277 1685545 1830816 1813732
3245 1813732 1854049 1874730 1794122 2004261 2248531 2493151 2786661 3411036 4056660 4720110
3235 4720110 4990524 4807125 4324046 3742419 3124787 2694942 2362941 2136442 1991886 1780873
3225 1780873 1683281 1580327 1535095 1683330 1647463 1464609 1375479 1373085 1332808 1284507 1386441
3214 1386441 1400135 1443714 1581633 1642579 1642548 1686283 1745993 1792337 1755318 1790809 1831092 1877626
3202 1877626 2011303 1966614 1907901 1994608 1949870 1963444 2078767 2026181 1909683 1799558 1827640
3191 1827640 1706409 1661348 1643439 1557974 1586965 1541104 1496663 1509101 1593169 1610456 1664042
3180 1664042 1763318 1743425 1684760 1718566 1795324 1954958 2084143 2194933 2176098 2243641 2300534
3169 2300534 2531912 2720024 2923246 3119412 3361624 3488932 3651167 3765441 3818074 3757861
3159 3757861 3777814 3633790 3534503 3509261 3467169 3311478 3323500 3299347 3210564 3106098 3080628
3148 3080628 3069683 2977469 2955888 2987592 3085609 3035266 2981545 2992916 3060803 3049713 3128073
3137 3128073 3176750 3279696 3296697 3428323 3520732 3649343 3736769 3900616 4160887 4441619
3127 4441619 4799224 5332043 5721996 5959154 6024002 5716858 5273696 4732964 4374782 3959957
3117 3959957 3669173 3468490 3246468 3060695 2879683 2725928 2659017 2609352 2452113 2441059
3107 2441059 2438076 2491769 2376911 2355403 2359373 2310715 2316426 2263111 2253906 2413696 2417489 2483888
3095 2483888 2535602 2588112 2565221 2471366 2462885 2440328 2260746 2201490 2083654 2077309 1918806
3084 1918806 1769827 1848103 1814502 1872694 1733095 1627378 1590319 1559253 1584731 1679462 1627288
3073 1627288 1497706 1436718 1361532 1327989 1352334 1363160 1315391 1304098 1268094 1254551 1255209 1170892
3061 1170892 1071694 1014653 1024814 1164266 1167787 1061302 1063018 1103767 1059908 1014300 982559
3050 982559 901551 819384 830123 883337 893887 836930 797213 773121 855821 939136 916376 824437
3038 824437 812554 877623 834748 717659 609158 594560 575423 690422 699401 683494 701513
3027 701513 630092 685382 681720 601806 630794 571267 585753 568011 562809 612174 668288 491246
3015 491246 499917 538085 524192 529697 532602 482004 460695 443295 473567 480160 503790 568072
3003 568072 479418 504238 518136 583652 610727 522276 529689 543518 563575 441788 478937 533711
2991 533711 508274 550511 414962 468858 420077 388803 476171 489472 444950 526814 530073 545423
2979 545423 547075 505979 457166 515100 464347 543037 469031 372988 521390 446466 508728 481916
2967 481916 438399 457332 426656 390937 399981 450327 454085 395041 428424 580039 510330 370235
2955 370235 518987 458282 465798 489640 471195 493199 386878 396966 452220 345605 389771
2944 389771 452454 392860 429265 497841 479535 490638 542889 461489 398545 517108 574818
2933 574818 545953 482183 517212 611250 589554 361647 413213 412398 333158 365691 389680 408184
2921 408184 390939 364119 359308 379301 434882 520827 347076 247257 378208 431220 355105
2910 355105 386689 476951 542391 452068 470637 452502 438077 349175 368290 373265 370063 399288
2898 399288 336748 400813 325855 348294 381198 361753 350480 378342 434599 474646 526469 521101
2886 521101 449711 419092 380720 392762 459224 434226 459913 444285 421430 333789 348790 317489
2874 317489 355873 449007 509453 530392 563785 492567 468127 390836 368484 361948 310176 332540
2862 332540 300447 288988 375721 480903 442200 474993 585209 482830 439992 504988 586250
2851 586250 591604 534565 503345 534688 589160 604111 608711 541316 562224 576632 643344 576165
2839 576165 533840 492193 455934 618440 604500 562820 511375 534854 561519 556748 499744 468066
2827 468066 425536 453332 419205 503768 542402 564270 566462 538514 608559 614302 656978 704225
2815 704225 736100 868292 816168 872341 872319 826390 884509 863876 929329 862051 737964 748977
2803 748977 836495 693131 675629 639724 688346 707480 752403 841556 850368 769745 747270 760126
2791 760126 825542 793410 865663 742462 807347 771526 724872 725810 811969 879464 902286 947292
2779 947292 1069253 1102799 1099153 1193997 1273357 1208823 1087615 1078589 1095012 915380 824127
2768 824127 882080 861096 741170 746253 843251 825251 726342 713493 755891 769206 830150 792836
2756 792836 774439 671405 793820 779716 811510 703282 733813 722942 665560 679386 693872
2745 693872 711834 746923 824074 811182 789321 870835 976416 909523 804875 817099 757962
2734 757962 658914 502775 521497 627529 625067 638504 621573 688532 668795 675032 617547 605267
2722 605267 684228 636925 634214 562984 510929 528561 451308 524689 551177 489445 398397 417179
2710 417179 518907 484724 467458 516433 560210 556889 610585 499767 410945 371474 330341
2699 330341 405848 429164 362472 238078 413365 501472 409684 385081 437605 433715 422502
2688 422502 470613 439729 314287 397279 368314 398549 351282 378976 422601 364894 512616
2677 512616 447726 365908 410523 321273 262905 350037 210704 246138 267510 404147 295028
2666 295028 248902 237154 229824 284072 283371 326982 285165 316401 286628 321252 317698 260519
2654 260519 206106 155694 200077 232239 265317 166908 213583 208987 284151 248629 212963 243054
2642 243054 294932 249985 167493 259305 310301 166995 184258 219426 228295 263420 268804 291613
2630 291613 274582 157676 181605 301797 296593 207264 179727 281018 301948 331439 388701
2619 388701 314113 236228 312747 368979 370002 418406 382709 331077 260248 213624 142197 110195
2607 110195 133418 117748 185698 196091 253645 329439 321104 225083 189907 211550 336730 209662
2595 209662 237463 285663 297519 285307 342018 454179 647723 706540 851143 936556 1001777
2584 1001777 963969 823632 701060 571775 446015 449734 457246 446691 370860 372358 313620
2573 313620 341096 365757 314785 337229 283278 270210 264697 183216 154635 209842 345031 328771
2561 328771 345701 228277 263658 178035 145242 123964 99450 194972 263639 340351 373272
2550 373272 380582 232702 204960 198547 309391 245374 114319 210852 250209 183327 299528
2539 299528 336003 318941 281810 235898 140796 125302 65241 154153 197722 230191 199861 190160
2527 190160 194745 347520 367029 314700 278212 299787 305983 310357 337105 302156 244868 187618
2515 187618 209555 199929 229475 278591 291788 267035 188872 133984 218660 268028 178776 151319
2503 151319 151785 189309 195050 181728 199224 254085 162050 247988 224820 98770 200052 194029
2491 194029 305849 341433 307922 276312 226991 234125 252322 191262 129378 219063 290301 316033
2479 316033 316573 274127 191822 134122 89078 171955 180964 222677 218084 203428 340568 379671
2467 379671 282096 287509 370298 339052 320069 222649 267391 269471 277244 302917 250153 248726
2455 248726 257446 286052 272368 236510 249431 271795 270451 297129 287350 293892 283010 287236 333022
2442 333022 375742 370431 360853 283846 322868 353652 369849 444255 419746 437629 509098 476881
2430 476881 439054 550153 540704 380693 349674 440439 463354 388885 365983 389260 430225
2419 430225 404007 408831 475372 455080 489933 543014 506467 557459 623113 498870 552177 579669
2407 579669 666706 693943 649214 587446 621428 739907 756584 791391 810268 770964 817978
2396 817978 912050 932358 891888 873813 840136 829992 793995 856299 928115 941923 970494 957908
2384 957908 892212 858132 893599 901136 921755 957557 1004250 960016 913569 873481 799173 810074
2372 810074 830426 897884 1000406 1100909 1240635 1436218 1549093 1731255 1814466 1826372
2362 1826372 1910014 1879016 1836302 2003322 2072891 2093511 2237988 2406999 2503101 2718756 2796876
2351 2796876 2756401 2731185 2698922 2733150 2764515 2838963 3024586 3230816 3587776 4064130 4501838
2340 4501838 5025497 5722366 6590325 7559947 8882288 10492360 12054959 13214668 14153735
2331 14153735 14990726 16021741 17543558 19439375 22095187 25711869 30816546 38968379
2323 38968379 51590446 69871991 95902372 128867850 154856348 159470179 141107011
2316 141107011 112810516 86752270 65663121 50357647 39270433 31062676 25139193
2309 25139193 20950276 18047326 16185445 15170019 14770262 14521602 13925694 12871161 11612709
2300 11612709 10441441 9430816 8662868 8030944 7541632 7231325 6935401 6836192 6688718
2291 6688718 6393373 6089555 5667416 5297016 4924563 4553713 4372034 4203831 4115515 3938665
2281 3938665 3792059 3612591 3636992 3536964 3531416 3444442 3238123 3135164 3128121 2986275 2903069
2270 2903069 2991107 2898877 2926780 2940703 2799730 2722052 2771566 2734786 2562023 2468078 2451686
2259 2451686 2439461 2338397 2242252 2097096 1957406 1953127 1864896 1815568 1746508 1665197 1687248
2248 1687248 1704272 1620751 1500032 1406711 1433011 1342574 1294922 1240229 1326906 1345706 1352640
2237 1352640 1327717 1251782 1163053 1138350 1204245 1278020 1346445 1243686 1154601 1089983 1040697
2226 1040697 1026778 937485 1025414 1076720 1103454 1063141 988415 962843 959235 864475 878814 917290
2214 917290 964213 902950 863383 857418 741534 770159 734056 682265 717692 783573 806231 761865
2202 761865 735259 675471 687196 665254 751882 720084 732452 785578 688820 656393 711781 826225
2190 826225 776115 804790 752650 861721 839685 746955 736068 747483 630069 599354 713488
2179 713488 764854 697758 619379 595919 472469 469750 585096 476664 524842 656054 579618
2168 579618 533028 486871 393302 473707 593389 628386 591629 556715 620402 521547 519981 473273
2156 473273 475929 559714 463562 463504 359800 363331 442050 419468 366624 391717 429546 576192
2144 576192 405564 400560 314686 272338 277174 310255 456508 431890 444102 456879 396978 346436
2132 346436 311364 261380 358509 338909 354989 365824 473864 474319 414410 280543 319502 404454
2120 404454 324173 316053 235280 239325 311021 383657 491321 505369 319422 234597 312090 323268
2108 323268 340734 371453 370701 381032 315822 318898 265305 234170 276500 316499 375822 346298
2096 346298 224424 200452 284814 268091 268178 313383 285437 308686 339562 344003 369347 198115
2084 198115 287549 314659 205261 238953 360742 455839 455839 456557 396991 341402 253001 190155
2072 190155 237040 199379 162536 186740 196919 245387 216439 128836 215906 142702 128096 203858
2060 203858 304532 311280 306318 280351 283506 369466 441378 546361 654325 776445 901505
2049 901505 851411 882908 818227 625906 549382 630513 498362 475196 306612 278476 316518
2038 316518 276026 236269 136261 158698 185414 270529 200161 162557 217478 294136 253733
2027 253733 239744 261237 264172 198745 205264 146984 145194 91468 98247 143117 143739 86572 100452
2014 100452 165244 227345 271822 235941 157978 122788 31009 27981 86088 227130 260999 124090
2002 124090 112447 177240 182939 153540 195238 289826 289133 252073 184967 216837 183332 123428
1990 123428 144125 112678 213249 227875 143564 200670 130406 149338 155271 110140 103012 162022
1978 162022 221646 157820 182729 188641 238924 260555 243017 143151 177658 238350 165993 142176
1966 142176 168605 217575 267204 234396 92272 120907 132947 57202 131773 174582 86462
1955 86462 64059 126776 166206 165507 166467 109105 83956 102185 195264 193509 128683 147899 11689
1942 11689 24116 101104 59542 104144 112205 137320 160644 236184 136019 189881 214000 155449
1930 155449 123212 116972 82183 -18655 62847 142501 142117 92607 74841 49226 58625 -3875
1918 -3875 3731 85955 162608 71859 104933 121660 161242 149252 151516 169250 121156 30764
1906 30764 4267 146896 239621 184701 148058 200848 100098 87668 71797 104976 144348
1895 144348 147659 131763 121772 56687 65999 124575 96214 126479 169595 222521 190281 227750
1883 227750 200166 118687 120375 110947 103392 142159 75475 67865 134233 100150 173329 201587
1871 201587 40763 86781 29323 -12089 70163 3514 19264 40354 122918 168658 205040
1860 205040 258025 101561 55040 91791 156421 169470 105190 69098 75441 87005 14467 34375
1848 34375 85545 101680 195256 305324 231665 170459 155808 87210 96143 113633 164896 93630
1836 93630 106864 158870 106061 41304 57390 134106 123521 118931 149641 120397 148165 217114
1824 217114 233436 211822 82170 97357 62908 -18007 13888 47354 67477 117980 130990
1813 130990 131986 218964 84334 12839 8771 105346 193420 144351 121291 118960 173532 168125
1801 168125 150433 76174 53974 54716 147633 109278 90123 140825 113860 113885 62830 59275 71434
1788 71434 74107 68618 60829 101035 117534 31701 53508 124168 43973 51606 36979 112490 147608
1775 147608 73832 34946 57823 6103 65590 194397 191044 109139 63749 79261 75646 61821
1763 61821 66389 65690 42089 47564 20182 24072 134013 75299 49461 105389 108977 41847 -4618
1750 -4618 65836 35032 57293 138760 169880 240845 185185 60917 112619 164501 165684 131084
1738 131084 102592 99515 40114 38497 36207 24085 -14464 -35174 12933 59131 -25869 -15754
1726 -15754 -4088 103435 176130 43635 60662 64139 95906 123261 106546 100996 72422 64539
1714 64539 143861 147594 144697 90091 73279 125877 140140 79340 158060 64532 -9762 59970
1702 59970 83656 49611 9545 38259 51870 98668 39891 148771 158719 113274 160840 136175
1690 136175 40219 12813 56346 116845 98936 -3842 88499 133171 81573 89783 133148 70472
1678 70472 150688 154704 133155 168328 157030 10540 12751 15553 22759 71291 -4102 -3034 56001
1665 56001 44775 121926 229118 187968 214540 253786 183111 102090 87578 127184 18915
1654 18915 -17871 -30498 -57147 -73656 -39661 -36393 60809 144514 87955 49197 -10904 11275
1642 11275 29897 21613 9635 94175 24188 77569 40183 76582 69550 92654 156338 118485
1630 118485 62636 28602 27352 18088 94876 59403 -25413 -46059 -16599 15972 97610 146215
1618 146215 73155 113121 173156 167468 157707 115005 67709 44186 48367 125239 61880 16198
1606 16198 47930 61353 91966 52417 16249 -2254 24647 80314 73521 65052 68538 16348
1594 16348 30394 23414 -2978 32203 40048 116999 164187 163967 144751 91631 33468 -75465
1582 -75465 -91607 -17612 -3172 134441 103239 157460 76465 22622 32891 70262 113736 71866
1570 71866 79744 88860 114782 19983 -1012 6627 41172 -5460 -32356 30301 25184 55394 126025
1557 126025 76286 119514 79090 105808 46716 -8723 46065 32262 -2483 -48313 -22245 -20122
1545 -20122 7071 64037 47390 97399 22557 1169 35979 -55839 -4392 -25153 -105080 -106759
1533 -106759 22140 62238 -25510 -93197 -8798 61205 32683 59010 5540 58732 57472 102253
1521 102253 31367 32455 124579 83087 31065 15644 47030 64706 -34917 -11647 -78833 -66692
1509 -66692 -39853 -26352 -66460 -16683 160134 102514 27674 21447 -39355 -53667 -50527 -4026
1497 -4026 49313 81275 2541 50875 -56548 -117116 -110296 -99850 27702 -5510 54245 29100
1485 29100 109268 101938 -49936 -46206 32998 35483 151026 81523 139486 60066 118516 107104
1473 107104 65949 84438 -53371 28436 33036 -71493 35119 24510 68003 66088 -11224
1462 -11224 -23318 14501 39294 62742 94291 29451 -76701 -167994 -147720 1665 18676
1451 18676 39297 24674 -121593 -33034 -74473 -8924 118863 85792 17641 -85308 -76956
1440 -76956 -9437 -32066 -33258 21243 27103 71122 128107 64973 56861 30495 43218 -16057
1428 -16057 19386 95393 -75145 -175203 -155300 -80463 18482 72724 -26632 -152782 -59920
1417 -59920 27320 17489 -43957 -65668 39399 59688 81894 79320 52317 -51764 -97001 996
1405 996 27125 143713 98202 56459 18887 91395 176204 87868 99353 127230 125241 129464
1393 129464 108442 31088 -532 -4826 62797 10522 60622 114106 66635 133028 94512 77620
1381 77620 45710 91794 104762 31329 18544 15672 47704 45439 53835 99256 -21494 -5948
1369 -5948 44468 698 48327 58619 55522 18362 28168 3206 23598 -26222 46752 807
1357 807 -122696 -64343 -51503 57828 81850 5970 -54542 3718 53854 43635 51218 -81
1345 -81 -57679 -65366 6129 230803 215355 39247 66044 23258 -25119 7382 -69380 -87305
1333 -87305 -61374 71687 106124 25806 -56049 -46456 84819 119750 68189 -5235 -2024 47276
1321 47276 88261 9445 23623 99154 93200 -7536 -74857 -32989 -13509 -4119 -40912 -103317
1309 -103317 -57872 -24473 34200 63884 62643 55583 25079 27966 -36776 83417 83751 -7639
1297 -7639 -73410 -75794 81058 15413 -46286 -41625 16100 88225 -146489 -91271 -51111 -77451
1285 -77451 -28314 -46425 -29467 -34428 -2992 -21080 104435 115368 45519 37077 61153 50694
1273 50694 103424 71468 86383 14646 9018 89994 42672 -9679 -113620 -57600 538 -46648
1261 -46648 27357 19696 -13932 -13881 32468 4819 -12237 -32761 -34383 76292 4474 27009 9549
1248 9549 14832 68606 26053 97521 -19257 -55737 -126884 -109940 -76899 -126659 -106551 -93747
1236 -93747 -40037 60676 -21643 -66678 27555 33554 73589 16929 101874 141234 105254 156883
1224 156883 180943 145535 111800 126659 133438 23248 -27397 -56258 -22545 41829 22529 13555
1212 13555 -12729 -13637 -34535 -53054 -43959 -158102 -19578 12355 20473 -47689 -9052 32699
1200 32699 44869 32693 28066 -31938 65332 90041 57064 35601 75708 75530 -59984 -57999
1188 -57999 -66873 -102883 -55451 -37718 -72661 -64105 -24154 7517 -49535 186441 198420 94256
1176 94256 93985 -14076 -51809 28514 -129166 -129963 -129025 -111711 -79504 -54062 -38364 -23995 -100930
1163 -100930 -31196 40252 82008 117190 109224 49652 -33564 269 9793 34840 -8687 -115474
1151 -115474 -98289 -31227 -115256 -51453 57251 53058 31384 -42037 -72788 20494 -94128
1140 -94128 -117569 -89607 -18660 31487 -95335 -137733 -212445 -175867 -65765 -25773 -29078 -43359
1128 -43359 -49143 -68704 -32578 -9791 -69533 -74380 -13809 91147 41592 -44251 -57975 -25670
1116 -25670 24362 -21433 -12080 24832 38136 130235 90882 -38959 -47478 -45336 23861 92681
1104 92681 124796 79986 -23731 -80325 -111889 -142757 -84729 -53969 -99862 -65375 -16708 -822
1092 -822 -53336 25703 -42727 -78220 -120006 -103889 -60467 -89342 -106952 -72194 -52457 -56834
1080 -56834 -45419 -18036 70156 -14068 -18575 -1127 -99677 1939 25900 6676 -54352 -137594
1068 -137594 -4109 -69306 -75506 -62521 -64930 -36221 -28374 5057 -47860 -39339 -42784 -51009 -92033
1055 -92033 -76437 -32351 16452 47022 37735 25308 -27582 159 23485 67779 -39005 -166244
1043 -166244 -104120 -13739 -30306 -60660 -30775 -21370 -59348 -69853 -21212 -29339 -28353 31590
1031 31590 -18610 5859 -31269 41734 -122132 -102812 -28135 58940 63519 19153 -18657 -45
1019 -45 28873 69181 98997 129908 74964 144957 36536 23438 79575 -14721 -97196 -135931
1007 -135931 -24466 63766 118209 102248 45620 -36800 -48242 -58811 -51563 -51312 -69189 -75510
995 -75510 -75453 -32130 -9525 -32672 -5997 -148973 -17709 -17364 -29889 95272 42745 -37636
983 -37636 2785 -61034 -31944 -35574 -127274 -144222 12647 -89273 -99147 -51339 -116407 -117357
971 -117357 -83911 -99147 -39515 -121325 -61251 2273 -86398 -138989 -59724 -97299 -42389 -76399
959 -76399 -44646 76815 -35545 -29384 22542 59764 5775 -74922 -3340 25751 -74828 -64231
947 -64231 -74755 -68924 -47231 -66104 -126420 -100047 -56680 -44742 -11703 -95164 -7686 41984
935 41984 53968 55808 -58574 -33963 -23259 -29342 25679 63625 -23315 -132441 -159461 -78865
923 -78865 -31175 -8024 -82999 -182698 -189631 -96299 -159591 -52800 64905 -11504 -55802 -69964
911 -69964 20255 -107420 -185605 -43513 -68476 -118131 -47124 -32717 -41165 -49321 -87592 -52138
899 -52138 -4997 -29056 -115321 -47255 93673 -12803 -49250 -28251 87518 70289 -16135
888 -16135 -27361 16219 -7393 -21100 -17185 -2789 44859 -101718 -46416 -81896 -33363 -42050
876 -42050 2744 4081 -23749 -20373 30414 -74060 -15190 -66434 -81329 -105582 -66512 -104053
864 -104053 -162451 -72132 -16230 37799 9566 -123849 -221695 -83854 -56640 -42810 -21176
853 -21176 -55191 -57343 -79555 -89079 -107459 -76396 -116145 -67302 -87988 -88506 60796 30851 -2822
840 -2822 50370 80322 135113 54073 -70962 -26635 -45199 -125448 -90399 -43281 -51799 -27776
828 -27776 -148591 -112420 -81615 -54979 -19328 -91224 -110591 -108784 -156051 -71997 -96841 -22302
816 -22302 55951 84574 8164 -92944 -11422 50562 3802 -50331 -106023 -53282 -56135 -27499
804 -27499 -11136 -96175 -95966 -75535 -177486 -98690 -81645 -176078 -153344 -27345 -2743 239
792 239 34953 -22682 -74838 -90074 -92056 -180259 -194424 -109166 -71211 -87331 -111237 -82784 -57776
779 -57776 -48873 24589 65004 13073 7253 -75342 -63986 -5349 -91751 -137242 -70410 -38583
767 -38583 -21596 -4828 -35575 -126698 -122249 -170116 -187199 -91413 -85064 -55189 34869 42696 -35371
754 -35371 -85953 -58749 36644 50606 110517 38065 13601 22359 67582 81791 13692 -63757
742 -63757 9671 -4303 -91155 -76870 -149273 -156447 -70703 -92014 -196453 -149495 -49832 -46575
730 -46575 -165034 -194126 -138950 -45806 34842 65509 -4835 -71350 28703 11009 79890 26813
718 26813 5947 -40221 -114833 -39581 -83927 -86385 69541 86859 -65495 -59241 -49386 -117219
706 -117219 -61600 -95211 -152427 -114620 -129419 -23670 -32392 -77778 -28382 58729 53883 12241
694 12241 -7856 5886 -37837 8236 38298 -9289 87736 -27615 -59319 27558 42590 62699
682 62699 35272 -5169 -139650 -115871 -20176 -79909 -46928 -8664 -87294 -109604 -59697 -48502
670 -48502 -23456 -108884 80671 155916 50594 16271 -66938 -115553 -99249 764 41846
659 41846 62417 -13115 -34326 -70563 -89522 10976 17786 40693 19853 -22105 9854 -20701
647 -20701 -137275 -53104 -54887 -55990 -73674 -106957 -136966 -118948 10379 6540 12601 -46196
635 -46196 -94374 -67137 -23651 -9213 42342 102205 44737 80096 40592 -7793 -122585 -89007
623 -89007 -25558 -31260 37192 -31935 -18815 -92181 38937 45768 -41703 -37445 57823 122338
611 122338 15354 -91044 -35682 -14120 -3113 57757 9110 15624 49588 47743 -40669 -33089
599 -33089 -8314 -51654 -7818 33481 80762 -17795 -39085 -66591 -63525 -43077 -80395 -70830
587 -70830 -65869 -85854 -74212 -64456 41573 40049 -47776 -19095 -20700 -230 5263 -27267 -21697
574 -21697 84752 84363 -7759 25241 9234 -51042 -14309 -68280 -106751 3871 -35183 -31437
562 -31437 62759 -15978 -32505 -29206 -3813 -46970 -63678 -60914 68857 47496 -22416 -51959
550 -51959 -44637 58466 59745 119162 186350 71023 -67455 -92012 -60345 68195 54689 24690
538 24690 -65294 -87978 -18838 17983 15618 9061 111579 28846 6126 -13901 -58889 -14459
526 -14459 -92520 -123493 -66362 -79702 -110185 -22633 -86011 -154299 -42910 -53177 -81781 -166468
514 -166468 -210221 -52310 -108854 -195204 -129383 228 45899 12963 -55940 -65786 -79906 -76686
502 -76686 -31587 -74367 -155653 -37674 -56202 -100110 -74052 16238 -55658 -39332 -37160 -92125
490 -92125 51256 -43534 -118388 -64795 2065 15514 -7525 -28456 9852 -9169 -45659 -94113
478 -94113 -101846 -68363 -56288 -57565 -90396 -148696 -33849 -64305 -45535 -95939 -24156 7873
466 7873 128849 57321 -89605 -95379 -54900 -219422 -226230 -76904 -96032 -79377 -1262 31598
454 31598 66748 174066 116884 66095 67116 33477 -42958 -6158 39120 84453 48972 74502
442 74502 -53848 -85562 -162994 -71340 29311 -17588 -63318 -57460 -2572 -64729 -102635 -106704
430 -106704 -81073 -64993 -69458 -104716 -100567 -42754 6421 -36629 -45344 -2707 -105338 -136596
418 -136596 -89456 -170696 -192541 -235059 -131528 -80236 -88473 -1106 57340 38463 -29638 28765
406 28765 6268 55698 -15258 -138250 -98655 -44983 -14751 -71350 -80548 -171153 -258377 -103435
394 -103435 -89550 -109930 -71587 -78671 -136693 -165156 -111021 -28042 -65873 -65016 -137795 3600
382 3600 -41763 -177308 -104953 -55904 -8611 -8267 46712 81817 29945 -119455 -153849 -216642
370 -216642 -232917 -103503 -66962 -73629 -148443 -160095 -110031 -141005 -32340 -119125 -125583 7948
358 7948 25455 -85393 16664 77669 29220 -34695 2566 12973 -36657 -45596 -67973 -121641
346 -121641 -193754 -106636 -57902 -60039 9090 68919 40415 -82719 -141002 -112956 -104580 -63309
334 -63309 -53058 -80370 -90576 -92777 -103336 -11129 -53563 -42980 13516 6721 73065 23668
322 23668 2714 29775 -17986 -60297 -156236 -198548 -94788 -60871 -77642 -57779 -97745 -185743
310 -185743 -143460 -185765 -190032 -129445 -113196 -109438 -164799 -66645 70869 -13868 -29874 -61970
298 -61970 -114181 -138512 -176394 -98733 -104279 -89495 -88181 -114433 -39410 -55337 -70460 -83583
286 -83583 -48476 -4145 -87834 -22976 20104 -28484 -61067 -56687 8658 -39993 -30077 30817
274 30817 -35638 -100389 -154669 -43988 -44467 -62493 -94688 -46623 -69923 -104951 -57358 -41143
262 -41143 -94544 -76849 -90851 -92554 -21388 -74999 -23865 18485 103120 70565 -10630 -2660
250 -2660 -123886 -150904 -81321 8325 15000 -42105 -28378 -94067 -105628 -163114 -197175 -64183
238 -64183 -54064 36601 30489 -136166 -146296 57159 45290 -48732 -5894 101838 10391 -38978
226 -38978 -41814 -87814 -90252 -112564 -38645 17428 -11788 -125742 -89027 -67876 -51443 -129490
214 -129490 -176548 -155764 -44306 -77051 -41336 -96851 -129598 -182929 -87175 -42323 -74309 -13601
202 -13601 -65501 14894 -38665 -94696 -69991 -75690 -46047 -82101 -111755 -136044 -136256 -157976 -101795
189 -101795 -31911 -66596 -27831 24785 31855 -19062 -218505 -218077 -154772 -135154 -75545 -64016
177 -64016 -104288 -94221 -69908 -26105 -63352 -102726 -100767 -116751 -100028 -73896 -49306 -41805
165 -41805 -15580 -53312 -98969 -119128 -134580 -115491 -36088 -46967 -112112 -130186 -129439 -85613
153 -85613 -24845 31624 24349 7701 5828 23930 -68961 -184127 -115587 -37308 -131755 -94156
141 -94156 -15921 -113116 -126724 -151146 -95622 -90308 -79759 -26506 -88032 -80650 3506 -119325
129 -119325 -41459 -97374 36093 54844 49654 -5318 6630 23460 -11295 -18786 -45937 -45879 -32777
116 -32777 -31703 -77571 -135417 -149833 -99828 -89832 -7367 27324 -69072 -93881 -62014 -122446
104 -122446 -91672 -68636 -100103 -135107 -99025 -119578 -174933 -89469 -36552 -9700 5111 62046
92 62046 46831 -41785 -77222 -138167 -74306 -156297 -152727 -61664 -113428 -63387 -25724 -105691
80 -105691 -63025 -80661 -125800 -89887 -72993 -75944 -107886 -128232 -31868 -39619 -58545 -43475
68 -43475 -44713 -115372 -78265 -89108 2505 15338 -15672 -79697 -47135 -63425 -104778 -45382
56 -45382 -74438 -96508 -149603 -64169 -36048 -65998 -33836 -102383 -54973 37397 -4745 3603
44 3603 51801 66267 -17507 -43290 -14979 17899 45799 24929 -50847 -59462 -104647 -61055 -74568
31 -74568 -151500 -230385 -139703 -77457 -146643 -177009 -117834 -82630 -80806 -131688 -150374 -73132
19 -73132 -52889 -84746 -117095 -93149 -131308 -43947 -77459 -44213 -78336 -108546 -89486 -65967
7 -65967 -72492 -46261 -17980 -28167 -35895 1022 -21222
0 -21222
$$ Imaginary data points
##PAGE= N=2
##DATA TABLE= (X++(I..I)), XYDATA
16383 -1640376 -1565632 -1496544 -1506604 -1493202 -1492655 -1475846 -1433469 -1422065 -1354923 -1258416 -1234456 -1308389
16371 -1308389 -1324398 -1294307 -1314220 -1259823 -1237009 -1182788 -1143142 -1096048 -1168714 -1162137 -1127296
16360 -1127296 -1071240 -1070432 -1016329 -1027989 -996325 -892955 -878710 -918383 -866869 -858819 -852181 -839250
16348 -839250 -851942 -815794 -850775 -787294 -725674 -719887 -579059 -557478 -541135 -576237 -658264
16337 -658264 -599591 -553851 -490970 -532174 -560604 -586059 -475636 -411461 -395306 -461335 -432592
16326 -432592 -407668 -383696 -354018 -287418 -201946 -287047 -246658 -244183 -257776 -202232 -172316 -135826
16314 -135826 -69174 -116218 -113745 -78167 -41578 57125 7986 -21228 21574 -48076 62211
16303 62211 123751 100443 93635 55732 -15046 14403 72401 144117 265534 221103 246429 292333
16291 292333 321784 218717 231858 263722 414046 442101 419447 411202 411084 342107 383215 398949
16279 398949 420238 419339 400306 417861 526826 496247 471867 473668 532416 635959 594741 672607
16267 672607 633897 620220 558445 608888 618190 572798 562384 547147 651216 701310 725285
16256 725285 646590 681184 786440 797028 797585 825357 835314 866231 842227 869181 896656 853521
16244 853521 875647 886770 904759 825116 873000 1061435 1003428 984250 988150 917356 980052
16233 980052 1029524 968069 1060887 1101479 1071665 1078545 1064876 1100640 1120879 1151033 1054418 1063805
16221 1063805 1110406 1086481 1059411 1089821 1052697 1091777 1125633 1167567 1181598 1140625 1162259
16210 1162259 1179740 1195580 1265280 1162695 1116866 1175250 1265698 1305124 1344443 1301247 1278767
16199 1278767 1267428 1303720 1274355 1235380 1300420 1258717 1288402 1380367 1378587 1449238 1350720
16188 1350720 1241878 1300009 1392381 1438761 1407560 1428679 1356815 1316818 1393635 1417964 1448071
16177 1448071 1487718 1475846 1416036 1418642 1391040 1445177 1456051 1514297 1608731 1610419 1513461 1476971
16165 1476971 1492543 1499696 1547125 1506321 1593991 1638841 1543941 1513258 1576241 1608686 1535778
16154 1535778 1579578 1739445 1761262 1587146 1574469 1643058 1655007 1672332 1666963 1635850 1570024
16143 1570024 1629251 1669842 1656458 1709773 1678650 1580722 1780284 1721595 1795598 1770417 1623308
16132 1623308 1677395 1602511 1593257 1663967 1660158 1668292 1573443 1643944 1709864 1656130 1632800 1741136
16120 1741136 1689301 1597967 1707390 1737491 1771262 1708157 1696496 1715573 1625726 1573060 1622490
16109 1622490 1738116 1779332 1705729 1678965 1716452 1769161 1680592 1639836 1777194 1739859 1792779
16098 1792779 1697847 1666957 1758772 1849280 1778752 1792690 1763730 1738872 1706810 1686058 1740632
16087 1740632 1784512 1840510 1809983 1751024 1771437 1871857 1825652 1763327 1672817 1647927 1692734
16076 1692734 1759133 1821761 1924918 1800375 1757495 1758235 1734317 1605084 1639682 1728681 1550781
16065 1550781 1604924 1650348 1695238 1802935 1790570 1813636 1753223 1781845 1762653 1741945 1777590
16054 1777590 1795308 1744590 1743442 1742204 1783168 1771360 1705814 1723983 1741955 1729382 1754519 1837518
16042 1837518 1915751 1815634 1804430 1755893 1719479 1903837 1844160 1846156 1769072 1772979 1807083
16031 1807083 1662659 1679208 1659363 1726292 1662556 1709654 1791032 1809402 1818667 1804538 1870113
16020 1870113 1762420 1696835 1763924 1851604 1812507 1826642 1752016 1761248 1841879 1858764 1803452
16009 1803452 1741864 1829708 1750835 1702682 1700334 1831475 1771080 1702721 1835260 1930992 1896426
15998 1896426 1899320 1859474 1754136 1693452 1683164 1726939 1795330 1793418 1843937 1866335 1805744
15987 1805744 1770502 1717344 1813033 1809532 1784540 1796489 1824222 1835424 1951723 1896745 1806163
15976 1806163 1718942 1640664 1648237 1694937 1773132 1793722 1819449 1829142 1778700 1838892 1812405 1788923
15964 1788923 1796533 1844965 1776480 1664458 1799659 1768839 1770445 1821279 1837507 1857095 1791896
15953 1791896 1897385 1822824 1746471 1711271 1601219 1711185 1793593 1840726 1819487 1821225 1682036
15942 1682036 1587792 1622608 1611490 1696283 1705951 1706430 1758844 1745673 1785483 1839944 1840790 1828210
15930 1828210 1828261 1803702 1881862 1880710 1951264 1907782 1927853 1920250 1812100 1894608 1884352 1863480
15918 1863480 1925856 1950536 1919834 1866070 1834985 1885824 1905083 2031100 1921263 1826738 1804472
15907 1804472 1837702 1848597 1772173 1733987 1751210 1769235 1766033 1761447 1732399 1693382 1735676 1732392
15895 1732392 1812701 1782350 1788371 1769094 1878607 1844773 1858792 1935857 1866153 1894390 1874002
15884 1874002 1838251 1832447 1778166 1780565 1696886 1652814 1729241 1745533 1802744 1797800 1813979 1831155
15872 1831155 1921882 1830369 1873829 1826673 1787050 1778520 1826132 1819472 1791914 1796059 1935380 1932976
15860 1932976 1877945 1948958 1754967 1753456 1809182 1861713 1828888 1744064 1806916 1762072 1858845
15849 1858845 1827328 1787484 1809324 1765234 1774320 1801479 1750909 1818403 1751097 1722702 1750393
15838 1750393 1827682 1872135 1845620 1824982 1753200 1722238 1740890 1739119 1738660 1719303 1707300 1776549
15826 1776549 1725304 1794630 1796502 1816355 1850132 1859808 1853283 1830366 1916359 1927652 1917601 1774981
15814 1774981 1846960 1855150 1799736 1805143 1745330 1853122 1865313 1856515 1854314 1868653 1863959 1871706
15802 1871706 1876058 1938493 1870314 1745913 1763887 1795962 1790546 1858317 1779390 1678038 1694965
15791 1694965 1765547 1767504 1869727 1820397 1801805 1898507 1875353 1835689 1773329 1783173 1841545
15780 1841545 1823278 1766745 1735876 1767215 1777564 1728799 1761079 1763843 1844746 1745967 1771074
15769 1771074 1922388 1884841 1829886 1852789 1922093 1845331 1783583 1772006 1733008 1704799 1764660
15758 1764660 1765275 1777004 1734342 1692437 1661347 1695522 1655592 1718836 1812265 1864658 1808682 1909237
15746 1909237 1960816 1943690 1878121 1768526 1775855 1779487 1858922 1869241 1856054 1816948 1840522
15735 1840522 1726618 1745497 1867650 1764958 1811989 1833561 1776508 1829754 1838039 1973520 1769889
15724 1769889 1690727 1799898 1847711 1730609 1761690 1800653 1781073 1720907 1731265 1773016 1739962
15713 1739962 1858759 1843068 1869811 1880107 1880743 1912080 1828539 1830840 1699118 1689597 1725416 1700460
15701 1700460 1859083 1846649 1889885 1877280 1905199 2007358 1842545 1805859 1847802 1869309 1826275
15690 1826275 1784798 1846793 1873956 1961514 1891390 1838232 1915709 1852227 1730642 1777793 1836899
15679 1836899 1810483 1783026 1704188 1722988 1791372 1790301 1815213 1884441 1842881 1850742 1882409 1831952
15667 1831952 1803809 1834508 1797418 1838164 1791045 1791361 1794826 1815432 1864701 1812628 1852872 1782561
15655 1782561 1883933 1971757 1942463 1867629 1767135 1825527 1950959 1926762 1822350 1744546
15645 1744546 1813965 1889225 1863838 1739795 1791091 1751985 1724106 1796956 1842819 1966693 1948385
15634 1948385 1890731 1902505 1897767 1897881 1882154 1873502 1848912 1817902 1851304 1909253 1930544 1850683
15622 1850683 1889054 1916466 1967060 1890430 1806292 1944644 1870045 1876791 1925591 1941843 2014006
15611 2014006 1998818 1897988 1807787 1757138 1801977 1822114 1789108 1725711 1698170 1740161 1786246
15600 1786246 1723493 1790000 1857773 1912140 1838048 1761121 1769374 1758716 1763723 1835900 1839298 1863630
15588 1863630 1840611 1794014 1817946 1856324 1782043 1841736 1914796 1883783 1808148 1804806 1735343
15577 1735343 1714002 1785758 1793157 1963572 1856129 1857819 1913989 1857823 1734468 1713146 1789476
15566 1789476 1900100 1868257 1959611 1904183 1883223 1890618 1876673 1846862 1867289 1850008 1886175
15555 1886175 1825593 1790049 1839723 1867510 1811303 1789795 1787148 1786142 1839079 1988662 1887146
15544 1887146 1753660 1742609 1753520 1876405 1866454 1836753 1898765 1939829 1914368 1885670 1926321
15533 1926321 1905068 1896943 1812456 1745245 1855130 1928340 1864598 1885196 1862724 1892301 1887555
15522 1887555 1906475 1953864 1929899 1918001 1853777 1811578 1776092 1797493 1822491 1890447 1843891
15511 1843891 1801011 1792816 1846669 1877948 1916113 1890379 1872351 1876824 1908170 1836761 1835801 1861867
15499 1861867 1907725 1894745 1964270 1869721 1806638 1716757 1727431 1720160 1734021 1814633 1820306 1761877
15487 1761877 1842931 1891112 1889469 1874858 1861113 1788692 1852052 1874288 1876898 1831953 1876757 1871764
15475 1871764 1909767 1902645 1807370 1903070 1926793 1821806 1832193 1953231 1917963 1925948 1933837
15464 1933837 1985464 1955026 1866532 1918332 2016965 1927421 1856488 1880770 1917217 1921116 1914313 1902196
15452 1902196 1806902 1794582 1975757 1987908 1934682 1916265 1909451 1836556 1830060 1835552 1881904 1863692
15440 1863692 1847515 1927814 1839629 1782295 1771919 1895675 1998310 1924956 1805108 1784633 1855226
15429 1855226 1809802 1920953 1873521 1909244 1993525 1935969 1782659 1738281 1687369 1727763 1678631
15418 1678631 1725939 1828390 1934311 1969236 1893245 1899859 1927986 1958051 2011196 2013303 1972247
15407 1972247 1888440 1821428 1780417 1831117 1843271 1806092 1752060 1753261 1783372 1819948 1956200
15396 1956200 1935463 1832227 1835549 1913025 1961360 1914308 1854087 1860484 1832175 1929860 1848640
15385 1848640 1820881 1874301 1983875 1920980 1998727 1994660 1912376 1932207 1835327 1852461 1809459
15374 1809459 1921003 1925392 1906842 1938353 1950011 1939080 1888978 1907725 1903542 1791481 1899890
15363 1899890 1894748 1911021 1925759 1821904 1801432 1785405 1889613 1903198 1956385 1816906 1808984
15352 1808984 1755438 1814377 1882933 1871350 1864037 1779948 1768658 1794087 1867732 1899558 1947759
15341 1947759 2014509 2037582 2025017 1921380 1951910 1966140 1863085 1794724 1818353 1884089 1767566
15330 1767566 1709089 1753310 1831991 1831717 1776766 1781319 1882603 1922699 1849921 1937794 1955555 1926529
15318 1926529 1970579 1969570 1936390 1899990 1929940 1909761 1914167 1893340 1866261 1868410 1853411 1926182
15306 1926182 1944652 1864845 1886276 1907352 1923904 1906719 1846104 1927529 1900676 1848184 1811953
15295 1811953 1883051 1870289 1946343 1939385 1975805 1847063 1807717 1869450 1907832 1969779 1954067
15284 1954067 1918520 1918311 1955289 1928447 1869061 1788644 1920541 1987254 1963721 1881649 1875168 1823874
15272 1823874 1797028 1930087 1873063 1863210 1896860 1918099 1967935 1925242 1983095 1972547 1999636
15261 1999636 2032143 1928740 1923511 1919024 1974947 2059859 2046271 2004277 1917805 1912695 1858834 1922508
15249 1922508 1865981 1905461 1919855 1926854 1834549 1852860 1868138 1826896 1842630 1895830 1921167
15238 1921167 1905206 1882355 1999886 1952410 1937557 1930239 1939647 1968185 1825251 1782834 1825595
15227 1825595 1811630 1866300 1844113 1894946 1874247 1742011 1762137 1789135 1866416 1944817 1974609
15216 1974609 1956758 1934369 1827853 1841994 1940679 1943986 1848192 1868701 1896338 1901955 1862711
15205 1862711 1808573 1836027 1869202 1797213 1822619 1889224 1907697 1887420 1888327 2050463 2084596
15194 2084596 1994188 1936925 1944997 1946560 2022423 1979862 1909686 1907383 1922837 1996618 1931531 1912753
15182 1912753 1854344 1852697 1817833 1823946 1868494 1810254 1831688 1822593 1910270 1908575 1864751 1905124
15170 1905124 1777777 1911972 1954135 1907725 1891590 1994758 1974572 1929415 1930874 1978691 1918843
15159 1918843 1937928 1977842 1946479 1979156 1938021 1897579 1868410 1897524 1915161 1889059 1955776
15148 1955776 1927490 1924029 1833672 1796337 1820310 1875216 1946722 1964910 1977980 2069691 2059622
15137 2059622 1927699 1899171 1922663 1878360 1859931 1852292 1825576 1934180 1928736 1902952 1890967
15126 1890967 1875145 1898565 1929294 1942327 1887399 1893386 1996861 2045844 1924756 1923616 2040284
15115 2040284 2043384 2083655 1948122 1841057 1937545 2023469 1996153 2069163 1961898 1884998 1912009
15104 1912009 1933660 2072965 2056307 1958502 1966721 2088965 1982677 1897263 1788507 1852504 1968893
15093 1968893 1884915 1873046 1925225 1993322 1852231 1962607 2006032 2100723 2085085 2061468 2011331
15082 2011331 1960160 1903236 1858063 1986832 1943765 1952382 2045805 2012394 1915087 1985538 1930739
15071 1930739 1852226 1951848 1916232 1992648 1961606 1948265 1971174 2032443 2030153 1980802 1978018 1975913
15059 1975913 1983138 1981347 2010597 2051994 2019191 2001497 2041090 2034423 2008327 1935066 1832671 1890404
15047 1890404 1893316 1803686 1867305 1898222 1968413 1959332 1895121 1913590 1896437 1919225 1876180 1993785
15035 1993785 1954262 1911550 1846335 1819995 1776556 1795095 1882732 1823092 1898046 1904524 1944345
15024 1944345 1855684 1875462 1934472 1958710 1871834 1885417 1873913 1827707 1795097 1800907 1844788
15013 1844788 1980643 1972174 2000959 2033586 1979993 2008155 1995126 2008071 1962778 1944957 1972449
15002 1972449 1943092 2004028 2099797 2015842 1838085 1892067 1947096 1986259 2180177 2122581 1934312
14991 1934312 1903739 1814753 1809082 1908020 2027754 2023907 2009221 1918252 1991338 1990057 1960941 1949191
14979 1949191 1926574 2026331 2111272 2152291 2068243 1960022 1943184 1966486 1885854 1932954 1867448
14968 1867448 1868393 1873878 1917374 1897768 1938239 1898848 1953573 1911621 1969820 2024654 2009884 2055419
14956 2055419 1976862 1998651 2082190 1948428 1883933 1945171 1879739 1888047 1914910 1981889 1904178
14945 1904178 1842173 1857552 1963949 1992515 1987771 1951906 1939660 1936106 1972798 2051376 2020081
14934 2020081 1958127 1948966 1997172 1981980 1886309 1949388 1999995 1947010 1910873 1952709 1947608 2067471
14922 2067471 2083672 2012226 1899917 1975824 2038300 2040749 1978552 1893742 1859110 1871545 1917376
14911 1917376 1999841 1975149 1846047 1908560 1849108 1884539 1878680 1923868 1982958 1903171 1930956
14900 1930956 1943374 1884322 1871909 1891045 1919033 1959666 1925070 2009734 1936851 1844048 1911652
14889 1911652 1925003 1917773 1883014 1912186 1956056 1893713 1912788 1992980 1984808 2020075 2001004 1994589
14877 1994589 2047433 2073539 2053873 2020087 2033417 2059933 2079290 1987697 2026501 2086914 2021118
14866 2021118 2012387 1966290 1975202 1863100 1995148 2031852 1993984 2066979 2081986 2021975 1985457
14855 1985457 1888414 2003516 1981796 1991485 1925852 1967704 2015080 1947150 1985243 1979848 1966369
14844 1966369 1912796 1880437 1890543 1948701 2112318 2047018 1930155 2037068 2100051 2061778 2010422
14833 2010422 1981026 2035290 2075240 2038808 2033873 1997974 2017301 2023710 2048974 2030258 1957121 1818561
14821 1818561 1915428 1982279 1973551 2043913 2040612 2032036 2067598 2092559 2074838 2009595 1951838 2000876
14809 2000876 2159458 2184480 1998431 1833416 1875313 1930917 2013933 2063857 1949722 2009447
14799 2009447 2086144 2063357 1990371 2018858 1973186 1934927 1961570 1922959 1976393 1926621 1915106
14788 1915106 2004560 2010543 2000787 2022726 1926894 1875607 1837469 1910384 1980097 2013644 2014196 1932892
14776 1932892 1970454 1961211 1992230 2030152 1977831 2057244 2091902 1986992 1932058 2014508 1964900
14765 1964900 1999706 2048253 2016533 1949637 1922429 1869922 1952556 2021828 1995768 2033933 2025298
14754 2025298 1926345 1931517 1926775 1951244 1971014 1979087 2031491 1951400 1868471 2019390 1978376 1827722
14742 1827722 1942416 1955763 1877470 2001994 2091357 2037728 2152883 2069743 1959975 1989421
14732 1989421 1926380 1904178 1962556 2008756 1883356 1924225 1973331 1960979 2010082 1964966 1972571
14721 1972571 1905715 1979604 2039552 1995610 1981064 2026065 2095353 2068948 2172472 2113314 2028333
14710 2028333 2063701 2131263 2116227 2048851 2070006 2103016 2148416 2139475 1984746 2035210 2065660
14699 2065660 2045728 2153404 2068511 1994257 2042743 2013162 1983198 2096385 2026873 2005742 1945871
14688 1945871 2035476 2037295 1903669 1945569 1975870 2077117 2167783 2082446 1960027 2024758 2042804
14677 2042804 1962326 2008997 2059052 2039888 2033196 1998744 1968829 1952050 1939054 1971704 1879620
14666 1879620 1801100 1926087 2109472 1958535 1925170 1965184 1968513 1886732 1937597 1934273 1903225
14655 1903225 1938159 1931836 2033214 2073681 2074905 2098777 2010178 1970326 1984355 1975153 1990065 1995086
14643 1995086 2064515 1987704 1904579 1970710 2057626 2054882 1954676 1979735 2043776 2113431 2067525
14632 2067525 1911772 2075226 2070036 2052219 2013570 1875900 2051842 2055288 1995038 1960306 2057837
14621 2057837 2086404 2018001 1934627 1984381 2075638 1999283 1921749 2055531 2081245 2090539 2151531
14610 2151531 2046535 1972785 2009467 2078743 2073576 2021130 2049864 2067019 2036795 2084133 2009253
14599 2009253 1971751 2018007 2119646 2082750 2129372 2048880 2036662 2012191 2031584 2057251 2012714
14588 2012714 2064600 2105835 1921933 1970666 1956876 1984946 1988585 1994602 2007370 1989030 2014578
14577 2014578 1919676 1881848 1911764 1989950 2022326 2076633 1918853 1890813 1968873 2029136 2129544
14566 2129544 2041187 2010702 1920281 2007045 2058181 2031231 2034599 2134569 2156033 2058292 2054855 1998610
$$ [...]
##END NTUPLES=NMR SPECTRUM
##END=
