##TITLE=1H_DE-80H_X3
 200.13MHz, d2o
 8 sc
 
 19ns.26.2.2025
##JCAMPDX= 6.0         $$ Bruker NMR JCAMP-DX V2.0
##DATA TYPE= NMR SPECTRUM
##DATA CLASS= NTUPLES
##ORIGIN= UXNMR, Bruker Analytische Messtechnik GmbH
##OWNER= pz
$$ XWIN-NMR		Version 3.5
$$ Mon Jul  7 11:29:38 2025 Russian Standard Time (UT+4h)  Yarkov@DPX200
##.OBSERVE FREQUENCY= 200.1313
##.OBSERVE NUCLEUS= ^1H
##.ACQUISITION MODE= SIMULTANEOUS
##.ACQUISITION SCHEME= undefined
##.AVERAGES= 8
##.DIGITISER RES= 18
##SPECTROMETER/DATA SYSTEM= spect
##.PULSE SEQUENCE= zg30
##.SOLVENT NAME= CDCl3
##.SHIFT REFERENCE= (INTERNAL, CDCl3, 0, 15.5056)
##AUDIT TRAIL= $$ (NUMBER, WHEN, WHO, WHERE, WHAT)
$$ ##TITLE= Audit trail, XWIN-NMR		Version 3.5
$$ ##JCAMPDX= 5.01
$$ ##ORIGIN= Bruker BioSpin GmbH
$$ ##OWNER= Yarkov
$$ C:/Bruker/XWIN-NMR/data/yarkov2/nmr/H-C/1/pdata/1/auditp.txt
$$ ##AUDIT TRAIL=  $$ (NUMBER, WHEN, WHO, WHERE, WHAT)
(   1,<2025-07-07 11:28:49.10 +0400>,<Yarkov>,<DPX200>,
      <created by zg, POWCHK disabled, PULCHK disabled
       configuration hash MD5:
       00 E9 B6 7A A2 85 ED C7 34 08 36 98 17 FE 4E 26
       data hash MD5: 16K
       AF 49 26 9E 06 0F 0C 2E 12 21 36 91 B2 92 3D 84>)
(   2,<2025-07-07 11:28:57.12 +0400>,<Yarkov>,<DPX200>,
      <Start of raw data processing
       efp BC_mod = 2 LB = 0.25 FT_mod = 6 PKNL = 1 PHC0 = -1355.951 PHC1 = 7.64948 SI = 16K 
       data hash MD5: 16K
       66 9F F7 D0 A8 EC FF 0F 81 EE 6B E1 C9 D5 72 0D>)
(   3,<2025-07-07 11:29:13.10 +0400>,<Yarkov>,<DPX200>,
      <pk PHC0 = -5.886716 PHC1 = 6 
       data hash MD5: 16K
       9C A6 98 1E 0E 79 B9 62 E0 18 B3 42 10 55 1E 15>)
(   4,<2025-07-07 11:29:16.01 +0400>,<Yarkov>,<DPX200>,
      <abs ABSG = 5 
       data hash MD5: 16K
       2B AF 76 52 52 B4 1B D2 A5 9E FA F0 5D 73 A8 95>)
$$ ##END=
$$ 
$$ hash MD5
$$ AA 43 63 E0 76 EC 3C E0 52 7C A9 95 9A E9 BF DD
##$RELAX= 
##$RELAX= 
##$RELAX= 
##$RELAX= 
##$RELAX= 
##$RELAX= 
$$ Bruker specific parameters
$$ --------------------------
##$DU= <C:/Bruker/XWIN-NMR>
##$EXPNO= 1
##$NAME= <H-C>
##$PROCNO= 1
##$TYPE= <nmr>
##$USER= <yarkov2>
##$AMP= (0..31)
100 100 100 100 100 100 100 100 100 100 100 100 100 100 100 100 100 100 
100 100 100 100 100 100 100 100 100 100 100 100 100 100 
##$AQSEQ= 0
##$AQ_mod= 1
##$AUNM= <au_zg>
##$AUTOPOS= <>
##$BF1= 200.13
##$BF2= 200.13
##$BF3= 200.13
##$BF4= 200.13
##$BF5= 200.13
##$BF6= 200.13
##$BF7= 200.13
##$BF8= 200.13
##$BYTORDA= 1
##$CFDGTYP= 0
##$CFRGTYP= 5
##$CHEMSTR= <none>
##$CNST= (0..31)
1 1 145 1 1 1 1 1 1 1 1 1 1 1 1 1 1 1 1 1 1 1 1 1 1 1 1 1 1 1 1 1 
##$CPDPRG= <>
##$CPDPRG1= <>
##$CPDPRG2= <>
##$CPDPRG3= <>
##$CPDPRG4= <mlev>
##$CPDPRG5= <mlev>
##$CPDPRG6= <mlev>
##$CPDPRG7= <mlev>
##$CPDPRG8= <mlev>
##$CPDPRGB= <>
##$CPDPRGT= <>
##$D= (0..31)
0 0.7 0 0 0 0 0 0 0 0 0 0.03 0 0 0 0 0 0 0 0 0 0 0 0 0 0 0 0 0 0 0 0 
##$DATE= 1751873328
##$DBL= (0..7)
120 120 120 120 120 120 120 120 
##$DBP= (0..7)
150 150 150 150 150 150 150 150 
##$DBP07= 0
##$DBPNAM0= <>
##$DBPNAM1= <>
##$DBPNAM2= <>
$$ [...]
##$SUBNAM3= <"">
##$SUBNAM4= <"">
##$SUBNAM5= <"">
##$SUBNAM6= <"">
##$SUBNAM7= <"">
##$SUBNAM8= <"">
##$SUBNAM9= <"">
##$SW= 18.0517328524113
##$SWIBOX= (0..15)
0 0 2 0 0 0 0 0 0 0 0 0 0 0 0 0 
##$SW_h= 3612.71676300578
##$TD= 16384
##$TD0= 1
##$TE= 0
##$TE2= 300
##$TE3= 300
##$TEG= 300
##$TL= (0..7)
0 120 120 120 120 120 120 120 
##$TP= (0..7)
150 150 150 150 150 150 150 150 
##$TP07= 0
##$TPNAME0= <>
##$TPNAME1= <>
##$TPNAME2= <>
##$TPNAME3= <>
##$TPNAME4= <>
##$TPNAME5= <>
##$TPNAME6= <>
##$TPNAME7= <>
##$TPOAL= (0..7)
0.5 0.5 0.5 0.5 0.5 0.5 0.5 0.5 
##$TPOFFS= (0..7)
0 0 0 0 0 0 0 0 
##$TUNHIN= 0
##$TUNHOUT= 0
##$TUNXOUT= 0
##$USERA1= <user>
##$USERA2= <user>
##$USERA3= <user>
##$USERA4= <user>
##$USERA5= <user>
##$V9= 5
##$VALIST= <valist>
##$VCLIST= <CCCCCCCCCCCCCCC>
##$VD= 0
##$VDLIST= <DDDDDDDDDDDDDDD>
##$VPLIST= <PPPPPPPPPPPPPPP>
##$VTLIST= <TTTTTTTTTTTTTTT>
##$WBST= 1024
##$WBSW= 4
##$XGAIN= (0..3)
0 0 0 0 
##$XL= 0
##$YL= 0
##$YMAX_a= 593746
##$YMIN_a= -625756
##$ZGOPTNS= <>
##$ZL1= 120
##$ZL2= 120
##$ZL3= 120
##$ZL4= 120
##$ABSF1= 15.5056
##$ABSF2= -2.546249
##$ABSG= 5
##$ABSL= 3
##$ALPHA= 0
##$AQORDER= 0
##$ASSFAC= 0
##$ASSFACI= 0
##$ASSFACX= 0
##$ASSWID= 0
##$AUNMP= <proc_1d>
##$AZFE= 0.1
##$AZFW= 0.1
##$BCFW= 0
##$BC_mod= 2
##$BYTORDP= 0
##$COROFFS= 0
##$CY= -3
##$DATMOD= 1
##$DC= 0
##$DFILT= <>
##$DTYPP= 0
##$F1P= 0
##$F2P= 0
##$FCOR= 1
##$FTSIZE= 16384
##$FT_mod= 6
##$GAMMA= 0
##$GB= 0
##$INTBC= 1
##$INTSCL= 3.241238e-09
##$ISEN= 128
##$LB= 0.25
##$LEV0= 0
##$LPBIN= 0
##$MAXI= 10000
##$MC2= 0
##$MEAN= 0
##$ME_mod= 0
##$MI= 1.114404
##$NCOEF= 0
##$NC_proc= -5
##$NLEV= 6
##$NOISF1= 3.799351
##$NOISF2= 2.8
##$NSP= 0
##$NTH_PI= 0
##$NZP= 0
##$OFFSET= 15.5056
##$PC= 1
##$PHC0= -1361.838
##$PHC1= 13.64948
##$PH_mod= 1
##$PKNL= yes
##$PPARMOD= 0
##$PSCAL= 0
##$PSIGN= 0
##$REVERSE= no
##$SF= 200.130003223501
##$SI= 16384
##$SIGF1= 3
##$SIGF2= 2
##$SINO= 0.751879
##$SIOLD= 32768
##$SREGLST= <19F.Aceton>
##$SSB= 0
##$STSI= 16384
##$STSR= 0
##$SW_p= 3612.71676300578
##$SYMM= 0
##$S_DEV= 0
##$TDeff= 16384
##$TDoff= 0
##$TI= <>
##$TILT= no
##$TM1= 0
##$TM2= 0
##$TOPLEV= 0
##$USERP1= <user>
##$USERP2= <user>
##$USERP3= <user>
##$USERP4= <user>
##$USERP5= <user>
##$WDW= 1
##$XDIM= 16384
##$YMAX_p= 335803549
##$YMIN_p= -120243
$$ End of Bruker specific parameters
$$ ---------------------------------
##NTUPLES= NMR SPECTRUM
##VAR_NAME=  FREQUENCY,     SPECTRUM/REAL,   SPECTRUM/IMAG
##SYMBOL=    X,             R,               I
##VAR_TYPE=  INDEPENDENT,   DEPENDENT,       DEPENDENT
##VAR_FORM=  AFFN,          ASDF,            ASDF
##VAR_DIM=   16384,         16384,           16384
##UNITS=     HZ,            ARBITRARY UNITS, ARBITRARY UNITS
##FACTOR=    0.220516191357247, 1,           1
##FIRST=     3103.13577309633, 0,            0
##LAST=      -509.580989909449, 0,           0
##MIN=       -509.580989909449, -120243,     0
##MAX=       3103.13577309633, 335803549,    0
$$ Real data points
##PAGE= N=1
##DATA TABLE= (X++(R..R)), XYDATA
$$ [...]
6066a567L4750O214o508J0583M1080k5794k0111k5121l0359M3622J4890J1697
$$ -1567 33183 39397 32889 43472 84552 58758 38647 13526 -16833 26789 41679 53376
6054E3376M5257j4570j5112o470k0578k0537N792J0304M0633k8714L656J050q897
$$ 53376 98633 84063 68951 62481 41903 21366 27158 37462 78095 49381 53037 54087 45190
6041D5190K9639j5537j9702K009J4430m313k5044P939j3022J2927J9350K2183
$$ 45190 74829 59292 39590 41599 56029 51716 26672 34611 21589 34516 53866 76049
6029G6049l0023j4462L919N78l304M78L975j8707L3731K5135j3218j6292k2382
$$ 76049 46026 31564 35483 36061 32757 33235 37210 18503 52234 77369 64151 47859 25477
6016B5477K4071k326Q076J9040l9184Q582K7346L7014j3343q520l6334k916k021
$$ 25477 49548 47222 55298 74338 35154 43736 71082 108096 94753 86233 49899 46983 44962
6003D4962k112J6496j1974K932m282J1199k6051M3099k135P797j3624l463J0105
$$ 44962 42850 59346 47372 50304 46022 57221 31170 74269 72134 79931 66307 62844 72949
5990G2949r611j5049r634N7162K1615r188j5967j4267m208k3588q689M1331l9173
$$ 72949 63338 48289 38655 95817 117432 108244 92277 78010 73802 50214 41525 82856 43683
5977D3683K1262K2456r058O140Q548J6765p97q928J787J2970r370M931P412q322
$$ 43683 64945 87401 78343 84483 93031 109796 108999 100071 101858 114828 105458 110389 117801 109479
5963A09479J4598p8386J7940K6418P525J086j0479j2993J3919K3344j6374L924
$$ 109479 124077 45691 63631 90049 97574 98660 88181 75188 89107 112451 96077 100001
5951A00001L176K202J7709l203j0540l5149r836J8997J0704Q665o37l2620R785
$$ 100001 103177 105379 123088 119885 109345 74196 64360 83357 94061 102726 102089 69469 79254
5938G9254j3221J4430J1118k02r907q354q170n418J6846L6990r466o0243R991
$$ 79254 66033 80463 91581 91379 81472 73118 64948 59530 76376 113366 103900 43657 53648
5925E3648J1474j1642K8451k423j3554J3424n739j0311q319J6095k7433Q555L1819
$$ 53648 65122 53480 81931 79508 65954 79378 73639 63328 55009 71104 43671 52226 84045
5912H4045m153l1982m9806M611M7575j5648K3433J4512J2574j1703k534Q201j8823
$$ 84045 79892 47910 -1896 2715 50290 34642 58075 72587 85161 73458 70924 79125 60302
5899F0302l6460J0113N1950q687k9301J4481k3054l0066J3685L7876N887J7123
$$ 60302 23842 33955 85905 77218 47917 62398 39344 9278 22963 60839 66726 83849
5887H3849o432M481r487m4719K8406J5394o842j08L6317k5444o598Q647l7716
$$ 83849 77417 81898 72411 27692 56098 71492 64650 64542 100859 75415 68817 77464 39748
5874C9748j2211K0558J1030J880J659J915P372J7500J6036l2052k6077L2146K4526
$$ 39748 27537 48095 59125 61005 62664 64579 71951 89451 105487 73435 47358 79504 104030
5861A04030q202L6073j4940J1768k8713K0442k163N662l8809K8022N1969r560
$$ 104030 95828 131901 116961 128729 100016 120458 118295 123957 85148 113170 165139 155579
5849A55579m9290j5253M2979M014q379L0371j2879j2267M0226k5772J0567k718
$$ 155579 106289 91036 134015 138029 129650 160021 147142 134875 175101 149329 159896 157178
5837A57178k0289q456L70K2378p293j0001L9604j3796o874j71J375m035K080J9232
$$ 157178 136889 128433 128803 151181 143888 133887 173491 159695 152821 152650 154025 149990 152070 171302
5823A71302J7068J5856K0116j1414j501k9033N381J3709K163k8825j7812n281
$$ 171302 188370 204226 224342 212928 211427 182394 187775 201484 203647 174822 157010 151729
5811A51729m4873p252J1601K5279K0691L796n014j2809K1336l5498Q411j1282
$$ 151729 106856 99604 111205 136484 157175 160971 155957 143148 164484 128986 137397 126115
5799A26115R766L0415M332j6231m731J9983j199l9122j8747L9043M6548j7001
$$ 126115 135881 166296 170628 154397 149666 169649 168450 129328 110581 149624 196172 179171
5787A79171k6377j908k015L640J3698n1766k1650K1241L0264K0316J5191j9548
$$ 179171 152794 150886 148871 152511 166209 114443 92793 114034 144298 164614 179805 160257
5775A60257k6218K6995L725k0383m775R023k4243J6635n873P450L2499J5393k3568
$$ 160257 134039 161034 164759 144376 139601 148624 124381 141016 135143 142593 175092 190485 166917
5762A66917K3751q115J5672j7785p64M86K2088k569j3219j654K1325J558j5615
$$ 166917 190668 182553 198225 180440 179676 180162 202250 199681 186462 184808 206133 207691 192076
5749A92076j3873J8429j3803j0222J0528K3361L3680k8454j7402j1438J7194l266
$$ 192076 178203 196632 182829 172607 183135 206496 240176 211722 194320 182882 200076 196810
5737A96810m398J5208K6018j5840j5437j0376J3294K8579j0121k6375K7879L5659
$$ 196810 192412 207620 233638 217798 202361 191985 205279 233858 223737 197362 225241 260900
5725B60900j1158k1944O163J2589Q491M024L8641j5392k7901K1379J0752l8649
$$ 260900 249742 227798 233961 246550 255041 259065 297706 282314 254413 275792 286544 247895
5713B47895N941k938L940L3577j5418j4168J566M840K6893k7363j0354J8225L900
$$ 247895 253836 250898 254838 288415 272997 258829 260395 265235 292128 264765 254411 272636 276536
5700B76536Q415j4807j130L46L0965p173L041o470j3244J3871j4416J0099K8999
$$ 276536 284951 270144 269014 269360 300325 293152 296193 289723 276479 290350 275934 286033 315032
5687C15032j5722j6869N378M237O061n0576j7453K6513L663J3243o860j3611J1241
$$ 315032 299310 282441 287819 292056 298117 247541 230088 256601 260264 273507 266647 253036 264277
5674B64277k3648Q551L4132j4582l5231K695o068k817r739M4491K0241j8784K0998
$$ 264277 240629 249180 283312 268730 233499 236194 230126 227309 217570 262061 282302 263518 284516
5661B84516j850o688o433O406L060l664j0095j0104P367Q887k3485M44M3024l5302
$$ 284516 282666 275978 269545 275951 279011 275347 265252 255148 262515 271402 247917 248361 291385 256083
5647B56083r16J515J738L4256k2424j8513j2705P156Q897j6906K5506J5636J2472
$$ 256083 255167 256682 258420 292676 270252 251739 239034 246190 255087 238181 263687 279323 291795
5634B91795J1295l5084M510l3044R324m968K3448j5121k89J2324J7849l0373p142
$$ 291795 303090 268006 272516 239472 248796 243828 267276 252155 251866 264190 282039 251666 244524
5621B44524L4247j3624L945J2659J6669j437j1059j9422Q987J0977l1581k0718
$$ 244524 278771 265147 269092 281751 298420 296983 285924 266502 275489 286466 254885 234167
5609B34167Q790J9929Q468K6470K0678K4137K4822O453k1680l2647m94M932J7190
$$ 234167 242957 262886 271354 297824 318502 342639 367461 373914 352234 319587 319093 324025 341215
5596C41215j4673J0349K3470k0344k6504k8206J6439L7715Q954P710K5020k0268
$$ 341215 326542 336891 360361 340017 313513 285307 301746 339461 348415 356125 381145 360877
5584C60877j5908N949L675N4559R015k9989p838l2840M1972N2053r481j0604k7106
$$ 360877 344969 350918 354593 409152 418167 388178 380340 347500 389472 441525 432044 421440 394334
5571C94334K0942l166J7344L483L3156p952j0451J553q7L2206M315k222k4290
$$ 394334 415276 412110 429454 432937 466093 458141 447690 449243 449156 481362 485677 483455 459165
5558D59165K6779J8574R399N0773M170k9546L473n321L893k493m3799L0423L3548
$$ 459165 485944 504518 513917 564690 568860 539314 542787 537466 541359 538866 495067 525490 559038
5545E59038j1473j6495l763K2475J4125K685j099J2467K9106P460K842K5424J7718
$$ 559038 547565 531070 527307 549782 563907 566592 565493 577960 607066 614526 617368 642792 660510
5532F60510j5528L4584n909k1295J0291N172J9828Q543m016N433J9942L1j6319
$$ 660510 644982 679566 673657 652362 662653 667825 687653 696196 692180 697613 717555 717586 701267
5519G01267J7541K1581K3063r364q64j1475p602J9492N4129j223J610M6565k138
$$ 701267 718808 740389 763452 754088 753224 741749 734147 753639 807768 806545 808155 854720 852582
5506H52582O2644l5612k722K4648o933N2738J9721j6443K7597L2369O4970L9912
$$ 852582 915226 879614 876892 901540 894607 947345 967066 950623 978220 1010589 1075559 1115471
5494A115471L177J2184L6490M2118O1193m229K3663L3088L9859L6108M5389M0071
$$ 1115471 1118648 1130832 1167322 1209440 1270633 1266404 1290067 1323155 1363014 1399122 1444511 1484582
5482A484582O6762Q2798N5123N5374K7585L6284P6676J14924P6185O1502R1853
$$ 1484582 1551344 1634142 1689265 1744639 1772224 1808508 1885184 2000108 2076293 2137795 2229648
5471B229648J18304R0271J08305R1714J26598J32649J42982J35547J69170J92982
$$ 2229648 2347952 2438223 2546528 2638242 2764840 2897489 3040471 3176018 3345188 3538170
5461C538170J85666K21278K47627K47470L21366K94872L58482L29827L37340L60368
$$ 3538170 3723836 3945114 4192741 4440211 4761577 5056449 5414931 5744758 6082098 6442466
5451F442466L38486K94423K64675K42015J79771J90368J72764J68615J29969J75459
$$ 6442466 6780952 7075375 7340050 7582065 7761836 7952204 8124968 8293583 8423552 8599011
5441H599011J55481J91877K39008K35866K28291K99513L38576M03654M06288L95965
$$ 8599011 8754492 8946369 9185377 9421243 9649534 9949047 10287623 10691277 11097565 11493530
5431A1493530M52799M42264M54417M58865M75258N02751M70188M94906M58538
$$ 11493530 11946329 12388593 12843010 13301875 13777133 14279884 14750072 15244978 15703516
5422A5703516M12464L41845K63578K47151J78813J07767J21013J27018P8660J57663
$$ 15703516 16115980 16457825 16721403 16968554 17147367 17255134 17376147 17503165 17581825 17739488
5412A7739488J46491K02101K52453L25608L75793M07004M93930N29439N11894
$$ 17739488 17885979 18088080 18340533 18666141 19041934 19448938 19942868 20472307 20984201
5403B0984201N53665N53141N36773M84561M15868L22343K72099J88147R5172J0398
$$ 20984201 21537866 22091007 22627780 23112341 23528209 23850552 24122651 24310798 24405970 24416368
5393B4416368n2483p6479j06008j42398j23506j03581m4515J4931J2940J29844
$$ 24416368 24363885 24287406 24181398 24039000 23915494 23811913 23767398 23782329 23795269 23925113
5383B3925113J20904J75693K13520K57850K61048K35469K67336K81415K64441
$$ 23925113 24046017 24221710 24435230 24693080 24954128 25189597 25456933 25738348 26002789
5374B6002789K37093J82260J87534P6304m3584j03100j58932j91368k56228l46199
$$ 26002789 26239882 26422142 26609676 26685980 26642396 26539296 26380364 26188996 25932768 25586569
5364B5586569m00769l88653l66783m04568l28801k69645k12154j69670r0022k9011
$$ 25586569 25185800 24797147 24430364 24025796 23696995 23427350 23215196 23045526 22955504 22926493
5354B2926493l1660R461L0552k7854m9862r7977j30159k03471k83434l54694m30370
$$ 22926493 22894833 22904294 22934846 22906992 22857130 22759153 22628994 22425523 22142089 21787395 21357025
5343B1357025m80633n36516n62267n65424o27129n89081n24235n14366m87380
$$ 21357025 20876392 20339876 19777609 19212185 18585056 17995975 17471740 16957374 16469994
5334A6469994m67757l86552m08361l96743l71347l10214l05027k60709k20607
$$ 16469994 16002237 15615685 15207324 14810581 14439234 14129020 13823993 13563284 13342677
5325A3342677k65503k18592k27368j97024j66034k35650k38586k77316l27256
$$ 13342677 13077174 12858582 12631214 12434190 12268156 12032506 11793920 11516604 11189348
5316A1189348l45032l54554l97065m48929m24503m28862m76080m43391m12934
$$ 11189348 10844316 10489762 10092697 9643768 9219265 8790403 8314323 7870932 7457998
5307G457998l26740l12708l16993k82559k50756k58756k75422k35954k10503j98262
$$ 7457998 7131258 6818550 6501557 6218998 5968242 5709486 5434064 5198110 4987607 4789345
5297D789345j47262j56781j41078j94715j49413j46921j03733j11823j39843q9809
$$ 4789345 4642083 4485302 4344224 4149509 4000096 3853175 3749442 3637619 3497776 3407967
5287C407967j17270r5345o8373r2014r1892o0680o3385q0266r3748o3189o9418
$$ 3407967 3290697 3195352 3126979 3034965 2943073 2882393 2819008 2738742 2644994 2581805 2512387
5276B512387m6514n5997l1990q7554k4861m3569n6103n0977n3406p4700j7936
$$ 2512387 2465873 2409876 2377886 2290332 2265471 2221902 2165799 2114822 2061416 1986716 1968780
5265A968780l8931n6322j5829l0554k2282m4804l5604p2557p733j2901M760m4004
$$ 1968780 1929849 1873527 1857698 1827144 1804862 1760058 1724454 1651897 1644164 1631263 1636023 1592019
5253A592019m0174Q338j9914l5204m4507j6070q734m6768o4237k8775L598L170
$$ 1592019 1551845 1560183 1540269 1505065 1460558 1444488 1435754 1388986 1324749 1295974 1299572 1302742
5241A302742k742j1759j6190l2476o952j2725j5650q817o420m3192k3060J6381
$$ 1302742 1300000 1288241 1272051 1239575 1232623 1219898 1204248 1195431 1189011 1145819 1122759 1139140
5229A139140l5465l9568K0278P217k7988k7161j9660k7106j2546l765M2067k1828
$$ 1139140 1103675 1064107 1084385 1091602 1063614 1036453 1016793 989687 977141 973376 1015443 993615
5217I93615o739r877j3005n974k0311p71K116m088m754J4207j2479k5628m6102
$$ 993615 986876 976999 963994 958020 937709 936938 939054 934966 930212 944419 931940 906312 860210
5204H60210o51L0442k0388k239J5804k4859O216k7865K940K3865o950p989j4561
$$ 860210 859559 890001 869613 867374 883178 858319 864535 836670 839610 863475 856525 848536 833975
5191H33975j5662J7599j3585J6447j7039k2196L4204j835K1472j3761l3364R565
$$ 833975 818313 835912 822327 838774 821735 799539 833743 831908 853380 839619 806255 815820
5179H15820k9639J7466m244m7329L3568J8832k759j1610j4232N758J6001k8893
$$ 815820 786181 803647 799403 752074 785642 804474 801715 790105 775873 781631 797632 768739
5167G68739k0418J3702M042K0906K351k7500m045N1450o040R364J7824j7782J1343
$$ 768739 748321 762023 766065 786971 789322 761822 757777 809227 803187 812551 830375 812593 823936
5154H23936k0038Q05J9897j7290J3389J5065J1475J275J2031l0536q031J8205
$$ 823936 803898 804703 824600 807310 820699 835764 847239 848514 860545 830009 821978 840183
5142H40183K4129J972k6070M7431L05m085j2076J8990J3809M5977J3450L1965
$$ 840183 864312 866284 840214 887645 887950 883865 871789 890779 904588 950565 964015 995980
5130I95980K1143j9827M2441q678N435K279L9747K7500K862m778M0839L6595J7113
$$ 995980 1017123 997296 1039737 1031059 1036494 1038773 1078520 1106020 1108882 1104104 1144943 1181538 1198651
5117A198651K8046K2973J4125L5079J6486L9452L7717L7770L1894K1552j8478
$$ 1198651 1226697 1249670 1263795 1298874 1315360 1354812 1392529 1430299 1462193 1483745 1465267
5106A465267J01448O5213M2M0891L4649O0948P2926Q0344K9181M8755R2541R5155
$$ 1465267 1566715 1631928 1631970 1672861 1707510 1768458 1841384 1921728 1950909 1999664 2092205 2187360
5094B187360N9252O9784P8237N8320J03012J06431J39667J36956J44638J44651
$$ 2187360 2246612 2316396 2394633 2452953 2555965 2662396 2802063 2939019 3083657 3228308
5084C228308J45048J64856J69821J66115J78674K03660K73149K56238K54448L18059
$$ 3228308 3373356 3538212 3708033 3874148 4052822 4256482 4529631 4785869 5040317 5358376
5074E358376L10832L02091K89065L18860L01153K85557K63341K45692J92740J89450
$$ 5358376 5669208 5971299 6260364 6579224 6880377 7165934 7429275 7674967 7867707 8057157
5064H057157J51802J38600P3430Q7668J15047J54544J05302J56121J61492J74983
$$ 8057157 8208959 8347559 8420989 8508657 8623704 8778248 8883550 9039671 9201163 9376146
5054I376146K03589K19377K40219K56906K89147L22087L63770L78581M20215M77629
$$ 9376146 9579735 9799112 10039331 10296237 10585384 10907471 11271241 11649822 12070037 12547666
5044A2547666N12120N22076N50437O19385N83034O65420O16036N69767N52445
$$ 12547666 13059786 13581862 14132299 14751684 15334718 16000138 16616174 17185941 17738386
5035A7738386M78703L68856K85509J98240J01281M4225M3429l7296l0327N852
$$ 17738386 18217089 18585945 18871454 19069694 19170975 19215200 19258629 19221333 19191006 19196858
5025A9196858j5915K206M2363P4705J32044J38360J23897J62267J57249J70912
$$ 19196858 19180943 19183149 19225512 19300217 19432261 19570621 19694518 19856785 20014034 20184946
5015B0184946J31608K18429J99646K39310K94015L11413L48527L50805L62056
$$ 20184946 20316554 20534983 20734629 20973939 21267954 21579367 21927894 22278699 22640755
5006B2640755L73619L59262L70467L19689K58108J75596Q7112K483k7460j05716
$$ 22640755 23014374 23373636 23744103 24063792 24321900 24497496 24584608 24587091 24559631 24453915
4996B4453915j91605j62402j54228j84981j38819r2508j6994m610P73K4512k4564
$$ 24453915 24262310 24099908 23945680 23760699 23621880 23529372 23512378 23507768 23508541 23533053 23508489
4985B3508489m7873j06521j79283j92152k58739k45374k77521k90995k82772k62285
$$ 23508489 23460616 23354095 23174812 22982660 22723921 22478547 22201026 21910031 21627259 21364974
4975B1364974k45478k36014j82652j96420j62381j77923j85983j86210j97456
$$ 21364974 21119496 20883482 20700830 20504410 20342029 20164106 19978123 19791913 19594457
4966A9594457k28912k08176k11687j64455j64166j67282j25398r0101m5496n1173
$$ 19594457 19365545 19157369 18945682 18781227 18617061 18449779 18324381 18234280 18188784 18137611
4956A8137611l4761n6393n8567j11379j78525j92597k80519l89021m24861n01520
$$ 18137611 18102850 18046457 17987890 17876511 17697986 17505389 17224870 16835849 16410988 15909468
4946A5909468n33257n45229n08430n35879m83029m61032m10353l96421l87223
$$ 15909468 15376211 14830982 14322552 13786673 13303644 12842612 12432259 12035838 11648615
4937A1648615l53748l43984k84531k37968k29261k09367j93674j67504j29321
$$ 11648615 11294867 10950883 10666352 10428384 10199123 9989756 9796082 9628578 9499257
4928I499257j35426j19714j08086j30161j35210q9997o6051j08247j40000j32615
$$ 9499257 9363831 9244117 9136031 9005870 8870660 8780663 8714612 8606365 8466365 8333750
4918H333750j74948k03036k16344k84187k78295k91401k95647k64983k83868l16535
$$ 8333750 8158802 7955766 7739422 7455235 7176940 6885539 6589892 6324909 6041041 5724506
4908E724506k78780k30660k33926j98788j70952j73772j87737j40865j19785j01596
$$ 5724506 5445726 5215066 4981140 4782352 4611400 4437628 4249891 4109026 3989241 3887645
4898C887645j22532j27348q5020j01516n9442j02898r2928p6579j09315p7142
$$ 3887645 3765113 3637765 3552745 3451229 3391787 3288889 3195961 3119382 3010067 2932925
4888B932925r7789p8179n5654q3554n2203n2478m4353j06252k4265l3061o7630
$$ 2932925 2835136 2756957 2701303 2617749 2565546 2513068 2468715 2362463 2338198 2305137 2237507
4877B237507m2091r7746o4031k7978k4923o1047k6072l4588j4521j9166p4712
$$ 2237507 2195416 2097670 2033639 2005661 1980738 1919691 1893619 1859031 1844510 1825344 1750632
4866A750632l9946K843j1587j6554m8673j1235m4006o6060l3082p18j6999l3315
$$ 1750632 1710686 1713529 1701942 1685388 1636715 1625480 1581474 1515414 1482332 1481614 1464615 1431300
4854A431300j9564O859k9100j7976l0641k619N273j6967m1061j5387m5516l2301
$$ 1431300 1411736 1418595 1389495 1371519 1340878 1338259 1343532 1326565 1285504 1270117 1224601 1192300
4842A192300J9674k4760j2263j2412k7068M2512l4223j5716l8828k5114l389j5667
$$ 1192300 1211974 1187214 1174951 1162539 1135471 1177983 1143760 1128044 1089216 1064102 1060713 1045046
4830A045046k8095j416j3510k8798j1159O451m9193k292M0178J2660m5082l0818
$$ 1045046 1016951 1015535 1002025 973227 962068 968519 919326 917034 957212 969872 924790 893972
4818H93972P574k0070K3455k7817k5988j120k1104J5743j68m9553j5418k2633
$$ 893972 901546 881476 904931 877114 851126 850006 828902 844645 844477 794924 779506 756873
4806G56873j2146k6089N4190l8385r962J5104l3691P262j0025j2838j5625k8715
$$ 756873 744727 718638 772828 734443 724481 739585 705894 713156 703131 690293 674668 645953
4794F45953J3053r072j2627k7819J6214r074K751o077P898P454k7423j2793K8013
$$ 645953 659006 649934 637307 609488 625702 616628 619379 613302 621200 628654 601231 588438 616451
4781F16451m139j1542p140L360L218k2160n564j3997m684l085j607k5095J9694
$$ 616451 612312 600770 593630 596990 600208 578048 572484 558487 553803 550718 549111 524016 543710
4768E43710j2475M045L159N20o613K4907p115l6617J7790J9091J381P77m875L9674
$$ 543710 531235 535280 538439 538959 532346 557253 550138 513521 531311 550402 551783 552560 547685 587359
4754E87359K0235r684J2873J3335j6831r10L937P202J8770K9975N0890M9334P1079
$$ 587359 607594 597910 610783 624118 607287 606377 610314 617516 636286 666261 717151 766485 837564
4741H37564O3754N9952M3951P0785J10130K7536q1982r1339j04012n5914p9632
$$ 837564 901318 961270 1005221 1076006 1186136 1213672 1131690 1040351 936339 880425 800793
4730H00793k0772m7753m7267l3806l7818J1324k0655j7488K0434l7415J219L344
$$ 800793 780021 732268 685001 651195 613377 624701 604046 586558 606992 569577 570796 574140
4718E74140J9687K622j8615j6123j6253m434j0352j3557j307L908j6970K1874
$$ 574140 593827 596449 577834 561711 545458 541024 530672 517115 515808 519716 502746 524620
4706E24620p265K57L4165j6006K210j1082L186j296K0J9381j8091j0244M762K3163
$$ 524620 517355 517612 551777 535771 537981 526899 530085 528789 528809 548190 530099 519855 524617 547780
4692E47780N988O599l578j646k7346J4832j7098K0076r743L326J40k5319K0777
$$ 547780 553768 560367 556789 555143 527797 542629 525531 545607 535864 539190 539330 514011 534788
4679E34788J116l956k0208M3855L9553l5264j3601L818J4898K750R452k9552J5538
$$ 534788 535904 531948 511740 555595 595148 559884 546283 550101 564999 567749 577201 547649 563187
4666E63187K7717k9114N577N724R352m270Q118P23q788K7934M1366K3626j7242
$$ 563187 590904 561790 567367 573091 582443 578173 586291 587014 578226 606160 647526 671152 653910
4653F53910l6860J6176J3188K0416j0408L119P907j2808j9671m913L4910l5234
$$ 653910 617050 633226 646414 666830 656422 659541 667448 654640 634969 630056 664966 629732
4641F29732N884J2750j3588L70M0717J6394K8466P731j6605j4380R548J1181o274
$$ 629732 635616 648366 634778 635148 675865 692259 720725 728456 711851 697471 707019 718200 711926
4628G11926K8301K7675L1518J9416j450q43M5608M825n182j5130k3298P8059K1946
$$ 711926 740227 767902 799420 818836 817386 816543 862151 866976 861794 846664 823366 901425 923371
4615I23371K659L0692J2465K0344O036P733J4746L0295K5429L4577M0700N8431
$$ 923371 926030 956722 969187 989531 995567 1003300 1018046 1048341 1073770 1108347 1149047 1207478
4603A207478N9225l650k7502J9119N0701N0055J8299M3088L7361J3149N0174M1869
$$ 1207478 1266703 1263053 1235551 1254670 1305371 1355426 1373725 1416813 1454174 1467323 1517497 1559366
4591A559366N5645N7288N3056P3672L7472L3664O5577L0814P6593J06421N8726
$$ 1559366 1615011 1672299 1725355 1799027 1836499 1870163 1935740 1966554 2043147 2149568 2208294
4580B208294J03699R9178M4673R9026J48429J16437P9408J08057J70192J67603
$$ 2208294 2311993 2411171 2455844 2554870 2703299 2819736 2899144 3007201 3177393 3344996
4570C344996J53273J66713J64579J98185J69822K22494K79280K51952K49480K96078
$$ 3344996 3498269 3664982 3829561 4027746 4197568 4420062 4699342 4951294 5200774 5496852
4560E496852L34455L50519L72617L74471M55249M87816N06916N59160N90844O78084
$$ 5496852 5831307 6181826 6554443 6928914 7384163 7871979 8378895 8938055 9528899 10206983
4550A0206983O91700P18385P58820Q28625Q61065P95172Q52421Q00506P12291
$$ 10206983 10898683 11617068 12375888 13204513 14065578 14860750 15713171 16513677 17225968
4541A7225968N60455L54759J90693K383k56435m59307n87653p07211q04480q12946
$$ 17225968 17786423 18141182 18331875 18334258 18077823 17618516 17030863 16323652 15519172 14706226
4531A4706226p96846p72748p74103p33916o85913o75593n77478n27775n01389
$$ 14706226 13909380 13136632 12362529 11628613 10942700 10267107 9689629 9161854 8660465
4522H660465m91222m55887m14488l64647l51845l05620l00556k70230k60358k51455
$$ 8660465 8169243 7713356 7298868 6934221 6582376 6276756 5976200 5705970 5445612 5194157
4512E194157k19672k35558j94469j87391j38728j83767j29967j37316j26253j36870
$$ 5194157 4974485 4738927 4544458 4357067 4218339 4034572 3904605 3767289 3641036 3504166
4502C504166j40928j20049r9934r7008j34419q5143n4036q3783j04390n7507n8473
$$ 3504166 3363238 3243189 3143255 3046247 2911828 2826685 2772649 2688866 2584476 2526969 2468496
4491B468496o6544n3187o2811n2379m5151m8810n4300n4951m6050k6076k6252
$$ 2468496 2401952 2348765 2285954 2233575 2188424 2139614 2085314 2030363 1984313 1958237 1931985
4480A931985l4305j5227k2528m0173o7415l8679l1179j2181k9338j7503o8501
$$ 1931985 1897680 1882453 1859925 1819752 1752337 1713658 1682479 1670298 1640960 1623457 1554956
4469A554956k8870j2138j9338m129o7353k8290N007j5870k2820k5618j0811r620
$$ 1554956 1526086 1513948 1494610 1490481 1423128 1394838 1399845 1383975 1361155 1335537 1324726 1315106
4457A315106o0150k4068j7644K9396k871l7684M413j4092J5540k8799O977k779
$$ 1315106 1254956 1230888 1213244 1242640 1239769 1202085 1206498 1192406 1207946 1179147 1186124 1183345
4445A183345k1696k947l631j5375L104k5831r583K3057J6807k0140l0733j5881
$$ 1183345 1161649 1158702 1155071 1139696 1142800 1116969 1107386 1130443 1147250 1127110 1096377 1080496
4433A080496l144p506l7259K0904k5599k846l713K8054j4217l899k9980r684R579
$$ 1080496 1077352 1069846 1032587 1053491 1027892 1025046 1021333 1049387 1035170 1031271 1001291 991607 1001186
4420A001186l063J6019m7175j4776L6066K3888K6979J062j4131r884k3377J045
$$ 1001186 998123 1014142 966967 952191 988257 1012145 1039124 1040186 1026055 1016171 992794 993839
4408I93839M0134J7863J3795J3520k7518j4062J6120o508M315L5172p535N03k298
$$ 993839 1033973 1051836 1065631 1079151 1051633 1037571 1053691 1047183 1051498 1086670 1079135 1079638 1077340
4395A077340R49J448Q36m2735P527L1119N03p561j0485q760K4291L9105J4651
$$ 1077340 1078289 1079737 1080573 1037838 1045365 1076484 1076987 1069426 1058941 1050181 1074472 1113577 1128228
4382A128228l7459p836j460K7152M4615n579J9535M788K4647J6035q147M2699
$$ 1128228 1090769 1082933 1081473 1108625 1153240 1147661 1167196 1171984 1196631 1212666 1204519 1247218
4370A247218Q647j4220N000N5038N6313k256L2178K727M8930L3466r465J1846
$$ 1247218 1255865 1241645 1246645 1301683 1357996 1355740 1387918 1390645 1439575 1473041 1463576 1475422
4358A475422N6402P1698N774N3181N8737J7704O1784M7039M1602R5635M6011N4346
$$ 1475422 1531824 1603522 1609296 1662477 1721214 1738918 1800702 1847741 1889343 1984978 2030989 2085335
4346B085335P7611Q0494R1730N7836J16108R6384Q8959J50013J30699J33576J86170
$$ 2085335 2162946 2243440 2335170 2393006 2509114 2605498 2694457 2844470 2975169 3108745 3294915
4335C294915J97015J88980K33996J93693J86716K59755K64358K61227K88878K69905
$$ 3294915 3491930 3680910 3914906 4108599 4295315 4555070 4819428 5080655 5369533 5639438
4325E639438L14167L59182L74246M04505M79076N02624N16984N54142N51211N47538
$$ 5639438 5953605 6312787 6687033 7091538 7570614 8073238 8590222 9144364 9695575 10243113
4315A0243113N39796M67155N12617M85950M76174N18878N63279O59690P43453
$$ 10243113 10782909 11250064 11762681 12248631 12724805 13243683 13806962 14466652 15210105
4306A5210105Q04084Q76636R41930R67138Q77446Q02467O36481M31993L37059
$$ 15210105 16014189 16890825 17832755 18799893 19677339 20479806 21116287 21548280 21885339
4297B1885339K54044K58373K95752L26733M15145N31281O71552P65717P02122
$$ 21885339 22139383 22397756 22693508 23020241 23435386 23966667 24638219 25403936 26106058
4288B6106058O56412N42284K88990M0831j95518l74791l96570m07477l19755k08489
$$ 26106058 26762470 27304754 27593744 27634575 27439057 27064266 26667696 26260219 25940464 25731975
4278B5731975j01011N831J28302J54259J43244Q2669r6499l24764m73521o08588
$$ 25731975 25630964 25636795 25765097 25919356 26062600 26145269 26048770 25724006 25250485 24641897
4268B4641897o92643p08612o58332n94752m55431l77376l38949j92851j31348
$$ 24641897 23949254 23240642 22582310 21987558 21532127 21154751 20815802 20622951 20491603
4259B0491603j12021j14801j30004j72036k10749k23257k31506j89284j74163
$$ 20491603 20379582 20264781 20134777 19962741 19751992 19528735 19297229 19107945 18933782
4250A8933782j14045j47679j06249o1676m0658J7587N357L8608J05148J52848
$$ 18933782 18819737 18672058 18565809 18504133 18463475 18481062 18486419 18525027 18630175 18783023
4240A8783023J44641J39240J49512Q6806J36747J30255J23989J09928J56233K25574
$$ 18783023 18927664 19066904 19216416 19303222 19439969 19570224 19694213 19804141 19960374 20185948
4230B0185948K40463K74384L25127L91174M26551M48427M66509N14076N03086
$$ 20185948 20426411 20700795 21025922 21417096 21843647 22292074 22758583 23272659 23775745
4221B3775745N01574M31888L10962K77352K14051J23968L9264Q528m1936l7603
$$ 23775745 24277319 24709207 25020169 25297521 25511572 25635540 25674804 25683332 25641396 25603793
4211B5603793o0426m6767J174k078P1797R7395K01333K12029K42282L11824K68039
$$ 25603793 25543367 25496600 25497774 25495696 25567493 25664888 25866221 26078250 26320532 26632356 26900395
4200B6900395K71113K93149K17867J91476J67350M5558j27026j82107k21776k75094
$$ 26900395 27171508 27464657 27682524 27874000 28041350 28086908 27959882 27777775 27555999 27280905
4190B7280905l17302k62693k69319l41623l52217l33900l25960l99385l89060
$$ 27280905 26963603 26700910 26431591 26089968 25737751 25403851 25077891 24678506 24289446
4181B4289446l33446l04999l02223l28013k55627k32157k54613j81057j11680
$$ 24289446 23956000 23651001 23348778 23020765 22765138 22532981 22278368 22097311 21985631
4172B1985631j10725O062j1618L5490J09345P8048P8158n925p7697j91632k85654
$$ 21985631 21874906 21880968 21869350 21904840 22014185 22092233 22170391 22164466 22086769 21895137 21609483
4161B1609483l94957m82190n87983n86506n99432n87167n74662n76868m89338
$$ 21609483 21214526 20732336 20144353 19557847 18958415 18371248 17796586 17219718 16730380
4152A6730380m67342l98074m29104l78716l95092l64773l50296k97499l30526
$$ 16730380 16263038 15864964 15435860 15057144 14662052 14297279 13946983 13649484 13318958
4143A3318958l17922k85796k73806k13557k47840k53507j94514j58144j70268
$$ 13318958 13001036 12715240 12441434 12227877 11980037 11726530 11532016 11373872 11203604
4134A1203604j52911j25354o9206p7080p1412n9069j1676m5448j03072p4492o9533
$$ 11203604 11050693 10925339 10856133 10779053 10707641 10648572 10636896 10591448 10488376 10413884 10344351
4123A0344351q6879j25774j00526o6406r5335p6066r3909q0860q5278j36321j90516
$$ 10344351 10257472 10131698 10031172 9964766 9869431 9793365 9699456 9618596 9533318 9396997 9206481
4112I206481j84712k16650k23980k07891k72217k46472k33687j94541k00066k13447
$$ 9206481 9021769 8805119 8581139 8373248 8101031 7854559 7620872 7426331 7226265 7012818
4102G012818k13591k01619j38965j48211j45639j08257j09720r4577n3696o1638
$$ 7012818 6799227 6597608 6458643 6310432 6164793 6056536 5946816 5852239 5798543 5736905
4092E736905o0389m7040m1482l0461M371j0163q268l7319j6682L2878R060R357
$$ 5736905 5676516 5629476 5587994 5557533 5561904 5551741 5543473 5506154 5489472 5522350 5531410 5540767
4080E540767r201K5047K6944m104Q7579K6606J5359R4856P4006Q5558J17913J27647
$$ 5540767 5531566 5556613 5583557 5579453 5667032 5693638 5708997 5803853 5877859 5963417 6081330 6208977
4068F208977J15926J37380J21340J34864J67887J34732J95930J72508J59173J89180
$$ 6208977 6324903 6462283 6583623 6718487 6886374 7021106 7217036 7389544 7548717 7737897
4058G737897J93797J73671K58715K40432K46794K60835K30231J94256J49018J36019
$$ 7737897 7931694 8105365 8364080 8604512 8851306 9112141 9342372 9536628 9685646 9821665
4048I821665Q1016O0141R4126J03331J20509J26289J67768J75651K10314K11083
$$ 9821665 9902681 9962822 10056948 10160279 10280788 10407077 10574845 10750496 10960810 11171893
4038A1171893J84169K16882K12268K43038J98483J78883J54732J60696J43204
$$ 11171893 11356062 11572944 11785212 12028250 12226733 12405616 12560348 12721044 12864248
4029A2864248J55852J49767J51433K14694K38858K49885K86842K80924L75601
$$ 12864248 13020100 13169867 13321300 13535994 13774852 14024737 14311579 14592503 14968104
4020A4968104M03292M24645M76064M74158M67406N24328N26356N27311N44712
$$ 14968104 15371396 15796041 16272105 16746263 17213669 17737997 18264353 18791664 19336376
4011A9336376N26806N32564M83665N35130M62979M28222M26891L61848L16377
$$ 19336376 19863182 20395746 20879411 21414541 21877520 22305742 22732633 23094481 23410858
4002B3410858K28015J67397J64048Q6856Q4444M8682N4139P5004O1018J20167
$$ 23410858 23638873 23806270 23970318 24057174 24141618 24190300 24244439 24319443 24380461 24500628
3992B4500628J32643J77831K36778K38140K91664M00497L87412M27966M43851
$$ 24500628 24633271 24811102 25047880 25286020 25577684 25978181 26365593 26793559 27237410
3983B7237410M62588M86988M78898M80437N24495M65096M43599M34137L24146
$$ 27237410 27699998 28186986 28665884 29146321 29670816 30135912 30579511 31013648 31337794
3974C1337794K48222J99040J33944R7563l2017j31830j32798j78241j66658j86193
$$ 31337794 31586016 31785056 31919000 32016563 31984546 31852716 31719918 31541677 31375019 31188826
3964C1188826j47995j06010j01285o4226m2862M781L151Q007Q543k7852m8349
$$ 31188826 31040831 30934821 30833536 30769310 30726448 30731229 30734380 30742387 30750930 30723078 30674729
3953C0674729o0007o6024p1153q5769r0248n2189j9026L4471P7819J76265K49254
$$ 30674729 30614722 30548698 30477545 30391776 30301528 30249339 30230313 30264784 30342603 30518868 30768122
3942C0768122L37884M85033O31725P24185Q51410R78543J095200J274731J426454
$$ 30768122 31106006 31591039 32222764 32946949 33798359 34776902 35872102 37146833 38573287
3933C8573287J644811J764809J996712K286847K458515K641902K770896K801690
$$ 38573287 40218098 41982907 43979619 46266466 48724981 51366883 54137779 56939469
3925E6939469K739383K567961K260138J883415J345711Q66556M49534N3983k67427
$$ 56939469 59678852 62246813 64506951 66390366 67736077 68602633 69052167 69106150 68838723
3916F8838723m01514n26250m18736l73850k35327o9927r8304j61439l64140o33629
$$ 68838723 68437209 67910959 67492223 67118373 66883046 66813119 66714815 66553376 66189236 65555607
3906F5555607j012144j431046j883756k252492k600891k813629k991931l025697
$$ 65555607 64543463 63112417 61228661 58976169 56375278 53561649 50569718 47544021
3898D7544021l010210k861923k726909k534885k306702k124059j942820j749435
$$ 47544021 44533811 41671888 38944979 36410094 34103392 31979333 30036513 28287078
3890B8287078j613904j413965j340550j237914j143475j032303r40719q68558
$$ 28287078 26673174 25259209 23918659 22680745 21537270 20504967 19564248 18695690
3882A8695690p96631p62043o59753o50154n97285o22140n56579m82541m89717
$$ 18695690 17899059 17137016 16477263 15827109 15229824 14607684 14051105 13568564 13078847
3873A3078847m69721m33739l85991l27413l71268l47270k90022k76675k41451
$$ 13078847 12609126 12175387 11789396 11461983 11090715 10743445 10453423 10176748 9935297
3864I935297k60849k65163j89200j99905k11815j83476j96623j53716j87430j34804
$$ 9935297 9674448 9409285 9220085 9020180 8808365 8624889 8428266 8274550 8087120 7952316
3854G952316j11475j79686j52745j08279j06458j28096j26145j09927j19791j06224
$$ 7952316 7840841 7661155 7508410 7400131 7293673 7165577 7039432 6929505 6809714 6703490
3844F703490q7019o3969m5105p3566r2748o8661p4887r2293m6230n7237r8596
$$ 6703490 6616471 6552502 6507397 6433831 6341083 6272422 6197535 6105242 6059012 6001775 5903179
3833E903179m9246n9168m1651m6502m2851j0746p0763r685J2484l6413m8900k6789
$$ 5903179 5853933 5794765 5753114 5706612 5663761 5653015 5582252 5572567 5585051 5548638 5499738 5472949
3821E472949j2002P629O060K152J1743K1784L9465L1736Q3630L9650L4197N8972
$$ 5472949 5460947 5468576 5474636 5476788 5488531 5510315 5549780 5581516 5665146 5704796 5738993 5797965
3809E797965Q1006Q0076P0493O3130R0432J36780Q9555J25586J34866J26946J22738
$$ 5797965 5878971 5959047 6029540 6092670 6183102 6319882 6409437 6535023 6669889 6796835 6919573
3798F919573J69685J64871K12663J72885J95388J98506K28110K30870K12455K37244
$$ 6919573 7089258 7254129 7466792 7639677 7835065 8033571 8261681 8492551 8705006 8942250
3788H942250K52787K58731K80510L02578L36496L33732L71147L86346M52495M87483
$$ 8942250 9195037 9453768 9734278 10036856 10373352 10707084 11078231 11464577 11917072 12404555
3778A2404555N09469N43041O13804N91229N73952N44499M66204L86143K52156
$$ 12404555 12914024 13457065 14070869 14662098 15236050 15780549 16246753 16632896 16885052
3769A6885052J08467n100j61882k05109k61055l13984k85488l02247k25578j93321
$$ 16885052 16993519 16988419 16826537 16621428 16360373 16046389 15760901 15458654 15233076 15039755
3759A5039755j54542p3874P673N8726R5875J02410J89429K43613L00874L78323
$$ 15039755 14885213 14811339 14819012 14877738 14973613 15076023 15265452 15509065 15809939 16188262
3749A6188262M17502M83543N48556O39559P52299P72923R01445R78345J115895
$$ 16188262 16605764 17089307 17637863 18277422 19029721 19802644 20704089 21682434 22798329
3740B2798329J218880J403152J543258J671236J892342K115230K358131K597132
$$ 22798329 24017209 25420361 26963619 28634855 30527197 32642427 35000558 37597690
3732C7597690K888992L288283L659327M089549M561682M982859N474130N907973
$$ 37597690 40486682 43774965 47434292 51523841 56085523 61068382 66542512 72450485
3724G2450485O250334O493788O560647O455938O223391N775980N152268M428416
$$ 72450485 78700819 85194607 91755254 98211192 104434583 110210563 115362831 119791247
3716A19791247L550948K590316J651558O73272k90499j206241j989970k605479
$$ 119791247 123342195 125932511 127584069 128257341 127966842 126760601 124770631 122165152
3708A22165152l207379l596065l914593m239804m511834m714457m910876m965994
$$ 122165152 118957773 115361708 111447115 107207311 102695477 97981020 93070144 88104150
3700H8104150m993414n010045m892351m768735m586652m331006m086639l787540
$$ 88104150 83110736 78100691 73208340 68439605 63852953 59521947 55435308 51647768
3692E1647768l476069l187366k919793k666242k427698k199685j952478j796914
$$ 51647768 48171699 44984333 42064540 39398298 36970600 34770915 32818437 31021523
3684C1021523j621957j497615j355756j218606j168374j021989r33113q49205
$$ 31021523 29399566 27901951 26546195 25327589 24159215 23137226 22204113 21354908
3676B1354908p63470p12186o83178n85003n16351m76735m03570l47954k76634
$$ 21354908 20591438 19879252 19196074 18611071 18094720 17617985 17214415 16866461 16589827
3667A6589827k27329k00430j19656p6305K0958O5141M2966P6084J04916J26948
$$ 16589827 16362498 16162068 16042412 15966107 15987065 16052206 16095172 16171256 16276172 16403120
3657A6403120M8708P6568J0914l2165l6270j76577k49761l01603l49415m24343
$$ 16403120 16451828 16528396 16539310 16507145 16470875 16294298 16044537 15742934 15393519 14969176
3647A4969176m90486n08209n05716n15274n01347m87965m61108m16184l80309
$$ 14969176 14478690 13970481 13464765 12949491 12448144 11960179 11499071 11082887 10702578
3638A0702578l66945l73394l29868l20706k83350k43661k67741k23669j79215
$$ 10702578 10335633 9962239 9632371 9311665 9028315 8784654 8516913 8293244 8114029
3629H114029k09667k00232j92681j82053j76394j61536j52769j13915j62555j19551
$$ 8114029 7904362 7704130 7511449 7329396 7153002 6991466 6838697 6724782 6562227 6442676
3619F442676q1210j20575j25745j07245n7378m3419j06035r8819q4084q0098q8843
$$ 6442676 6361466 6240891 6115146 6007901 5950523 5907104 5801069 5702250 5618166 5538068 5449225
3608E449225o1707q0259q0518q7384o9931l7671m5270n2299j8147j2097n2133
$$ 5449225 5387518 5307259 5226741 5139357 5069426 5031755 4986485 4934186 4916039 4903942 4851809
3597D851809o2275q4245j7274R35n8841p1933j6301j3471l4294n7598j9713l3598
$$ 4851809 4789534 4705289 4688015 4688950 4630109 4558176 4541875 4528404 4494110 4436512 4416799 4383201
3585D383201o8812k3714m4059o6232k9426L218l4626o2040L0596n6404m4087K4502
$$ 4383201 4314389 4290675 4246616 4180384 4150958 4154176 4119550 4057510 4088106 4031702 3987615 4012117
3573D012117l1141j1206m8713L6240J9724l6221k7575p496K9776n497L1032M2715
$$ 4012117 3980976 3969770 3921057 3957297 3977021 3940800 3913225 3905729 3935505 3930008 3961040 4003755
3561D003755l565J3888L031P8332R3073M7325N9670O1708P8607Q0937R4820J20611
$$ 4003755 4000190 4014078 4017109 4095441 4188514 4235839 4295509 4357217 4435824 4516761 4611581 4732192
3549D732192J40113J35060J12266J46047J80324K10674K45327K41835K38027L23674
$$ 4732192 4872305 5007365 5119631 5265678 5446002 5656676 5902003 6143838 6381865 6705539
3539F705539L55149L56638L51510L61052L90493L77869L45361L19222K52265J91466
$$ 6705539 7060688 7417326 7768836 8129888 8520381 8898250 9243611 9562833 9815098 10006564
3529A0006564J49446J06660J21486R5865R6125Q2990J12588J33649J64324J53902
$$ 10006564 10156010 10262670 10384156 10480021 10576146 10659136 10771724 10905373 11069697 11223599
3519A1223599J43065J35649P4469O2607J7771j2025m8526k9696n7115n6790o635
$$ 11223599 11366664 11502313 11576782 11639389 11657160 11645135 11596609 11566913 11509798 11453008 11446373
3508A1446373L0034L6087J30400K32672K49671K77322L45732M04830M69759N03388
$$ 11446373 11476407 11512494 11642894 11875566 12125237 12402559 12748291 13153121 13622880 14126268
3498A4126268N59655O77045P41899Q26250Q89801J064946J150366J272536J395680
$$ 14126268 14685923 15362968 16104867 16931117 17820918 18885864 20036230 21308766 22704446
3489B2704446J589269J755490J970606K229636K460125K759745L095421L420903
$$ 22704446 24293715 26049205 28019811 30249447 32709572 35469317 38564738 41985641
3481D1985641L712452M022398M322224M542627M634059M583867M559622M314659
$$ 41985641 45698093 49720491 54042715 58585342 63219401 67803268 72362890 76677549
3473G6677549M019771L727814L488036L301583L211885L106994L074673K991845
$$ 76677549 80697320 84425134 87913170 91214753 94426638 97533632 100608305 103600150
3465A03600150K855123K696402K311837J890323J252179N22846k25419r57033
$$ 103600150 106455273 109151675 111463512 113353835 114606014 115128860 114903441 113946408
3457A13946408j619567k070540k515750k761326k879408l009420l044586l129152
$$ 113946408 112326841 110256301 107740551 104979225 102099817 99090397 96045811 92916659
3449I2916659l246497l392596l635647l821099l986903m175253m209141m240188
$$ 92916659 89670162 86277566 82641919 78820820 74833917 70658664 66449523 62209335
3441F2209335m135935l953425l742725l454240l145854k821039k541125k305143
$$ 62209335 58073400 54119975 50377250 46923010 43777156 40956117 38414992 36109849
3433C6109849k082095j853784j675494j507261j356747j242407j092609j024094
$$ 36109849 34027754 32173970 30498476 28991215 27634468 26392061 25299452 24275358
3425B4275358r21627q05707p75910o74555o06728n42533m78624m50544m00150
$$ 24275358 23353731 22548024 21772114 21097559 20490831 19948298 19469674 19019130 18618980
3416A8618980l57647k60943k67477k27833j64709j03946q4258n3442l803l964
$$ 18618980 18261333 18000390 17732913 17505080 17340371 17236425 17152167 17098725 17094922 17090958
3406A7090958J5113k1671p5901j22871r2212j86320k16872k09773k34226k62300
$$ 17090958 17106071 17084400 17008499 16885628 16793416 16607096 16390224 16180451 15946225 15683925
3396A5683925k11667j98543k03924j68127j86922k10169k17489k44816l04717
$$ 15683925 15472258 15273715 15069791 14901664 14714742 14504573 14287084 14042268 13737551
3387A3737551l71715l77620l96410m06904l86610m03968l64508l32457k88557
$$ 13737551 13365836 12988216 12591806 12184902 11798292 11394324 11029816 10697359 10408802
3378A0408802k56369j63797j68476j86911j15578j04187j00785p6935l6190k5265
$$ 10408802 10152433 9988636 9820160 9633249 9517671 9413484 9312699 9235764 9199574 9174309
3368I174309j3793k208J5182l2997l1064j6131n9261m7464l4080m7807m578l9630
$$ 9174309 9160516 9158308 9173490 9140493 9109429 9093298 9034037 8986573 8952493 8904686 8900108 8860478
3356H860478Q836O8911N5104M3074P6862J06377J38633J31718J46163J56198K10336
$$ 8860478 8869314 8938225 8993329 9036403 9113265 9219642 9358275 9489993 9636156 9792354 10002690
3345A0002690K37782K54736K94295K84535L36847L49109M04018M68696M55376
$$ 10002690 10240472 10495208 10789503 11074038 11410885 11759994 12164012 12632708 13088084
3336A3088084N32395O40311P03777P41042Q24866R21897J071820J169668J346437
$$ 13088084 13620479 14260790 14964567 15705609 16530475 17452372 18524192 19693860 21040297
3327B1040297J480033J623839J884985K041169K248743K500291K709377L022761
$$ 21040297 22520330 24144169 26029154 28070323 30319066 32819357 35528734 38551495
3319C8551495L312033L675172M105422M515678M876134N164161N240133N121265
$$ 38551495 41863528 45538700 49644122 54159800 59035934 64200095 69440228 74561493
3311G4561493M780176M078400L218385K097169P98966n93856j875009l037025
$$ 74561493 79341669 83420069 86638454 88735623 89534589 88940733 87065724 84028699
3303H4028699l989660m675303n105455n236087n139402m902122m539281m107637
$$ 84028699 80039039 75363736 70258281 65022194 59882792 54980670 50441389 46333752
3295D6333752l670714l301729k941621k597449k318958k100361j862650j668408
$$ 46333752 42663038 39361309 36419688 33822239 31503281 29402920 27540270 25871862
3287B5871862j527802j388013j254542j140409j063063r73630q73127p74045p09512
$$ 25871862 24344060 22956047 21701505 20561096 19498033 18524403 17651276 16877231 16167719
3278A6167719o32452o13677n78421n03426m81515m58851l93965l82297l33807
$$ 16167719 15535267 14921590 14343169 13839743 13358228 12899377 12505412 12123115 11789308
3269A1789308k66199k64056k15928k22726k03727k74225k87351l29722k84170
$$ 11789308 11523109 11259053 11043125 10820399 10616672 10342447 10055096 9725374 9441204
3260I441204k45743k57982k33270k00865j86726j90903j91647j56959j48613j21253
$$ 9441204 9195461 8937479 8704209 8503344 8316618 8125715 7934068 7777109 7628496 7507243
3250G507243j23068j26892j13032q2041r1280o5776r8482j24743p6497o7874l0114
$$ 7507243 7384175 7257283 7144251 7062210 6970930 6905154 6806672 6681929 6605432 6537558 6507444
3239F507444l3353n5013p4865j40072j72884k20340j87428j67697j51986j73873
$$ 6507444 6474091 6419078 6344213 6204141 6031257 5810917 5623489 5455792 5303806 5129933
3229E129933j77977j48641j71614j31957r3153r1419j10202p5121o8997o0098
$$ 5129933 4951956 4803315 4631701 4499744 4406591 4315172 4204970 4129849 4060852 4000754
3219D000754o4130l8083o8079p3547k6723l6275l8099k9326l7493k1535m169l8463
$$ 4000754 3936624 3898541 3830462 3756915 3730192 3693917 3655818 3626492 3588999 3567464 3563295 3524832
3207C524832k1795J7105O301R716p677p089k1275l1155n04J5472m534K790j9235
$$ 3524832 3503037 3520142 3526443 3536159 3528482 3521393 3500118 3468963 3468459 3483931 3479397 3482187 3462952
3194C462952m0480j0134J2503p306Q061k0348n4166o900J598P187j4080R81k4070
$$ 3462952 3422472 3412338 3424841 3417535 3425596 3405248 3351082 3344182 3345780 3352967 3338887 3339868 3315798
3181C315798J990R554R121J0843n664r391l9k720J2872M3588L1692N468p281L9642
$$ 3315798 3317788 3327342 3336463 3347306 3341642 3332251 3332212 3329492 3342364 3385952 3417644 3423112 3415831 3455473
3167C455473L3936j3441R059J0692K6374L3887l1021K2433n1375l0685m3558K880
$$ 3455473 3489409 3475968 3485027 3495719 3522093 3555980 3524959 3547392 3496017 3465332 3421774 3424654
3155C424654l0900j8184l4669k1411k3489k9809m3318j6142J269m7027l6803K9178
$$ 3424654 3393754 3375570 3340901 3319490 3296001 3266192 3222874 3206732 3208001 3160974 3124171 3153349
3143C153349j0618J1865K6036K0955J5433L1446N8997M7766K8773J3914O6808
$$ 3153349 3142731 3154596 3180632 3201587 3217020 3248466 3307463 3355229 3384002 3397916 3464724
3132C464724K4857K0901J9912N1865N9388K8832N1981J9376M7339Q2078Q3123
$$ 3464724 3489581 3510482 3530394 3582259 3641647 3670479 3722460 3741836 3789175 3871253 3954376
3121C954376P0989Q9618R3063P4412P7882M0946K7039J1885M7547O1558Q2355
$$ 3954376 4025365 4114983 4208046 4282458 4360340 4401286 4428325 4440210 4487757 4549315 4631670
3110D631670P6623J08596J68166J99417K01498J83213J73360K37215K03420J82625
$$ 4631670 4708293 4816889 4985055 5184472 5385970 5569183 5742543 5979758 6183178 6365803
3100F365803K15317K20015K49156K54297K39474L17566K87121L25473L28012L69509
$$ 6365803 6581120 6801135 7050291 7304588 7544062 7861628 8148749 8474222 8802234 9171743
3090I171743L70302L58886L27889L89050M02969M33172M86030N41758N66034O38020
$$ 9171743 9542045 9900931 10228820 10617870 11020839 11454011 11940041 12481799 13047833 13685853
3080A3685853P04975P06474P68118Q20386Q97213J005129J101644J158461J248915
$$ 13685853 14390828 15097302 15865420 16685806 17583019 18588148 19689792 20848253 22097168
3071B2097168J410973J548465J603512J775665J948626K116181K334204K586230
$$ 22097168 23508141 25056606 26660118 28435783 30384409 32500590 34834794 37421024
3063C7421024K802300L073567L309499L650342M026387M492714M998769N683235
$$ 37421024 40223324 43296891 46606390 50256732 54283119 58775833 63774602 69457837
3055F9457837O526919P474830Q406995R431642J0509410J1876693J3518914J5610068
$$ 69457837 75984756 83459586 91866581 101298223 111807633 123684326 137203240 152813308
3047A52813308J8202860K1217256K4386880K7099865K8832582K8273896K3313996
$$ 152813308 171016168 192233424 216620304 243720169 272552751 300826647 324140643
3040C24140643J1662906n211417k0824991k9650730l1479116k9046842k5005204
$$ 324140643 335803549 330592132 309767141 280116411 248637295 219590453 194585249
3033A94585249k0854736j7245386j4363948j2182054j0527665r416195q434034
$$ 194585249 173730513 156485127 142121179 129939125 119411460 109995265 101561231
3026A01561231p535142o658804n971611n385426m898809m514802m176227l746496
$$ 101561231 94026089 87367285 81395674 76010248 71111439 66596637 62420410 58673914
3018E8673914l346146k969354k574272k322857k109408j921683j732293j579929
$$ 58673914 55327768 52358414 49784142 47461285 45351877 43430194 41697901 40117972
3010D0117972j523976j431671j360843j281788j245110j177737j119114r69708
$$ 40117972 38593996 37162325 35801482 34519694 33274584 32096847 30977733 30008025
3002C0008025q83051p89616p07701o24941m84361m02066l46115l30974l18405
$$ 30008025 29124974 28335358 27627657 27002716 26518355 26116289 25770174 25439200 25120795
2993B5120795l30326l85661n49868o30810p82654q33660q12061q28976q19618
$$ 25120795 24790469 24404808 23854940 23224130 22441476 21607816 20795755 19966779 19147161
2984A9147161p63157p50782o77484o10985n42451m90405m26243l63391l73130
$$ 19147161 18384004 17633222 16955738 16344753 15802302 15311897 14885654 14522263 14149133
2975A4149133l16148k70141k72862k61986k90787l53445l27447l28725l46454
$$ 14149133 13832985 13562844 13289982 13027996 12737209 12383764 12056317 11727592 11381138
2966A1381138l99707m14730l56655l07839l08873k96409k39244k31171j39480
$$ 11381138 10981431 10566701 10210046 9902207 9593334 9296925 9057681 8826510 8687030
2957H687030j81975j98715j74641j96032j99036j68914j34473j39340j52951j28899
$$ 8687030 8505055 8306340 8131699 7935667 7736631 7567717 7433244 7293904 7140953 7012054
2947G012054j20735j51110j23732j04964r9644r8695j35877j24745o6728p7489
$$ 7012054 6891319 6740209 6616477 6511513 6411869 6313174 6177297 6052552 5985824 5908335
2937E908335j19342j27325j15532q6122j62563j09816j14782j04433j08397j17031
$$ 5908335 5788993 5661668 5546136 5460014 5297451 5187635 5072853 4968420 4860023 4742992
2927D742992j14923r5233q0986q2369q7138r8310m5496m3342n0402n6730o1086
$$ 4742992 4628069 4532836 4451850 4369481 4282343 4184033 4138537 4095195 4044793 3988063 3926977
2916C926977n1652l9254k5092j3682k0805n3514o0187k4607m5029n0229k6947
$$ 3926977 3875325 3836071 3810979 3797297 3776492 3722978 3662791 3638184 3593155 3542926 3515979
2905C515979m9894r1757n2299l4147j8160q4038q5391m8714l7601r4645o3864
$$ 3515979 3466085 3374328 3322029 3287882 3269722 3185684 3100293 3051579 3013978 2919333 2855469
2894B855469l4774n7002k8327j05116o0767m3498m1211q189k3272l9706l1722
$$ 2855469 2820695 2763693 2735366 2630250 2569483 2525985 2484774 2476585 2453313 2413607 2381885
2883B381885j4946Q210o1946m081k6137l7305N8742N517o252J7431j1010m0918
$$ 2381885 2366939 2375149 2313203 2309122 2282985 2245680 2304422 2309939 2303687 2321118 2310108 2269190
2871B269190k9287J7725Q326k4589k0216l0629M56m4732k7991k9020o914j7819
$$ 2269190 2239903 2257628 2265954 2241365 2221149 2190520 2190976 2146244 2118253 2089233 2082319 2064500
2859B064500k41k7345j6397k365n2482n7120p8987k7281j082o1419m1431j6706
$$ 2064500 2064259 2036914 2020517 2018152 1965670 1908550 1829563 1802282 1801200 1739781 1698350 1681644
2847A681644l4084m8057k0075k030m037l4384l6755m3511m4329o093l8291p838
$$ 1681644 1647560 1599503 1579428 1577398 1573361 1538977 1502222 1458711 1414382 1408289 1369998 1362160
2835A362160k8774K7808l1435j4916K774J3385O939j5856k2905k067J3363r708
$$ 1362160 1333386 1361194 1329759 1314843 1317617 1331002 1337941 1322085 1299180 1297113 1310476 1300768
2823A300768L001j2269J0678Q011j7530m5780R021k4588k2751J1443l2279l9593
$$ 1300768 1303769 1291500 1302178 1310189 1292659 1246879 1255900 1231312 1208561 1220004 1187725 1148132
2811A148132M39l4595k9273o756q556m1536k3531j0448N112L8152l4908j6715
$$ 1148132 1148571 1113976 1084703 1077947 1069391 1027855 1004324 993876 998988 1037140 1002232 985517
2799I85517K3940k5348k0800l6363L2365L6703p228q862l929j1019J121J2104
$$ 985517 1009457 984109 963309 926946 959311 996014 988786 979924 975995 964976 966097 978201
2787I78201q68l5476K0163K1502k1794M876K2053J5213N650j6823N331R594L8421
$$ 978201 977333 941857 962020 983522 961728 966604 988657 1003870 1009520 992697 998028 1007622 1046043
2774A046043J3041L4898K7208Q769M9975M8668K1013J8905O8414N7383O7515P8776
$$ 1046043 1059084 1093982 1121190 1129959 1179934 1228602 1249615 1268520 1336934 1394317 1461832 1540608
2762A540608P1113J02223J19165J26153J22730J33960P1716L7246k3931j16353
$$ 1540608 1611721 1713944 1833109 1959262 2081992 2215952 2287668 2324914 2300983 2184630
2752B184630r7871j39000j25714j24799j23092r6146q7952p6077j2776p8686p6532
$$ 2184630 2086759 1947759 1822045 1697246 1574154 1478008 1390056 1313979 1301203 1222517 1145985
2741A145985l2567j4748m1933q9717m7557k5694j9977k3650l8694l6909J3036
$$ 1145985 1113418 1098670 1056737 967020 919463 893769 873792 850142 811448 774539 787575
2730G87575L5605k7347m694k2620l1349K6885k0222j2255k4777n390K1880l4742
$$ 787575 823180 795833 791139 768519 737170 764055 743833 731578 706801 701411 723291 688549
2718F88549j8973j6095l4567k1143m127j175j7413K1159k1573k9928o793j488
$$ 688549 669576 653481 618914 597771 593644 592469 575056 596215 574642 544714 537921 536433
2706E36433J6915j6154j522P255m1421l0915N8019j8541j8144J1805P445k2620
$$ 536433 553348 537194 535672 542927 501506 470591 528610 510069 491925 503730 511175 488555
2694D88555o275j9104K4958k3844J8671n442J3897K1448Q616j8029l0445J2890
$$ 488555 482280 463176 488134 464290 482961 477519 491416 512864 521480 503451 473006 485896
2682D85896M766J647R991R135j1902q328j9788j788j2926j1900J2429k0574J7225
$$ 485896 490662 492309 502300 511435 499533 491205 471417 469629 456703 444803 457232 436658 453883
2669D53883M3349K471q573k7929j9422j5402Q12k2685q771J8117j5405P543j463
$$ 453883 497232 499703 491130 463201 443779 428377 429189 406504 397733 415850 400445 407988 406525
2656D06525o387J0761l0298j0636P902k1345j2312K7388j081k6427l5234k9231
$$ 406525 400138 410899 380601 369965 377867 356522 344210 371598 370517 344090 308856 279625
2644B79625j5555K3540M2599J0528M140j1170M277M3047k0481k0175J0136K1529
$$ 279625 264070 287610 330209 340737 344877 333707 337984 381031 360550 340375 350511 372040
2632C72040k8142l479j3051K9236j4402j4437J5849j7703j3816o525j4079K9406
$$ 372040 343898 340419 327368 356604 342202 327765 343614 325911 312095 305570 291491 320897
2620C20897j8035K1978J6778n67L40j7835j7256j5616l5268K1044J4162M86L5488
$$ 320897 302862 324840 341618 341051 341391 323556 306300 290684 255416 276460 290622 291108 326596
2607C26596O348j5119K2205k2241k344k799l6180K797j3128M638j4664J0274m1761
$$ 326596 332944 317825 340030 317789 315445 312646 276466 279263 266135 270773 256109 266383 224622
2594B24622K2250J6714P003J7967L0014O330j9143j5566K7635J2860m191k5680
$$ 224622 246872 263586 270589 288556 318570 324900 305757 290191 317826 330686 326495 300815
2582C00815m8808n67L1176Q247k6883R020J135k5974K3643M393j8096j5672N593
$$ 300815 252007 251440 282616 290863 263980 273000 274135 248161 271804 276197 258101 242429 248022
2569B48022r244l0824J8493K0975l1237q676j0014k3034L1565n678J6078M936
$$ 248022 238778 207954 226447 247422 216185 207509 197495 174461 206026 200348 216426 221362
2557B21362J1378k55l586J0789J6244Q020J629n072l6766P539L341N766R210k2663
$$ 221362 232740 232485 228899 239688 255932 263952 265581 260509 223743 231282 234623 240389 249599 226936
2543B26936k0942k543J1545k1172L2163Q26r816j4065Q01j7286k3799k229N45
$$ 226936 205994 203451 214996 193824 225987 226813 216997 202932 203733 186447 162648 160419 160964
2530A60964m04m646K774M992R999k0303J4240R615j6656k6218K3085L2349j2965
$$ 160964 160560 155914 158688 163680 173679 153376 167616 177231 160575 134357 157442 189791 176826
2517A76826l9584K5458J6960j3793O365K6716n09l2568K4739P673l2606R878k0845
$$ 176826 137242 162700 179660 165867 172232 198948 198439 165871 190610 198283 165677 175555 154710
2504A54710J4992J4979j7783k2356k8691L1145L0683j1401J0638J7522J3300o645
$$ 154710 169702 184681 166898 144542 115851 146996 177679 166278 176916 194438 207738 201093
2492B01093j058r933J9015k0616k9213L9528J179l0674j111J4961L1894j1145
$$ 201093 200035 190102 209117 188501 159288 198816 199995 169321 168210 183171 215065 203920
2480B03920k5890k2995J2516K1920J0253R109J3087k2685j6954L3233L770J2076
$$ 203920 178030 155035 167551 189471 199724 208833 221920 199235 182281 215514 219284 231360
2468B31360L363k3421k6419j6368J609j5272m263k696j9973K4769k5919N2020
$$ 231360 234723 211302 184883 168515 170124 154852 150589 147893 127920 152689 126770 178790
2456A78790J0421j6683J3297j3488j1235K2753m4293O524M2222k1988L0290j5958
$$ 178790 189211 172528 185825 172337 161102 183855 139562 146086 188308 166320 196610 180652
2444A80652j2474k3314J5015O43o152n383K5372M161j6904k583L3733J6738j2142
$$ 180652 168178 144864 159879 160522 154370 148987 174359 178520 161616 159033 192766 209504 197362
2431A97362R413k0943j351k5747K044K1705m766L581J1463O262P926k0300k9881
$$ 197362 206775 185832 184481 158734 160778 182483 177717 181298 192761 199023 206949 186649 156768
2418A56768j3189N896L2924o698j2175n6092J7977l407k3899L5177K41K5141O114
$$ 156768 143579 149475 182399 175701 163526 107434 125411 122004 98105 133282 133523 158664 164778
2405A64778K5999n0549o955P047j7143k1981r68K4383k7009O384L3464l1342K915
$$ 164778 190777 140228 133273 140320 123177 101196 100228 124611 97602 103986 137450 106108 109023
2392A09023J7l1587M7322L673l1187j3667J5071L746j5370J656j8793J6070K5021
$$ 109023 109040 77453 124775 128448 97261 83594 98665 102411 87041 88697 69904 85974 110995
2379A10995J5818J5016J0009j3800R746k3159q592M0780P335J4163l80R058m0498
$$ 110995 126813 141829 151838 138038 147784 124625 116033 156813 164148 178311 177931 186989 146491
2366A46491j2171J7391K0971j6934k4442J4284K0642k6041k0197j3028l0058M2
$$ 146491 134320 151711 172682 155748 131306 145590 166232 140191 119994 106966 76908 76950
2354G6950K2796k150J436k9239L3870J7418J336p252j6207n090k8152L0581O400
$$ 76950 99746 97596 99032 69793 103663 121081 122417 115165 98958 93868 65716 96297 102697
2341A02697j3376K4M438l6690K8539K1753P014L732J853n192M294J8877J2623
$$ 102697 89321 89345 93783 57093 85632 107385 114399 118131 119984 114792 119086 137963 150586
2328A50586k4843J161j3689k0119j471J078J5053K3244l1943K1146J0208p022
$$ 150586 125743 126904 113215 93096 91625 92703 107756 131000 99057 120203 130411 123389
2316A23389k2842L9470L0690m7613K1179K3930m2374O038J9996J0486K6377k4055
$$ 123389 100547 140017 170707 123094 144273 168203 125829 131867 151863 162349 188726 164671
2304A64671j8789J0599j5319r798M1185o058j8258q77j6756K5111K2073m946j6308
$$ 164671 145882 156481 141162 131364 172549 166491 148233 147356 130600 155711 177784 172838 156530
2291A56530L694k4425J5602L1390k6091K4646k5895j6672K3005K563P624o710
$$ 156530 160224 135799 151401 182791 156700 181346 155451 138779 161784 164347 171971 165261
2279A65261r696J3392K8458k5935m4913j82J3505J6969J7249J06O007J6706M0583
$$ 165261 155565 168957 197415 171480 126567 126385 139890 156859 174108 174214 180221 196927 237510
2266B37510J2603j7639k4631L4898O88K633L6219K235J3565J4003O198R591L9667
$$ 237510 250113 232474 207843 242741 243429 246062 282281 284516 298081 312084 318282 327873 367540
2253C67540j0045K8371K0171Q212j7782M0522J8894K3941K7237M4588L8360L9554
$$ 367540 357495 385866 406037 414249 396467 436989 455883 479824 507061 551649 590009 629563
2241F29563m408j3460K9022M4271N4614L2901L5841P9927M6201Q0766N1176Q5914
$$ 629563 625155 611695 640717 684988 739602 772503 808344 888271 934472 1015238 1066414 1152328
2229A152328O4747Q9544R0550J24813J49712J91472J28919J76082K31247K09618
$$ 1152328 1217075 1306619 1397169 1521982 1671694 1863166 1992085 2168167 2399414 2609032
2219B609032K64793K56311K23142K56618K94050M05258M48118O08216P44840R28913
$$ 2609032 2873825 3130136 3353278 3609896 3903946 4309204 4757322 5365538 6110378 7039291
2209G039291J181407J492037J614128K009510K341978K496894O78836k367699
$$ 7039291 8220698 9712735 11326863 13336373 15678351 18175245 18854081 16486382
2201A6486382k924675k499573j819601j321981j011708q64330o75659m80756l60493
$$ 16486382 13561707 11062134 9242533 7920552 6908844 6044514 5368855 4888099 4527606
2192D527606l28964k79376k13260j75976j81303k09055k55072k56252j90799j56764
$$ 4527606 4198642 3919266 3706006 3530030 3348727 3139672 2884600 2628348 2437549 2280785
2182B280785j94273j55383r2865o7132r5901p5160j02340o5609o8994p1836n0977
$$ 2280785 2086512 1931129 1838264 1771132 1675231 1600071 1497731 1432122 1363128 1291292 1240315
2171A240315l6433l4711l0875o3401m2765n1963l3625l8060o5164l4046l7717
$$ 1240315 1203882 1169171 1138296 1074895 1032130 980167 946542 908482 843318 809272 771555
2160G71555l5764j1702q208k3254k6384k5552j5792j265l7517l077k7797k4070
$$ 771555 735791 724089 715881 692627 666243 640691 624899 623634 586117 583040 555243 531173
2148E31173l1537k8103K8939M667J649J827n5837k4201P434L507k5500K6402l1124
$$ 531173 499636 471533 500472 505139 506788 508615 452778 428577 436011 439518 414018 440420 409296
2135D09296j7969J4775j9428M9220k8464j7088l8113j1467j1454j8963j3758n105
$$ 409296 391327 406102 386674 435894 407430 390342 352229 340762 329308 310345 296587 291482
2123B91482K8796o64O576m34k8507j234j9094K6171k1471r995p105J0605p650
$$ 291482 320278 319614 326190 325756 297249 296015 276921 303092 281621 271626 264521 275126 267476
2110B67476l712J3573j9729k4062L3359j2365k4858j266k5835K7467j9081k3985
$$ 267476 263764 277337 257608 233546 266905 254540 229682 228416 202581 230048 210967 186982
2098A86982q493R331L691J5796R252K8583p095n8224K2975q255j1100n3007k4712
$$ 186982 178489 187820 191511 207307 216559 245142 238047 179823 202798 194543 183443 130436 105724
2085A05724L6531L6756m6076Q306J6295j3491j2063J1662M2287j3049j2875j025
$$ 105724 142255 179011 132935 141241 157536 144045 131982 143644 185931 172882 160007 158982
2073A58982K9451J833k1069J501K0341k3211j1295K7580j8228l5074K094j4246
$$ 158982 188433 190266 169197 170698 191039 167828 156533 184113 165885 130811 132905 118659
2061A18659j3667K961k706K1750l5201p836K2381j212J8607j5812r754K643l1076
$$ 118659 104992 107953 105247 126997 91796 83960 106341 105129 123736 107924 98170 100813 69737
2048F9737K1612J4546q408J6723j9443k003K955L286R726j3046j0141O929J8710
$$ 69737 91349 105895 97487 114210 94767 92764 95719 99005 108731 95685 85544 92473 111183
2035A11183j4761k4736N777P278L3108k1773l1150k406N0028P76m7819K3045K556
$$ 111183 96422 71686 77463 84741 117849 96076 64926 62520 112548 113324 65505 88550 91106
2022I1106j6957q63N1506p887k8469R533m00l1613j7045j470O0451J3403l4700
$$ 91106 74149 73286 124792 116905 88436 97969 97569 65956 48911 47441 107892 121295 86595
2009H6595M941O501J0112k927l1680l3229j5080Q034K3974M7347p037k1711M015
$$ 86595 91536 98037 108149 105222 73542 40313 25233 33267 57241 104588 97551 75840 79855
1996G9855r243J0196k9168j7226N641L3529l7934j7927J5797J685k123J9556L816
$$ 79855 70612 80808 51640 34414 40055 73584 35650 17723 33520 35205 33082 52638 56454
1983E6454o363K2263Q35M659K3928j342j0148k9996j6266J0836J0182K943O736
$$ 56454 50091 72354 73189 77848 101776 100434 90286 60290 44024 54860 65042 67985 74721
1970G4721K750j5487J2293P358j4868K568j1396J8193K0164j8790J5190n0454
$$ 74721 77471 61984 74277 81635 66767 69335 57939 76132 96296 77506 92696 42242
1958D2242R008j4900J3648Q975j0732K3288l0833k6360L789J2028P217J2342K1986
$$ 42242 51250 36350 49998 58973 48241 71529 40696 14336 18125 30153 37370 49712 71698
1945G1698k6712j7726P7584n904q990J6159O217j7394J236R088J3911J117K3320
$$ 71698 44986 27260 104844 98940 89950 106109 112326 94932 96168 105256 119167 120284 143604
1932A43604j934n69j635k0228r598R485m038m08j0640m433k7822M263J8044k4392
$$ 143604 141670 141101 139466 119238 109640 119125 115087 114679 104039 99606 71784 76047 94091 69699
1918F9699m0055m823j1333Q873j631j1530L7171J2699r232k3044J7433k6465L721
$$ 69699 29644 24821 13488 22361 20730 9200 46371 59070 49838 26794 44227 17762 21483
1905B1483n429M6756j5295k9917L047L196J3568q743J3038j5308j7029q096K4900
$$ 21483 16054 62810 47515 17598 20645 23841 37409 28666 41704 26396 9367 1271 26171
1892B6171L4282K9346j1573o12j7662L228K806q84k950j2333m4359P873L9490
$$ 26171 60453 89799 78226 77614 59952 63180 65986 65102 62152 49819 5460 13333 52823
1879E2823k841k0908O593K2925j1104o642l7536R579J1237j2303k361L5864J0653
$$ 52823 49982 29074 35667 58592 47488 40846 3310 12889 24126 11823 9462 45326 55979
1866E5979p700j8557j7799O081j270L697N505Q455j6248J5651O715k66k6181M257
$$ 55979 48279 29722 11923 18004 16734 20431 25936 34391 18143 33794 40509 40243 14062 18319
1852A8319M825J8266K8621k6572Q988J5073j2459k9460L8581Q313P330j7434J2928
$$ 18319 23144 41410 70031 43459 52447 67520 55061 25601 64182 72495 79825 62391 75319
1839G5319J407l0280j5754k65J0633K7452n866k1471l4446j3112M3709J1553j4110
$$ 75319 76726 46446 30692 30427 41060 68512 62646 41175 6729 -6383 37326 48879 34769
1826C4769O907q014J0208K3147j768k7260k1082k7582Q235L8033O214l203j3975
$$ 34769 41676 33662 43870 67017 65249 37989 16907 -10675 -2440 35593 41807 38604 24629
1813B4629k4872Q249L631J1835K6703k486Q467J3047l1155r628j2169K9304J1983
$$ 24629 -243 8006 11637 23472 50175 47689 56156 69203 38048 28420 16251 45555 57538
1800E7538j427R072m1144Q626j3198J2370L609J3247Q57l0808L6723k4335l453
$$ 57538 56111 65183 24039 32665 19467 31837 35446 48693 49550 18742 55465 31130 27677
1787B7677K6551J082k268j9333M653l051r979Q662J6369k4821j3936M5479K6259
$$ 27677 54228 55310 53042 33709 38362 35311 25332 33994 50363 25542 11606 57085 83344
1774H3344l4315J0755j3515l9842Q135j9467q894J7853j6986J5459L3777J1490
$$ 83344 49029 59784 46269 6427 14562 -4905 -13799 4054 -12932 2527 36304 47794
1762D7794j2925l878k468J5267m693l0505K8278j3131j9480J9356j2261j532j0559
$$ 47794 34869 30991 28523 43790 39097 8592 36870 23739 4259 23615 11354 9822 -737
1749g37J0212j9042n994J1091L9598J4671l7009j7338J6426k739L0285k8358j9294
$$ -737 9475 -9567 -15561 -4470 35128 49799 12790 -4548 11878 9139 39424 11066 -8228
1736h228K5992K114k943K9308j2943j2170M389j7707J2643K0913j3759r762Q870
$$ -8228 17764 19878 16935 46243 33300 21130 25519 7812 20455 41368 27609 17847 26717
1723B6717m854j6947M084O927j575j2610n663P804J4103N516J5408j3784j3793
$$ 26717 21863 4916 9000 15927 14352 1742 -3921 3883 17986 23502 38910 25126 11333
1710A1333l3318Q388N8996J4689m348l1413N454J503J3063k2279J1497J5165K6110
$$ 11333 -21985 -13597 45399 60088 55740 24327 29781 31284 44347 22068 33565 48730 74840
1697G4840k3336l190L494Q225n013P445l1464l1672N039Q312k4427L7990p833
$$ 74840 51504 48314 51808 60033 55020 62465 31001 -671 4368 12680 -11747 26243 18410
1684A8410l6567J9619j6732p114n167K9949L2015j6633j5212o417l938N1628J744
$$ 18410 -18157 1462 -15270 -22384 -27551 2398 34413 17780 2568 -3849 -7787 43841 45585
1671D5585j5885K5051M050r714L452k5946j5222K022j8459k0299K5037K9437n903
$$ 45585 29700 54751 58801 49087 52539 26593 11371 13393 -5066 -25365 -328 29109 23206
1658B3206L4681j7375m0248j6752K313J0830r812j0108O074L0751O986J9373j7256
$$ 23206 57887 40512 264 -16488 -14175 -3345 -13157 -23265 -17191 13560 20546 39919 22663
1645B2663j5387O44o999L8470k070q191O04k5803K7142J3943j6402r546N325l9170
$$ 22663 7276 7920 921 39391 37321 29130 29734 3931 31073 45016 28614 19068 24393 -14777
1631a4777P879K4659j5408l584J5357k1291J5032J4403O689J0951j0194k9473
$$ -14777 -6898 17761 2353 -1231 14126 -7165 7867 22270 28959 39910 29716 243
1619B43o021K2880Q345J0605k0941L5196k8802j9601P624K3392q464m4953J5651
$$ 243 -5778 17102 25447 36052 15111 50307 21505 1904 9528 32920 24456 -20497 -4846
1606d846N324J8035L743j4899J2786k4321k216r770L4981K924l4613L843r34M2191
$$ -4846 478 18513 22256 7357 20143 -4178 -6394 -16164 18817 21741 -12872 -9029 -9963 32228
1592C2228J831k4120j2795j3147p823K2377r186J1697j4931J7276L3247k7916
$$ 32228 34059 9939 -2856 -16003 -23826 -1449 -10635 1062 -13869 3407 36654 8738
1580H738j7030j0125K6793O61r054k061N7517j1447m9388L0958L382l0611l736
$$ 8738 -8292 -18417 8376 9037 -17 -2078 55439 43992 -5396 25562 28944 -1667 -5403
1567e403J4142l1092Q550K5255J616j5534k24J7568L3743j5833l3890j7081Q421
$$ -5403 8739 -22353 -13803 11452 13068 -2466 -2690 14878 48621 32788 -1102 -18183 -9762
1554i762J047p023j6695N44l280O942J6895j1600K1313p273m3572J8150N6662
$$ -9762 -8715 -15738 -32433 -31889 -35169 -28227 -11332 -22932 -1619 -8892 -52464 -34314 22348
1541B2348J8577q11n864j0585j1283M431m0202J2974k1995j9555M4567L8523L7810
$$ 22348 40925 40114 34250 23665 12382 16813 -23389 -10415 -32410 -51965 -7398 31125 68935
1528F8935l2871o4271n4522L1226N0501j7143n309n61K6506N2197k0786j7179
$$ 68935 36064 -28207 -82729 -51503 -1002 -18145 -23454 -24015 2491 54688 33902 16723
1516A6723k925k3834q537j2139j4796J0182K7083L0656P571K0298l7114O124L0890
$$ 16723 13798 -10036 -18573 -30712 -45508 -35326 -8243 22413 29984 50282 13168 19292 50182
1503E0182j9991k5985n096K8049L0601j5775k9022N87o221O356j4905J9146O384
$$ 50182 30191 4206 -890 27159 57760 41985 12963 13550 7329 13685 -1220 17926 24310
1490B4310o926J6886l0408l3197L4301j3311k5776M959M4696K271j0257N058k2647
$$ 24310 17384 34270 3862 -29335 4966 -8345 -34121 -29162 15534 17805 7548 12606 -10041
1477a0041M536P850J4353J3867k4316J3825J2038J2585j3814j580l6771J1430
$$ -10041 -5505 2345 16698 30565 6249 20074 32112 44697 30883 29303 -7468 3962
1465C962K2420l4480l476j3724L776M0246j9938K2883M498k1010N229j3796P054
$$ 3962 26382 -8098 -11574 -25298 -21522 18724 -1214 21669 26167 5157 10386 -3410 3644
1452C644k1312j684J5670L4972k5407K3658J8204j3664M346l95k5138k3142L9931
$$ 3644 -17668 -19352 -3682 31290 5883 29541 47745 34081 38427 38032 12894 -10248 29683
1439B9683J9194m2537k3223K7099J2966K0429j4113k2296n840J8646j3694N51
$$ 29683 48877 6340 -16883 10216 23182 43611 29498 7202 1362 20008 6314 6865
1427F865N805l4959P469J7439P272k9452J5728J6243k3044j6929J7491J8875j102
$$ 6865 12670 -22289 -14820 2619 9891 -19561 -3833 12410 -10634 -27563 -10072 8803 7701
1414G701n836L958p781L268Q548L380j5149J1002l7091J715J4200J4895l486j7614
$$ 7701 1865 5823 -1958 1310 9858 13238 -1911 9091 -28000 -26285 -12085 2810 -676 -18290
1400a8290o532r956J2356K0645k5461K4291J3357k7957k6011r941j6963J5181
$$ -18290 -24822 -34778 -22422 -1777 -27238 -2947 10410 -17547 -43558 -53499 -70462 -55281
1388e5281L6245J3366O27m1819J0048M2973K3102k2807j4798K575Q957K482j8763
$$ -55281 -19036 -5670 -5043 -46862 -36814 6159 29261 6454 -8344 -5769 3188 5670 -13093
1375a3093j0899J7952J8897J2460k8085L999K3419j979J2657k6471j511J1853
$$ -13093 -23992 -6040 12857 25317 -2768 1231 24650 22671 35328 8857 7346 19199
1363A9199j4072j4729q26L8100j3095J390j2435m3469K722J9199n658k792L8021
$$ 19199 5127 -9602 -10428 27672 14577 15967 3532 -39937 -37215 -18016 -23674 -26466 11555
1350A1555j4224k6793L3822J5721o154J2076j839n116J1584k6621j7647J5171
$$ 11555 -2669 -29462 4360 20081 13927 26003 24164 19048 30632 4011 -13636 1535
1338A535n748o485R18l736K7902k0171R428L905N48j072j1767R900M79k8401J8791
$$ 1535 -4213 -10698 -9780 -13516 14386 -5785 3643 7548 8096 7024 -4743 5157 5636 -22765 -3974
1323c974M403J9545k5890J1913j8052j1424J6931q890L2514l7452J7981K273K1437
$$ -3974 429 19974 -5916 5997 -12055 -23479 -6548 -15438 17076 -20376 -2395 -122 21315
1310B1315j725m2162L1629L024j548o967k3217k283l760M0035n983J799J1576
$$ 21315 19590 -22572 9057 12081 10533 3566 -19651 -21934 -25694 14341 8358 10157 21733
1297B1733l901J0342j6589j0663r909J285J6686j0784k2279Q810J0913K8965k5969
$$ 21733 17832 28174 11585 922 -8987 -7702 8984 -1800 -24079 -15269 -4356 24609 -1360
1284a360j1014m746P935M057L0161M458j9913M048J9588n044n9314j1669K6323
$$ -1360 -12374 -17120 -9185 -5128 25033 29491 9578 13626 33214 28170 -31144 -42813 -16490
1271a6490J6100M190k5634r029K8071L691Q566k2948O861J0875m461j3735K7928
$$ -16490 -390 3800 -21834 -30863 -2792 899 9465 -13483 -6622 4253 -208 -13943 13985
1258A3985J2294j866P37l1490j1578J436k3833J5503N826j1894M0261K1521k1994
$$ 13985 26279 24413 25150 -6340 -17918 -16482 -40315 -24812 -18986 -30880 9381 30902 8908
1245H908j6981J6694K5110K735J0749J3725P7o8640L591l878j0523N671K4159
$$ 8908 -8073 8621 33731 36466 47215 60940 61017 -7623 -4032 -7910 -18433 -12762 11397
1232A1397j3461l8380K7278r341j5331K2524K1107k1630k5442q820K6721Q291
$$ 11397 -2064 -40444 -13166 -22507 -37838 -15314 5793 -15837 -41279 -50099 -23378 -15087
1220a5087J4086P840j6820j4311J9315J0046J3282Q106N861j0354q485m395J1638
$$ -15087 -1001 6839 -9981 -24292 -4977 5069 18351 26457 32318 21964 13479 9084 20722
1207B0722J4733J4598K739o8639j6851n480L7239P684k7430J1617l807L93J6150
$$ 20722 35455 50053 52792 -15847 -32698 -38178 -939 6745 -20685 -9068 -12875 -12482 3668
1194C668J060j7927q770j9582l452K7885j0113Q022M687m122o055m274j111R485
$$ 3668 4728 -13199 -21969 -41551 -45003 -17118 -27231 -19209 -14522 -18644 -24699 -28973 -30084 -20599
1180b0599M0517k387k2811j9212P331J6116j1781K1583K4248O435k8784j7139
$$ -20599 19918 17531 -5280 -24492 -17161 -1045 -12826 8757 33005 39440 10656 -6483
1168f483k1793K2647J8898j086J3598l4201l625M6621p810j4231N844J2223J5311
$$ -6483 -28276 -5629 13269 12183 25781 -8420 -12045 34576 26766 12535 18379 30602 45913
1155D5913j9569n8366j5090R909j7071K7255K3154o917N73R769j6081j8230l5066
$$ 45913 26344 -32022 -47112 -37203 -54274 -27019 -3865 -10782 -10209 -440 -16521 -34751 -69817
1142f9817R804J9477J9063J4343M765j9061k8297P86J6519K1836K173J1731M369
$$ -69817 -60013 -40536 -21473 -7130 -2365 -21426 -49723 -48937 -32418 -10582 -8409 3322 7691
1129G691J1632j8094l4616J3142R911J0442j9488J3842J8783j5237n203j5753
$$ 7691 19323 1229 -33387 -20245 -10334 108 -19380 -5538 13245 -1992 -7195 -22948
1117b2948P813m406k0242J5346N299k98P791m867k7001K4355K3813k0594k1040
$$ -22948 -15135 -19541 -39783 -24437 -19138 -19436 -11645 -16512 -43513 -19158 4655 -15939 -36979
1104c6979J0317P058J3415r573k7940K8028K3798r72k0815l643m092N455J1312
$$ -36979 -26662 -19604 -6189 -15762 -43702 -15674 8124 7152 -13663 -17306 -21398 -15943 -4631
1091d631o278j8206n66K9154L47J8814l407O813p739J5854R988j3361j6517j3939
$$ -4631 -10909 -29115 -29681 -527 -180 18634 15227 22040 14301 30155 40143 26782 10265 -3674
1077c674q449L4146k3359p894K911P897P974N1243k1507k2945N47j1812j4264
$$ -3674 -12123 22023 -1336 -9230 -6319 1578 9552 60795 39288 16343 16890 5078 -9186
1064i186k1668L684J0003k4189J8767J2066r999O144j199k372j1690k2432K8726
$$ -9186 -30854 -27170 -17167 -41356 -22589 -10523 -20522 -14378 -15577 -17949 -29639 -52071 -23345
1051b3345L1266l4111M0071R781J4067p032m004j2886j5173k0108j3795L3264
$$ -23345 7921 -26190 13881 23662 37729 30697 26693 13807 -1366 -21474 -35269 -2005
1039b005L2488l0949k2467J468m516j8434K9869L2116O422l763j4632j5331l116
$$ -2005 30483 -466 -22933 -21465 -25981 -44415 -14546 17570 23992 20229 5597 -9734 -12850
1026a2850J5059O964k7023p63J6934J0620o825L5624m3093R613j3835K2626k239
$$ -12850 2209 9173 -17850 -18613 -1679 8941 2116 37740 -5353 4260 -9575 13051 10812
1013A0812k3900K6362k0025j7233L5557M492k7788j6164K8257J7643k5510k0834
$$ 10812 -13088 13274 -6751 -23984 11573 16065 -11723 -27887 370 18013 -7497 -28331
1001b8331K971J321q784k0188L1598K9047L575j3528o437j9581j0488K6861M6095
$$ -28331 -25360 -24039 -32823 -53011 -21413 7634 11209 -2319 -8756 -28337 -38825 -11964 34131
988C4131k3016k9545J5649l3207K3902N9025j1962l34K0577m1237j6952J448R149
$$ 34131 11115 -18430 -2781 -35988 -12086 46939 34977 34643 55220 13983 -2969 -1521 7628
975G628o575k677L4484r357j6199j2129l254l2380J3034J5550k1006J3142N561
$$ 7628 1053 -1624 32860 23503 7304 -4825 -8079 -40459 -27425 -11875 -32881 -19739 -14178
962a4178K2448K885r557N430L5460l381j1409l5602J3229l0301k3548Q484O769
$$ -14178 8270 11155 1598 7028 42488 39107 27698 -7904 5325 -24976 -48524 -40040 -33271
949c3271J8527K651k389R219J0751r604k4863J6374J3152k830k0797p349R349
$$ -33271 -14744 -12093 -14482 -5263 5488 -4116 -28979 -12605 547 -2283 -23080 -30429 -21080
936b1080n900j1849K2129p499j689J5028l0903K685K3510K325J8751Q191P998
$$ -21080 -26980 -38829 -16700 -24199 -25888 -10860 -41763 -39078 -15568 -13243 5508 13699 21697
923B1697p631j2495J4612n806l5490L392J2911R6n475P423l1832K504n338J3859
$$ 21697 14066 1571 16183 10377 -25113 -21721 -8810 -8714 -14189 -6766 -38598 -36094 -41432 -27573
909b7573J6717J5142J8455J9827k6621k7573r08J6288J5587j0059j7186k9800
$$ -27573 -10856 4286 22741 42568 15947 -11626 -12534 3754 19341 9282 -7904 -37704
897c7704L3041J7134l6677L4242J6049R103p640l7708j6176j8971K5768N6658
$$ -37704 -4663 12471 -24206 10036 26085 35188 27548 -10160 -26336 -45307 -19539 37119
885C7119k4669J224q478k3662J6862m579J6021K9594o112q4916K5698K5419J6849
$$ 37119 12450 13674 5196 -18466 -1604 -6183 9838 39432 33320 -51596 -25898 -479 16370
872A6370n218k6137L2723j4275m5693L7249K4308k8995l5369J7972M0641j3273
$$ 16370 11152 -14985 17738 3463 -42230 -4981 19327 -9668 -45037 -27065 13576 303
860C03j2211j5663k936K6387L5861N199n3183J2194N619l3222K7406k6541j1492
$$ 303 -11908 -27571 -30507 -4120 31741 36940 -16243 -4049 1570 -31652 -4246 -30787 -42279
847d2279J8243J6221l0859J8406K5919P287k9878K151L177k1235J6942N817K2572
$$ -42279 -24036 -7815 -38674 -20268 5651 12938 -16940 -14789 -11612 -32847 -15905 -10088 12484
834A2484Q491J1088m5663R997k0328j216K973J7634n934k9985j3155L8737K2688
$$ 12484 20975 32063 -13600 -3603 -23931 -25147 -22174 -4540 -10474 -40459 -53614 -14877 7811
821G811J1940k565k1803Q2J6324M870J2089M579m900O063q975k6854j5956K763
$$ 7811 19751 17186 -4617 -4535 11789 16659 28748 33327 28427 34490 25515 -1339 -17295 -14532
807a4532l5065K1003K7116k4333J6518j6189q58P31J0970Q792J0528J0981J4774
$$ -14532 -49597 -28594 -1478 -25811 -9293 -25482 -26340 -25609 -14639 -5847 4681 15662 30436
794C0436j3294O257Q340K201l5422j400K142m810K1041J6763k5196q601J9547
$$ 30436 17142 23399 31739 33940 -1482 -2882 -740 -5550 15491 32254 7058 -1543 18004
781A8004J6160k6852p388P765L706k4668m441J9332k1755L7724k8140m18M0978
$$ 18004 34164 7312 -76 7689 11395 -13273 -17714 1618 -20137 17587 -10553 -10971 30007
768C0007l2837r334J8128j0008J4719k2100J0805j2681J0218L0980k5844J8862
$$ 30007 -2830 -12164 5964 -4044 10675 -11425 -620 -13301 -3083 27897 2053 20915
756B0915J3626l2862k0772J2827j505k9155L0990P734L440l0319J8099K5198K710
$$ 20915 34541 1679 -19093 -6266 -7771 -36926 -5936 1798 5238 -25081 -6982 18216 20926
743B0926j1167k1340J397o785q828J323J555K3807l077K1992J5499n122L0901
$$ 20926 9759 -11581 -10184 -16969 -25797 -24474 -22919 888 -2189 19803 35302 30180 61081
730F1081J97o0428j3660J8070j9791k8660K6303K1421j3162J5683K8633J981j2081
$$ 61081 61278 850 -12810 5260 -14531 -43191 -16888 4533 -8629 7054 35687 37668 25587
717B5587j2330j3136q126j0982j1715r482J0507J2776J9648N398l4848K482J1218
$$ 25587 13257 121 -8005 -18987 -30702 -40184 -29677 -16901 2747 8145 -26703 -24221 -13003
704a3003K4522k8026q621M558j426J9121j3025J1916N859J0031L462o480j1971
$$ -13003 11519 -16507 -25128 -20570 -21996 -2875 -15900 -3984 1875 11906 15368 8888 -3083
691c083J178o071J142M8244o274p431R018j3928l3037K6528j4575Q15O004l0807
$$ -3083 -1905 -7976 -6834 41410 35136 27705 36723 22795 -10242 16286 1711 2526 8530 -22277
677b2277K8590r173j3341q558j0260L5121L844l9725K281K8524L8609j7265k9671
$$ -22277 6313 -2860 -16201 -24759 -35019 102 3946 -35779 -33498 -4974 33635 16370 -13301
664a3301l380N31M7629J4088k8548L72k4628J5518K884k0794K0361j5330j1634
$$ -13301 -16681 -16150 31479 45567 17019 17391 -7237 8281 11165 -9629 10732 -4598 -16232
651a6232K2485K9120l9317k9728J1580K0855k068n500R741K252Q850k339K6023
$$ -16232 6253 35373 -3944 -33672 -22092 -1237 -3305 -8805 936 3188 12038 9699 35722
638C5722q346q934K937j6498n688R191J7032j8248p207q947j1481J3110j5221
$$ 35722 27376 18442 21379 4881 -807 8384 25416 7168 -39 -8986 -20467 -7357 -22578
625b2578L9070K0814k8400k26j0285j6371L2969l0047j1737n9840M2855L2043
$$ -22578 16492 37306 8906 8680 -1605 -17976 14993 -15054 -26791 -86631 -43776 -11733
613a1733q117K1272O011k4895o393K3962q275l0808J1715M3067L6835k6610l0077
$$ -11733 -19850 1422 7433 -17462 -23855 107 -8168 -38976 -27261 15806 52641 26031 -4046
600d046L4474j5575l9977J0325J7634L277l057R916j2763k5324J5966K1169j7746
$$ -4046 30428 14853 -25124 -14799 2835 6112 3055 12971 208 -25116 -9150 12019 -5727
587e727j2367R433K7670J6942l4529J7852r456j7399o617k881Q558L450J4875
$$ -5727 -18094 -8661 19009 35951 1422 19274 9818 -7581 -14198 -17079 -8521 -5071 9804
574I804m776m473J5716J6685L808n977K2224j9844k6998n467J1075k1068K3351
$$ 9804 5028 555 16271 32956 36764 30787 53011 33167 6169 702 11777 -9291 14060
561A4060J9838l8264J3330Q56m0877P626N466L008K1638j9138M0196l528m5269
$$ 14060 33898 -4366 8964 9820 -31057 -23431 -17965 -14957 6681 -12457 27739 24211 -21058
548b1058j3240q03J7024J6540r888q993j2094K462J3487O609l785K510J0345l9487
$$ -21058 -34298 -35101 -18077 -1537 -11425 -20418 -32512 -30050 -16563 -9954 -13739 -11229 -884 -40371
534d0371j244J8097j059J131R418J2808j6944j6860N0893K1348j5723k0055Q466
$$ -40371 -41615 -23518 -24577 -23446 -14028 -1220 -18164 -35024 15869 37217 21494 1439 9905
521I905P672j8490m8644m129L2466j2146J2176o475K8153L8249j1616l4025j2659
$$ 9905 17577 -913 -49557 -53686 -21220 -33366 -21190 -27665 488 38737 27121 -6904 -19563
508a9563j1849l298N862K7255J9411j9900k1172k544J4597J2263L990k6749P0116
$$ -19563 -31412 -34710 -28848 -1593 17818 -2082 -23254 -25798 -11201 1062 5052 -21697 48419
495D8419l5882j5429j8007P262j3185m735P137K8746K2417j6758Q771o809k2140
$$ 48419 12537 -2892 -20899 -13637 -26822 -31557 -24420 4326 26743 9985 18756 11947 -10193
482a0193Q423k54K0273J689j1920m551J2561r599j3607J5045m5741q97J8000Q237
$$ -10193 -1770 -2024 18249 19938 8018 3467 16028 6429 -7178 7867 -37874 -38771 -20771 -12534
468a2534j430k8724m011K7479J6891j3650r530K1154l5067J7999J4715k111K1046
$$ -12534 -13964 -42688 -46699 -19220 -2329 -15979 -25509 -4355 -39422 -21423 -6708 -8819 12227
455A2227r373j9338K2501p738P205M051j1464K4269m612j1743R636K053j5719
$$ 12227 2854 -16484 6017 -1721 5484 9535 -1929 22340 17728 5985 15621 17674 1955
442A955l5842J7762K6932j8454R287j2233j0228n327J0446o411J026K1194J0660
$$ 1955 -33887 -16125 10807 -7647 1640 -10593 -20821 -26148 -15702 -22113 -21087 107 10767
429A0767R763k6778J427j9342M784J2633L5411j6616k7617l166J0358j3435K9240
$$ 10767 20530 -6248 -4821 -24163 -19379 -6746 28665 12049 -15568 -18734 -8376 -21811 7429
416G429j9656j8379K6898j1840J3296n587J4179k1577Q550L2579j8540L5563j0358
$$ 7429 -12227 -30606 -3708 -15548 -2252 -7839 6340 -15237 -6687 25892 7352 42915 32557
403C2557j6793l5487L3477j3824J6579K4310k9859k069M987j7342m557J5857q383
$$ 32557 15764 -19723 13754 -70 16509 40819 10960 8891 13878 -3464 -8021 7836 -547
390e47l4709K8601K9312q212l1459J3882K8729j0779m6654L7819j806j6156k633
$$ -547 -35256 -6655 22657 14445 -17014 -3132 25597 14818 -31836 5983 4177 -11979 -14612
377a4612j6265M0125K6195j7751m2036l565l88O3485j6484j4935j5955n602p005
$$ -14612 -30877 9248 35443 17692 -24344 -27909 -28297 35188 18704 3769 -12186 -17788 -24793
364b4793L7743j3465J3341L0953j7467o3971J4758K6073j3571r505l562J971J6425
$$ -24793 12950 -515 12826 43779 26312 -37659 -22901 3172 -10399 -19904 -23466 -21495 -5070
351e070K2937J7895m8987j6291O810J3042J935K415J0439R418o121J0875j5734
$$ -5070 17867 35762 -13225 -29516 -22706 -9664 -7729 -5314 5125 14543 8422 19297 3563
338C563o727L1185l1369p947J3388j5334L6067j8851l552l675l5206K2261J2218
$$ 3563 -3164 28021 -3348 -11295 2093 -13241 22826 3975 423 -3252 -38458 -16197 -3979
325c979p706J6365R052J0443j4911k7104L3660M247J2472l0472J3232r834j0982
$$ -3979 -11685 4680 13732 24175 9264 -17840 15820 20067 32539 2067 15299 5465 -5517
312e517J8018j7576P560L0968p51j8624l2567K9243o386j6234K4151j7700j9979
$$ -5517 12501 -5075 2485 33453 32702 14078 -18489 10754 4368 -11866 12285 -5415 -25394
299b5394J099K0143J1754Q389L5900j1286P92J5845o930j0623k6497q226K0374
$$ -25394 -24295 -4152 7602 15991 51891 40605 41397 57242 50312 39689 13192 4966 25340
286B5340N796k3725O842Q507l436k7812M0236m7898k6890R158K5166K0857k7429
$$ 25340 31136 7411 14253 22760 19324 -8488 31748 -16150 -43040 -33882 -8716 12141 -15288
273a5288J2233j4588j4142p116K4396L9875r368j9075K4817j4732l3663l956Q672
$$ -15288 -3055 -17643 -31785 -38901 -14505 25370 16002 -3073 21744 7012 -26651 -30607 -21935
260b1935j9602J7978L8081j0865j0697k740O479j0225k3901K0622L5997k160j8917
$$ -21935 -41537 -23559 14522 3657 -7040 -9780 -3301 -13526 -37427 -16805 19192 17032 -1885
247a885N460J147J9251j5653L58j2466K2517q050k7465L3033M694j1492j261j9418
$$ -1885 3575 4722 23973 8320 8678 -3788 18729 10679 -16786 16247 20941 9449 8188 -11230
233a1230k9014K2513J3521J0418J0214J0704K005p514k588l8993p936o589k9095
$$ -11230 -40244 -17731 -4210 6208 16422 27126 29131 21617 19029 -19964 -27900 -34489 -63584
220f3584M0191k0450j2157L3275K9046q610j0507J0934M179O779j4897J6152k0144
$$ -63584 -23393 -43843 -56000 -22725 6321 -2289 -12796 -1862 2317 9096 -5801 10351 -9793
207i793O294o387J430L7266R858k9310k4056k4873K5431J5236J1916J8440j4309
$$ -9793 -3499 -9886 -8456 28810 38668 9358 -14698 -39571 -14140 1096 13012 31452 17143
194A7143j5504r521j091J5363j456j6013q109k36o812M3035J4474l2942j1062
$$ 17143 1639 -7882 -8973 6390 4934 -11079 -19188 -19424 -26236 16799 31273 -1669 -12731
181a2731l232J0274J231J4493j2959k45j3961J5466J3520J5017L756k3985l2339
$$ -12731 -15963 -5689 -4458 10035 -2924 -3169 -17130 -1664 11856 26873 30629 6644 -25695
168b5695j2342P187P129K8202K5127j6979m611j2190j0605J7318n562J3490m680
$$ -25695 -38037 -30850 -23721 4481 29608 12629 8018 -4172 -14777 2541 -3021 10469 5789
155E789l0608o105o937M1700o008m284Q931k5138R086K3665j1103O038O61o058
$$ 5789 -24819 -30924 -37861 3839 -2169 -6453 2478 -22660 -13574 10091 -1012 5026 5687 -371
141c71J5885J94k223j0517O613P50o494l595j783j814O52j7674J5488N456j7192
$$ -371 15514 15708 13485 2968 9581 10331 3837 242 -1541 -3355 -2703 -20377 -4889 567 -16625
126a6625N949j4749K0049O165K2084m235l9715m110P480r19K2232j5366j192K5467
$$ -16625 -10676 -25425 -5376 789 22873 18638 -21077 -25187 -17707 -18626 3606 -11760 -12952 12515
112A2515k049p513r114J7607J2827n668j4716O989j5922P202k4920q06j8880m825
$$ 12515 10466 2953 -6161 11446 24273 18605 3889 10878 -5044 2158 -22762 -23568 -42448 -47273
98d7273k379J4905J9187j933K1332P376k894k1324K4978r074k3458J9367o87J4027
$$ -47273 -49652 -34747 -15560 -17493 3839 11215 8321 -13003 11975 2901 -20557 -1190 -1877 12150
84A2150j0492l6161J8632N391L829p356k954K0697p49Q429k984j736J808j967
$$ 12150 1658 -34503 -15871 -10480 -6651 -14007 -16961 3736 2987 11416 8432 6696 8504 6537
70F537l534r943j0290k116J5726K1283N269j2871K3154k6564j1709n64j3812Q848
$$ 6537 3003 -6940 -17230 -19346 -3620 17663 22932 10061 33215 6651 -5058 -5622 -19434 -10586
56a0586j1067M246J2469J2291r409o384p56P390M730j0928K038J1432n809O22
$$ -10586 -21653 -17407 -4938 7353 -2056 -8440 -9196 -1806 2924 -8004 -5966 5466 -343 279
42B79K752j9087O412M648R512j4876m712p224J1996J8416j2100J1907j1799m872
$$ 279 3031 -16056 -9644 -4996 4516 -10360 -15072 -22296 -10300 8116 -3984 7923 -3876 -8748
28h748O95m018p337J337R352j3636l6752M857L7635j7017K1176J7060K38M20J1339
$$ -8748 -8053 -12071 -19408 -18071 -8719 -22355 -59107 -54250 -16615 -33632 -12456 4604 4842 5262 16601
13A6601O829J2819j9559k1324o787j9168l745J5118L673O735J2814j036l074
$$ 16601 23430 36249 16690 -4634 -11421 -30589 -34334 -19216 -15543 -8808 4006 2970 -104
0a04
$$ Imaginary data points
##PAGE= N=2
##DATA TABLE= (X++(I..I)), XYDATA
16383a137863k765K615K3536J4021K6284M910J1651L2367K2362L4382K5280R167
$$ -1137863 -1140628 -1138013 -1114477 -1100456 -1074172 -1069262 -1057611 -1025244 -1002882 -968500 -943220 -934053
16371i34053K792J637Q736J2977j413J9356L4244J0979M734J8570L2866J4872
$$ -934053 -931261 -929624 -920888 -907911 -909324 -889968 -855724 -844745 -840011 -821441 -788575 -773703
16359g73703J1410q271L1989j686M79K7561L2306J6867J9214R913L9059J5209
$$ -773703 -762293 -770564 -738575 -740261 -739782 -712221 -679915 -663048 -643834 -633921 -594862 -579653
16347e79653m79J3842J9690K0656j088L1181L8563j6426O939N660k976O16M1484
$$ -579653 -580132 -566290 -546600 -525944 -527032 -495851 -457288 -473714 -466775 -461115 -464091 -463475 -421991
16334d21991J1200J3660M2419O95L747P930K2936K5601Q261J430l932L7622M2528
$$ -421991 -410791 -397131 -354712 -354017 -350270 -342340 -319404 -293803 -285542 -284112 -288044 -250422 -207894
16321b07894R068J8127K6168j3883K186J6652j254L4870K0984J651J1501J8669
$$ -207894 -198826 -180699 -154531 -168414 -166228 -149576 -150830 -115960 -94976 -93325 -81824 -63155
16309f3155J8852L7371K1273j2115j4154L8271l291J1609K7600J6530R375K4954
$$ -63155 -44303 -6932 14341 2226 -11928 26343 23052 34661 62261 78791 88166 113120
16297A13120Q346l354K2883K9895J9837l383j4762J7806K8145L037J6200Q849
$$ 113120 121466 118112 140995 170890 190727 187344 172582 190388 218533 221570 237770 246619
16285B46619Q756J3612K3693P949J475J8002J2476j3900K2655J6477J9049K3588
$$ 246619 255375 268987 292680 300629 302104 320106 332582 318682 341337 357814 376863 400451
16273D00451J56J4945J3147J1060k2828j1862K9836K8265J434N688R194J8278
$$ 400451 400607 415552 428699 439759 416931 405069 434905 463170 464604 470292 479486 497764
16261D97764J9532K3496q957P637M499m405J6950J7634j213J3242P176M165L9644
$$ 497764 517296 540792 531835 539472 543971 539566 556516 574150 572937 586179 593355 597520 637164
16248F37164k9021J3018P172Q127J3461J3011J9427M1880j2732J1375R466j8066
$$ 637164 608143 621161 628333 636460 649921 662932 682359 724239 711507 722882 732348 714282
16236G14282K3237J9220o091m692K1653Q568J9821K4584l07j9478N211K2210J2916
$$ 714282 737519 756739 750648 745956 767609 776177 795998 820582 820275 800797 806008 828218 841134
16223H41134n771K4303o061J0520M909P146J6756K2907N670k7265L0627j3184
$$ 841134 835363 859666 853605 864125 869034 876180 892936 915843 921513 894248 924875 911691
16211I11691P042j016L73K5941J2736l025K7548l662K978J3873j6903J0511p50
$$ 911691 918733 917717 918090 944031 956767 953742 981290 977628 980606 994479 977576 988087 987337
16198I87337J4819J5382j1519k6430l53K5792q122K1970L3938j4599j6761J2532
$$ 987337 1002156 1017538 1006019 979589 979236 1005028 996906 1018876 1052814 1038215 1021454 1033986
16186A033986K6080j5023N223j0580L4922P041J0962l3829J5447L5251l2607R681
$$ 1033986 1060066 1045043 1050266 1039686 1074608 1081649 1092611 1058782 1074229 1109480 1076873 1086554
16174A086554J6040j9157o121j0413L3850K4565o63j6009R836k258J16J9835J9421
$$ 1086554 1102594 1083437 1077316 1066903 1100753 1125318 1124655 1108646 1118482 1116224 1116340 1136175 1155596
16161A155596n844M522J206L948K277L159k5667J7122K4833q819M026K7303l171
$$ 1155596 1149752 1154274 1155480 1159428 1161705 1164864 1139197 1156319 1181152 1172333 1176359 1203662 1200491
16148A200491l9809J2997K0147L4048o524Q41J6325J8888j2620r596l6026J4752
$$ 1200491 1160682 1173679 1193826 1227874 1221350 1222191 1238516 1257404 1244784 1235188 1199162 1213914
16136A213914n704l678Q210K8313L7119k7398k8799J6555M1510P940k6777J0937
$$ 1213914 1208210 1204532 1212742 1241055 1278174 1250776 1221977 1238532 1280042 1287982 1261205 1272142
16124A272142o910J506k5351j6172J5357p928J1104O256J6434j783R50J683p265
$$ 1272142 1265232 1266738 1241387 1225215 1240572 1232644 1243748 1250004 1266438 1264655 1265605 1267288 1260023
16111A260023L3060k2681K1041J4831j8711l9836K3174J9317m0546K5706j1542
$$ 1260023 1293083 1270402 1291443 1306274 1287563 1247727 1270901 1290218 1249672 1275378 1263836
16100A263836P935J6583m569K9518J4717j826n380J8096r919j6643m118K1119
$$ 1263836 1271771 1288354 1283785 1313303 1328020 1326194 1320814 1338910 1328991 1312348 1308230 1329349
16088A329349r465J9376O342l2963j9836J54J5372k2091J3126k6313J2891L7016
$$ 1329349 1319884 1339260 1345602 1312639 1292803 1292957 1308329 1286238 1299364 1273051 1285942 1322958
16076A322958L356K2619l9241J5625J752R868o540j581J6842k6131M635r944P517
$$ 1322958 1326314 1348933 1309692 1325317 1327069 1336937 1330397 1328816 1345658 1319527 1324162 1314218 1321735
16063A321735q050n138j3126J0674K9546k2850m537J8701n681K2828J6099r290
$$ 1321735 1313685 1308547 1295421 1306095 1335641 1312791 1308254 1326955 1321274 1344102 1360201 1350911
16051A350911n5855J4321K8737j9930K0924M864N833j5213N06P209k3162j657
$$ 1350911 1295056 1309377 1338114 1318184 1339108 1343972 1349805 1334592 1335098 1342307 1319145 1317488
16039A317488j9776J2882J7525j7539L3646P809k4417l4781M87o229j3260L5156
$$ 1317488 1297712 1310594 1328119 1310580 1344226 1352035 1327618 1292837 1293324 1287095 1273835 1308991
16027A308991P328M022l699K9252j5288K0042r433j7066M2197K5713m9304k1061
$$ 1308991 1316319 1320341 1316642 1345894 1330606 1350648 1341215 1324149 1366346 1392059 1342755 1321694
16015A321694K498N162R179J5862l1604j0684K0081k0410K3443J2606q74j3227
$$ 1321694 1324192 1329354 1338533 1354395 1322791 1312107 1332188 1311778 1335221 1347827 1346953 1333726
16003A333726j1002R964J0801K8753j9109p866R549r499o646J566J485J9973K9808
$$ 1333726 1322724 1332688 1343489 1372242 1353133 1345267 1354816 1345317 1338671 1340237 1341722 1361695 1391503
15990A391503j5254m850j8048n459O520k8921K3825k5551r314k884P987K2499
$$ 1391503 1376249 1371399 1353351 1347892 1354412 1325491 1349316 1323765 1314451 1311567 1319554 1342053
15978A342053L5396l6174k5131J7760k5269J7337L8244N463l0502l622k3438L264
$$ 1342053 1377449 1341275 1316144 1333904 1308635 1325972 1364216 1369679 1339177 1335555 1312117 1315381
15966A315381P474J3737K1340j5035J0187J2999j7975j745o582r156J4879M9767
$$ 1315381 1322855 1336592 1357932 1342897 1353084 1366083 1348108 1346363 1339781 1330625 1345504 1395271
15954A395271n9152l2194K6077K0937N602o671o566n297j6333l989J793K1842
$$ 1395271 1336119 1303925 1330002 1350939 1356541 1349870 1343304 1338007 1321674 1317685 1319478 1341320
15942A341320j039l01P40N204J2053J171q069j703L438J0381j5557K2652L7665
$$ 1341320 1340281 1339980 1340720 1345924 1357977 1359148 1351079 1349376 1352814 1363195 1347638 1370290 1407955
15929A407955k6233k9905J3695M459J2554j4784j2410m3357K5850L1844j0142
$$ 1407955 1381722 1351817 1365512 1369971 1382525 1367741 1355331 1311974 1337824 1369668 1359526
15918A359526j2926k604L3454J842l8794k1307J9359K03M378J368j4075J7055
$$ 1359526 1346600 1343996 1377450 1379292 1340498 1319191 1338550 1338753 1343131 1344499 1330424 1347479
$$ [...]
##END NTUPLES=NMR SPECTRUM
##END=
