##TITLE=1H_DE-80H_X3
 200.13MHz, d2o
 8 sc
 
 19ns.26.2.2025
##JCAMPDX= 6.0         $$ Bruker NMR JCAMP-DX V2.0
##DATA TYPE= NMR FID
##DATA CLASS= NTUPLES
##ORIGIN= UXNMR, Bruker Analytische Messtechnik GmbH
##OWNER= pz
$$ XWIN-NMR		Version 3.5
$$ Fri Jul 25 15:04:40 2025 Russian Standard Time (UT+4h)  Yarkov@DPX200
##.OBSERVE FREQUENCY= 200.1313
##.OBSERVE NUCLEUS= ^1H
##.DELAY= (6, 6)
##.ACQUISITION MODE= SIMULTANEOUS
##.ACQUISITION SCHEME= undefined
##.AVERAGES= 8
##.DIGITISER RES= 18
##SPECTROMETER/DATA SYSTEM= spect
##.PULSE SEQUENCE= zg30
##.SOLVENT NAME= DMSO
##.SHIFT REFERENCE= (INTERNAL, DMSO, 0, 14.3821)
##AUDIT TRAIL= $$ (NUMBER, WHEN, WHO, WHERE, WHAT)
$$ ##TITLE= Audit trail, XWIN-NMR		Version 3.5
$$ ##JCAMPDX= 5.01
$$ ##ORIGIN= Bruker BioSpin GmbH
$$ ##OWNER= Yarkov
$$ C:/Bruker/XWIN-NMR/data/yarkov2/nmr/H-C/1/audita.txt
$$ ##AUDIT TRAIL=  $$ (NUMBER, WHEN, WHO, WHERE, WHAT)
(   1,<2025-07-25 15:03:44.20 +0400>,<Yarkov>,<DPX200>,
      <created by zg, POWCHK disabled, PULCHK disabled
       configuration hash MD5:
       00 E9 B6 7A A2 85 ED C7 34 08 36 98 17 FE 4E 26
       data hash MD5: 16K
       78 BB FA 8F 05 0F 5E 09 B4 B0 63 52 7B CB 38 4E>)
$$ ##END=
$$ 
$$ hash MD5
$$ 25 33 FD 1E 7E 0A 46 BC 9F 0C F0 E5 24 D9 F1 AF
##$RELAX= 
##$RELAX= 
##$RELAX= 
##$RELAX= 
##$RELAX= 
##$RELAX= 
$$ Bruker specific parameters
$$ --------------------------
##$DU= <C:/Bruker/XWIN-NMR>
##$EXPNO= 1
##$NAME= <H-C>
##$PROCNO= 1
##$TYPE= <nmr>
##$USER= <yarkov2>
##$AMP= (0..31)
100 100 100 100 100 100 100 100 100 100 100 100 100 100 100 100 100 100 
100 100 100 100 100 100 100 100 100 100 100 100 100 100 
##$AQSEQ= 0
##$AQ_mod= 1
##$AUNM= <au_zg>
##$AUTOPOS= <>
##$BF1= 200.13
##$BF2= 200.13
##$BF3= 200.13
##$BF4= 200.13
##$BF5= 200.13
##$BF6= 200.13
##$BF7= 200.13
##$BF8= 200.13
##$BYTORDA= 1
##$CFDGTYP= 0
##$CFRGTYP= 5
##$CHEMSTR= <none>
##$CNST= (0..31)
1 1 145 1 1 1 1 1 1 1 1 1 1 1 1 1 1 1 1 1 1 1 1 1 1 1 1 1 1 1 1 1 
##$CPDPRG= <>
##$CPDPRG1= <>
##$CPDPRG2= <>
##$CPDPRG3= <>
##$CPDPRG4= <mlev>
##$CPDPRG5= <mlev>
##$CPDPRG6= <mlev>
##$CPDPRG7= <mlev>
##$CPDPRG8= <mlev>
##$CPDPRGB= <>
##$CPDPRGT= <>
##$D= (0..31)
0 0.7 0 0 0 0 0 0 0 0 0 0.03 0 0 0 0 0 0 0 0 0 0 0 0 0 0 0 0 0 0 0 0 
##$DATE= 1753441423
##$DBL= (0..7)
120 120 120 120 120 120 120 120 
##$DBP= (0..7)
150 150 150 150 150 150 150 150 
##$DBP07= 0
##$DBPNAM0= <>
##$DBPNAM1= <>
##$DBPNAM2= <>
##$DBPNAM3= <>
##$DBPNAM4= <>
##$DBPNAM5= <>
##$DBPNAM6= <>
##$DBPNAM7= <>
##$DBPOAL= (0..7)
0.5 0.5 0.5 0.5 0.5 0.5 0.5 0.5 
##$DBPOFFS= (0..7)
0 0 0 0 0 0 0 0 
##$DE= 6
##$DECBNUC= <off>
##$DECIM= 32
##$DECNUC= <off>
##$DECSTAT= 4
##$DIGMOD= 1
##$DIGTYP= 9
##$DL= (0..7)
0 120 120 120 120 120 120 120 
##$DP= (0..7)
150 150 150 150 150 150 150 150 
##$DP07= 0
##$DPNAME0= <>
##$DPNAME1= <>
##$DPNAME2= <>
##$DPNAME3= <>
##$DPNAME4= <>
##$DPNAME5= <>
##$DPNAME6= <>
##$DPNAME7= <>
##$DPOAL= (0..7)
0.5 0.5 0.5 0.5 0.5 0.5 0.5 0.5 
##$DPOFFS= (0..7)
0 0 0 0 0 0 0 0 
##$DQDMODE= 0
##$DR= 18
##$DS= 0
$$ [...]
##$SUBNAM2= <"">
##$SUBNAM3= <"">
##$SUBNAM4= <"">
##$SUBNAM5= <"">
##$SUBNAM6= <"">
##$SUBNAM7= <"">
##$SUBNAM8= <"">
##$SUBNAM9= <"">
##$SW= 18.0517328524113
##$SWIBOX= (0..15)
0 0 2 0 0 0 0 0 0 0 0 0 0 0 0 0 
##$SW_h= 3612.71676300578
##$TD= 16384
##$TD0= 1
##$TE= 0
##$TE2= 300
##$TE3= 300
##$TEG= 300
##$TL= (0..7)
0 120 120 120 120 120 120 120 
##$TP= (0..7)
150 150 150 150 150 150 150 150 
##$TP07= 0
##$TPNAME0= <>
##$TPNAME1= <>
##$TPNAME2= <>
##$TPNAME3= <>
##$TPNAME4= <>
##$TPNAME5= <>
##$TPNAME6= <>
##$TPNAME7= <>
##$TPOAL= (0..7)
0.5 0.5 0.5 0.5 0.5 0.5 0.5 0.5 
##$TPOFFS= (0..7)
0 0 0 0 0 0 0 0 
##$TUNHIN= 0
##$TUNHOUT= 0
##$TUNXOUT= 0
##$USERA1= <user>
##$USERA2= <user>
##$USERA3= <user>
##$USERA4= <user>
##$USERA5= <user>
##$V9= 5
##$VALIST= <valist>
##$VCLIST= <CCCCCCCCCCCCCCC>
##$VD= 0
##$VDLIST= <DDDDDDDDDDDDDDD>
##$VPLIST= <PPPPPPPPPPPPPPP>
##$VTLIST= <TTTTTTTTTTTTTTT>
##$WBST= 1024
##$WBSW= 4
##$XGAIN= (0..3)
0 0 0 0 
##$XL= 0
##$YL= 0
##$YMAX_a= 97416
##$YMIN_a= -83170
##$ZGOPTNS= <>
##$ZL1= 120
##$ZL2= 120
##$ZL3= 120
##$ZL4= 120
##$ABSF1= 10
##$ABSF2= 0
##$ABSG= 5
##$ABSL= 3
##$ALPHA= 0
##$AQORDER= 0
##$ASSFAC= 0
##$ASSFACI= 0
##$ASSFACX= 0
##$ASSWID= 0
##$AUNMP= <proc_1d>
##$AZFE= 0.1
##$AZFW= 0.1
##$BCFW= 1
##$BC_mod= 2
##$BYTORDP= 1
##$COROFFS= 0
##$CY= 83.5205535888672
##$DATMOD= 1
##$DC= 2
##$DFILT= <>
##$DTYPP= 0
##$F1P= 10.8118882576601
##$F2P= -7.23987719738617
##$FCOR= 0.5
##$FTSIZE= 0
##$FT_mod= 4
##$GAMMA= 1
##$GB= 0.15
##$INTBC= 1
##$INTSCL= 1
##$ISEN= 128
##$LB= 0.25
##$LEV0= 0
##$LPBIN= 0
##$MAXI= 10000
##$MC2= 0
##$MEAN= 0
##$ME_mod= 0
##$MI= 1.114404
##$NCOEF= 0
##$NC_proc= 0
##$NLEV= 6
##$NOISF1= 3.799351
##$NOISF2= 2.8
##$NSP= 1
##$NTH_PI= 0
##$NZP= 0
##$OFFSET= 14.38212
##$PC= 1
##$PHC0= -1358.956
##$PHC1= 13.59091
##$PH_mod= 1
##$PKNL= yes
##$PPARMOD= 0
##$PSCAL= 0
##$PSIGN= 0
##$REVERSE= no
##$SF= 200.129724274929
##$SI= 16384
##$SIGF1= 3
##$SIGF2= 2
##$SINO= 400
##$SIOLD= 16384
##$SREGLST= <1H.CDCl3>
##$SSB= 0
##$STSI= 0
##$STSR= 0
##$SW_p= 3205.1282051282
##$SYMM= 0
##$S_DEV= 0
##$TDeff= 0
##$TDoff= 0
##$TI= <>
##$TILT= no
##$TM1= 0
##$TM2= 0
##$TOPLEV= 0
##$USERP1= <user>
##$USERP2= <user>
##$USERP3= <user>
##$USERP4= <user>
##$USERP5= <user>
##$WDW= 1
##$XDIM= 8192
##$YMAX_p= 0
##$YMIN_p= 0
$$ End of Bruker specific parameters
$$ ---------------------------------
##NTUPLES= NMR FID
##VAR_NAME=  TIME,          FID/REAL,        FID/IMAG
##SYMBOL=    X,             R,               I
##VAR_TYPE=  INDEPENDENT,   DEPENDENT,       DEPENDENT
##VAR_FORM=  AFFN,          ASDF,            ASDF
##VAR_DIM=   8192,          8192,            8192
##UNITS=     SECONDS,       ARBITRARY UNITS, ARBITRARY UNITS
##FACTOR=    0.0002768,     1,               1
##FIRST=     0,             0,               0
##LAST=      2.2672688,     0,               0
##MIN=       0,             -83170,          0
##MAX=       2.2672688,     97416,           0
$$ Real data points
##PAGE= N=1
##DATA TABLE= (X++(R..R)), XYDATA
$$ [...]
921h29N09Q36L93m03j249k15R42R03k3r80r14K96J187M65k42j259o93J030J224
$$ -829 -320 516 909 506 -743 -958 -16 887 864 -116 -1030 -734 453 918 676 -583 -1276 -246 978
940I78Q3r21j297J76J374N91j82j158r50P93J185N21o63j487m01J386J207l28
$$ 978 1061 140 -1157 -981 393 984 802 -356 -1306 -513 672 1193 530 -957 -1358 28 1235 907
958I07j245r69O12J352M92n35j371n72R47J367J17j056j311K79J274Q77m00j242
$$ 907 -338 -1307 -695 657 1149 614 -757 -1329 -382 985 1102 46 -1265 -986 288 1165 765 -477
976d77q95Q79J205N22q00j312k60J113J172j35j340j002P40J114N26n02j159n84
$$ -477 -1372 -493 712 1234 434 -878 -1138 -25 1147 1012 -328 -1330 -590 524 1050 548 -611 -1195
994a195R44J081J83q90j140P4J183Q10l67j193n17P17R14J88m37j179p4Q55Q61
$$ -1195 -251 830 1013 123 -1017 -943 240 1050 683 -510 -1027 -310 604 792 355 -824 -898 -43 818
1013H18p7j092m52M33O58L92l03p99k76N94O55J59m99q63k4R84L58k42p48k55
$$ 818 741 -351 -803 -370 288 680 377 -422 -698 -104 551 710 211 -652 -676 308 666 424 -324 -579
1033e79M39L87J64P7r09l9N78K38m5l95l16K08K74J27n1l08j78K63M1K78o9n39
$$ -579 -140 247 411 488 -421 -460 118 356 311 -84 -400 -192 82 209 158 -150 -328 -65 -24 254 185 -354
1055c54M5M09M8N1k61p4J03j71K85K75k51j25J43l44K76O5p7p7L5j23J15P4J01
$$ -354 -309 100 148 199 -62 -136 -33 -204 81 356 105 -20 123 -221 55 120 43 -34 1 -122 -7 67 168
1078A68j19m33M06J72q3j24j34j45K85N25q5l32o79J69N62K83o5n67m02M64L97
$$ 168 49 -384 22 194 111 -13 -147 -292 -7 518 433 101 -578 -409 153 436 371 -196 -598 -134 263
1099B63L4j71m67j95N70M52J3o75n42L99O01K37r5q48l83P00O00l8l14p52N1O06
$$ 263 297 126 -341 -536 34 486 499 -176 -718 -319 282 519 424 -424 -807 -107 493 455 141 -611 -560 46
1121D6N97n2j049l69P35N41J20k98p35l54P76P28Pp65q43L74Q35L20j32r02k99
$$ 46 643 591 -458 -827 -92 449 569 271 -464 -818 -42 686 693 -72 -915 -541 294 614 482 -420 -719
1142g19O07O13J35n38o94n1P73N34j48r48m31P14O13K43l88q84k00P02N52L05
$$ -719 -112 501 636 98 -596 -647 126 660 512 -436 -867 -153 460 703 315 -569 -769 -67 485 790
1162G90p24q78K87P52N57l02r26k91P43M79O4k80q76J26N90M89q7q52m02M70N41
$$ 790 66 -812 -525 227 784 482 -444 -735 8 487 551 271 -605 -479 111 600 513 -339 -741 -271 270
1183B70L25k40p76j27M84L49J83n09o06K13N54M79l64o26J7L59K54J48k10n43
$$ 270 595 355 -421 -548 -64 285 468 -41 -647 -434 120 599 235 -391 -374 -15 239 387 177 -366
1203c66J1K57N56j71m75j89J96K75J74j67l44p8J37M06M4k31l70J25J55J84N3
$$ -366 -355 -98 458 287 -188 -377 -181 94 268 101 -243 -321 -184 222 266 35 -335 -210 -55 129 182
1224A82l51m6J41J42R0n0k47n9J86j3K76j14k40j7J33Q7r1n1J76k36O3N5M4lm0
$$ 182 -169 -215 -74 68 158 108 -139 -198 -12 -25 251 137 -103 -120 13 100 9 -42 134 -102 -39 16 60 57 17
1249A7k07J44J13k2k4M1k97J12J78J4K6l15n5L44M2m3L3k53j8K25P5J22k48l45
$$ 17 -190 -46 67 45 21 62 -235 -123 55 69 95 -220 -275 69 111 68 101 -152 -170 55 130 252 4 -341
1273c41L31K92l2m4n22L7L23J86J31l81l30J45L21K46Jo13k04K48M61l6k50k55
$$ -341 -10 282 250 206 -316 -279 44 230 361 -20 -350 -205 116 362 363 -250 -454 -206 255 219 -31 -286
1295b86n2M11K46R5n99k58K63L51K42j92o12l8M32L11J18l90n49K14L49L38r3
$$ -286 -338 73 319 414 -185 -443 -180 171 413 221 -391 -429 3 314 432 42 -507 -293 56 394 301
1316C01o71j7K81M13J01m26m19J01L43M32J0n90l74K79M88L23l65n25j2L78K96
$$ 301 -370 -387 -106 307 408 -18 -437 -336 7 439 449 -141 -515 -236 252 575 210 -315 -327 51 347
1337C47Q7m80m04J19M99K47j13n41k23L30M10L4j85m17n7L41M57j96l51l69K41
$$ 347 434 -46 -450 -331 168 415 302 -239 -462 -132 278 312 127 -290 -347 -6 451 255 -96 -465 -224
1358b24L51K42k05n54qL50L45l0k53m92J10M40L30j01n32j84L44L42R8l06m07
$$ -224 127 369 164 -390 -398 -48 297 267 14 -478 -368 72 402 301 -231 -415 -71 271 369 63 -344
1379c44R5K88J73Q9l57k45J50J42L20k51k79m2K77R7K01k38j85m0J74Q1L3j94
$$ -344 -249 39 212 301 -56 -301 -151 -9 311 60 -219 -261 16 113 314 76 -109 -149 25 106 139 -55
1401e5j80J41J77M5r5n0o1J7J34J15r0k32M4J32J30l8k33J6P4j49J86J01k03J1
$$ -55 -235 -94 83 128 33 -17 -78 -61 73 188 98 -134 -90 42 172 134 -99 -83 -9 -158 28 129 -74 -63
1425f3jk2J19n5K5jk19K33J1k0Q6k21M6J97M9j0j21j56m5L33o9l4o6q6M0J34Q1
$$ -63 -64 -86 33 -22 3 2 -217 16 27 7 93 -128 -82 115 164 154 33 -123 -168 165 96 62 -4 -90 -50 84 165
1452A65k00n5q0K33J33L1k04j63J02J6K95j05k47j18J39K13J25j66k94R3J11J49
$$ 165 -35 -90 -170 63 196 227 23 -140 -38 -22 273 168 -79 -197 -58 155 280 114 -180 -87 24 173
1474A73L0k74k18L00J01K10j84m23K2J07L19R1j67l67P3K17K48p2l61j32K35K58
$$ 173 203 -71 -289 11 112 322 138 -285 -263 -156 163 254 87 -280 -207 10 258 186 -175 -307 -72 186
1496A86O9j40l81J59R1J61L3j93l36K05K34L12l27m16KL43K72rk85l86K85J55
$$ 186 255 115 -266 -107 -16 145 178 -15 -351 -146 88 400 73 -343 -341 2 274 265 -20 -406 -121 34
1518C4O1O8k72k10J65K63J67j86n30L46J15N4J13k01l82K39K58J24q3l11n1K65
$$ 34 95 163 -109 -319 -154 109 276 90 -440 -94 21 75 188 -13 -395 -156 102 226 143 -168 -219 46
1540D6R3J13m25L4R3J50J43k11p4j49R6K78N7j53l17J07P9K04N9k77j95J06R5
$$ 46 139 252 -173 -139 -46 104 247 36 -38 -187 -91 187 244 91 -226 -119 -40 164 223 -54 -249 -143 -48
1563d8K08m2k46j4R9J41kj20j00M5mJ37Q4k26M4r7J08J35O2l15J55n1J51J21j53
$$ -48 160 118 -128 -142 -43 98 96 -24 -124 -79 -83 54 138 -88 -44 -141 -33 102 164 -151 4 -47 104 225 72
1588G2j56P8n5P8o9J46j96k4J46N5m4p8p5R8J18p1m0M6j43J65k7kP1j05L1r1L4
$$ 72 -84 -6 -61 17 -52 94 -102 -126 20 75 31 -47 -122 -24 94 23 -17 29 -114 51 24 22 93 -12 19 -72 -38
1615c8J08J14j81j74P8J80j11Q6j53J18O9r3J79j93j59R1O9j06L00j79j95P6J56
$$ -38 70 184 3 -171 -93 87 -24 62 -91 27 96 3 182 -11 -170 -79 -10 -116 184 5 -190 -114 42
1638D2R1j70Kp1L8J41J99k79j51O4J39j31P0rj24J5J37OJ10k00J2l9J65K41l42
$$ 42 133 -37 -35 -106 -68 73 272 -7 -158 -94 45 -86 -16 -25 -149 -134 3 9 119 -81 -69 -108 57 298 -44
1663d4j31L1J98J29nk76k5Q9J87N0j64j68jJ56J54j58j7k43K38j95L57k1l13M8
$$ -44 -175 -144 54 183 178 -98 -123 -34 153 203 39 -129 -130 26 180 22 5 -238 0 -195 162 141 -172 -124
1687a24o7K94J20k04j96J51Q8J38o7k76J8J23L2J98j88j26k8j6L51Rk76j22p7
$$ -124 -191 103 223 19 -177 -26 62 200 133 -143 -125 -2 30 228 40 -86 -114 -130 221 230 -46 -168 -245
1710b45L00J36l7l15j77J59K61J3k3j34m8J53J24m2k43P2o9R4J83j68O0j65PJ89
$$ -245 55 191 154 -161 -338 -179 82 95 72 -62 -110 43 167 125 -118 -46 -115 -21 162 -6 54 -111 -104 85
1734H5J49l07q5J94o1K72j53j50j7N1j9R8j8j99Q7l8K38M3k42R6j69R7K26j00
$$ 85 234 -73 -158 36 -25 247 94 -56 -73 -22 -41 57 39 -160 -73 -111 127 170 -72 24 -145 -48 178 78
1758G8j78j1P4R9M7j49K9jK4J23n5r4L7o2O4l2R7p4Lj62J20R1p6k1p0nK38p5q9
$$ 78 -100 -111 -37 62 109 -40 -11 -12 12 135 80 -14 23 -39 25 -7 90 16 19 -143 -23 68 -8 -29 -99 -104 134 59 -30
1787c0L1p5J61P3k11L1Q0j09l4oL4pj3o8J74J48j1m4l41J28J19Q1j74KKL6m6J
$$ -30 1 -74 87 160 -51 -20 60 -49 -83 -89 -55 -62 -75 -143 31 179 168 124 -217 -89 30 111 -63 -61 -59 -23 -69 -68
1815f8J12l8j36KJ52J11j49j17l0K01J24p6j84p9K62Lj1o8j61K13p6L3l9J34k04
$$ -68 44 6 -130 -128 24 135 -14 -131 -161 40 164 88 -96 -175 87 90 79 11 -150 63 -13 20 -19 115 -89
1840h9m0J56J15m2k57J21qK0K24j49k18J74K4J30j02j86m2J41N5O6O5k58M3L5
$$ -89 -129 27 142 100 -157 -36 -44 -24 200 51 -167 7 31 161 59 -127 -169 -28 27 93 158 -100 -57 -22
1864b2J39J4j51p1l9K25Q9j26j40q5J06J80n9j54lM1Q4O6J8r4m9j17K41j8j2j21
$$ -22 117 131 -20 -91 -130 95 184 58 -82 -167 -61 119 60 -94 -97 -56 28 94 112 18 -31 -148 93 75 63 -58
1890e8on9J57Q5k8j80j74K33J69l4k65R1P7J21J5n2j84K5RJ00J32k17l9n6J00
$$ -58 -64 -123 34 119 91 -89 -263 -30 139 105 -160 -69 8 129 144 92 -92 -67 -58 42 174 -43 -82 -138 -38
1915c8K72k93K1o3P4L0M9M6j42NP0Q6j21q1P4J0q6J28Pl1j9j22J84M4l6j44p5
$$ -38 234 -59 -38 -101 -27 3 52 98 -44 -39 31 117 -4 -85 -11 -1 -87 41 48 17 -2 -124 60 104 68 -76 -151
1942a51J59N6L7k08oM4J07l3j37L0J70q0q9J25N7q6r4j44K65N2L5j32j98L03N3
$$ -151 8 64 101 -107 -113 -69 38 5 -132 -102 68 -12 -101 24 81 -5 -99 -243 22 74 109 -23 -221 82 135
1967A35j73O3r4J3J69j36q0M6N2%o5J6M2L5m3j59J17J51m0j25r4J05R2k%j8K2
$$ 135 -38 25 -69 -56 113 -23 -103 -57 -5 -5 -70 -54 -12 23 -20 -179 -62 89 49 -76 -170 -65 27 25 25 7 29
1994B9N8r6m7p3J19Lk6O8NP9j84j2K2J60j55j69M0K17N1m4r3m0J11J8PP2j89M5
$$ 29 87 -9 -56 -129 -10 -7 -33 35 40 119 -65 -77 -55 105 -50 -219 -179 38 89 45 -48 -88 23 41 48 120 -69 -24
2022b4K9JP6Rj06j28M1J29J98k53q4O3J18M8p7r7KJ67p4j22J20j00N5k9j3K19
$$ -24 5 6 82 91 -15 -143 -102 27 225 -28 -112 -49 69 117 40 -57 -55 112 38 -84 36 -64 -9 -38 -51 168
2048A68k45l9m1J02K76j27k13k6J61P3k2j27o1J95j50J38o9p8r4J79L5L5pj42
$$ 168 -77 -116 -157 -55 221 94 -119 -145 16 89 67 -60 -121 74 -76 62 -7 -85 -179 0 35 70 63 -79
2072g9lNJ66q8r2n2N4J31K35k76n7l3K16j58LJ02p6q2j1N1O0j6k0o2P1K2n5L2
$$ -79 -82 -77 89 1 -91 -143 -89 42 277 1 -56 -89 127 -31 -28 74 -2 -84 -95 -44 16 0 -20 -82 -11 11 -44 -12
2100a2j28J32O2K02k48j00J16qJ24p5q2M8M1qp4J28%r7pK3K1m6r3n3K17k8n4m0
$$ -12 -140 -8 54 256 8 -92 24 16 140 65 -17 31 72 64 -10 118 118 21 14 37 58 12 -81 -134 83 55 1 -39
2128c9j6l0J57%k6j26P1r3P3K8OR1r1m4J39N0o4j67j6Q8O4jj91L8J77n9l8K5k7
$$ -39 -55 -85 72 72 46 -80 -9 -102 -29 -1 5 96 5 -39 100 150 86 -81 -97 -9 55 54 -137 -99 78 19 -19 6 -21
2157b1J18l2k27K05M7o8j22L6O6O8n3k0k2J33j13Lj06J76j63N0O3Ok0M8l4p3q
$$ -21 97 65 -162 43 90 22 -100 -64 2 70 17 -3 -25 108 -5 -2 -108 68 -95 -45 18 24 4 52 18 -55 -63
2184f3R6n8K4J19j27O0k65K09J3p9J56N3k14J9R1m2R4j88J28q5l1J09n7J55r7
$$ -63 33 -25 -1 118 -9 51 -214 -5 8 -71 85 138 -76 -57 34 -8 86 -102 26 -59 -90 19 -38 117 20
2209B0j25J10J14o0k14J10Q0J23q9%j36n9R2J14j26m3J05r0M3j6N6Nq4K2R3Q3
$$ 20 -105 5 119 59 -155 -45 35 158 69 69 -67 -126 -34 80 -46 -89 16 -74 -31 -47 9 14 -70 -48 45 128
2235A28j82l7k6LJ45O8j88N6L3L7R0k26M8P1J8P2Ok6n3j85J34J50pk46J64j25
$$ 128 -54 -91 -117 -114 31 99 -89 -33 0 37 127 -99 -51 20 38 110 116 90 37 -148 -14 136 129 -117 47 -78
2261g8J39M1j77QK8J02M3j80j36J87K8L6o2k9n3j3K7M9J93j66J30k32J07J05j79
$$ -78 61 102 -75 -67 -39 63 106 -74 -210 -23 5 41 -21 -50 -103 -116 -89 -40 153 -13 117 -115 -8 97 -82
2286h2R2m8q5R0k6J2p8M6J41k0l7Oo6p6J34l5O0J5j56J79qk6ll1lM5R0j70O5l3
$$ -82 10 -38 -123 -33 -59 -47 -125 -79 62 42 5 11 -55 -131 3 -32 28 43 -113 66 58 32 29 -2 -5 40 130 -40 25 -8
2316hL6J5o1K4j21J52J5j36K23j71oOK9O0k06J55j42J0N4J00o3J5J22j31p1J31
$$ -8 28 43 -18 6 -115 37 52 -84 139 -32 -38 -32 -3 57 -149 6 -136 -126 -72 28 -35 -20 102 -29 -100 31
2342C1J0J7lm6pJ22q6j7k9J0M4j5q6k7R5K0K6n6k1o9J02Pj80J93q9p9R5O2j2K1
$$ 31 41 58 55 9 2 124 38 21 -8 2 46 31 -55 -82 13 33 59 3 -18 -87 15 22 -158 35 -54 -133 -38 24 12 33
2372C3n0n3J3P2Q2j99o1K8J66j06J06k8J5l2J15r6o2L0q3L2J11LQ4j10k2K2Q8
$$ 33 -17 -70 -57 15 97 -102 -163 -135 31 -75 31 3 18 -14 101 5 -57 -27 -110 -78 33 36 120 10 -12 10 98
2399I8o9m4m9J5M1l5N1lo6Q1lK8Kj09Q0m4P6j4l0k5pJ07o5k6K0j04J02j3J13j96
$$ 98 29 -15 -64 -49 -8 -43 8 5 -61 20 17 45 47 -62 18 -26 50 36 6 -19 -26 81 16 -10 10 -94 8 -5 108 -88
2429h8J08j09P8K8R2k17R3q1L3N9N8k31J94q4J39o9m3J40j70k5J82o7J2n8R4p6
$$ -88 20 -89 -11 17 109 -108 -15 -96 -63 -4 54 -177 17 -67 72 3 -40 100 -70 -95 87 20 32 -26 68 -8
2455hJ8L7n1L4j22J01J05p5On3l4J66j77N0k0j6N5o8L0JPL9l9M5q7k1L0pN7k2
$$ -8 10 47 -4 30 -92 9 114 39 45 -8 -42 124 -53 -3 -23 -39 16 -52 -22 -21 -14 25 -14 31 -56 -77 -47 -54 3 -19
2485a9n0O4K7L1j38k1M6J5M3M9k2j1n7o2J62j27P3k8P0j1rmM9p4k31K66j57J09
$$ -19 -69 -5 22 53 -85 -106 -60 -45 -2 47 25 14 -43 -105 57 -70 3 -25 45 34 25 21 70 -4 -235 31 -126 -17
2513a7q0M1L1m7N3P9l2J0l6q3L9O1K8j45P1k2K10j18M5l1K4n3l2L6k11K53l6p0
$$ -17 -97 -56 -25 -72 -19 60 28 38 2 -81 -42 19 47 -98 -27 -49 161 43 88 57 81 28 -4 32 -179 74 38 -32
2541c2O8L6p3p4O0J45r4p2K1K3q3J35r1J12j60P1j2l5O0j32M0J03l0P7j59R8q
$$ -32 36 72 -1 -75 -15 130 36 -36 -15 8 -75 60 -31 81 -79 -8 -20 -55 5 -127 -87 16 -14 63 -96 2 -6
2568fm7Qm2j1O6L0J11M9j93jR2p1J0J3j33L5J01O2o4k5P6j21O0R5m0j75k7J43
$$ -6 -53 -45 -87 -98 -32 -2 109 158 -35 -36 56 -15 -5 8 -125 -90 11 73 9 -16 60 -61 -1 94 54 -121 -148 -5
2596eR5j88J09j4rJ2P1k5o8K6n6K0J12p3p2o1K4J37%J5Kj9q5KJ59j55j2O2L1J03
$$ -5 90 -98 11 -3 -12 0 71 46 -22 4 -52 -32 80 7 -65 -126 -102 35 35 50 52 33 -52 -50 109 -46 -58 4 35 138
2626A38n4j20J1J20j01N6j11jk8J80j45J87J0j66L7M0mj29L7oO1%l4J21k51J16
$$ 138 84 -36 -25 95 -6 50 -61 -62 -90 90 -55 132 142 -24 13 53 49 -80 -43 -49 12 12 -22 99 -152 -36
2652c6j5J8O5r6J78j35R9p6n5J19q8R0j6r9R1J1r4N5k0P4M2j36N5o1k7Q4n9m5
$$ -36 -51 -33 32 -64 114 -21 78 2 -53 66 -22 68 52 -47 44 55 -39 16 -4 70 112 -24 31 -30 -57 27 -32 -77
2680g7J37r5O8P0m3j30J13j25%J15j18N8kj1MM4m8P9j7l5j04P6J36q0pJ15q0m5
$$ -77 60 -35 33 103 60 -70 43 -82 -82 33 -85 -27 -29 -40 -36 8 -40 39 22 -13 -117 -41 95 15 8 123 43 -2
2708bJ7l6k1P1JL1j63L1O3M9j63J2R9j0K4M2j39K00k88J09jQ3l7j7M4q8N9L0k9
$$ -2 15 -21 -42 29 30 61 -102 -71 -8 41 -122 -110 -11 -21 3 45 -94 106 -182 -73 -74 9 -28 -45 -1 -89 -30 0 -29
2737b9N3Q1r4l7n4P7r8O4P9n2L6J6p6P0Kr0M6P3ok4o1r7K29j98J37J1n9n6L9l1
$$ -29 24 105 11 -26 -80 -3 -101 -37 42 -10 26 42 -34 36 38 -52 -6 67 61 37 -24 -121 108 -90 47 58 -1 -57 -18 -49
2767d9P3n5J93k10Q3Kn7oM3n5k4J26pk0r1mJ1n5J02N7j10L2P8n5j59K07j09P5
$$ -49 24 -31 162 -48 35 37 -20 -26 17 -38 -62 64 57 37 -54 -58 -47 -102 0 57 -53 -21 57 2 -157 50 -59 16
2795A6k0O0L8l8j07J6J09j06J06j09j4L9J06j47J58k9l7J7k00J46M2p4M0j66R1
$$ 16 -4 56 94 56 -51 -35 74 -32 74 -35 -49 -10 96 -51 107 78 41 58 -142 4 46 -28 12 -154 -63
2820f3Q7r2m8O9P6r6N4j05J26m0l7J7Q6K3j07oJ18r4p0P3J16j09M8o7KJ18j03
$$ -63 24 -68 -116 -47 29 -67 -13 -118 8 -32 -69 -52 34 57 -50 -56 62 -32 -102 -29 87 -22 26 -41 -39 79 -24
2847b4M7l7Qq3Q1J36j16k2j10J66J19j47j22K13j69Q4kO6m6o5N4K9j20J26r1O6
$$ -24 23 -14 -6 -89 -8 128 12 -10 -120 46 165 18 -104 109 -60 24 22 88 42 -23 31 60 -60 66 -25 41
2873D1o5L8N5R0j78o5J33j09K8Q3j1N8j58R3q6q7J28J3l4J10n9p3q1K85r1J3r1
$$ 41 -24 14 69 159 -19 -84 49 -60 -32 51 40 98 -60 33 -53 -140 -12 1 -33 77 18 -55 -136 149 58 71 -20
2900b0NJ15n5k0k0n5J4L7Pn8%Q2p7R1J9p0J17j50J8LPO9R6j86J35j54N5J35j60
$$ -20 -15 100 45 25 5 -50 -36 1 8 -50 -50 32 -45 46 65 -5 112 -38 -20 -17 -10 59 155 -31 104 -50 5 140 -20
2929b0L2oro5L5J11k02K15j36J27k4L7n9j1j5J3k3o4M2J30j35M8M1j10K3L3Lj18
$$ -20 12 6 -3 -68 -33 78 -124 91 -45 82 58 95 36 25 10 23 0 -64 -22 108 -27 21 62 -48 -25 8 11 -107
2957a07J19L2K9j4l8j39R5m3J15j22J01J7o9kN5r4N7m3o2J23J5K2q4J34p2R1m8
$$ -107 12 44 73 59 21 -118 -23 -66 49 -73 28 45 -24 -26 29 -65 -8 -51 -113 10 25 47 -37 97 25 116 68
2984F8p5R4k9p5j5l5K4kk9J8M7ml2N0l6J10j54J2K4M7k9j0l8J17j55K35k01O2
$$ 68 -7 87 58 -17 -32 -67 -43 -45 -74 -56 -9 -13 -45 5 -31 79 -75 -63 -39 8 -21 -31 -69 48 -107 128 -73 -11
3012a1K2k2O5q4p9J26R0j35rJ0J6Nj3J2jLP5j54N1P3o0J02k4k8n5R2l8op7K2j0
$$ -11 11 -11 54 -30 -109 17 107 -28 -37 -27 -11 -6 -19 -7 -8 -5 70 -84 -33 40 -20 82 58 30 -25 67 29 23 -54 -32 -42
3043d2Q7j2oJ0Jo9J7N8M2m7o2O9k0j15J10j00M2n3P2Lm0pJ00p2P6j6J5Om7k5P7
$$ -42 45 33 27 37 38 -31 -14 44 86 39 -23 46 26 -89 21 -79 -37 -90 -18 -15 -55 -62 38 -34 42 26 41 47 0 -25 52
3074E2J22j33j25L1j1j14J41M9j15J72l0NK2j55J01l2J55l6r9J50k56J40j5K6
$$ 52 174 41 -84 -53 -64 -178 -37 12 -103 69 39 44 66 -89 12 -20 135 99 0 150 -106 34 19 45
3098D5p0L5N5j06N9q0l1R2K0m8K0R5l4J2Ml6o5j29O9N2O8L7k1m4j4k7J04Nm6J8
$$ 45 -25 10 65 -41 18 -62 -93 -1 19 -29 -9 86 52 64 68 32 -33 -162 -93 -41 27 64 43 -1 -15 -42 62 67 21 39
3128C9j27L4k5N3L6l5J40Pj61l6J61k9RL9j68J43j60O1J0K3q8J16j4r5L3Pn4m
$$ 39 -88 -54 -79 -26 10 -25 115 122 -39 -75 86 57 66 105 -63 80 -80 -19 -9 14 -74 42 28 -67 -34 -27 -81 -85
3156h5O7j27J65k0PK1L0n6r7N5k1J4N2j46K00j05Q0p4N8oj32J33J3l2N7l6M8p8
$$ -85 -18 -145 20 0 7 28 58 2 -95 -40 -61 -47 5 -141 59 -46 34 -40 18 12 -120 13 26 -6 51 15 63 -15
3184a5MJ2R2j18k8m3J25r6L1J20l9j38J30l7M2klj43J17J3o7M4K9M6n0O6K0j73
$$ -15 -11 1 93 -25 -53 -96 29 -67 -36 84 45 -93 37 0 42 40 37 -106 11 24 -43 1 30 76 26 92 112 -61
3212f1k2o3J18L1K4M1n6K9j22J19O0j47O7K3N5j6o2qj02J28j03J05m5n4J50o3
$$ -61 -83 -146 -28 3 27 68 12 41 -81 38 98 -49 18 41 96 80 18 10 -92 36 -67 38 -7 -61 89 26
3238B6n3J9r9J10ko4J04o8M2J46k43k7J49j9K0j05L7O4p9jO8O3j16J7R0j08o0
$$ 26 -27 -8 -107 3 1 -63 41 -27 15 161 -82 -109 40 21 41 -64 -27 37 -42 -43 25 88 -28 -11 79 -29 -89
3265h9J08n4N9O7j32n7K2J58l8j28m0J42l4k3L5J0j00J32j9N3j61J27j18N9K5
$$ -89 19 -35 24 91 -41 -98 -76 82 44 -84 -124 18 -16 -39 -4 6 -94 38 19 72 -89 38 -80 -21 4
3290Dk6L8l3Kj7J26j41J73j17n7N9j28M8Nl8J71q8L4j13J10N2k0k8km3oL4K2p2
$$ 4 -22 16 -17 -15 -32 94 -47 126 9 -48 11 -117 -69 -64 -102 69 -19 15 -98 12 64 44 16 14 -29 -35 -1 21 -51
3319e1L4r8J11k0J31j16m4P7j00R2o3r2L1P8J25k7n7M6p4l0J04m0j00Q6O3j13
$$ -51 -17 -115 -4 -24 107 -9 -53 24 -76 16 -47 -139 -108 -30 95 68 11 57 -17 -47 57 17 -83 3 66 -47
3345d7J8J9l5l3J22M0N8k07J93k38J83n9P9j06j01N9O3m6P6j33R5n2N9J03n3j7
$$ -47 -29 -10 -45 -78 44 84 142 -65 128 -110 73 14 93 -13 -114 -55 8 -38 38 -95 0 -52 7 110 57 40
3371D0p1j9J34O2j65j1m0K5R9o5l4N1%n3M7J10j73J07m5K3qM1o1M2k6k8R0m5J7
$$ 40 -31 -50 84 146 -19 -30 -70 -45 54 -11 -45 6 6 -47 0 110 -63 44 -1 22 14 55 -6 36 10 -18 72 27 44
3400D4j8j31N4j8J12q7O0j1l7jl5n2N4jJ27j42l1P8j05J70j48rK07n5n5M6n5P9
$$ 44 26 -105 -51 -69 43 -44 16 5 -32 -33 -68 -120 -66 -67 60 -82 -113 -35 -140 30 -118 -127 80 25 -30 16 -39 40
3428D0r2m2J40m4J6j21P5m6N8O0j13k6P6J19p9l4M7k35K87j56R9n7R5k8p9J53
$$ 40 -52 -94 46 2 18 -103 -28 -74 -16 44 -69 -95 -19 100 21 -13 34 -201 86 -70 29 -28 67 39 -40 113
3454A13k24J90j41KM4N0n7Q8k5qM0K6j11r7J33K6j2j14J76l7q2J8J55j78J4K0
$$ 113 -111 79 -62 -60 -16 34 -23 65 40 32 72 98 -13 -110 23 49 37 -77 99 62 -20 -2 153 -25 -11 9
3480IL5l7p5J36j03N0p7Q9R5q1q7k7P5n9N9J07j54m4k2O7J81j30L3j11J65q3K2
$$ 9 44 7 -68 68 -35 15 -62 27 122 41 -46 -73 2 -57 2 109 -45 -89 -111 -44 137 7 40 -71 94 11 33
3507C3K6n1m6M9Q1q9P3l4q8P0k0m9Q7M7l0j49O0j3Q7p1K3O8J7k24Q6J23q3j01
$$ 33 59 8 -38 11 92 3 76 42 -46 24 4 -45 42 89 59 -90 -30 -43 44 -27 -4 64 81 -143 -57 66 -17 -118
3535a18Q6J1m7j1J63j28Q9j2m2mO6K7j96N4p4J44p9K5P5j51J07L6n7l4O2j3P5
$$ -118 -32 -21 -68 -79 84 -44 45 33 -9 -13 53 80 -116 -62 -136 8 -71 -46 29 -122 -15 21 -36 -70 -8 -21 54
3562E4Oj15M3p7J31M0m8j40J33o4m8M7qOK7L1L2N7l3j64N7K9P1j38N9O6j00J02
$$ 54 60 -55 -12 -89 42 82 34 -106 27 -37 -85 -38 -46 -40 -13 18 50 107 74 -90 -33 -4 67 -71 -12 54 -46 56
3590E6J7j45R6L9k9M6j02J30l3o1n6K8R0j30J20qp5o0qJ19r5Q4p8O7k4l4o5J18
$$ 56 73 -72 24 63 34 80 -22 108 75 14 -42 -14 76 -54 66 58 -17 -77 -85 34 -61 23 -55 12 -12 -46 -111 7
3618Gn2R3j04p4P5O5l7N3j34J06oL9Q2k02l7Q5P2o2J14Q1j57q8O9Q2k3k6j54J81
$$ 7 -45 48 -56 -130 -55 10 -27 26 -108 -2 -8 31 113 -89 -126 -41 31 -31 83 164 7 -81 -12 70 47 21 -133 48
3646D8o6L0j4K6o7M7o0p9Q8O2m2L1L2m4k6R8o1j32K0J64Mk04J22j7L7j4j3l8K29
$$ 48 -18 12 -2 24 -43 4 -56 -135 -47 15 -27 4 36 -8 -34 64 3 -129 -109 55 59 -145 -23 -40 -3 -17 -30 -68 161
3675A61L9q9j44L9o1l3O8K1J9J18k24J72n5l7O3j63K00r0pM3K7J3o0l4r6K22j20
$$ 161 200 111 -33 6 -55 -88 -20 1 20 138 -86 86 31 -6 57 -106 94 4 -3 40 67 80 20 -14 -110 112 -8
3702hlm5Q1n9K6l1O0k5p1L9K3J28j33M3m0P8j58K7Q0k0K5oO0q0K0l9oL4K8j20
$$ -8 -11 -56 25 -34 -8 -39 21 -4 -75 -36 -13 115 -18 25 -15 63 -95 -68 12 -8 17 11 71 -9 11 -28 -34 0 28 -92
3732i2J41L3j35M8l2%Q6j11P7%q3o5K92j22P3j38J5RQM5K1m7k0m9m3J03j29P4
$$ -92 49 82 -53 -5 -37 -37 49 -62 15 15 -68 -133 159 37 110 -28 -13 -4 4 49 70 23 3 -46 -89 14 -115 -41
3760d1J8Kpj2M0k1p7J05n8n6J41n9Or8N8k7R0j3p7J35r0n6R9%p8J63k2j05l1j6
$$ -41 -23 -21 -28 -40 0 -21 -98 7 -51 -107 34 -25 -19 -117 -59 -86 4 -9 -86 49 -41 -97 2 2 -76 87 65 -40 -71 -87
3790h7L4J42j29P6o8k1M5n4J27p9L6pm1N1m1p1Q8J28j80L5Q4p7r4J49p6Rj2l6
$$ -87 -53 89 -40 36 -32 -53 -8 -62 65 -14 22 15 -26 25 -16 -87 1 129 -51 -16 68 -9 -103 46 -30 -21 -33 -69
3818f9r8J89l3n0R4n2l0j9j2J9k7J62j08M1n1l9Q0R3j84j3J68k2p1N3M7j09R5
$$ -69 -167 22 -11 -61 33 -19 -49 -68 -80 -61 -88 74 -34 7 -44 -83 -3 90 -94 -107 61 39 -32 21 68 -41 54
3845E4q1L4M5m4k2K8J5n1j0J7L0r3Q2n3J12p3n4j7K21k07k3Q0r9J94j47O7j5J21
$$ 54 -27 7 52 8 -14 14 29 -22 -32 -15 15 -78 4 -49 63 -10 -64 -81 140 -67 -90 -10 -109 85 -62 5 -10 111
3873A11m7j35J0JQ5p5N8o9L4K4L0Jm9J5J2r2K7J40j11J38r4LJ1j00J15kj18N3
$$ 111 64 -71 -61 -60 25 -50 8 -61 -27 -3 27 28 -21 -6 6 -86 -59 81 -30 108 14 17 28 -72 43 41 -77 -24
3901b4n9P6L8o4P5p6Q0q8M8Nm8Q5o3N0n7N2mk9M4k6k1R5p7QL4l0k7O7q1j6J4r
$$ -24 -83 -7 31 -33 42 -34 46 -42 6 11 -37 48 -15 35 -22 30 26 -3 41 15 -6 89 12 20 54 24 -3 64 -17 -33 -19 -28
3933b8R0j2j5RL9n5j34J55k1n7P2n6O4m0q3J13j80J39oj36Q4k2N3R7pq4K3N8j63
$$ -28 62 50 35 44 83 28 -106 49 28 -29 43 -13 51 11 -72 41 -139 0 -6 -142 -58 -80 -27 70 63 -21 2 60 -103
3962a03R8M0l4r9K9L1j8mQ6j32Q4qL8j8Q8n7L8p2J30o7jo6L7P5j82J41j10J17
$$ -103 -5 35 1 -98 -69 -38 -56 -60 26 -106 -22 -30 8 -10 78 21 59 -13 117 50 49 -17 20 95 -87 54 -56 61
3990F1j09L7Lp8L%O0P6j23J0J3J09p5qk8NJ58j43j2m1N9p5J01k2N0l1nL5p0p1
$$ 61 -48 -11 -8 -86 -83 -83 -23 53 -70 -60 -47 62 -13 -21 -49 -44 114 -29 -41 -82 -23 -98 3 -19 31 0 -5 30 -40 -111
4020a11J38j8J5l4j4%P9n7K2j0p6O2n9m8Q5N9L6k4j6n4P5m3n0P6j31L9J39j17
$$ -111 27 9 24 -10 -24 -24 55 -2 20 10 -66 -4 -63 -111 -26 33 69 45 29 -25 50 7 -43 33 -98 -59 80 -37
4048c7q2J75n5k1lM6K6knl6N1l4o5NJ11n4K4p5m1O5k5n7J0P0L6L3m4N1m6p8R5
$$ -37 -119 56 1 -20 -23 23 49 47 42 6 57 23 -42 -37 74 20 44 -31 -72 -7 -32 -89 -79 -9 27 60 16 67 21 -57 38
4079C8L6q7j5R4rRlj09R4j49J42q4R7q8Q8J3J5j27P3Q7n1q7O7m6k4K9R1j22nJ46
$$ 38 74 -13 -28 66 57 66 63 -46 48 -101 41 -43 54 -34 54 67 82 -45 28 115 64 -23 44 -2 -26 3 94 -28 -33 113
4109A13r4m6L7p5M2j0L6j24Q2N3n4PQ1r0JK39j84r7R2j33K17j69K7Q6M3k7m4j0
$$ 113 19 -27 10 -65 -23 -33 3 -121 -39 14 -40 -33 48 -42 -41 198 14 -83 9 -124 93 -76 -49 37 80 53 9 -1
4137aL5j03J02J7J3o1k3J8L0P3j15P1r9L1M3P2j19r1K56l1j16j3O6j46J62o7K
$$ -1 34 -69 33 50 63 2 -21 -3 27 100 -15 56 -43 -12 31 103 -16 -107 149 118 2 -11 55 -91 71 4 6
4164Fn0J43j97K9J26j73N8Ql7J68j01j2n5J33q4J44j6j35J33j70J25p9R1Kq2N4
$$ 6 -44 99 -98 -69 57 -116 -58 -50 -87 81 -20 -32 -87 46 -38 106 90 -45 88 -82 43 -36 55 57 -25 29
4190B9K6o1P8j08R9r1J9l0l7j5N7pK7j7j5J00l1m1l5o7N4N1N3j21qJ28m6k0L4
$$ 29 55 -6 72 -36 63 -28 -9 -39 -76 -91 -34 -41 -14 -31 -46 54 23 -18 -53 -120 -66 -15 38 -83 -91 37 -9 -29 5
4219EK9r5K7l1O6J16j07nl7LN6j18M2J3n5R7m0j0j22K11%n2K8Lo8m6P0O1q5J9
$$ 5 34 -61 -34 -65 1 117 10 5 -32 -29 27 -91 -49 -36 -91 6 -34 -44 -166 45 45 -7 21 24 -44 -90 -20 41 -44 -25
4249b5K6R1n7j04P5o1qm9J23R9j35L2O7n1j16J76j88J31j1m%qp0J6m8J32j08J09
$$ -25 1 92 35 -69 6 -55 -63 -112 11 110 -25 7 74 23 -93 83 -105 26 15 11 11 3 -67 -51 -99 33 -75 34
4277C4L4j30K6lP1l0kJ7m1r9K05r3l4L5O2K7mq2j0k0OJ02r5n1J29p5mL5J20q6
$$ 34 68 -62 -36 -39 32 2 0 17 -24 -123 82 -11 -45 -10 52 79 75 -7 -17 -37 -31 71 -24 -75 54 -21 -25 10 130 44
4307D4j1j05K0Q3k5n0K1J09j17nR0j81J15k5O%RNQ2m1l2LM6p5%M0j08J04N9j28
$$ 44 33 -72 -52 31 6 -44 -23 86 -31 -36 54 -127 -12 -37 -31 -31 -22 -17 65 24 -8 -5 41 -34 -34 6 -102 2 61 -67
4337f7Q1PK4o7Q4m7oo2J38j20M6j02M7q5P8J42j41J34m4J07j63P3m2l0n9N8o8
$$ -67 14 21 45 -22 62 15 9 -53 85 -35 11 -91 -44 -129 -51 91 -50 84 40 147 -16 57 15 -15 -74 -16 -84
4364h4L6m9Q8M1J0j8m9m7P4o9p1J86j57J79J14j84pn8N4J25j43K7l0M7Jk3l4J22
$$ -84 -48 -97 -9 32 42 24 -25 -72 2 -67 -138 48 -109 70 184 0 -7 -65 -11 114 -29 -2 -32 15 16 -7 -41 81
4392H1j58R3k8QM6n7l6J16j16j0M1P5j26R4J4K9k1j53J6J86Nj49Q4j04JR7l2K5
$$ 81 -77 16 -12 -4 42 -15 -51 65 -51 -61 -20 55 -71 23 37 66 45 -108 -92 94 99 -50 34 -70 -69 28 -4 21
4420B1q7J15Mr2pK4M3p0M3J1M3Oj02P8j39J45q0jL8j33R2l2J50j59Q2p3J12o7
$$ 21 -66 49 53 -39 -46 -22 21 -49 -6 5 48 54 -48 30 -109 36 -44 -45 -7 -140 -48 -80 70 -89 -7 -80 32 -35
4448c5P2J05n0r4Km9M2l2r4J96Q5j70Q7L2j45J11k8K3k6q4R8m4r7RR3l5J46M0
$$ -35 37 142 92 -2 0 -49 -7 -39 -133 63 148 -22 65 97 -48 63 35 58 32 -52 46 2 -95 -86 7 -28 118 158
4476A58k68M9K0M0j3l0l9J66j63R3o1J1K4N0kK0j0n1Rj04J96n1J08j61M3j06J72
$$ 158 -110 -61 -41 -1 -14 -44 -83 83 -80 13 -48 -37 -13 37 35 55 45 -6 3 -101 95 44 152 -9 34 -72 100
4503A00j02l8Q8o6oP4q1L4o8J97k31Q8K1jq3J11K2l1j20J03p3K05k34p8K21m0
$$ 100 -2 -40 48 -18 -24 50 -31 3 -65 132 -99 -11 10 9 -74 37 59 28 -92 11 -62 143 -91 -169 52 12
4529A2M3m0OK1j61J26O3m0o8J29j62oP5k4O5r7L3m6Q9J14k07J00P2m5K2n0J9j15
$$ 12 55 15 21 42 -119 7 70 30 -38 91 -71 -77 -2 -26 39 -58 -25 -71 18 132 -75 25 97 52 74 24 43 -72
4557g2l3J14L6r2KM7rj9nK1J5Q7o6j32k4J33J01j56N7j58J22Jn3J7P6l9Q1jm5
$$ -72 -105 9 45 -47 -45 2 -7 -26 -31 -10 5 92 26 -106 -130 3 104 -52 5 -153 -31 -30 -83 -66 10 -29 52 51 6
4586FK9j10j7O7j0O6k2M1K1l7ko6KJ02q3J6j20J76m3l1R6p6k8%K2PJ09j26P4r3
$$ 6 35 -75 -92 -25 -35 31 9 50 71 34 32 -34 -32 70 -13 3 -117 59 16 -15 81 5 -23 -23 -1 6 115 -11 63 -30
4616c0P6j0kl3r5M5N6L8q8J1M9J2o9O2lo6O0n3P2l0op0R2J2j3K6qQ4j08P7p3L4
$$ -30 46 36 34 1 -94 -49 7 45 -43 -32 17 29 -40 22 19 -47 13 -40 32 2 -4 -74 18 30 17 43 35 119 11 88 15 49
4648D9n6JK2k9L9l5j19J34jRj4K9r0J33K6j28N9K7j13J7K1J46j09p7L9N2o9k5
$$ 49 -7 -6 16 -13 26 -9 -128 6 5 14 0 29 -61 72 98 -30 29 56 -57 -40 -19 127 18 -59 -20 32 -37 -62
4676f2O9o5K8J43n8r1J05m4j1L8j17O4%K5J9j6N0Pj54Q9k2j5k2L3r3J63kJ3r9
$$ -62 7 -58 -30 113 55 -36 69 25 14 52 -65 -1 -1 24 43 27 77 84 -70 19 -3 -18 -40 -7 -100 63 61 74 -25
4705b5K1J20j10q9P3M1k9J17p5r8M3K1q3J17j42Q4L4N7m2kn8M2k2J82k07L2J3
$$ -25 -4 116 6 -83 -10 31 2 119 44 -54 -11 10 -73 44 -98 -14 20 77 35 33 -25 17 -5 177 -30 2 15
4732A5n7J31j60J02n0j4K9j4J40j85M6J03j09J7N6k6rk8J07j10Q4l1j0r6R8K1
$$ 15 -42 89 -71 31 -19 -33 -4 -18 122 -63 -17 86 -23 -6 50 24 15 -13 94 -16 68 37 27 -69 29 50
4758E0Mm2r0J41r8L6ll0O2M2j15K5K9M4j75J46K7n4O2j29k1J28j52J19N5j43R1
$$ 50 54 12 -78 63 -35 1 -2 -32 30 72 -43 -18 11 55 -120 26 53 -1 61 -68 -89 39 -113 6 61 -82 9
4785IK9m5J9m9P1j21J27m8n4j8J13J54k22l3J13o3j7m3J21N4r7J2j1p5Q2Qp9Q4
$$ 9 38 -7 12 -37 34 -87 40 -8 -62 -80 33 187 -35 -68 45 -18 -35 -78 43 97 0 12 1 -74 8 16 -63 21
4813B1l0N6j14j3J34m7o5MP5j18Q9j6R1j91J36o5Q0p5N7j11J14j9m4M9q4P5J2
$$ 21 -9 47 -67 -80 54 7 -58 -54 21 -97 -8 -24 67 -124 12 -53 27 -48 9 -102 12 -7 -51 -2 -86 -11 1
4840Ar1J8Q5Ml6J0l4pN4M5r6R5j2l5J8j17P5Qk8J10pm6R5m5q5j8j17J51o0O2Q0
$$ 1 -90 -72 13 17 -19 -9 -43 -50 4 49 -47 48 36 1 19 -98 -23 -15 -43 67 60 14 109 64 -21 -39 -156 -5 -65 -3 77
4871G7j08nL3K6j11O5j7J7J4m6p1J44J09j98Q0j5KK8r6J2J39j00n3NP2r1O9oM0
$$ 77 -31 -36 -3 23 -88 -23 -40 -23 -9 -55 -126 18 127 -71 9 -6 -4 24 -72 -60 79 -21 -74 -69 3 -88 -19 -25 15
4900A5J3j7M9L9q0kR1j09J8p8J47k03N6Q6n8jm4j1J5O7l3P2M7k10R9PR9m3M0r
$$ 15 28 11 60 99 19 17 108 -1 17 -61 86 -117 -61 25 -33 -34 -78 -89 -74 -7 -40 32 79 -131 -32 -25 74 31 71 62
4930F2m7j7j4o0Q3J8r5Q6q7N2n3P0m5RLQ9N6j35oLQj34J87k7qj59Q0k6P6j9M0
$$ 62 15 -2 -16 -76 7 25 -70 16 -71 -19 -72 -2 -47 -38 -35 54 110 -25 -31 -28 -20 -154 33 6 -2 -161 -81 -107 -31 -50 -10
4961a0k2k7Q4Q9q7j39O3J34q7L0j5m4Q4j93J86pr2J17r5N8q2k5P1M8r1R6o8pK1
$$ -10 -32 -59 25 114 27 -112 -49 85 -2 28 13 -31 53 -140 46 39 -53 64 -31 27 -55 -80 -9 39 -52 44 -24 -31 -10
4990a0k1O0j05R1n7R3q3J05j63J00M1j05M5Rj16N1J13j23N4J89j6j57q7k3J32
$$ -10 -31 29 -76 15 -42 51 -32 73 -90 10 51 -54 -9 0 -116 -65 48 -75 -21 168 152 -5 -92 -115 17
5015A7j0n6R5j69Q8L4j27J59l4j5L5k1j42K37o7k2j9K8l1M9r4q8R7J03j8j25m9
$$ 17 7 -49 46 -123 -35 -1 -128 31 -3 -18 17 -4 -146 91 24 2 -17 11 -20 29 -65 -153 -56 47 29 -96 -145
5042a45J12J33j94K6J0Q4qK4l0Lo5J5M1J0j6L1M7j12M2K7k7Pl5K7j13J91l3K6
$$ -145 -33 100 -94 -68 -58 26 18 42 12 15 -50 -35 6 16 0 31 78 -34 8 35 8 15 -20 7 -106 85 52 78
5070G8l4o7k4R3Lo5Qj9K3M5L2n6M1j62J25j4j10K40j97R9pM0q1O4j70K03k4k8
$$ 78 44 -23 -47 46 49 -16 -8 -27 -4 41 73 17 58 -104 21 7 -103 137 -60 39 32 72 -9 55 -115 88 64 36
5098C6n2moR6j40J36pj30P0J6J18k42M8J33m0o3L7J7m7R9r9O5Rl1ql0N4K7q6P0
$$ 36 -16 -20 -26 70 -70 66 59 -71 -1 15 133 -109 -61 72 32 -31 6 23 -24 75 -24 41 50 19 11 -19 35 62 -24 46
5128D6j57m6J90n5l0P3r9K4Q6m4K9O8j84J68Pm1N4j22j22J16k3lL8J6JK3R1p2
$$ 46 -111 -157 33 -22 -52 21 -78 -54 32 -12 17 85 -99 69 76 35 89 -33 -155 -39 -62 -65 -27 -11 -10 13 104 32
5156C2Q7j49j35J16R8mm3J5J5rk9nN4r3J9J15r8p4Q0Ll7P0j1j4k3L4Po4RO9l2
$$ 32 119 -30 -165 -49 49 45 2 17 32 23 -6 -11 43 -50 -31 84 -14 -88 -8 -5 -42 28 17 3 -20 14 21 -43 -34 35 3
5187CJ22j16o3Kl1M5L7k1M4o6N3O3q9R3j75p3O1O8q9k0K10j86J10K2p5O7m5J46
$$ 3 125 9 -54 -52 -83 -38 -1 -22 22 -44 9 72 -17 76 -99 -172 -111 -43 -132 -152 58 -128 -18 4 -71 -4 -49 97
5215I7j82RJ01k2mQN4j04J19j7j17J8P9j72J72K2j06J1J8K7J34j67K9p2O5J21
$$ 97 -85 -76 25 3 -1 7 61 -43 76 59 -58 -40 39 -133 39 61 -45 -34 -16 11 145 -22 7 -65 0 121
5241A21j40J14j60q3K15j14oL0K0r4J05o2M8k6n1L6%L4No4P5M9O2k04m1J94j08
$$ 121 -19 95 -65 -148 67 -47 -53 -23 -3 -97 8 -54 -6 -32 -83 -47 -47 -13 -8 -72 3 52 114 -90 -131 63 -45
5268d5K1O5o0M7q5L5O4q5J01k0J7n0nN8m6l4M0m9P7kj50M9M1k8Q6o3qj62J79M5
$$ -45 -24 41 -19 28 -57 -22 42 -43 58 38 55 5 0 58 12 -22 18 -31 46 44 -106 -57 -16 -44 42 -21 -29 -191 -12 33
5298C3p5mN2m2M4j18O6J21j19l9J31j14J10Qo2m3M8L5k1P5q9Jn0J07o3J5q2R6
$$ 33 -42 -46 6 -36 8 -110 -44 77 -42 -81 50 -64 46 54 -8 -51 -3 32 11 86 -3 -2 -52 55 -8 7 -75 21
5326B1q2J83m3j13L3J7mr7Q2M7n8J02P2o9j31jl3P7kj60K00jr7Q2n2M5mNp9Q5
$$ 21 -61 122 79 -34 -1 16 12 -85 -3 44 -14 88 160 91 -40 -41 -74 3 1 -159 41 40 -57 25 -27 18 14 19 -60 25
5356B5o2J8n1M1qR4q6NM2j35K05j34M8L1ln8O1k4o3J02Mj3jj41O2L0L1q5J10l0
$$ 25 -37 -19 -70 -29 -37 57 -29 -24 18 -117 88 -46 2 33 30 -28 33 9 -54 48 52 39 38 -103 -41 -11 20 -65 45 15
5386A5j21M3J45j56J32j73J27j1q4J08k6K1m7J01N9q1r0O6j05R7J5q3Q5l2j21
$$ 15 -106 -63 82 -74 58 -115 12 1 -83 25 -1 20 -27 74 133 52 -38 28 -77 20 35 -48 37 5 -116
5411a16J51k5k9O6n3k2k0j14J48L1K0p1R6j30O7K6l6n9N9j9n3J14O7j36N3L7r3
$$ -116 35 10 -19 47 -6 -28 -48 -162 -14 17 37 -34 62 -68 -1 25 -11 -70 -11 -30 -83 31 98 -38 15 52 -41
5438d1J9Qj5J36o6J09j28j6K7r4L9k1N8pJ11o7j07L5m9J09p9NQ4j01j05J87q3
$$ -41 -22 -14 -29 107 41 150 22 6 33 -61 -22 -43 15 8 119 52 -55 -20 -69 40 -39 -34 50 -51 -156 31 -52
5465e2l8l1R4p9J32r4k2k4M4J32%j46O8o3Q7P8q0pR6j11M6%j91J25K08j78j22
$$ -52 -90 -121 -27 -106 26 -68 -90 -114 -70 62 62 -84 -16 -79 8 86 6 -1 95 -16 30 30 -161 -36 172 -6 -128
5492a28P8R1j4m8R1j41P4n8N6q5J89j16m7P5j2j27mM2P7o0J14p8m6J25q7M4o3
$$ -128 -50 41 27 -21 70 -71 3 -55 1 -84 105 -11 -58 17 5 -122 -126 -84 -7 -67 47 -31 -77 48 -39 5 -58
5519e8j3O8J9O1q7O9r4Q9j57J14Kl3L6p4O9k7N2j42J55qk4L7o2j9j6l5M3K3J0
$$ -58 -71 -3 16 77 -10 59 -35 54 -103 11 13 -20 16 -58 11 -16 36 -106 49 41 17 54 -8 -27 -43 -78 -35 -12 -2
5548bK6P2q1q5J08l7Kq9J49N2Qj51%J42j71J32j9o5N2m9r1J74j30J8M9j4J08p1
$$ -2 24 96 15 -70 38 1 3 -86 63 115 123 -28 -28 114 -57 75 56 -9 43 -6 -97 77 -53 -35 14 0 108 37
5576C7n8J1r4K6K4L6J8K5J7j03mj7J22j82J43q8J01Oj17J20r0k2j8J63J03k42
$$ 37 -21 -10 -104 -78 -54 -18 0 25 42 -61 -65 -82 40 -142 1 -87 14 20 -97 23 -67 -89 -107 56 159 -83
5602h3J11o7ok1M0J6N2P0j90Q6n4qM2jn6J56m9j31RK4PJ08n0M3j4j02Q7p4m9J83
$$ -83 28 -39 -45 -66 -26 -10 42 112 -78 8 -46 -54 -12 -13 -69 87 38 -93 -84 -60 -53 55 5 48 34 -68 19 -55 -104 79
5632G9m6q2R5m5J2j30J03K9jL3m5K3j9P2Qj03L1r6R0j11J02o6JQ4M2p0K9mk9N
$$ 79 33 -49 46 1 13 -117 -14 15 14 47 2 25 6 78 86 -17 14 -82 8 -103 -1 -67 -66 18 60 -10 19 15 -14 -9
5662in7OmN3%O3o8J6Jo0J9O1J2j23J15q5J4R0J1j13OK6J4QK1j5N6q9K1J8J14j08
$$ -9 -66 -60 -64 -11 -11 52 -16 0 1 -59 -40 21 33 -90 25 -60 -46 44 55 -58 -52 -26 -12 -4 17 2 58 -31 -10 8 122 14
5694A4J4l8rk8P3o4R8j30J01r2J25k1n1p1R1RK8J4k8k6QK6j02m0J39J5j44J16
$$ 14 28 -10 -19 -47 26 -38 60 -70 31 -61 64 43 -8 -79 12 21 49 63 35 9 17 43 -59 -99 40 55 -89 27
5722B7pKJ9n0j72J32Q6jQj55J96q0J6lqK2l4P3j45J17RJ4j56N6m4J20Ql6J5qk0
$$ 27 20 22 41 -9 -181 -49 37 36 44 -111 85 5 21 18 10 32 -2 71 -74 43 52 66 -90 -34 -78 42 50 14 29 21 1
5753AK2l7m4J23j20jJ43n7k17K16o0j3P7j29J87lk8j0%Q6r0j8Rp8QO6m8p5J29
$$ 1 23 -14 -58 65 -55 -56 87 30 -187 29 -31 -44 33 -96 91 88 60 50 50 136 46 28 37 -41 -33 33 -15 -90 39
5782C9k9k8N4l3lp6Q1N6N4j88N2OM3o7rJ15J1r7n8L4R6n6r0J11k3p3J66r8m5P
$$ 39 10 -18 36 3 0 -76 5 61 115 -73 -21 -15 28 -39 -48 67 78 -19 -77 -43 53 -3 -93 18 -5 -78 88 -10 -55 -48
5812d8J21j44R5K1j5k2L0o7K3Q5j3l3j4J32j17j08K0N0N3L9M8j27N5r9pk5P9r9
$$ -48 73 -71 24 45 30 8 38 -29 -6 79 66 33 19 151 34 -74 -54 -4 49 88 136 9 64 -35 -42 -67 12 -87
5840h7J35N3j70l3J1M1k9K2N0J8n5J56k27J80l3j33J39p2K4p3K8K3K1K5lj00P6
$$ -87 48 101 -69 -102 -91 -50 -79 -57 -7 11 -44 112 -115 65 32 -101 38 -34 -10 -83 -55 -32 -11 14 11 -89 -13
5867a3M7p7J09l3k1K4J1p6J01o9pKK3o3K4lJ5K10q3j11N6J2p2p5k5K5k6N7Lo7
$$ -13 34 -43 66 33 12 36 47 -29 72 3 -4 -2 21 -42 -18 -21 -6 204 121 10 66 78 6 -69 -94 -69 -95 -38 -35 -102
5897a02K5J05k0l4J1r2M5O9N8o3p6J15J1m2r7J47j03J68j08m1j6k6mJ97j31k6
$$ -102 -77 28 8 -26 -15 -107 -62 7 65 2 -74 41 52 10 -87 60 -43 125 17 -24 -40 -66 -70 127 -4 -30
5923c0p6k8Q5P1p8O8j7J9j42J09m5J4P3N4j1r5l3P1j12J7J77r1M6j32J60l4q1
$$ -30 -106 -134 -49 22 -56 12 -5 14 -128 -19 -64 -50 23 77 66 -29 -62 9 -103 -86 91 0 46 -86 74 40 -41
5950d1J05m0L4n0m0N7j15K15j87oJ34l2j81J77j50R9P6J3m3q6J48j89J2J07kl1
$$ -41 64 24 58 8 -32 25 -90 125 -62 -68 66 34 -147 30 -120 -21 55 68 25 -61 87 -102 -90 17 15 -16
5976a6j28P1J32r5j0K1J58k50M6J13n8j0L8r6N7N9q6J13j44J43j11K2K18j58K3
$$ -16 -144 -73 59 -36 -46 -25 133 -117 -71 42 -16 -26 12 -84 -27 32 -54 59 -85 58 -53 -31 187 29 52
6001E2j5q8p0J16q9N2oP5r2R9L7k42J39N5r6P4j0j02M9N2M4j12J66p4J5p5J34
$$ 52 37 -51 -121 -5 -94 -42 -48 27 -65 34 71 -171 -32 23 -73 1 -9 -111 -62 -10 34 -78 88 14 29 -46 88
6028H8q6m9N7r8L3N0N8n1O7q2m1J09j7pp3m6O6K1n5Q6j0m3pL5Nn9R4m6NK4k9l1
$$ 88 2 -47 10 -88 -55 -5 53 2 69 -13 -54 55 38 31 -42 -88 -22 -1 -56 30 20 -23 -30 5 10 -49 45 -1 4 28 -1 -32
6060c2o6j9J49j67J36p4P9o5Pjk0J40j69pR2k1mM6l7J14j8n5j26J26j8Rk9m8j0
$$ -32 -98 -117 32 -135 1 -73 6 -59 -52 -53 -73 67 -102 -109 -17 -38 -42 4 -33 81 63 8 -118 8 -10 -1 -30 -78 -88
6089h8O6J28j06j8o4j9R2m2J0J0J25l2j30Q6R0j36N3jQ9j75J8J26j63N2j4K0q5
$$ -88 -22 106 0 -18 -82 -101 -9 -51 -41 -31 94 62 -68 18 108 -28 25 24 113 -62 -44 82 -81 -29 -43 -23 -108
6116a08O6J26j16pR0j32J7J19n7j24Q3M7o5O0K1j12J39j02M7j4O3n7O3p2K4P1
$$ -108 -42 84 -32 -39 51 -81 -64 55 -2 -126 -43 4 -61 -1 20 -92 47 -55 -8 -22 41 -16 47 -25 -1 70
6142G0j35J5Q2j72J63o4N1m3J11j70M6J13k8M4kj44P2NJ6r9kj2KQ4M2l2k4J6m3
$$ 70 -65 -50 32 -140 23 -41 10 -33 78 -92 -46 67 39 83 81 -63 9 14 30 -69 -71 -83 -81 3 45 13 -11 5 -38
6171c8J4J6km5L6j0R7j03r8J77l8J8l7k3q8M7J03m1J6o2N2N3r2P7q8J3N1j7p3
$$ -38 -24 -8 -10 -55 -19 -29 68 -35 -133 44 6 24 -13 -36 -124 -77 26 -15 1 -61 -9 44 -48 29 -59 -46 5 -12 -85
6200h5J09p7n1J96j42M8m1J34q2J9M6j60J70j24M6j05L9J32m5o7O4J4j18J13k6
$$ -85 24 -53 -104 92 -50 -2 -43 91 9 28 74 -86 84 -40 6 -99 -60 72 27 -40 24 38 -80 33 7
6225GNN4N0o9o7M7p6R3Nj06J21n1q5NJ7P1n2J11j70O1L2l5J00q3K1l6L9m1k0j6
$$ 7 12 66 116 47 -20 27 -49 44 49 -57 64 13 -72 -67 -50 21 -31 80 -90 -29 3 -32 68 -15 6 -30 9 -32 -52 -68
6255f8R1O5k04J36k2n6J2J25p6m5K3n1J7k7J17l9Q1j17K8j0j0N1K5l8q1J5l8N1
$$ -68 23 88 -116 20 -2 -58 -46 79 3 -42 -19 -70 -53 -80 37 -2 79 -38 -10 -20 -30 21 46 8 -73 -58 -96 -45
6283d5k3J01m6p5P4lM0o8L3Q6j29J61n4p2N0l2J3l0J01l7p3L3L8M6j29RP9q2m1
$$ -45 -68 33 -13 -88 -14 -17 23 -45 -12 74 -55 106 52 -20 30 -2 11 -19 82 45 -28 5 43 89 -40 -31 48 -34 -75
6312g5J33j3k05J83j10J25o2J15j94J30kJ2j38J35j8q3J08j2N6r5N4O2j35o9N7
$$ -75 58 45 -160 23 -87 38 -24 91 -103 27 25 37 -101 34 16 -67 41 29 85 -10 44 106 -29 -98 -41
6337d1m2P7L2j09J54j3l3j02N6m3Q4L3l5P1j13m2Q6J43k12P9n4J98l14J64j3j23
$$ -41 -83 -6 26 -83 71 58 25 -77 -21 -64 20 53 18 89 -24 -66 20 163 -49 30 -24 174 -140 24 11 -112
6363a12J01KK8p4J45j29K3R5l3P3m5n6P8j28K5j3K5L4j12R8q3R7j0n1m7O0l4m3
$$ -112 -11 -9 19 -55 90 -39 -16 79 46 119 74 18 96 -32 -7 -20 5 39 -73 25 -58 39 29 -22 -69 -9 -43 -86
6391h6N7L6l2j4k9J94j79n8J21k6L0K0M4k4K6j76K28j03l8p4J41j43N6nO1R6o4
$$ -86 -29 7 -25 -39 -68 126 -53 -111 10 -16 14 34 78 54 80 -96 132 29 -9 -83 58 -85 -29 -34 27 123 59
6418E9j07k7J55j58R1j64J24Q0o1j27J10p6P4Q7j25P4p8O4Q4n4N7p4j2m7J38p6
$$ 59 -48 -75 80 -78 13 -151 -27 53 -8 -135 -25 -101 -27 60 -65 9 -69 -5 79 25 82 8 -4 -51 87 11
6444A1J5k6k1K5L2o1L0J35p3J7j38N4l2O6Rl2q8qM9J4O7oj1p7n8Q4m7R9j2l9J3
$$ 11 26 0 -21 4 36 -25 5 140 67 84 -54 0 -32 34 43 11 -77 -85 -36 -22 45 39 28 -49 -107 -23 -70 29 17 -22 -9
6475iJ21j17J17%n7r1j1J30j50k6J03p9M2O0j31O7J29o7l5Q6j98M6Q0q4J17n0
$$ -9 112 -5 112 112 55 -36 -47 83 -67 -93 10 -69 -27 33 -98 -31 98 31 -4 82 -116 -70 10 -74 43 -7
6501gJ05j68P2l1J04p9o4R6Q9r9N5n5l7k2P0o0P8o1K2k6o5Q8j5J0k9P4j0n0M6
$$ -7 98 -70 2 -29 75 -4 -68 28 117 18 73 18 -19 -41 29 -31 47 -14 8 -18 -83 5 -10 0 -29 45 35 -15 31
6530C1ln4O7j7j09P0J24q2k9R2j04n9J41j38R2R9j1j53R6m3j26J90o1n2k7J23
$$ 31 28 -26 41 24 -85 -15 109 27 -2 90 -14 -73 68 -70 22 121 110 -43 53 10 -116 74 13 -39 -66 57
6556E7m5P8o5j0j71Q7J39j7q7N2k6M9o4k5K5K3j8Q7n9K3m6m6J23O0j10j8r5K2
$$ 57 12 90 25 15 -156 -69 70 53 -34 18 -8 41 -23 -48 -23 0 -18 69 10 33 -13 -59 64 124 14 -4 -99 -77
6584g7O4oJ00j48R6%nn2j7N0K1Kj1J3j3j4q9J43j57M7kP8kJ3m2n8J7OM4k4M8l6
$$ -77 -13 -19 81 -67 29 29 24 -28 -45 5 26 28 17 30 17 3 -86 57 -100 -53 -55 23 21 34 -8 -66 -49 -43 1 -23 25 -11
6616a1N1O5O7j24p6k1R8l3j60Q7m2Q8P3o8J28j45o1J14%o4k9N3pJ23j26J37r4
$$ -11 40 105 172 48 -28 -49 49 16 -144 -57 -99 -11 62 -6 122 -23 -84 30 30 -34 -63 -10 -17 106 -20 117 23
6643B3k5k1L2L7l5oj39J29J04m5r3m4R9OL9k4l1M3l6P2p6oJ7r3J22j7J7l7n0L
$$ 23 -2 -23 9 46 11 5 -134 -5 99 54 -39 -83 16 22 61 37 6 49 13 85 9 3 20 -73 49 32 49 12 -38 -35
6673c5J20nj49N5Lk8L1j8L9l3J33j21j3n0J26p2R3r4j04j6J90Qm3p2LN0K0qL0
$$ -35 85 80 -69 -14 -11 -39 -8 -26 13 -20 113 -8 -21 -71 55 -17 76 -18 -122 -138 52 60 17 -55 -52 -2 18 10 40
6702D0j30J52m2k8L4m4M8J5j08RJ59o4l8L1j03R8Kp5J36m1r3R7Mr4K0L0M7J7j05
$$ 40 -90 62 20 -8 26 -18 30 45 -63 -54 105 41 3 34 -69 29 31 -44 92 51 -42 55 59 -35 -15 15 62 79 -26
6731b6mL3m0J27r4J1P2j44J19q0p2J19o0N6p9K6N9o2o2J38n6M9L7j73R2P9L2j90
$$ -26 -30 3 -37 90 -4 7 79 -65 54 -26 -98 21 -39 17 -62 -36 23 -39 -101 37 -19 30 67 -106 -14 65 97 -93
6759i3k9K30j1q8j5K0K0L5j18K2M4k7M7q2R5j02%R8m5%J19j27m6J1J59o9M9L0
$$ -93 -122 108 97 9 -6 14 34 69 -49 -27 17 -10 37 -45 50 -52 -52 46 1 1 120 -7 -53 -42 117 48 97 127
6787A27j00O5o0m3k9Kl0J20j1l4j9P6l5n5K2J9J3o6j54K36r5J05j2j20J18l7K5
$$ 127 27 92 32 -11 -40 -38 -68 52 41 7 -12 64 29 -26 -4 15 28 -38 -192 44 -51 54 42 -78 40 3 28
6814B8Pn3K9M3k9j45Q6R6q8K1mm0Q4l6l7M5k3N4j09R0R3j76j50J75j23J39Q1j09
$$ 28 35 -18 11 54 25 -120 -34 62 -26 -5 -9 -49 35 -1 -38 7 -16 38 -71 19 112 -64 -214 -39 -162 -23 58 -51
6842e1M4kq7K9J1J62j72J67n6p2K2Lo7L3NK9j0pQN9j9N6j38n9J54k9p0M7J0j08
$$ -51 -7 -9 -96 -67 -56 106 -66 101 45 -27 -5 -2 -69 -36 -31 -2 -12 -19 -11 48 29 85 -53 -112 42 13 -57 -10 0 -108
6872a08J64o2P9j3j4k0M8p2p2M3O8j4j7q7k2J12J5ok0J9o2J1P3m3o7J13l9O5j7
$$ -108 56 -6 73 60 46 26 74 2 -70 -27 41 27 10 -77 -99 13 28 22 2 21 -41 -30 43 0 -67 46 7 72 55
6901E5n4N5j06Q1O2q9O9k3o8M4K4m5K0LR7j50M7L7j7K9o8N1q1N6oo8L5K4j48J08
$$ 55 1 56 -50 31 93 4 73 50 -18 26 50 5 25 28 125 -25 22 59 42 71 3 54 -27 29 23 -45 -10 14 -134 -26
6931b6m4R8m5m4NP8q2OO7q4J83j16k4P8r0m2R7K6O9j35j1o4KJ10r0Q3JN0m3nO
$$ -26 -70 28 -17 -61 -56 22 -60 -54 13 -71 112 -4 -28 50 -40 -82 15 41 110 -25 -36 -100 -98 12 -78 5 6 56 13 8 14
6962A4k6Mj17O1L8j4Q2o4m6R2k9J7M7J11k14J72j85J21o5R6p9j19J22o2MQ4n0
$$ 14 -12 -8 -125 -64 -26 -40 42 -22 -68 24 -5 12 59 170 -44 128 -57 64 -1 95 16 -103 19 -43 -39 45 -5
6989eR6j53P1mr9J4Q4q0M2kR4m2lo2P4j26M7M5L4r3J72j80K4J26k04J58j38R0
$$ -5 91 -62 9 5 -94 -80 4 -76 -34 -36 58 16 13 -49 25 -101 -54 -9 25 -68 104 -76 -52 74 -130 28 -110 -20
7017b0p5J10l7Q2l7K7j33J27M8j41M1l7O4l6p3M9K1J9Rj6J8J00j15Q2o9Pp4J33
$$ -20 -95 15 -22 60 23 50 -83 44 92 -49 -8 -45 19 -17 -90 -41 -20 -1 8 -8 10 110 -5 77 8 15 -59 74
7045G4P5j65M1l9N7k7J9j5JJ6KL8m7p1PO9j52M6O5K2n9N5K4o9j67L86n2k16P3
$$ 74 149 -16 25 -14 43 16 35 20 21 37 39 77 30 -41 -34 35 -117 -71 -6 16 -43 12 36 -33 -200 186 134 -82 -9
7074irl5Q1n7R1j10P7J9o3j9j7j8J05p9O8k4J2K5n2n4l0P0o4N4N0P7k26K31o0
$$ -9 -18 -53 28 -29 62 -48 29 48 -15 -34 -51 -69 36 -43 25 1 13 38 -14 -68 -98 -28 -92 -38 12 89 -137 94 34
7103C4R1j26j33O2M2k0J38j82M8J37n8l5l5P8p5K5L9m2m7J54j28n8J18j9K0P0
$$ 34 125 -1 -134 -72 -30 -50 88 -94 -46 91 33 -2 -37 41 -34 -9 30 -12 -59 95 -33 -91 27 8 28 98
7129I8j97M6K6L3k0Qj33J27j5k1M3J15j98N2J7J1o9l8J09M1j43Q1J27j34J0o3
$$ 98 -99 -53 -27 6 -14 -6 -139 -12 -27 -48 -5 110 -88 -36 -19 -8 -77 -115 -6 35 -108 -27 100 -34 -24 -87
7155h7L4L2pJ6l9rN0j7o8J68rj72J34r7J8R1p4oJ38o8K5o6Q3j13O5m9O8om0N7
$$ -87 -53 -21 -28 -12 -51 -60 -10 -27 -95 73 64 -108 26 -71 -53 38 -36 -42 96 28 53 -13 70 -43 22 -27 41 35 -5 52
7185E2j71L7L1lN4P4r4PRQ1j39Q2j03J3P1n0m2M7J40k12J26J0j1J7p9J31o1j07
$$ 52 -119 -82 -51 -54 0 74 -20 -13 -4 77 -62 20 -83 -70 1 -49 -91 -44 96 -116 10 20 9 26 -53 78 17 -90
7213i0J60j56OJ05j3m4P9m4k6M8k7M8mn9M7L0k6j18J4O8J2j78R8J20p7o9J27j1
$$ -90 70 -86 -80 25 12 -32 47 3 -23 25 -2 46 42 -17 30 60 34 -84 -70 -2 10 -168 -70 50 -27 -96 31 20
7241B0p5J01k5m2Q4k4j12jJ35n8j1J3j3J4m1M6L9j2n7Q6q6J14q3o1J28o9Pn1R0
$$ 20 -55 46 21 -21 63 39 -73 -74 61 3 -8 5 -8 6 -35 11 50 38 -19 67 -19 95 12 -49 79 10 17 -34 56
7270E6k2k9N3j07rO1M0Or0LP8n0m4K8J7k6m9K2L8Q5K4q1n4P6n6K3m4m6N1l4J05
$$ 56 34 5 58 -49 -58 3 43 49 -41 -38 40 -10 -54 -26 -9 -35 -84 -62 -24 61 85 4 -50 26 -30 -7 -51 -97 -46 -80 25
7301B5k0M5k1m2P4j08qJ07j1k6p3mQ7j12PjJ33K6j41M2J3KN2j89J84Rn7Mn8P0
$$ 25 5 50 29 -13 61 -47 -55 52 41 15 -58 -62 25 -87 -80 -81 52 78 -63 -21 -8 -6 46 -143 41 50 -7 -3 -61 9
7331Ik9R8mj56P0j27K31k27QJ18J16q0k0K5k1Q3j25J3l0J6M7Qj05J20j0J13j62
$$ 9 -20 78 74 -82 -12 -139 92 -135 -127 -9 107 27 7 32 11 94 -31 -18 -48 -32 15 23 -82 38 28 141 -21
7358b1l5q1J15J42j03j9M7n8j4L0NK6rJ7L3j34O6o5P2P3l7l9r0J01k8N7n4rM4
$$ -21 -56 -137 -22 120 17 -2 45 -13 -27 3 8 34 25 42 75 -59 7 -58 14 87 50 11 -79 22 -6 51 -3 -12 32
7387C2Oj09R8n3NK9n5lM3ON2j25K8n4J24L3j85O2J45j02m0J37mo2J8n1J1K9j9
$$ 32 38 -71 27 -26 -21 8 -47 -50 -7 -1 51 -74 -46 -100 24 57 -128 -66 79 -23 -63 74 70 8 26 -25 -14 15 -4
7416dj15J16M9J19j10l4Mnk1K9O0j63K6ML6j20J29o6J6K1M8j9p2MJ64oj85K65
$$ -4 -119 -3 46 165 55 21 25 20 -1 28 88 -75 -49 -45 -9 -129 0 -66 -50 -29 19 0 -72 -68 96 90 -95 170
7444A70k71J17P7p3j28O7J42n5k3K7pLl7m3O4n5J29r1J09j93P5o2R6p3P6j89K51
$$ 170 -101 16 93 20 -108 -41 101 46 23 50 43 46 9 -34 30 -25 104 13 122 -71 4 -58 38 -35 41 -148 103
7471A03q5o4K4L9j03O8K1L0o7km0P1j2j4OPN9L9j81O2P6k7j24J05P6j76R3J4j01
$$ 103 18 -46 -22 17 -86 -18 3 33 -34 -36 -76 -5 -17 -31 -25 -18 41 80 -101 -39 37 10 -114 -9 67 -109 -16 -2 -103
7500a03J71K6r2k1qO5p5M0n0M4l9J86k34l0K07j23J1N0k0M0ql6L9p6K6qM1j7j43
$$ -103 68 94 2 -19 -27 38 -37 3 -47 -3 -42 144 -90 -120 87 -36 -25 25 5 45 37 1 40 -36 -10 -18 23 6 -137
7529a37M3N9J60j42K05k14J8l2J4J52j29J6m7L7j4Oo6M5R0j28J20r6J4M3n4J04
$$ -137 -94 -35 125 -17 188 -26 -8 -40 -26 126 -3 13 -34 3 -11 -5 -71 -26 64 -64 56 -40 -26 17 -37 67
7555F7l8J6o7m5j3P8j6k0R7k1j00R4Q3j76Q7o3nk2o8J05l7K2p2J63q4Q6ql2J22
$$ 67 29 45 -22 -67 -80 -2 -18 -38 59 38 -62 32 115 -61 26 -37 -42 -64 -132 -27 -64 -42 -114 49 -35 51 43 11 133
7584A33p0j49R2r4J9K26j67K6m6m6J30j21J18P0j62QK2l9M7L9j10o5J38P9q3M5
$$ 133 63 -86 6 -88 -69 157 -10 16 -30 -76 54 -67 51 121 -41 -33 -11 -50 -3 36 -74 -139 -1 78 -5 40
7610D0n3J9O2Rmn6J05p0o0J5k3k7R1o4J48j59L2m0O1P2j34M0M3j20J1N0p4J50
$$ 40 -13 6 68 77 73 17 122 52 -8 7 -16 -43 48 -16 132 -27 5 -35 26 98 -36 4 47 -73 -62 -12 -86 64
7638F4n2K1k8p1N4k5M1p0k8LJ12N7n8M5j40L6R3r0J03j19j32J31J38n5j05J80
$$ 64 12 33 5 -66 -12 -37 4 -66 -94 -91 21 78 20 65 -75 -39 54 -36 67 -52 -184 -53 85 30 -75 105
7664A05j59K4K3m6K8q6R5l0J09n0j24K43j03q8K8l7K3J32m3j02J52j27p5J40j25
$$ 105 -54 -30 -7 -53 -25 -111 -16 -46 63 13 -111 132 29 -59 -31 -68 -45 87 44 -58 94 -33 -108 32 -93
7689i3O1m1J75j36o8J53j70J52o0k3JQ6j05O5M9O1j99R0k0RjP1q8L0Rl8P9j31
$$ -93 -32 -73 102 -34 -102 51 -119 33 -27 -50 -49 37 -68 -3 46 107 -92 -2 -22 -13 -14 57 -31 -1 8 -30 49 -82
7717h2J0L8M7M8k6k0L2p5L5r2Q7M1m7n3J6P1o9k9J39o9J5k9J04l7j18K3j9J25
$$ -82 -72 -34 13 61 35 15 47 -28 7 -85 2 43 -4 -57 -41 30 -39 -68 71 2 17 -12 92 55 -63 -40 -59 66
7745F6k23J60J7L9p8j0J54mn6nj35M7L0kK9p6Q7M7j47N7j3q2Q8J6L0p7j4J04l9
$$ 66 -157 3 20 59 -19 -29 125 121 65 60 -75 -28 2 0 29 -47 40 87 -60 -3 -16 -98 -10 6 36 -41 -55 49 10
7774A0MNo3l8Q5K6L5k9P6j47J37j37l1K9p4K1P5K8n7M5r9L1J34q9ln5K37q9J9
$$ 10 14 19 -44 -82 3 29 64 35 111 -36 101 -36 -67 -38 -112 -91 -16 12 -45 0 -99 -68 66 -23 -26 -81 156 67 86
7803H6j17J8L1n3m8M7PQ0p1n7J23n9P7j52N2m7J8J19r8Q7L5j05O0l4K4m2K3k0
$$ 86 -31 -13 18 -35 -83 -36 -29 51 -20 -77 46 -13 64 -88 -36 -83 -65 54 -44 43 78 -27 33 -1 23 -19 4 -16
7831a6J7k3Rj7m8Q9k2J27k06K34k18J26l6K2Lj18J12j1QR6j37L7l7LL9k4N8j12
$$ -16 1 -22 -13 -30 -78 11 -11 116 -90 144 -74 52 16 38 41 -77 35 24 32 128 -9 28 -9 -6 33 9 67 -45
7859d5J23r0L7J16r5r1J22q8j2O8J6p0N5j26J0P7Q4j4n1l3M8j22J50o5j38O9J45
$$ -45 78 -12 25 141 46 -45 77 -11 -23 45 61 -9 46 -80 -70 7 91 77 26 -7 41 -81 69 4 -134 -65 80
7886H0m6p0Q8J1l6p8R0n8Q4j6J0o1J4j6p0K8pJ86j53L1k9o4J88Jj39J62j57m3
$$ 80 34 -36 52 63 27 -51 39 -19 65 49 59 -2 12 -4 -74 -46 -53 133 -20 11 -18 -82 106 107 -32 130 -27 -70
7914g0M4P2J4O2r1J6j08J2J04q6k6%J03j53O4J03j04k5M9l0Q2r2O1Jn5Q5p8J51
$$ -70 -26 46 60 122 31 47 -61 -49 55 -31 -57 -57 46 -107 -43 60 -44 -69 -20 -50 32 -60 1 2 -53 32 -46 105
7942A05o9L8l8k4J01j03qOM4k5n8J0O6j0n7J05j91J53M8q6M2p4NR3j14N1j2O5
$$ 105 36 74 36 12 113 10 2 8 52 27 -31 -21 45 35 -22 83 -108 45 93 7 49 -25 -20 73 -41 10 -2 63
7970F3r0l6K7M3L5n9jJ03q9q0L8J7NK8l8k0Q5M6k2j5j5j32R2J00j71N3qJ9m6M2
$$ 63 -27 -63 -36 7 42 -17 -18 85 -4 -84 -46 -29 -24 4 -34 -54 31 77 55 40 25 -107 -15 85 -86 -33 -41 -22 -68 -26
8000b6P5o4J13j53P7n8J20k5n2L4%j23M5R6k6j1m7q5J28rJ7Kj2M7r5J3Mo6R8j4
$$ -26 49 -15 98 -55 22 -36 84 59 7 41 41 -82 -37 59 33 22 -25 -110 18 9 26 28 16 63 -32 -19 -15 -81 17 3
8030CJ64j04j00K6J03p2p6lO9M4j17K3o2J05J00j23J6o6P1j03J84l9m4qo2J34
$$ 3 167 63 -37 -11 92 20 -56 -59 10 54 -63 -40 -102 3 103 -20 -4 -70 1 -102 82 43 -1 -9 -71 63
8056F3j29J35j36J4J00m6l6M9o3L6J0r7R9o3M5P7j52m3L0J04l4Q5m5m0N3l8M5
$$ 63 -66 69 -67 -53 47 1 -35 14 -49 -13 -3 -100 -1 -64 -19 58 -94 -137 -107 -3 -37 48 3 -37 16 -22 23
8083B3rK8kkJ8p8M5J4m1o0Q5q8K3j1J09o8k8J10k7j4o0P6J7j77J26r9J9R2J3j
$$ 23 14 42 40 38 56 -22 23 37 -4 -64 21 -67 -44 -55 54 -14 -42 68 41 27 -33 43 60 -117 9 -90 -71 21 34 33
8113C3p6k2L5R0p5l7Q9l5Rl2O4n3k6P2n1j5M4m7M1Ojl0J90j82r3R5j8lJ4n3J14
$$ 33 -43 -65 -30 60 -15 -52 37 2 11 -21 43 -10 -36 36 -15 -30 14 -33 8 14 13 -17 173 -9 -102 -7 -25 -28 -14 -67 47
8144D7M6k04K3R0M7j88P8P9j43J16m9QQ5Pj4n5r4J16O2K0k4l7m4L8j15L7R3j4
$$ 47 93 -111 -88 2 49 -139 -61 18 -125 -9 -58 -50 35 42 28 -27 -121 -5 57 77 53 16 -28 10 -105 -68 25 11
8172A1K5o8J07K3n6M%n2Q1K4j39p2J76r0R3p6M2j02J40
$$ 11 36 -32 75 98 42 46 46 -6 75 99 -40 -112 64 -26 67 -9 33 -69 71
8191G1
$$ Imaginary data points
##PAGE= N=2
##DATA TABLE= (X++(I..I)), XYDATA
0@%%%%%%%%%%%%%%%Qj6J6j6J6k4L2l2M0m8N6o4P2q8J01j12J28j47J66j87K11k38
$$ 0 0 0 0 0 0 0 0 0 0 0 0 0 0 0 0 8 -8 8 -8 8 -16 16 -16 24 -24 32 -32 40 -48 53 -59 69 -78 88 -99 112 -126
37a26K67k98L31l69M09m52N03n58O18o82P50q26R13j008J110j221J346j488J646
$$ -126 141 -157 174 -195 214 -238 265 -293 325 -357 393 -433 480 -528 582 -639 707 -781 865
56H65j824K030k268K544k876L282l785M432n300O536q449J1823j9539P1122k083
$$ 865 -959 1071 -1197 1347 -1529 1753 -2032 2400 -2900 3636 -4813 7010 -12529 58593 56510
71E6510j39680J6106P8697M2486l8437k6631r658L386J1954K4776j1504k2366
$$ 56510 -83170 -67064 11633 54119 15682 -10949 -20607 -17221 -5267 19509 8005 -14361
83a4361P100K7338p703k6003J612K6606o918k2429J0956K2727j7402k8890J0526
$$ -14361 -7261 20077 12374 -13629 -12017 14589 7671 -14758 -3802 18925 1523 -27367 -16841
96a6841L8095N361k9305j8812O692J7121K1581K276l0969k9919J0590L8164J7929
$$ -16841 21254 26615 -2690 -21502 -14810 2311 23892 26168 -4801 -34720 -24130 14034 31963
109C1963j8224k5368j5228L893L1705K9155j7828m3244p867L5812K1867k2589
$$ 31963 13739 -11629 -26857 -22964 8741 37896 20068 -23176 -31043 4769 26636 4047
121D047k1433J2414J5552m115j0876n241J588Q628J4206J029k4180j4269K1149
$$ 4047 -17386 -4972 10580 6465 -4411 -9652 -8064 564 14770 15799 -8381 -22650 -1501
134a501J8709j1550j2861Q060N409j5540o156K3832J3177k1981j9110J0828J8831
$$ -1501 17208 5658 -7203 857 6266 -9274 -15430 8402 21579 -402 -19512 -8684 10147
147A0147J695j1033n638n89Q26Q514N590q983q850N056Q090k754q430M242J0679
$$ 10147 11842 809 -4829 -5418 -4592 3922 9512 529 -8321 -3265 4825 2071 -6359 -2117 8562
162H562l277j0063j005L790K671L401K702l893j1518k288J2782Q615n031q432
$$ 8562 5285 -4778 -5783 -1993 678 4079 6781 2888 -8630 -10918 1864 10479 5448 -2984
176b984m489L493Q121K865n761q040J362J0714K435q874n427K544N790L160j599
$$ -2984 -7473 -3980 4141 7006 1245 -6795 -5433 5281 7716 -1158 -6585 -4041 1749 4909 3310
191C310l325m892k281Q567Q919m895j2042l870R169J1360j333j0676r013J347
$$ 3310 -15 -4907 -7188 1379 10298 5403 -6639 -10509 -1340 10020 8687 -1989 -11002 -9655
205i655J4230J1326q737j7819m493J3167J4606j705j2165p788P0Q651J0301q00
$$ -9655 4575 15901 7164 -10655 -15148 -1981 12625 10920 -1245 -9033 -8963 -312 9989 9189
219I189j1343r431L924J4283N817r809j1705j530J0206J1568j185j2817r997M047
$$ 9189 -2154 -11585 -7661 6622 12439 2630 -9075 -10605 -399 11169 9984 -2833 -12830 -8783
233h783J5413P637j0319j3356j982R633J1702N74j0968j1141O89J4742J1841p753
$$ -8783 6630 14267 3948 -9408 -11390 -1757 9945 10519 -449 -11590 -10901 3841 15682 7929
247G929j7329o173J1567J6716J334j4716j2487J989J4161J0524n765j3424n251
$$ 7929 -9400 -15573 -4006 12710 14044 -672 -13159 -11170 2991 13515 7750 -5674 -10925
260a0925O437J0623L052o780p899k725N667J0109J552r765r310J599J2344Q196
$$ -10925 -4488 6135 9187 2407 -5492 -8217 -2550 7559 9111 -654 -9964 -8365 3979 12175
274A2175p133j2465l874Q909J2498Kj2333q446L954J1489N214p127q586j642M960
$$ 12175 5042 -7423 -11297 -2388 10110 10112 -2221 -10667 -6713 4776 9990 2863 -5723 -7365 -2405
289b405P724K510o269p951j750P625R162j837r548n224L485Q500L476n843o624
$$ -2405 5319 7829 1560 -6391 -8141 -516 8646 6809 -2739 -7963 -4478 4022 7498 1655 -4969
304d969o43N730N674k468o423r08L287L509Q6k726j912p59Q53M083J728l785m163
$$ -4969 -5612 118 5792 3324 -3099 -4007 -720 2789 2875 149 -1763 -2522 -1669 2414 4142 357 -3806
321c806p2M840L911k852m967o09L001L894n93m528j200K479K483q0k743j137K345
$$ -3806 -3878 962 4873 2021 -2946 -3555 -554 3340 2747 -1781 -2981 -502 1981 1901 -842 -1979 366
338C66O68p97p46j32J131L40j071K63n38l63J090J132j09j356k523P58L894J484
$$ 366 1034 237 -509 -641 490 830 -241 22 -516 -879 211 1343 1234 -122 -2645 -1887 2007 3491
356C491k574m196l39M941K922k942l960r05L598L542j313l540j791R56L794J841
$$ 3491 917 -3279 -3618 1323 4245 1303 -2657 -3562 36 3578 2265 -1275 -3066 -2110 1684 3525
372C525k375l004j614K018M294J087l051m213j399M736N612j405o552m228L526
$$ 3525 1150 -1854 -3468 -1450 2844 3931 880 -3333 -4732 4 5616 4211 -2341 -6569 -3043
387c043P758J542o068n458K27O011M742j939n474l732J716O281L547l628o091
$$ -3043 4715 6257 189 -5269 -5042 969 5711 3772 -1702 -5434 -3718 2563 6110 2482 -3609
402c609k505M607O795L12o039n710Q95P665M868m215p416k501N450P240R7o673
$$ -3609 -6114 -1507 5288 5600 -439 -6149 -5254 2411 7279 3064 -4352 -6853 -1403 5837 5934 -739
418g39n049J129O179M508k543n748l351K219O659L181m450o518j866N735O913
$$ -739 -5788 -4659 1520 6028 3485 -2263 -5614 -3395 3264 6445 1995 -4523 -6389 -654 6259
433F259p25p118m932K323P571L355m631o305j675M793O274j32n831m365J184N531
$$ 6259 5534 -1584 -6516 -4193 3378 6733 2102 -4203 -5878 -1085 5189 5057 -774 -5139 -3955 1576
449A576L760k282n461k899K728O513J627n022n327j12N762M876k332o011k484
$$ 1576 5336 3054 -2407 -5306 -2578 3935 5562 540 -4787 -4899 863 5739 3407 -2604 -5088
464e088L179N275J064m012l482m52L430L590n28l775k313N91L792K381k075l502
$$ -5088 -1909 3366 4430 418 -3064 -3516 -86 3504 2976 -799 -3112 -2521 1271 3652 1577 -1925
480a925j499K314L842K71l136k590j28L406K967j868l324j078J944K744K14j982
$$ -1925 -3424 -1110 2732 3003 -133 -2723 -2851 555 3522 1654 -1670 -2748 -804 1940 2154 172
496A72j853k24J798K382p93k440j125J106K640K53k282j102O41J462P78j157j078
$$ 172 -1681 -1905 -107 2275 1482 -958 -2083 -977 1663 1916 -366 -1468 -827 635 1413 256 -822
513h22J52O45Q65m29j453M15J538k78q21o63N48Q76k03m58j53k85L99O82j94k78
$$ -822 -670 -25 840 411 -1042 -627 911 633 -188 -851 -303 573 370 -88 -241 -526 -127 555 361 83
533H3o14k25J117O10n36q60r13P90J650P2r36j677m02K395J596r70j955j282Q56
$$ 83 -531 -756 361 971 435 -425 -1338 -548 1102 1174 238 -1439 -1841 554 2150 1180 -775 -2057 -1201
552a201K689J076j923k685n68K844K625j076k601j848Q84L469J531k449l363n38
$$ -1201 1488 2564 641 -2044 -2612 232 2857 1781 -820 -2668 -1784 1685 3216 767 -2596 -3134
568c134L394L118j269l308j840J211L436J210k012k459j163J995L514J21k986
$$ -3134 260 3378 2109 -1199 -3039 -1828 1608 2818 806 -1653 -2816 -821 2693 2814 -172
583a72k850N61L516K128j407k904k424J462M571J402l187l867l72L945L456j282
$$ -172 -3022 -2461 1055 3183 1776 -1128 -3552 -2090 2481 3883 696 -3171 -3543 402 3858 2576
599B576l749k343J516M037J433k457l495j095L242L797n20l798k529J141L650
$$ 2576 -1173 -3516 -2000 2037 3470 1013 -2482 -3577 -335 3462 2942 -856 -3385 -2244 1406
614A406J955j782l506j556K282M007K81l060k776O8L161K621j052l263j920J549
$$ 1406 3361 1579 -1927 -3483 -1201 2806 3087 27 -2749 -2681 480 3101 2049 -1214 -3134 -1585
630a585L726R19k360l008o72K710L387n55l214k320Q84L528J688j981l005p32
$$ -1585 2141 3060 700 -2308 -2980 -270 3117 2562 -652 -2972 -2088 1440 3128 1147 -1858 -2590
646b590K243K673l82k201j889J52K622J938j438k489r25J543K405J84j650j560
$$ -2590 -347 2326 1944 -257 -2146 -1994 628 2566 1128 -1361 -2286 -743 1662 1846 196 -1364
662a364m89J704K019m74j930j348P45K283O53j445j458k75J362J358l94r90j130
$$ -1364 -1853 -149 1870 1396 -534 -1882 -1137 1146 1799 354 -1104 -1379 -17 1341 947 -43 -1173
679a173n6J907Q16j282j052kQ36Q45k54o50k95m3N15N27n31l96P2Q9N37l01l10
$$ -1173 -1229 678 1494 212 -840 -842 -6 839 585 -65 -360 -403 112 639 108 -288 -216 -127 410 109 -201
700b01P1K20k8P3l21P8K80j62J4j74k52N04L05j95l06l90J77Q35j9m21o60k10
$$ -201 -130 90 62 135 -186 -108 172 10 24 -150 -402 102 407 212 -94 -484 -307 528 509 88 -572 -782
722g82J065O46m71o12q21K87J449L42q45j214l82J586J229p20j207j117O94J791
$$ -782 283 929 458 -154 -975 -688 761 1103 258 -956 -1338 248 1477 757 -450 -1567 -873 918
740I18N45j096j442m01J262J763j49j602j466M46K047Q62j060j374j130J255K004
$$ 918 1463 367 -1075 -1476 -214 1549 1400 -202 -1668 -1222 825 1687 627 -747 -1877 -622 1382
757A382M23j588j811n2K114J619q85j890j298J066K322N28j368j985n75J945K051
$$ 1382 1805 217 -1594 -1646 468 2087 1202 -688 -1986 -920 1402 1930 562 -1423 -1998 -53 1998
774A998k89k267j552P09K523J003j429j946q79J703K297n0j759j901r7K580J450
$$ 1998 1709 -558 -2110 -1401 1122 2125 696 -1250 -2129 -426 1871 1821 62 -1839 -1936 644 2094
791B094r57k273j040J373K441J78j627j763l68K078J857m87k014j521Q95K392
$$ 2094 1137 -1136 -2176 -803 1638 1816 189 -1574 -1942 136 1993 1506 -508 -2029 -1134 1258
807A258P41j422j918m74J650J765j31j672j588L10K089J276j072j832q19J324
$$ 1258 1999 577 -1341 -1815 -165 1600 1469 -203 -1791 -1481 608 1884 812 -1020 -1839 -515
823e15J930J57j355j565j02J610J480n93j600j066P57J824M98j263j110k49J098
$$ -515 1415 1572 217 -1348 -1450 160 1640 1047 -553 -1619 -862 962 1460 197 -913 -1162 -64
840f4J169j68r80j101K16J396P68q18j079k99P42J134j04q52o56k3R08P13m63
$$ -64 1105 937 -43 -1144 -928 468 1236 418 -661 -960 -218 916 812 -40 -696 -719 189 902 439
859D39o39n74L57R50R1m46n29k85N87M62kl10m42j23O06J99j88k75k96M41L75
$$ 439 -200 -774 -417 533 624 178 -351 -636 -49 413 411 101 -341 -464 142 341 153 -122 -418 23 398
880C98m92O6J23j01j00J36J1J13j36j14J35k12J2M06kj83k73L2L58K91l38l19
$$ 398 -94 -28 95 -6 -106 30 41 154 18 -96 39 -173 -161 245 243 60 -213 -181 177 468 130 -189
902a89k39K61O56K9l82o20k07P46O83k94p49n27M41J084r3m44o16l37P25P58k
$$ -189 -428 -167 489 518 136 -484 -691 55 738 444 -305 -832 -391 693 600 156 -460 -797 -72 686 684
923F84p06o84j26J275O01n48q77p14Q74J090K6q42q47k03J231R26l17j206q20
$$ 684 -22 -706 -832 443 1044 496 -381 -1095 -221 869 895 53 -794 -997 234 1160 843 -363 -1183
942a183N46J495K85q79j183l14J171J193j98j124j013K50J483P80p43j373m63
$$ -1183 -637 858 1143 264 -919 -1233 -62 1131 933 -191 -1204 -954 529 1309 566 -807 -1270
959a270J027J317P0j173j021k10J530J118o01j315q30P83J394L87j054r79m30
$$ -1270 -243 1074 1144 -29 -1050 -1260 270 1388 787 -528 -1358 -575 819 1206 152 -827 -1257
976a257J209J234l31r77r30K23J394Q10q80j209n17R93J238L4j127r94j0J419
$$ -1257 -48 1186 855 -122 -1052 -829 565 1375 495 -714 -1231 -238 1000 1034 -93 -1087 -1097 322
994C22Q02m76j016q05O97J223L58r84p93l35J093Q16k45p45r09J47J252O83o10
$$ 322 1124 648 -368 -1173 -476 747 1105 121 -672 -1007 86 902 657 -88 -997 -850 402 1085 475
1013D75j093l22Q22R11j46n06p74m6R12L29j63n35o31L77R74J3m79o71QO77K48
$$ 475 -618 -940 -118 793 647 141 -633 -679 233 562 399 -136 -767 -390 584 597 118 -553 -545 132 380
1034C80ql38m89j36Q50J93k75l92l43N09K63P6k10k46o1M06L1m4N4n26N2M80m1
$$ 380 372 34 -455 -591 259 452 177 -215 -558 -49 214 290 80 -166 -227 179 210 166 220 -306 -254 226 185
1057A85j03j15j31J36J6J44J19k06j26n8j8M23j31r5j37P7j67K79N1j78p8l17
$$ 185 82 -33 -164 -28 -12 132 251 45 -81 -139 -157 266 135 40 -97 -20 -187 92 143 -35 -113 -430
1079d30M90L84l38j90j72OL09L52j94l22l65L14M83R0k75n16j82N41N02k70k63
$$ -430 60 444 106 -84 -256 -250 59 411 217 -105 -470 -156 327 417 142 -374 -556 -15 487 217 -46
1100d6l38J8N14M13k66o37l63N34P76n0n03n63j85P80N26k65o53l42K56P30L28
$$ -46 -384 -366 148 561 295 -342 -705 -171 605 555 52 -511 -696 84 610 345 -308 -650 -394 336 664
1121F64m33o63k48P25N37j93n54l98L7P57N51m21p88l49O67R32j62n05q14j39
$$ 664 231 -432 -680 45 582 389 -165 -563 -526 231 782 361 -427 -776 -109 823 661 156 -658 -797
1141g97R51O72m54n75n70L87Q91J95m88p44j80P58O97m16l12o49J1Q80L96j93
$$ -797 154 826 372 -203 -773 -386 505 700 212 -532 -712 46 743 327 15 -634 -623 257 653 460
1161D60q06n08N77Q64O5m88p61j28Q35N24k60n83m76K24Q51L10n03o90k92Q05
$$ 460 -346 -854 -277 587 652 164 -597 -725 110 634 374 -209 -685 -461 390 700 197 -493 -785 20
1181B0N98j53n11n18J6P72L12q9n85l92L83N44Ol79m86K2N86K04j27l46l39J76
$$ 20 618 465 -46 -564 -548 224 536 447 -138 -530 -147 397 403 24 -462 -440 146 350 223 -123 -462 -286
1203b86N68J07j91n07k48M82L47Q2k36m65j2M50J29Q2l40k51J67K57J45j50m14
$$ -286 282 389 198 -309 -557 -75 272 354 118 -347 -359 91 220 302 -38 -289 -122 135 280 130 -284
1224b84J28K30J00pl9l78J25J51m2L09k88k27R4J54j1Q1k28N7kn7L23r9j23J0
$$ -284 -156 74 174 167 128 -250 -125 26 -16 293 5 -222 -128 26 15 96 -132 -75 -77 -134 189 90 -33 -23
1248b3j14J22K48j59j36Rj47J19L25j47j31j17m7L99J0k39m5j85J51K38O5j37
$$ -23 -137 -15 233 74 -62 -53 -200 -81 244 97 -34 -151 -198 201 211 -28 -73 -258 -107 131 196 59
1270E9l03r5L07L71j38k42k55J30L09P3n6k35l26K83K82K14l66m40J14L87K92
$$ 59 -244 -339 -32 339 201 -41 -296 -166 143 216 160 -75 -401 -118 164 378 12 -428 -314 73 365
1291C65r9l12l24J80K86L15j97m80k60L22N45j1l36m92J03N35L38k80l08m40L16
$$ 365 266 -46 -370 -190 96 411 214 -266 -526 -204 341 330 -6 -498 -395 140 478 198 -110 -550 -234
1312b34M81J67l42m87l4N20L73j70m42k83K19M41K23k02m37m21O69L69km61l93
$$ -234 247 414 72 -415 -449 71 444 274 -168 -451 -232 209 432 230 -207 -628 41 410 408 -53 -446
1333d46J16N26K01n4n37l03K94M74J09k22m82k0M51L15j56l69l15J13O00J31l13
$$ -446 -330 196 397 343 -194 -497 -203 271 380 158 -324 -344 107 422 266 -103 -418 -305 295 426 113
1354A13l53k01L83M42J7m04m47J55M83J08j52k50m00L71M09j05j44l52p3M23L27
$$ 113 -240 -441 -58 384 401 -3 -450 -295 188 296 144 -106 -506 -135 274 169 25 -327 -400 23 350
1375C50m3m45k58K50K21J12n0k13k34L00K43k8j77k95OL27K23j96o3k35J3K34
$$ 350 307 -138 -396 -146 75 187 137 -76 -310 -10 233 205 28 -267 -261 66 289 93 30 -205 -192 42
1397D2J95j46k28j34L14%J1q4j73M2J94PJ03k26o4O8J84l2j35p7J2J26J6K6kk8
$$ 42 237 91 -137 -271 43 43 54 -30 -203 -161 33 40 143 -83 -147 -79 105 73 -62 -139 -127 -1 15 41 39 11
1423A1j4l9NJ15pr1P2L6o9J36r5mq2o1L14j80n4l0j6M0J77j86M0p7pJ2J36k4M3
$$ 11 -3 -42 -37 78 71 -20 52 88 19 155 60 56 -26 -87 227 47 -7 -37 -53 -13 164 -22 18 -59 -66 -54 82 58 101
1452A01k55J1K45L2m6j65j84J75J33Q8j3m08%L33O5J55k86k43O1L25Kj3j73k48
$$ 101 -154 -143 102 134 88 -77 -261 -86 47 135 122 -286 -286 47 112 267 -19 -262 -201 124 126 113 -60 -308
1476c08K91K29K6l27j97Q7L36J38k14j67k38K36L29p1p5k65q8K50K05K4l21k51
$$ -308 -17 212 238 -89 -286 -199 137 275 61 -106 -344 -108 221 150 75 -190 -278 -28 177 201 -120 -371
1498c71J80K87J31k01k25jJ31J74J24j34m13J89K96P1j10k62k40J88L51Lj33k48
$$ -371 -191 96 227 26 -199 -200 -69 105 229 95 -318 -129 167 238 128 -134 -374 -186 165 168 35 -213
1520b13p2K92K29L5l56k09J70K80R3k11j98oQ8L67j11j81l06O3L28K7Q9l72o5
$$ -213 -285 7 236 271 -85 -294 -124 156 249 38 -160 -166 -78 289 178 -3 -309 -246 82 109 198 -174 -239
1543b39K16K45j19o6j80o7J51K40N1k53k69J87K08M6P0l36j26J59L38j41l2j91
$$ -239 -23 222 103 37 -143 -210 -59 181 232 -21 -290 -103 105 151 221 -115 -241 -82 256 115 83 -108
1565a08rQ4R8N6j32j87K45N4q9K27k97j71J44J71M9k01r0J54j21K13n9p3l4M4
$$ -108 -117 -33 65 121 -11 -198 47 101 12 239 -58 -229 -85 86 135 -66 -156 -2 -123 90 31 -42 -76 -32
1589c2LJ03n2j08j07J89j1K12j83j73R5K9L7J7m1j91R3J31J9Mnj02K9j0N4J26
$$ -32 -29 74 22 -86 -193 -4 -15 197 14 -159 -64 -35 2 19 -22 -213 -120 11 30 34 29 -73 -44 -54 0 126
1615A26n3q2j68J52K19o3j84o7J01P1p3m8k2o1J01O6l0j4K6j67Q4K82J0j03j59
$$ 126 73 -9 -177 -25 194 131 -53 -120 -19 52 -21 -69 -91 -152 -51 15 -15 -29 -3 -170 -86 196 206 103 -56
1640e6j2J10Q7L8k31j29J14J75l0j19j7k3J76J1m9n1j15m0K27O9j1j72j75J72
$$ -56 -68 42 129 167 -64 -193 -79 96 66 -53 -70 -93 83 94 45 -6 -121 -161 66 135 124 -48 -223 -51
1664e1K39r7o8k64N9L62j70J02k21j32O2K48j3M8j34p1R0P4k1K5j99l3K44J52
$$ -51 188 91 23 -241 -182 180 10 112 -109 -241 -179 69 56 104 -30 -101 -11 63 42 67 -132 -165 79 231
1688B31J5l54k49M25J14r8n3j37LJ52J6J72k08k46M4J08J33J17l21l0J60J20O1
$$ 231 246 -108 -357 68 182 84 31 -106 -103 49 65 237 29 -217 -173 -65 68 185 -136 -166 -6 114 175
1711A75n5l83L4L65M0o9r2j79J55J89q1kj99L6J45L1Nm8k65K5J78K21m7k49n9
$$ 175 120 -263 -229 136 176 107 15 -164 -9 180 99 97 -102 -66 79 110 115 67 -198 -173 5 226 179 -70 -129
1736a29K6K47m3r0j34L6J71J18l37O4n3R0J47j1p4q4j7Q3JM5P4k46j5J10J36l9
$$ -129 -103 144 101 11 -123 -87 84 202 -135 -71 -124 -34 113 102 28 -56 -73 10 11 56 130 -116 -131 -21 115 76
1762G6j36jo9K82M5j32k5m0m5K0J58q5K4j00p2Q7J82j46q7Q2J43q6R0k79P8k3
$$ 76 -60 -61 -130 152 197 65 40 0 -45 -25 133 48 72 -28 -100 -13 169 23 -64 18 161 75 165 -114 -36 -59
1788e9P7N2j60J85pj28m4M1k2L9o4pJ71M1j91L6j19J80R0j27O6r3n1PJ66j42J54
$$ -59 18 70 -90 95 88 -40 -84 -43 -65 -26 -90 -97 74 115 -76 -40 -159 21 111 -16 50 -43 -94 -87 79 -63 91
1815I1p1j02J54k3K5k9k46J05J65K9rj82j6J77P7j02o9j26J32J52q4pq1o9J11
$$ 91 20 -82 72 49 74 45 -201 -96 69 98 89 -93 -109 68 145 43 -26 -152 -20 132 48 41 -40 -109 2
1840BN1NP2k36r3L20o7k7O2k94R7J50J55j91p6o3J88J00r3k4p4J2L8P4P5k49o5
$$ 2 53 58 130 -106 -199 121 54 27 89 -205 -108 42 197 6 -70 -133 55 155 62 38 -36 -24 14 88 163 -86 -151
1867a51q4L27j5N9l87L0K78l1L8j31l8N0J86j16L3j41J11o4J02R6j39j06j9J11
$$ -151 -235 92 77 136 -251 -221 57 26 64 -67 -105 -55 131 15 48 -93 18 -46 56 152 13 -93 -112 -1
1891aP5J26j52k21J7K41N1q0k29OL17l0o7N1k12J61j46J69m3Nj44KJ84J21k18
$$ -1 74 200 48 -173 -156 85 136 56 -173 -167 150 120 53 104 -108 53 -93 76 33 38 -106 -104 80 201 -17
1916a7m5j09K72j2n8j25l2J13P5M7p5j86J61N7o4R9p7K0p0JJ10Ol4n1k9J63J02
$$ -17 -62 -171 101 89 31 -94 -126 -13 62 109 34 -152 9 66 2 101 24 44 -26 -25 85 91 57 6 -23 140 242
1943B42j12k21K5J29J7p6j8L3m8QjO7pj0p7q0J01J3Q7j06q0J15Q1j00j21J85j44
$$ 242 130 -91 -66 63 80 4 -14 19 -29 -21 -22 45 38 28 -49 -129 -28 -15 72 -34 -114 1 82 -18 -139 46 -98
1970i8J36p5lR2kj15M1M8J3qno2R0n1k2m6k4J85N6j29kj93K16o0j8j0O0j50J6
$$ -98 38 -37 -40 52 50 -65 -24 24 37 29 24 -38 52 1 -21 -67 -91 94 150 21 19 -174 42 -18 -36 -46 14 -136 -120
1999a20P8o7J82j92p3J62J83k1m0j81m8J55P5j58q4J37L9m6J02j0L6k25N8J92
$$ -120 -42 -109 73 -119 -192 -30 153 132 92 -89 -137 18 93 -65 -149 -12 27 -19 83 73 109 -116 -58 134
2023A34r6n2j93J52P2pJ24k20j08K48J91j25k51l4J46P8%P0k10MJ00k5J04P8k93
$$ 134 38 -14 -207 -55 17 10 134 -86 -194 54 245 120 -131 -165 -19 59 59 129 -81 -77 23 -2 102 180 -113
2048a13LL7RJ60j57j36N9J68K25j60j69LP3J58k12J72j81O9j4Q4K9j36j8o6J12
$$ -113 -110 -73 -64 96 -61 -197 -138 30 255 95 -74 -71 2 160 -52 120 -61 8 -6 78 107 -29 -47 -113 -1
2073aO5Q9j93r5M6K17j09o6o0l3K93j80J55j99o1R3J88r6q8N8m0P9l5K4m8n4q0
$$ -1 64 153 -40 -135 -89 128 19 -47 -107 -140 153 -27 128 -71 -132 -39 149 53 -35 23 -17 62 27 51 3 -51 -131
2100a31P1J44oj17J09L4j0O8k44l0J39l0lPqK4j92J82O6J05k14%M6J5J20r4j84
$$ -131 -60 84 78 -39 70 104 94 162 -82 -112 27 -3 -6 1 -7 17 -175 7 73 178 -36 -36 10 25 145 51 -133
2127a33m1K53q4J60j53omj2J85j61lJ2l7K8J46l4q5p3j3J14k0n5m4j24K15M0p
$$ -133 -174 79 -5 155 2 -4 -8 -20 165 4 1 13 -24 4 150 116 31 -42 -55 59 39 -16 -60 -184 31 71 64
2154F4l3L1j9j2n9o0L9Q8j06n0L6R5n0l1m8J95j09Nm3n6K46j42J6P7o8J9j03O1
$$ 64 31 62 43 31 -28 -88 -49 39 -67 -117 -81 14 -36 -67 -115 80 -29 -24 -67 -123 123 -19 -3 74 6 25 -78 -17
2182a7jk7J0M6j2J67l8k30M2N0J16k11J4j9J93j8P1k5n7m2r3N5MR7n8r0j4M4J09
$$ -17 -18 -45 -35 11 -1 166 128 -102 -60 -10 106 -105 -91 -110 83 65 136 111 54 12 -81 -26 -22 75 17 -73 -87 -43 66
2211F6mk16Q8M2Pp4rJ9L0K6N8j36Ok6J19L5o4J40k09P7l1N4P7q9j64K56l0Q2o9
$$ 66 62 -154 -66 -24 -17 -91 -100 -81 -51 -25 33 -103 -97 -123 -4 31 -33 107 -102 -25 -56 -2 75 -14 -178 78 48 130 61
2240F1mj5K9k8q9M9o0P0l1M0O2l3j46J3K3J03o2NK3o3Q9j01l5jJ17mJ5l3n8M1
$$ 61 57 42 71 43 -46 3 -57 13 -18 22 84 51 -95 -82 -59 44 -18 -13 10 -53 36 -65 -100 -101 16 12 27 -6 -64 -23
2270b3r0J82O0n1j79p2J40J16N3j72L1l3P8l7l1j03O4M9OJ13k01J39j6j74K57
$$ -23 -113 69 129 78 -101 -173 -33 83 136 -36 -5 -38 40 3 -28 -131 -67 -18 -12 101 -100 39 23 -151 106
2295A06r0J0o9K8r2j0K40m1j35R7k6M5j34N4P2m6Q8j38j16J62J07o9J5k6l4k2
$$ 106 16 26 -43 -15 -107 -117 123 82 -53 44 18 63 -71 -17 55 9 97 -41 -157 5 112 43 58 32 -2 -24
2321b4rJ52r9M3J3j78J21M2L1j00j28J00P4n8o2M1mO0k1M9m1R6j66O7j05N4J23
$$ -24 -33 119 20 63 76 -102 19 61 92 -8 -136 -36 38 -20 -82 -41 -45 15 -6 43 2 98 -68 -1 -106 -52 71
2348G1j62L4k4L9j3j9J23r4J62k36J15L8k3q3J49j1MJ0j15j6j6J51No9j5Q5m7
$$ 71 -91 -57 -81 -42 -55 -74 49 -45 117 -119 -4 34 11 -72 77 66 70 80 -35 -51 -67 84 89 20 5 90 43
2375D3p4L3n7k1R0K4k4j0k2m7O5m6n1P4q5J59r3JkL9k8QR3Q8l26J08L8l6L6N8
$$ 43 -31 2 -55 -76 14 38 14 4 -18 -65 0 -46 -97 -23 -108 51 -42 -41 -43 -4 -32 -24 69 157 -169 -61 -23 -59 -23 35
2405C5j11O2K0J3J50j79M4n4J0P9k9j36NR1l6M4O8k67J60J40j8j02n7O6MJ1J40
$$ 35 -76 -14 6 19 169 -10 34 -20 -10 69 40 -96 -91 0 -36 8 76 -191 -31 109 91 -11 -68 -2 2 13 153
2432A53k47Q0n9O8n0J21j02l3NR5L9o1k2n8J35o9J63j81L2j85J41Nm3P0r0l0J24
$$ 153 -94 -14 -73 -5 -55 66 -36 -69 -64 31 70 9 -13 -71 64 -5 158 -23 9 -176 -35 -30 -73 -3 -93 -123 1
2459AN3j8q1J8J40j30J0j2k1K9Q6k5j18J60p3k0KM5Nm0j8J0o6J23j46J70o7L6
$$ 1 54 36 -45 -27 113 -17 -7 -19 -40 -11 75 50 -68 92 19 -1 1 46 51 11 -7 3 -63 60 -86 84 17 53
2487E3k5PKq7P1n3N5%j75J83lj35J82q9k7n3k4K08j60L4J75j09m5O4l6l4N3J9
$$ 53 28 35 37 -50 21 -32 23 23 -152 31 28 -107 75 -14 -41 -94 -118 90 -70 -36 139 30 -15 49 13 -21 32 51
2515E1j04R2j8N0q2J29j48L4kq3L3J39j09nj1M7q8PN3P9ln5M7P1m4r3m9j6M5L2
$$ 51 -53 39 21 71 -11 118 -30 4 2 -81 -48 91 -18 -23 -34 13 -75 -68 -15 64 61 6 53 124 80 -13 -62 -78 -33 -1
2545ao0Pj3M7p7k1J93p4O5j23R7k1l5MK8%O8m5Ko8n6K0J18l6j7qK0j1J06q8r8
$$ -1 -61 -54 -67 -20 -97 -118 75 1 66 -57 40 19 -16 -12 16 16 84 39 41 -27 -83 -63 55 19 2 -6 14 3 109 21 -77
2576g7Q7l7K9qP6k5p3K9o5J12q8K5j8JJ9Ql2j2K4J31j11j60K14r0N1m1J02o4j9
$$ -77 10 -27 2 -6 70 45 -28 1 -64 48 -40 -15 -33 -32 -13 -5 -37 -49 -25 106 -5 -165 49 -41 10 -31 71 7 -12
2605a2L7K0K6q8m0k8L6J6O1o4n3J39Kpm6q8L7LJ34o1Rl1n3l7Q4M8K5o7jM1j48
$$ -12 25 45 71 -17 -57 -85 -49 -33 28 -36 -89 50 52 45 -1 -89 -52 -49 85 24 33 2 -51 -88 -4 44 69 2 1 42 -106
2636a06P6mJ27j53K2j3N0M8l6q9J48j21J8LP0k3O6q1Q4j06nJ05j7j77J28m9J3
$$ -106 -30 -34 93 -60 -38 -51 -1 47 11 -78 70 -51 -33 -30 40 17 83 2 86 -20 -25 80 63 -114 14 -35 -22
2663b2O1qk9l2l9K2J30j49Q7l9j2M1p9M3O9o5j7j6O5j7l2L5K0o6K1j55R9J45J05
$$ -22 39 31 2 -30 -69 -47 83 -66 21 -18 -30 11 -68 -25 44 -21 -38 -54 11 -6 -38 -3 17 -49 -28 -183 -84 61 166
2692A66j23n4J21o8o3J74q6j35J46j14n8Q8Q7j97O7J23j63J51M5r8j27L3Q5l5
$$ 166 43 -11 110 42 -21 153 67 -68 78 -36 -94 -6 81 -116 -49 74 -89 62 107 9 -118 -85 0 -35
2716c5O7j06k6J29r8o0L5P4n5J20PO8k15J69j01M4r8M9n4J25J0O5o0N5j60J09
$$ -35 32 -74 -100 29 -69 -129 -94 -20 -75 45 52 120 -95 74 -27 17 -81 -32 -86 39 49 114 54 109 -51 58
2742E8r7M0J18j34L4j3o0m9k0J03p3Q7Q7l1K3j60n5J84q7m1M5L9L1j3k5K6K4r7
$$ 58 -39 1 119 -15 19 6 -54 -103 -123 -20 -93 -6 81 50 73 -87 -142 42 -45 -86 -41 -2 29 16 -9 17 41 -56
2770e6PJ34j14l2n1J14J41j79J27j1o7k8M3Mj2N1j50J35KLj25L3J32j03k5P2o2
$$ -56 -49 85 -29 -61 -112 2 143 -36 91 80 13 -15 28 32 20 71 -79 56 58 61 -64 -31 101 -2 -27 45 -17
2797a7Pn6J56qj21N0qq1J38l4j03j1J37L2q5l6J06j25J58q7PPj15lR9l5k9P4n9
$$ -17 -10 -66 90 82 -39 11 3 -78 60 26 -77 -88 49 81 -4 -40 66 -59 99 12 19 26 -89 -92 7 -28 -57 17 -42
2826d2M8j09Q7R6n5j39J70n4J1n7Q2j71J74j9L0J7r0n8J05Po1L4k8n7J54j06P2
$$ -42 6 -103 -16 80 25 -114 56 2 13 -44 38 -133 41 22 52 69 -21 -79 26 33 -28 6 -22 -79 75 -31 41
2853D1Njj01N4j1R3l7j06O2l5L6O9j00M9l4o2R0r0J24k8q4Q9k4o1j5M5M3M7p5
$$ 41 46 45 -56 -2 -13 80 43 -63 -1 -36 0 69 -31 18 -16 -78 12 -78 46 18 -66 23 -1 -62 -77 -32 11 58 -17
2882a7j12P6j1P0J2p0pL9M0J18j19k6N7q2Q8j35L8M4k7J5O9n7P3p1N2J9J6j49
$$ -17 -129 -53 -64 6 18 -52 -59 -20 20 138 19 -7 50 -32 56 -79 -41 3 -24 -9 60 3 76 5 57 76 92 -57
2910e7lNN5M9Q5j67O1o8J14k5j7K3qmM2j41j7N3M0l3r9K16j37K1j7N4J0k2OR3
$$ -57 -60 -55 0 49 134 -33 28 -40 74 49 32 55 47 43 85 -56 -73 -20 20 -13 -112 104 -33 -12 -29 25 35 13 19 112
2940A12k08K12j73R1j32P4jOM7k1k0J33k13J25rl4r6O7j5KJ1j4Q1q2k1J21n6k1
$$ 112 -96 116 -57 34 -98 -24 -25 -19 28 7 -13 120 -93 32 23 -11 -107 -40 -55 -53 -42 -56 25 -57 -78 43 -13 -34
2968c4l7O2p9J16k3k5k6q3J08j5J16j73O0mK4k6J5j0k0M1J15p4J5O8r8P8j05j
$$ -34 -71 -9 -88 28 5 -20 -46 -129 -21 -36 80 -93 -33 -37 -13 -39 -24 -34 -54 -13 102 28 43 111 13 91 -14 -15
2996a5N6q1J04m1p8OJ06j5j5kmj9l5J23j35j3M7o9J15Ml5N0m5m5jJ37j37%mJ23
$$ -15 41 -40 64 23 -55 -49 57 42 27 25 21 2 -33 90 -45 -58 -11 -80 35 39 4 54 9 -36 -37 100 -37 -37 -41 82
3026H2po6r2j2J68n5Q0J9j03M1j22M0j9J58q1r2N7J32r5n2j8l8K02j13q1J31n2
$$ 82 75 9 -83 -95 73 18 98 117 14 55 -67 -27 -46 112 31 -61 -4 128 33 -19 -37 -75 127 14 -67 64 12
3053A2o0NNJ2M3K3m5l0J40r6j13pJ12np3J37M2k11jJ59K6n9j37J95n2L3PM9r5
$$ 12 -48 -43 -38 -26 17 40 -5 -35 105 9 -104 -111 1 -4 -77 60 102 -109 -110 49 75 16 -121 74 22 55 62 111 16
3082A6q6J31n6L5q7L0O8r4L7m3jM1N4l8JK0n1R8j32j8J54j96K34j52l2pl5J67
$$ 16 -70 61 5 40 -47 -17 51 -43 -6 -49 -50 -9 45 7 8 28 -23 75 -57 -75 79 -117 117 -35 -67 -74 -109 58
3110E8m4k3k3K4l8OO8J07j39kL3J25n9j35Q1j13m4QM4Q5k1J8M9mj0j6o9k6L4J6
$$ 58 14 -9 -32 -8 -46 -40 28 135 -4 -6 27 152 93 -42 39 -74 -118 -110 -66 19 -2 16 65 61 51 35 -34 -60 -26 -10
3140a0j0L2Mr3P7%j4m0P6m5j11J27K7o8N1l7Kj07J48p6J14l9N8nq8qM4O3j37P6
$$ -10 -20 12 16 -77 0 0 -14 -54 22 -23 -134 -7 20 -48 3 -34 -32 -139 9 -67 47 8 66 61 -27 -35 9 72 -65 11
3170A1n4j32Q8L2O4N4j03J21o8Q0k24K91j13j1Oj35J55m1J8m1R9j00OL6K7r2n9
$$ 11 -43 -175 -87 -55 9 63 -40 81 13 93 -131 160 47 36 42 -93 62 21 39 -2 97 -3 3 39 66 -26 -85
3197h5j3J64J6r1O6j2r7J02n8qp4N9l5nkM1O0r6P1k5R7l2j52O7PP7J9m6p4J43
$$ -85 -98 66 82 -9 57 45 -52 50 -8 -16 -90 -31 -66 -71 -73 -32 28 -68 3 -22 75 43 -109 -42 -35 42 61 15 -59 84
3227H4j46Q6M6k6j89J27M5J23j04M3k6j74Q4N3L0P5j62M1k5q0J51K1p9p2P7O5
$$ 84 -62 24 70 44 -145 -18 27 150 46 89 63 -111 -27 26 56 131 -31 10 -15 -95 56 77 -2 -74 3 68
3253F8K9r6p9P8M7q9P7J2M4p1J11k35K10j36rO1n5J16j05Pj4k8J83j90L9J3L3
$$ 68 97 1 -78 0 47 -42 35 47 91 20 131 -104 106 -30 -39 22 -33 83 -22 -15 -29 -57 126 -64 -25 -12 21
3280B1k4P9n5n7P3m4O5j22M6k6N9j1M2j34J37q0O0L6p7j8k4k3J43j0j13m2P7j
$$ 21 -3 76 21 -36 37 -7 58 -64 -18 -44 15 4 46 -88 49 -31 29 65 -12 -30 -54 -77 66 56 -57 -99 -22 -23
3308b3J25r4j7O3r0L9j4P6j12M2Q2o1K9p2J9Q0p8M3Q0n6p6p7R1q0J60n7J1P2j24
$$ -23 102 8 -9 54 -36 3 -11 65 -47 -5 77 16 45 -27 -8 72 -6 37 117 61 -15 -92 -1 -81 79 22 33 105 -19
3337a9p4J10l7K9qr1J19r5J1j0R0m4%N5qK9k50R3J0J55j97R9K21k00rJ09j90J69
$$ -19 -93 17 -20 9 1 -90 29 -66 -55 -65 25 -19 -19 36 28 57 -193 -100 -90 65 -132 -33 188 -12 -21 88 -102 67
3365F7j48J61j4j56L7L8m7Q3kn1J32j49L1j32M7P5%K2R3k0j08K5J07j54J82j60
$$ 67 -81 80 66 -90 -53 -15 -62 21 19 -32 100 -49 -18 -150 -103 -28 -28 -6 87 67 -41 -16 91 -63 119 -41
3391d1J19p0j33J58N5r3K7m9k7N6O0J0l6J4p2J6P5j5p1mQ6p9Qm5P6J18j64M2k3
$$ -41 78 8 -125 33 88 -5 22 -27 -54 2 62 72 36 50 -22 -6 69 54 -17 -21 65 -14 -6 -51 25 143 -21 21 -2
3420bR9j13M0j3p2O4r5Pj4mJ00M7m5M4l2J0l7N7r2p9Q2m3NJ29j11J07j1q8K0M7
$$ -2 97 -16 24 11 -61 3 -92 -85 -99 -103 -3 44 -1 43 11 21 -16 41 -51 -130 -48 -91 -86 43 -68 39 28 -60 -40 7
3450Gj24K29q0J1O5j24J27o8M8j33J38l3n1j4n2O4k0r7P8p7R4J0o0M9l1L9J3l7
$$ 7 -117 112 32 43 108 -16 111 43 91 -42 96 63 12 -2 -54 10 -10 -107 -29 -106 -12 -2 -62 -13 -44 -5 8 -29
3478b9N4m3NQQ0J7p6o5K1M9j02J60j50O1j5M3K0o4Q8r8k0K9M1K7OrM9j14JQ2l7
$$ -29 25 -18 -13 -5 75 92 16 -49 -28 21 -81 79 -71 -10 -25 18 38 -26 62 -36 -56 -27 14 41 47 38 87 -27 -26 56 19
3509A9O2o8N5mo3o2J33j73N7mQ8k6kk7N9j18o1J61N9l7Qj18J23n1Q7j43K9N4n8
$$ 19 81 13 68 64 1 -61 72 -101 -44 -48 40 14 12 -15 44 -74 -135 26 85 48 56 -62 61 10 97 -46 -17 37 -21
3538b1J8k6MP1j0j8q0j4J01M5p7j7J32p9j46Q9J45j74Q5qo7J7L7k7M6M3m4o2L7
$$ -21 -3 -29 -25 46 36 18 -62 -76 25 70 -7 -24 108 29 -117 -28 117 -57 28 20 -47 -30 7 -20 26 69 25 -37 0
3567@J00j21j0Q8j2M2r6OJ5J0q1O5K4oM7j2p0j15K33j63K5K8K5j82J16J2N3M3
$$ 0 100 -21 -31 57 45 87 -9 -3 12 22 -59 6 30 24 71 59 -11 -126 107 -56 -31 -3 22 -160 -44 -32 21 64
3595F4k5j07Mm9K27j19m0J21j47N5K6PqR3n1j11j0m7J37KoL4J2j60O1M5j19J92
$$ 64 39 -68 -64 -113 114 -5 -45 76 -71 -16 10 17 9 102 51 -60 -70 -117 20 22 16 50 62 -98 -37 8 -111 81
3623H1l5k2q0l3P8k3K4N7M8n7j9k6M8j77J92o6OO5j17N3k5J6j16J03Q9Oo1KoJ7
$$ 81 46 24 -56 -89 -11 -34 -10 47 95 38 19 -7 41 -136 56 -10 -4 61 -56 -3 -28 -12 -128 -25 64 70 9 11 5 22
3653B2l3J52j18pn9OM8l0k2R4j18M2K6l5J34j42R5q0O8p7P8q2R2q3J25j01n4N6
$$ 22 -11 141 23 16 -43 -37 11 -19 -41 53 -65 -23 3 -32 102 -40 55 -25 43 -34 44 -38 54 -29 96 -5 -59 -3
3681cL9p7j68K51Kj9j29N8L3J61j40O3q6J57r3q7J8N6n9PQ5l8lK0M9J3p2J3O3
$$ -3 36 -41 -209 42 44 25 -104 -46 -13 148 8 71 -15 142 49 -38 -20 36 -23 -16 69 31 28 48 97 110 38 51 114
3710A14j90P9l6K4J8o3L1L2J0J25k14K0O4j1pM5l7j00Q9j4k5N1N8m4L3j16J29
$$ 114 -76 3 -33 -9 9 -54 -23 9 19 144 -70 -50 14 3 -4 41 4 -96 -7 -21 -46 5 63 19 52 -64 65
3737F5n4Nj5M8k1J22r0k2k6j01N7J21P7j95JQ0l0j7O7m7j16PP9N9n5n9k0O0Q0
$$ 65 11 16 1 49 28 150 60 38 12 -89 -32 89 166 -29 -28 52 22 5 72 25 -91 -84 -5 54 -1 -60 -80 -20 60
3766F0m8K5n2M8p3N6m4M6r0J02j6p9Q4MM9j4r2J12n0l8q3J96m6m1QP5p3K9j06
$$ 60 12 37 -15 33 -40 16 -28 18 -72 30 14 -65 19 23 72 58 -34 78 28 -10 -93 103 57 16 24 99 26 55 -51
3795e1l3Q8KQ1j00K0l7N2j2p7K7K1l9JJ39M3j43K0n4N0O3j41J28k5n2L3J9o9K2
$$ -51 -84 4 6 87 -13 7 -30 22 10 -67 -40 -19 -58 -57 82 125 -18 2 -52 -2 61 -80 48 23 -29 4 23 -46 -24
3824b4N3p0NKJ3m2Q5j7J8L5j19k8J2R6R4j17j6M3m8M0j32J02J0o3P7jN5l2NJ03
$$ -24 29 -41 -36 -34 -21 -63 22 5 23 58 -61 -89 -77 19 113 -4 -20 23 -25 15 -117 -15 -5 -68 9 8 63 31 36 139
3854A39j41M1J60j25OOM1J9j30J3OoJ3o7P3M1m0j1l6j3jj9m8Q3K7r4J65p9mj8
$$ 139 -2 39 199 74 80 86 127 146 16 29 35 29 42 -25 48 89 49 38 2 -11 -12 -31 -79 4 31 -63 102 23 19 1
3884Ap8QR5p8k0O5j6J9r3K13k27L5J28l0PJ17j70J0j8%J9K1J3l7O3n4Nn0N8J18
$$ 1 -77 -69 26 -52 -72 -7 -23 -4 -97 116 -111 -76 52 22 29 146 -24 -14 -32 -32 -13 8 21 -16 47 -7 -2 -52 6 124
3914A24k32J22J08n2j11J88nl3j92R1l8k4m1K07m0j28K1o5N1J5j8J17k7rl5P8
$$ 124 -108 14 122 70 -41 147 142 109 -83 8 -30 -54 -95 112 72 -56 -35 -100 -49 -34 -52 65 38 29 -6 72
3940G2j78J44q4J56Qm8j04pM5j9P9m0q4R7L5o3p1P0j7J7l0K2O4j12Nk5J01n3k1
$$ 72 -106 38 -46 110 118 70 -34 -41 4 -15 64 24 -60 37 72 9 -62 8 -9 8 -22 0 64 -48 -43 -68 33 -20 -41
3969d1P1Kn9M4n3J40r6k2k1P4m2j3J1J02j30L1k6jL7J5N0j28P4O8o2k4p0J29l5
$$ -41 30 32 -27 17 -36 104 8 -14 -35 39 -3 -16 -5 97 -33 -2 -28 -29 8 23 73 -55 19 87 25 1 -69 60 25
3998B5m4L7o3O4m6J01p6Mj09O4Q7j7k0L6l3J6o5J07m9L0j09J9o2J30NRn3K8J8
$$ 25 -19 18 -45 19 -27 74 -2 2 -107 -43 44 27 7 43 10 26 -39 68 19 49 -60 -41 -103 27 32 41 -12 16 34
4027C4k5N3j48R8P0q5j7N3k9k8L7l2n6O5Q9j20j01J66M1j01O2j43R9O5l7K3l8
$$ 34 9 62 -86 12 82 -3 -20 33 4 -24 13 -19 -75 -10 79 -41 -142 24 65 -36 26 -117 -18 47 10 33 -5
4054eMn5N9j0J6P3m5J6k20J57J33q7l6m8j8J64q1n5P4jj40J95l9l7K6j05J08r5
$$ -5 -1 -56 3 -7 9 82 37 53 -167 -10 123 36 0 -48 -66 98 17 -38 36 35 -105 90 51 14 40 -65 43 -52
4082e2J7J68j38J06j38N0j3j08J66j75J19N2m4L8L9r4mJ04n7O3p6J0J40j69k4
$$ -52 -35 133 -5 101 -37 13 0 -108 58 -117 2 54 10 48 87 -7 -11 93 36 99 23 33 173 4 -20
4107b0Q9j49K73k00N1Q6j24j3L3K1K1Q3j77L0J66j10o1Ln9O6P7j23O5Oj5q7K8
$$ -20 69 -80 193 -7 44 130 6 -7 26 47 68 151 -26 4 170 60 -1 2 -57 9 86 -37 28 34 19 -68 -40
4134d0N3K6j40O5M9q4j9l2J86rM3j21m0O4P5r2p7K16j45N3p5O7K2J4q1l0N2Kn
$$ -40 13 39 -101 -36 13 -71 -90 -122 64 55 98 -23 -63 1 76 -16 -93 123 -22 31 -44 23 45 59 -22 -52 0 2 -3
4163cn9J83o0k8J2K4r3J07j04L9lm0l1J02n1o0JK5J16p3k5k4J8N1Pp3j7Q7m8J41
$$ -3 -62 121 61 33 45 69 -24 83 -21 18 15 -25 -56 46 -5 -65 -64 -39 77 4 -21 -45 -27 24 31 -42 -59 28 -20 121
4193A21j58O7j9r9J00k5j21R9l5J24j01M2K8j4L4n2j12J18o7J13Mj33Q2J44j30
$$ 121 -37 30 11 -88 12 -13 -134 -35 -70 54 -47 -5 23 9 43 -9 -121 -3 -70 43 47 -86 -4 140 10
4218A0l7J9l9J23k8p6K8m5k3J57r5k1oM8K2qJ4n7N6p9J31j72J37q0O2p1K3o3O8
$$ 10 -27 -8 -47 76 48 -28 0 -45 -68 89 -6 -27 -33 15 37 29 43 -14 42 -37 94 -78 59 -21 41 -30 -7 -70 -2
4247bnJ12j3j5p4l8R0j77J32j4M1j7L3j05pO4r3j06J67J18j30o3J53j22L0O5O2
$$ -2 -7 105 92 77 3 -35 55 -122 10 -4 37 20 53 -52 -59 5 -88 -194 -27 91 -39 -102 51 -71 -41 24 86
4274H6o4Q8j40J68j76K4Po4N0o3K3M7o8N1n5J7J59j36rJ11nkL0l1j2N2k1Qq5O5
$$ 86 22 110 -30 138 -38 -14 -7 -71 -21 -84 -61 -14 -82 -31 -86 -69 90 -46 -55 56 51 49 79 48 36 88 67 75 -10 55
4304E5j08J43j38k7J65j42N3N5N5m4Mk14K25j64Q6j37K22q1m2pJ22j00q5R7j3
$$ 55 -53 90 -48 -75 90 -52 1 56 111 67 71 -143 82 -82 4 -133 89 8 -34 -41 81 -19 -104 -7 -20
4329b0K1R0j51O5L3m8k0n7K27k16J00k0O3j89J24l7Q5oq1M3l5PR3o7N6o1r3J91
$$ -20 1 91 -60 5 38 -10 -30 -87 140 -76 24 4 67 -122 2 -35 50 44 -37 6 -29 -22 71 4 60 -1 -94 97
4357I7Lj31J4J6jK0l9k2J26j1n2J3%j3J01j65J14k6p1m4P7J01p2r8J3J02j24K9
$$ 97 100 -31 -17 -1 -2 18 -21 -43 83 72 20 33 33 20 121 -44 70 44 -27 -71 6 107 35 -63 -50 52 -72 -43
4385d3l9J87k24R2N1r6N1QQ5k00R2J5O0K7n0o0M7K4j51O8J31l1l4M7l2Mq4J09
$$ -43 -82 105 -119 -27 24 -72 -21 -13 72 -128 -36 -21 39 66 16 -44 3 27 -124 -56 75 44 10 57 25 29 -55 54
4413E4o9N4J0O5q0j8L5oo6R2j04O9J5n0qpr3N2J34j33N0j6m1jRO4o5OJO6K2j1
$$ 54 -15 39 49 114 34 16 51 45 -21 71 -33 36 51 1 -7 -14 -107 -55 79 -54 -4 -20 -61 -62 -53 11 -54 -48 -47 19 41 30
4445C0q3P9N5j80P1J6jJ2nj7jQ9k0M9j88J29L4j3j21p1Q7L7K2J6O9j57P6l7N7
$$ 30 -53 26 81 -99 -28 -12 -13 -1 -6 -23 -24 65 45 94 -94 35 69 56 -65 -136 -49 -12 10 26 95 -62 14 -23 34
4474C4o1P8N6o8j1m1l7RM8o9R1j8o1J29j4L4l0j9o3J0m9k6J30m2R8l8j00j6L1
$$ 34 -27 51 107 39 28 -13 -50 -41 7 -62 29 11 -50 79 65 99 69 50 -13 -3 -52 -78 52 10 108 70 -30 -46 -15
4503a5Q2J4l5m7RQr6m8J51j10J05P9j75L8J9M9L8k3q7M0N2j03O8N6n4j2P7J2m1
$$ -15 67 81 46 -1 8 16 -80 -128 23 -87 18 97 -78 -40 -21 28 66 43 -44 -4 48 -55 13 69 15 3 80 92 51
4532E1m1K3l5P4j38J23q2M4K4l0Q2o9o9J44j28j11K25k31J65n5P5Pk4j3j9J01
$$ 51 10 33 -2 72 -66 57 -25 19 43 13 95 26 -43 101 -27 -138 87 -144 21 -34 41 48 24 11 -8 93
4558I3j60P2P2p9O8j20R7j02n6J19Mp9M6L9j8o1J05M7o6k1O9r6m4J31k0l1jqR6
$$ 93 -67 5 77 -2 66 -54 43 -59 -115 4 8 -71 -25 14 -4 -65 40 87 21 0 69 -27 -71 60 40 9 8 0 96
4587I6m9k5m0M8J04j19q6J03l8o4Q5K1n3L9q6J22r8p1Q1j03J79lnj7p2J12j73
$$ 96 47 22 -18 30 134 15 -71 32 -6 -70 15 36 -17 22 -64 58 -40 -111 -30 -133 46 43 38 21 -51 61 -112
4614a12J15oP8p7l6J26j9p0nK5r0J46l4o7J08j90J81K2j50O3Q8r5J0k0r8K5N3
$$ -112 3 -3 75 -2 -38 88 69 -1 -6 19 -71 75 41 -26 82 -108 73 95 -55 8 96 1 11 -9 -107 -82 -29
4641b9R7j27J39Jn4j08K1Q2j86J76R3n4o2P3j29J11k26J64mP9P4j32mP8j51J12
$$ -29 68 -59 80 81 27 -81 -60 22 -164 12 105 51 -11 62 -67 44 -182 -18 -22 57 131 -1 -5 73 -78 34
4667C4M9j23L1o9P4P9k2j75J12O5j54J23Q5j57mm4N8q4J24m2oP2n4K5l8l4M5n1
$$ 34 83 -40 -9 -78 -4 75 53 -122 -10 55 -99 24 109 -48 -52 -96 -38 -122 2 -40 -46 26 -28 -3 -41 -75 -30 -81
4695h1J53q6L5p5O2n4J0J32k33K23j25RO4n7o5OQ4k0k4k1M3Q0N8j02k2l2J11q6
$$ -81 72 -14 21 -54 8 -46 -36 96 -137 86 -39 -30 34 -23 -88 -82 2 -18 -42 -63 -20 60 118 16 -6 -38 73 -13
4723a3q5L1o6J12R3Q7j54m7J77k23J03O6n2m3o3Q6j8Kl0J43q4jN7o5q6Q2R3q4
$$ -13 -98 -67 -133 -21 72 159 5 -42 135 -88 15 81 29 -14 -77 9 -9 -7 -37 106 22 21 78 13 -73 9 102 18
4751A8r4J25o4K2L4j20P9O1j06J01l9K6N4j51N0l2Q1L5k4K8j55M0K4K0qN8jj38
$$ 18 -76 49 -15 7 41 -79 0 61 -45 56 17 43 97 -54 -4 -36 45 80 56 84 -71 -31 -7 13 5 63 62 -76
4779g6O4jP6q4p9J51j1j0o2L0N6j06J19m6kK1J9J9j29L6P0j51J22Kk3l4J6O8L2
$$ -76 -12 -13 63 -21 -100 51 40 30 -32 -2 54 -52 67 21 19 40 59 78 -51 -15 55 -96 26 28 5 -29 -13 55 87
4808H7j36O3p5K5k8J08l7o0O7j0jj4n4J55j02mK3Q0lp6q3L3j2O5O0p0Q7r1R0j44
$$ 87 -49 14 -61 -36 -64 44 7 -53 14 4 3 -11 -65 90 -12 -16 7 87 84 8 -75 -42 -54 11 71 1 88 -3 87 -57
4838e7Q7r4J41j05m6J60k6l0l7K5k2l4l4J29m0l4L4m8O9m2R8q9j1n0O8l9j01J78
$$ -57 30 -64 77 -28 -74 86 60 30 -7 18 -4 -38 -72 57 17 -17 17 -31 38 -4 94 5 -6 -56 12 -27 -128 50
4866E0l5Jo4R2k7J5j34J31L6LRr0J29j55J3Q8l0P3j28J44j36l3J28j17Q0l9N2
$$ 50 15 16 -48 44 17 32 -102 29 65 68 77 -13 116 -39 -26 62 32 105 -23 121 -15 -48 80 -37 43 4 56
4893E6j45J00l1J86k45J14lk3MQ6k30J97q2n4R9J8o8k8k3J06j04R4K0N4j55Q5
$$ 56 -89 11 -20 166 -79 35 32 9 13 99 -131 66 -16 -70 29 47 -21 -49 -72 34 -70 24 44 98 -57 28
4919B8m3J7Q1n0k5j32J71n4L3P6j34J0j6J79q6rp2j0Q1j09k4P0R5m9o0K0Pm2L5
$$ 28 -15 2 83 33 8 -124 47 -7 26 102 -32 -22 -38 141 55 46 -26 -36 45 -64 -88 -18 77 28 -32 -12 -5 -47 -12
4948a2K5oO1j25j5J62j29P8j10j7J36K7J7j1k3j12P4L9Q4j79p1J23P0j78M8K5
$$ -12 13 7 68 -57 -72 90 -39 39 -71 -88 48 75 92 81 58 -54 20 59 143 -36 -107 16 86 -92 -44 -19
4974a9N1p8jJ1km7N2O3j04j8P7L4K3n6L8M9p8J3j27J06LM2r3J01j63O7J47j08
$$ -19 32 -46 -47 -36 -38 -85 -33 30 -74 -92 -15 19 42 -14 24 73 -5 8 -119 -13 -10 32 -61 40 -123 -56 91 -17
5002a7J40j30M7K1q1n8J49r0n7J18l6M6j00M7K1n1R2J5r6O5k6n1j2N6nJ9M1k4
$$ -17 123 -7 40 61 -20 -78 71 -19 -76 42 6 52 -48 -1 20 -31 61 76 -20 45 19 -32 -44 12 7 26 67 43
5030D3k0o4J15K0l2m6O2k4N2k30N2R5n8j5J9L0P8j06pK9qL7j8l5Q0j6j4rk5k5
$$ 43 23 -41 74 94 62 16 78 54 106 -124 -72 23 -35 -50 -31 -1 77 -29 -36 -7 -15 22 4 -31 49 33 19 10 -15 -40
5060d0J12o0m9L2Q3M2j88j3K0R2J4J0nJ7j23K9J46q7Oo7J04pr4K4P8j29Q6J4m7
$$ -40 72 12 -37 -5 78 120 -68 -81 -61 31 45 55 50 67 -56 -27 119 32 38 -29 75 68 -26 -2 76 -53 33 47 0
5089@N6k9j0o2J27j02L4p2O0l8R2j3j31L8QN5k6Jj3kO6l8lRM9j7M1m7j27J07l3
$$ 0 56 27 17 -45 82 -20 14 -58 2 -36 56 43 -88 -50 -42 13 -13 -12 -25 -27 39 1 -2 7 56 39 80 33 -94 13 -20
5120b0J2M1O6k47J01l7J45M4j9r0l1J6l0J23q4Q0l7Ro1K9r6R6J1O6k21J33Rm5
$$ -20 -8 33 99 -148 -47 -84 61 105 86 -4 -35 -19 -49 74 -10 70 33 42 -19 10 -86 10 21 87 -134 -1 8 -37
5148c7Q6m8N6m8o9J9k3K3J14j04J39j27J6o1L3k9Q7J3J0Kqo7K0L4j9R1j99P7L1
$$ -37 49 1 57 9 -60 -41 -64 -41 73 -31 108 -19 -3 -64 -31 -60 27 40 50 52 44 -23 -3 31 12 103 -96 -19 12
5177A2K2pl5l1R6Pr2k9J38J0j23l4n5K8J01o7N6n9N3MK5p9K6q8J86j29J28r4Q1
$$ 12 34 27 -8 -39 57 64 -28 -57 81 91 -32 -66 -121 -93 8 -59 -3 -62 -9 -5 20 -59 -33 -121 65 -64 64 -30 51
5206E1r0K1M7o3J43m8o0M4l6k3k0K23k62N3N7j18J61r3j6J14j09J18j5j0k6j34
$$ 51 -39 -18 29 -34 109 61 1 45 9 -14 -34 189 -73 -20 37 -81 80 -13 -29 85 -24 94 79 69 43 -91
5232i1K7K0J21n0n3J8k3R1o3l4Q9j96J12k8K6pnJ01n6O4j58R1p1K13j14k5m7R7
$$ -91 -64 -44 77 27 -26 -8 -31 60 -3 -37 52 -144 -32 -60 -34 -41 -46 55 -1 63 -95 -4 -75 138 24 -1 -48 49
5260D9L0j81J23l6j1O4l3k16K19l1NK1J7j19K2p7J39J07j94J67j94J67m6rj5J08
$$ 49 79 -102 21 -15 -26 38 5 -211 8 -23 -18 3 20 -99 -77 -154 -15 92 -102 65 -129 38 -8 -17 -32 76
5286G6j74J65lj30L5oJ2o6N3O3jp8j8P1P3r5j2P8q9P3q7n5R8P4k7p8J10j40M3
$$ 76 -98 67 64 -66 -31 -37 -25 -91 -38 25 24 -54 -72 -1 72 -23 -35 43 -46 27 -60 -115 -17 57 30 -48 62 -78 -35
5315c5Q2n7q1J06O0j71M2J61j05n4J20j08L5q5Q0J7N4j49kJ62j0j96O3P6o3Q4
$$ -35 47 -10 -91 15 75 -96 -54 107 2 -52 68 -40 -5 -90 -10 7 61 -88 -90 72 62 -134 -71 5 -58 26
5341B6J15m7K9j82L8q7J52j05J22j6p8K3Mm4o7J20o1Q5l1PJ3q4P8k4n1N0l5K2
$$ 26 141 94 123 -59 -21 -108 44 -61 61 45 -33 -10 -6 -50 -117 3 -58 27 -4 3 16 -68 10 -14 -65 -15 -50 -28
5369b8O3q0k4L8lJ39q0l4J14Pq4n3N8o7R6j37P3RM9nk8N5j72J99j43O7M0m8l4
$$ -28 35 -45 -69 -31 -34 105 25 -9 105 112 28 -25 33 -34 62 -75 -2 7 56 51 23 78 -94 105 -38 29 69 21 -13
5398a3O8k9k4%j2J2J8m4K5l4N5j5Pj9K6r4Q6m3k9JN6p2R4R3p5K2p6J51o4k8L2
$$ -13 55 26 2 2 -10 2 20 -24 1 -33 22 7 14 -5 21 -73 13 -30 -59 -58 -2 -74 20 113 38 60 -16 135 71 43 75
5429G5j72J50o9l2L3pJ20k10K22k06J21j8J6m3j40J66j9N8k9n7J60j49J09q3L8
$$ 75 -97 53 -16 -48 -15 -22 98 -112 110 -96 25 7 23 -20 -160 6 -13 45 16 -41 119 -30 79 -4 34
5454C4m0r1J27M5p1J9K6j14J29q6P2j38J24l5Q5j40P4j01R3J61j27q0J07j52L6
$$ 34 -6 -97 30 75 4 23 49 -65 64 -22 50 -88 36 1 86 -54 20 -81 12 173 46 -34 73 -79 -43
5479d3oR4p9O5l2k1Q8j06M3l7Pp6J39j26J78j36M4M1N3rJ0j21J65j62R8n4O3j49
$$ -43 -49 45 -34 31 -1 -22 66 -40 3 -34 -27 -103 36 -90 88 -48 -4 37 90 81 91 -30 135 -27 71 17 80 -69
5507f9O2kk8J04p8P3j64P1P9M1j28N6l0k4J9n0R9l9M5O8j03q6k3K1K51k38k2K03
$$ -69 -7 -9 -37 67 -11 62 -102 -31 48 89 -39 17 -13 -37 -18 -68 31 -8 37 105 2 -84 -107 -86 165 -73 -95 108
5535A08r3p0R9J3%N2j54kJ14k9n6k2n6K21Jn0j29J18J6P7j92n7J67o7k3N5j87
$$ 108 15 -55 44 57 57 109 -45 -47 67 38 -18 -40 -96 125 126 76 -53 65 81 158 -34 -91 76 9 -14 41 -146
5562a46O8K04j35jL4q7J34k4j03LJ39p6J19j99J17p1n6K7R1m2M3j7r9L1n0J23
$$ -146 -78 126 -9 -10 24 -63 71 47 -56 -53 86 10 129 -70 47 -24 -80 -53 38 -4 39 22 -77 -46 -96 27
5588B7j13J43j89m5K35r8PO5p3l8J52l3J03p9j10L6J08m8r8P9p6Nk6pJ2J06p3
$$ 27 -86 57 -132 -177 58 -40 -33 32 -41 -79 73 40 143 64 -46 -10 98 50 -48 31 -45 -40 -66 -73 -61 45 -28
5615b8J59j33M0n3QRJL9m2p1K2O3j41K10j33O3k5qj6K5M1k9m2O2n4K0J32J6j37
$$ -28 131 -2 38 -15 -7 2 3 42 0 -71 -49 14 -127 83 -50 13 -12 -20 -36 -11 30 1 -41 21 -33 -13 119 135 -2
5644bMp3J69j31N2k7o9k7J07J15o7p7O7k10L14j51o6J44j72J15j0J10q7n9K6p6
$$ -2 2 -71 98 -33 19 -8 -77 -104 3 118 51 -26 41 -169 145 -6 -72 72 -100 15 5 115 28 -31 -5 -81
5670h1R3R5o2o4J02o1l9N2K2o8l9M6l9J0J31j47J79j28M1Mn8J3j02J58j11J45
$$ -81 12 107 45 -19 83 22 -17 35 57 -11 -50 -4 -43 -33 98 -49 130 2 43 47 -11 2 -100 58 -53 92
5696I2o6n7N9j0R3q2j8k6q1J05j4R4j21J13j14M0m8rP3p2R2J4j36N3J4R0l4k2
$$ 92 26 -31 28 18 111 29 11 -15 -96 9 -5 89 -32 81 -33 7 -41 -50 23 -49 43 57 -79 -26 -12 78 44 22
5724B2jk6K9N0l0k7j53K15l0j12J32Jp5m2PJ19k9K6j03RJ8q6R4n9P3j0q3K2O9
$$ 22 21 -5 24 74 44 17 -136 79 49 -63 69 70 -5 -47 -40 79 50 76 -27 -18 0 -86 8 -51 22 12 -71 -49 20
5753B0r7J38n4K4n1k7N5n2J5J07j43Q4P4k61J39N3K5n1J8n6J33m7m8k1QnM8q2
$$ 20 -77 61 7 31 -20 -47 8 -44 -29 78 -65 19 93 -168 -29 24 49 -2 16 -40 93 46 -2 -23 -15 -20 28 -54
5781e4M1J36p2q8P9n6O1k1k5M6j7j0O0j19M3or1M8O6L2n9Jo3J8O0K6K2J8jj97
$$ -54 -13 123 51 -37 42 -14 47 26 1 47 30 20 80 -39 4 -2 -93 -45 21 53 -6 -5 -68 -50 10 36 58 76 75 -122
5811a22J11K9qLl7J4R5j35P3l3N6r4m5J43n7j6k8O7p8J46k9Ln8r3J02Q5o9l3q1
$$ -122 -11 18 10 13 -24 -10 85 -50 23 -10 46 -48 -93 50 -7 -23 -51 16 -62 84 55 58 0 -93 9 94 25 -8 -89
5840h9rN0N2M3j06J00o7N8lM0K3J4j34J29m1k5J1M7k8M0j12K6n3J57j02r0k3M7
$$ -89 -98 -48 4 47 -59 41 -26 32 29 69 92 106 -28 101 60 35 46 93 65 105 -7 19 -34 123 21 -69 -92 -45
5868d5K0M6J25p1j41N5L0j43N3J12J06j57J27j08N1l8k7Q8j51O9J33j76JJ02k7
$$ -45 -25 21 146 75 -66 -11 19 -124 -71 41 147 -10 117 9 60 22 -5 83 -68 1 134 -42 -41 61 34
5893C4j8m8N7M8j13N8K5m9M9r2P3J30j68P4j57J17k2l1M9r3J53j07J95p8j13j40
$$ 34 16 -32 25 73 -40 18 43 -6 43 -49 24 154 -14 60 -97 20 -2 -33 16 -77 76 -31 164 86 -27 -167
5919a67J08J46j02L0K2j02M1L2L6M7j32K9O7j03L9K1n8j8O2p8J09k3J8M2m0j41
$$ -167 -59 87 -15 15 37 -65 -24 8 44 91 -41 -12 55 -48 -9 12 -46 -64 -2 -80 29 6 24 66 26 -115
5945a15J82j11O6r0P6M6L5j04K8q2N9K5j8r6J19p7J44j93J10P6j49J26j5P3k40
$$ -115 67 -44 22 -68 8 54 89 -15 13 -69 -10 15 -3 -99 20 -57 87 -106 4 80 -69 57 42 115 -125
5970a25J11nJ4o1j4Q1l7M1M1j23P8p9P9J19r7J31j72rj7N4K1l1J3J31j34Ql7Q
$$ -125 -14 -19 -5 -66 -80 1 -36 5 46 -77 1 -78 1 120 23 154 -18 -27 -44 10 31 0 13 144 10 18 -19 -11
5998a1k9J2O9r0J36q5R8k01KJ29p5R8r4J7K0p0L4O3k1N4m3K8n3Q1Lr4O1k02J05
$$ -11 -40 -28 41 -49 87 2 100 -101 -99 30 -45 53 -41 -24 -4 -74 -40 23 2 56 13 41 -12 69 72 -22 39 -163 -58
6027e8K0J10J6j09l2M9l1Q2k00J78R6j74J58j43J2P7j0l7P9p2k4mOJ26j43n2J26
$$ -58 -38 72 88 -21 -53 -4 -35 47 -153 25 121 -53 105 -38 -26 51 41 4 83 11 -13 -17 -11 115 -28 -80 46
6054D6k0mj1L2N5r8k6p5J12N9j08M4o3R8M2j05j5J17j32P4n2m0J23J1j19P4NK9
$$ 46 26 22 11 43 98 0 -26 -101 11 70 -38 6 -57 41 83 -22 -37 80 -52 22 -30 -70 53 64 -55 19 24 53
6082E3o5P4J2ml3k1n2J02j68J98n3%l8Op3J15Rj40J70j60RJ39j33N4n5M4N8p5
$$ 53 -12 62 74 70 37 16 -36 66 -102 96 43 43 5 11 -62 53 62 -78 92 -68 -59 80 -53 1 -54 -10 48 -27
6110b7P4j05J19n1o2j4P4q8R8o3N7L3r8Q0m1m1P8L2km9n7J23j9o0J22j45o7J26
$$ -27 47 -58 61 10 -52 -66 8 -80 18 -45 12 45 -53 27 -14 -55 23 55 53 4 -53 70 51 -9 113 -32 -99 27
6138B7m2k3l2J49j09%L7j50J29n2r2N4P1M7q4L5m2O3k2k6J37p7M3lo9J6l0QR8
$$ 27 -15 -38 -70 79 -30 -30 7 -143 -14 -66 -158 -104 -33 14 -70 -35 -77 -14 -36 -62 75 -2 41 38 -31 -15 -45 -37 61
6167F1j44J14L9qq5N1k5k4J54k65J13JONj3p6Q1Q1j23Q2j04J2J1N1N2j18R1k7
$$ 61 -83 31 70 62 -23 28 3 -21 133 -132 -19 -18 -12 -7 -20 -96 -15 66 -57 25 -79 -67 -56 -5 47 -71 20 -7
6195gO6r0K4ORl8L1j08J92r6J05k34J12M1J1l3O4q7m2J14l5L5J5j1q0N6p9Q8L7
$$ -7 59 -31 -7 -1 8 -30 1 -107 85 -11 94 -140 -28 13 24 -9 55 -32 -74 40 5 40 55 44 -36 20 -59 29 66
6224F6m1l4O5j49J02pl0N7J6o8l3m0J30o1j05J83n0Mo5J06m0K3j9N6k5j7n8Q9
$$ 66 25 -9 56 -93 9 2 -28 29 45 -23 -56 -96 34 -27 -132 51 1 5 -60 46 6 29 10 66 41 24 -34 55
6252E5j7q4N9o8N9J07j26N5j17j7J54p6Q4j36k9K02p9P9q0Rr9O8rK6N0l8N6j03
$$ 55 38 -46 13 -55 4 111 -15 40 -77 -94 60 -16 68 -68 -97 105 26 105 25 34 -65 3 -6 20 70 32 88 -15
6280a5o1l0N5M8L1o0j04O8J15Lj05J43p2k2J2j34J03J1J7p5NJ27j18K5Q5j37R8
$$ -15 -76 -106 -51 -3 28 -32 -136 -68 47 50 -55 88 16 -6 6 -128 -25 -14 3 -72 -67 60 -58 -33 52 -85 13
6307A3J0J0Ko3K6j7J6m3n3J44p5K1Rl0N2M0nj12o5O5M0Mr0N6J08q0mo6N2n1n3
$$ 13 23 33 35 -28 -2 -19 -3 -46 -99 45 -30 -9 0 -30 22 62 57 -55 -120 -55 -15 -11 -101 -45 63 -17 -21 -87 -35 -86 -139
6338a39J77k1m6j3M9l0L8R7j84J03P5m8K0j06J9N4r6K3K2K2j04J56n9RJ8J3Ok3
$$ -139 38 17 -29 -42 7 -23 15 112 -72 31 106 58 78 -28 -9 45 -51 -28 -6 16 -88 68 9 18 36 49 55 32
6366C2p9P0J5j72K47r8n4k8P3l8O7%o4L5j40J97p1J7J8p4Q1RL0q6J21j7j12L9
$$ 32 -47 23 38 -134 113 15 -39 -67 6 -32 35 35 -29 6 -134 63 -8 9 27 -47 34 43 73 -13 108 91 -21 18
6394A8j5n8R2q7J52r9n2J12j60J02N4n4j22P0J26p6L8q5O4n0J56k01K5L7ll1O0
$$ 18 3 -55 37 -50 102 3 -49 63 -97 5 59 5 -117 -47 79 3 41 -44 20 -30 126 -75 -50 -13 -16 -47 13
6421A3m6P7o9j03O9P4o1L8N0nK1n9j4j9J10L7j28k3j25J29m2RK0R3l0k3J15r0
$$ 13 -33 44 -25 -128 -59 15 -46 -8 42 37 58 -1 -15 -34 76 113 -15 -38 -163 -34 -76 -67 -47 46 16 -7 108 18
6449A8k1P5K8j02n8Q0M6j28O7r3O2J17n3n5J63j87J15q8KJ02j07J9P4p5O2k9o9
$$ 18 -3 72 100 -2 -60 20 66 -62 5 -88 -26 91 38 -17 146 -41 74 -14 -12 90 -17 2 76 1 63 34 -35
6476c5J0J00j07Qn9J9N1j6L3j22J45N9p7j9RP7l1l6N0J2p8o3J07l0n2N1O4j02
$$ -35 -25 75 -32 -24 -83 -64 -13 -29 4 -118 27 86 9 -10 -1 76 45 9 59 71 -7 -70 37 7 -45 6 70 -32
6504c2j25K62j46R3oj6L9oM3j64M6m3J00r0J22j13pN8M3l7q9O7j2L8op4K2L0O7
$$ -32 -157 105 -41 52 46 30 69 63 106 -58 -12 -55 45 -45 77 -36 -43 15 58 21 -68 -1 -13 25 19 -55 -33 -3 64
6533F4l5o5N1j40J93Lr9J12l6j07O1l4K7o7J23J4n2p3O3k5J7m0J13j02J57k08
$$ 64 29 -36 15 -125 68 71 -28 84 48 -59 2 -32 -5 -72 51 65 13 -60 3 -22 -5 -45 68 -34 123 -85
6559h5J36q6n3J29r1Q8l7J0p0l1P0jl7J8J00jk8L4m2k8N0K9n0K8j16M2J9J52k01
$$ -85 51 -35 -88 41 -50 38 1 11 -59 -90 -20 -21 -58 -40 60 59 31 65 23 -5 45 74 24 52 -64 -22 -3 149 -52
6588e2Q3L5r6j5n4J67o8l6P8r0J77j53ML7J5J1k9L8j50J22j11P1k3m4J00q3K9
$$ -52 31 66 -30 -45 -99 68 0 -36 42 -48 129 -24 -20 17 32 43 14 52 -98 24 -87 -16 -39 -83 17 -66 -37
6615c7N0nK4j81J00P2j9N5n9Q8j41qJ76r9l3l8j30K01J03j52Q9o4J6j58J78J38
$$ -37 13 8 32 -149 -49 23 4 59 0 88 -53 -61 115 16 -17 -55 -185 16 119 -33 56 -8 8 -150 28 166
6641A66j51mN2r1QP2Q0l0j54L2PQ4J7j3j38L8q4P5n3J36j16L2P1q5K9J6o6l6J23
$$ 166 15 11 63 -28 -20 52 132 102 -52 -20 -13 71 88 75 -63 -25 -109 -34 -87 49 -67 -35 36 -49 -20 -4 -70 -106 17
6670A7r4M4M6k8n4R3K2p5Q3j4pK0K8q0k1Q5q7N1j26J25K7r4l0N2J20o9p9K6p7
$$ 17 -77 -33 13 -15 -69 24 46 -29 54 40 33 53 81 1 -20 65 -22 29 -97 28 55 -39 -69 -17 103 34 -45 -19 -96
6699i6J20rj2k7k8K3Q2n4N5M7j36p5O3r3J47k6J90j88J9P6q2J0J1k1m9J03l6M4
$$ -96 24 15 3 -24 -52 -29 53 -1 54 101 -35 -110 -47 -140 7 -19 171 -17 2 78 -4 6 17 -4 -53 50 14 58
6727E8rJ9o3J4k7l4j5l2K65k40l7J62r1J86k47Q1J27j86n0N0NR0l6n1J94j17o1
$$ 58 49 68 5 19 -8 -42 -57 -89 176 -64 -101 61 -30 156 -91 -10 117 -69 -119 -69 -64 26 -10 -61 133 16 -45
6754d5M1Q4m8j42J55n0P1j0j14Q0p0J06l9m8J7r2J98l3lr4L3mP5l9r1pJ16l7L2
$$ -45 -4 80 32 -110 45 -5 66 56 -58 22 -48 58 19 -29 -12 -104 94 61 58 -36 -3 -7 68 29 -62 -69 47 10 42
6783D2L8j06N5p8N9L3n3J24k07J02k0K4K3n4j9q6N7N3M3r7J23m8L3r3P9rL4l3
$$ 42 80 -26 29 -49 10 43 -10 114 -93 9 -11 13 36 -18 -37 -123 -66 -13 30 -67 56 8 41 -52 27 18 52 19
6811A9p2l2P2O5k43J37jM7O4K3j65J18J1K6j12m8k0J12P0j21J95q7M4o4P4j56
$$ 19 -53 -85 -13 52 -191 -54 -55 -8 56 79 -86 32 43 69 -43 -91 -111 1 71 -50 145 58 102 38 112 -44
6837d4Q9m0n5O5kN5j04K9K8m1K0k0NJ4RK5j1K6j3J7p1m9O6j96J37J6K8k5J3O1
$$ -44 45 5 -50 15 13 68 -36 -7 21 -20 0 -20 -15 -1 8 33 22 48 35 52 -19 -68 -2 -198 -61 -45 -17 -42 -29 32
6867C2o1J10j33Q2L2j04P1m0J79j93lRl1O6K5o5m4N0J17o0j21kK69j95J21j93
$$ 32 -29 81 -52 30 62 -42 29 -11 168 -25 -28 -19 -50 16 41 -24 -68 -18 99 39 -82 -84 185 -10 111 -82
6893h2N4P0l9P2%j29L5ql8k0M3R4o6J28m8j56l7J40K4L5l8j10M8mj8l3L5J03o2
$$ -82 -28 42 3 75 75 -54 -19 -27 -65 -85 -42 52 -14 114 66 -90 -127 13 37 72 34 -76 -28 -32 -50 -83 -48 55 -7
$$ [...]
8191b4
##END NTUPLES=NMR FID
##END=
